##TITLE=abcd
##JCAMPDX= 6.0         $$ Bruker NMR JCAMP-DX V2.0
##DATA TYPE= NMR SPECTRUM
##DATA CLASS= NTUPLES
##ORIGIN= UXNMR, Bruker Analytische Messtechnik GmbH
##OWNER= root
$$ XWIN-NMR		Version 3.5
$$ Tue Aug  4 16:36:31 2026 Russian Standard Time (UT+4h)  servis@DPX200
##.OBSERVE FREQUENCY= 200.131235884673
##.OBSERVE NUCLEUS= ^1H
##.ACQUISITION MODE= SIMULTANEOUS
##.ACQUISITION SCHEME= undefined
##.AVERAGES= 32
##.DIGITISER RES= 18
##SPECTROMETER/DATA SYSTEM= spect
##.PULSE SEQUENCE= zg
##.SOLVENT NAME= DMSO
##.SHIFT REFERENCE= (INTERNAL, DMSO, 0, 16.4885)
##AUDIT TRAIL= $$ (NUMBER, WHEN, WHO, WHERE, WHAT)
$$ ##TITLE= Audit trail, XWIN-NMR		Version 3.5
$$ ##JCAMPDX= 5.01
$$ ##ORIGIN= Bruker BioSpin GmbH
$$ ##OWNER= servis
$$ F:\spectra/data/av/nmr/H1/1/pdata/1/auditp.txt
$$ ##AUDIT TRAIL=  $$ (NUMBER, WHEN, WHO, WHERE, WHAT)
(   1,<2026-08-04 16:36:09.20 +0400>,<servis>,<DPX200>,
      <created by zg, POWCHK disabled, PULCHK disabled
       configuration hash MD5:
       00 E9 B6 7A A2 85 ED C7 34 08 36 98 17 FE 4E 26
       data hash MD5: 32K
       30 B6 2C 9E 1B B7 3B DC 0E B3 23 76 3B 32 37 2C>)
(   2,<2026-08-04 16:36:14.50 +0400>,<servis>,<DPX200>,
      <Start of raw data processing
       efp BC_mod = 2 LB = 0.05 FT_mod = 6 PKNL = 1 PHC0 = -412.7518 PHC1 = 3.101563 SI = 16K 
       data hash MD5: 16K
       30 8E 53 A2 F0 68 3B 30 AD CA C5 7A A8 56 25 13>)
$$ ##END=
$$ 
$$ hash MD5
$$ 86 45 E8 7C B0 8C 75 94 B8 55 6B 8C 53 2E A5 70
##$RELAX= 
##$RELAX= 
##$RELAX= 
##$RELAX= 
##$RELAX= 
##$RELAX= 
##$RELAX= 
##$RELAX= 
$$ Bruker specific parameters
$$ --------------------------
##$DU= <F:\spectra>
##$EXPNO= 1
##$NAME= <H1>
##$PROCNO= 1
##$TYPE= <nmr>
##$USER= <av>
##$AMP= (0..31)
100 100 100 100 100 100 100 100 100 100 100 100 100 100 100 100 100 100 
100 100 100 100 100 100 100 100 100 100 100 100 100 100 
##$AQSEQ= 0
##$AQ_mod= 1
##$AUNM= <au_zg>
##$AUTOPOS= <>
##$BF1= 200.13
##$BF2= 200.13
##$BF3= 200.13
##$BF4= 200.13
##$BF5= 500.13
##$BF6= 500.13
##$BF7= 500.13
##$BF8= 500.13
##$BYTORDA= 1
##$CFDGTYP= 0
##$CFRGTYP= 5
##$CHEMSTR= <none>
##$CNST= (0..31)
1 1 145 1 1 1 1 1 1 1 1 1 1 1 1 1 1 1 1 1 1 1 1 1 1 1 1 1 1 1 1 1 
##$CPDPRG= <>
##$CPDPRG1= <>
##$CPDPRG2= <>
##$CPDPRG3= <>
##$CPDPRG4= <mlev>
##$CPDPRG5= <mlev>
##$CPDPRG6= <mlev>
##$CPDPRG7= <mlev>
##$CPDPRG8= <mlev>
##$CPDPRGB= <>
##$CPDPRGT= <>
##$D= (0..31)
0 2 0 0 0 0 0 0 0 0.06 0 0 0 0 0 0 0.0002 0 0 0 0 0 0 0 0 0 0 0 0 0 0 
0 
##$DATE= 1785846968
##$DBL= (0..7)
120 120 120 120 120 120 120 120 
##$DBP= (0..7)
150 150 150 150 150 150 150 150 
##$DBP07= 0
##$DBPNAM0= <>
##$DBPNAM1= <>
##$DBPNAM2= <>
##$DBPNAM3= <>
##$DBPNAM4= <>
##$DBPNAM5= <>
##$DBPNAM6= <>
##$DBPNAM7= <>
##$DBPOAL= (0..7)
0.5 0.5 0.5 0.5 0.5 0.5 0.5 0.5 
##$DBPOFFS= (0..7)
0 0 0 0 0 0 0 0 
##$DE= 6
##$DECBNUC= <off>
##$DECIM= 32
##$DECNUC= <off>
##$DECSTAT= 4
##$DIGMOD= 1
##$DIGTYP= 9
##$DL= (0..7)
0 120 120 120 120 120 120 120 
##$DP= (0..7)
150 150 150 150 150 150 150 150 
##$DP07= 0
##$DPNAME0= <>
$$ [...]
##$SUBNAM4= <"">
##$SUBNAM5= <"">
##$SUBNAM6= <"">
##$SUBNAM7= <"">
##$SUBNAM8= <"">
##$SUBNAM9= <"">
##$SW= 20.6817932712277
##$SWIBOX= (0..15)
0 0 3 0 0 0 0 0 0 0 0 0 0 0 0 0 
##$SW_h= 4139.07284768212
##$TD= 32768
##$TD0= 1
##$TE= 0
##$TE2= 300
##$TE3= 300
##$TEG= 300
##$TL= (0..7)
0 120 120 120 120 120 120 120 
##$TP= (0..7)
150 150 150 150 150 150 150 150 
##$TP07= 0
##$TPNAME0= <>
##$TPNAME1= <>
##$TPNAME2= <>
##$TPNAME3= <>
##$TPNAME4= <>
##$TPNAME5= <>
##$TPNAME6= <>
##$TPNAME7= <>
##$TPOAL= (0..7)
0.5 0.5 0.5 0.5 0.5 0.5 0.5 0.5 
##$TPOFFS= (0..7)
0 0 0 0 0 0 0 0 
##$TUNHIN= 0
##$TUNHOUT= 0
##$TUNXOUT= 0
##$USERA1= <user>
##$USERA2= <user>
##$USERA3= <user>
##$USERA4= <user>
##$USERA5= <user>
##$V9= 5
##$VALIST= <valist>
##$VCLIST= <CCCCCCCCCCCCCCC>
##$VD= 0
##$VDLIST= <DDDDDDDDDDDDDDD>
##$VPLIST= <PPPPPPPPPPPPPPP>
##$VTLIST= <TTTTTTTTTTTTTTT>
##$WBST= 1024
##$WBSW= 30
##$XGAIN= (0..3)
0 0 0 0 
##$XL= 0
##$YL= 0
##$YMAX_a= 86393
##$YMIN_a= -154099
##$ZGOPTNS= <>
##$ZL1= 120
##$ZL2= 120
##$ZL3= 120
##$ZL4= 120
##$ABSF1= 0
##$ABSF2= 0
##$ABSG= 0
##$ABSL= 0
##$ALPHA= 0
##$AQORDER= 0
##$ASSFAC= 0
##$ASSFACI= 0
##$ASSFACX= 0
##$ASSWID= 0
##$AUNMP= <proc_1d>
##$AZFE= 0.1
##$AZFW= 0.1
##$BCFW= 0
##$BC_mod= 2
##$BYTORDP= 0
##$COROFFS= 0
##$CY= 18.4799938201904
##$DATMOD= 1
##$DC= 0
##$DFILT= <>
##$DTYPP= 0
##$F1P= 9.9274215381318
##$F2P= -0.165520771350173
##$FCOR= 1
##$FTSIZE= 16384
##$FT_mod= 6
##$GAMMA= 0
##$GB= 0
##$INTBC= 1
##$INTSCL= 4.127829e-11
##$ISEN= 128
##$LB= 0.05
##$LEV0= 0
##$LPBIN= 0
##$MAXI= 10000
##$MC2= 0
##$MEAN= 0
##$ME_mod= 0
##$MI= 50
##$NCOEF= 0
##$NC_proc= -8
##$NLEV= 6
##$NOISF1= 3.799351
##$NOISF2= 2.8
##$NSP= 0
##$NTH_PI= 0
##$NZP= 0
##$OFFSET= 16.48848
##$PC= 4
##$PHC0= -412.7518
##$PHC1= 3.101563
##$PH_mod= 1
##$PKNL= yes
##$PPARMOD= 0
##$PSCAL= 4
##$PSIGN= 0
##$REVERSE= no
##$SF= 200.130005582386
##$SI= 16384
##$SIGF1= 3
##$SIGF2= 2
##$SINO= 400
##$SIOLD= 16384
##$SREGLST= <1H.CDCl3>
##$SSB= 0
##$STSI= 16384
##$STSR= 0
##$SW_p= 4139.07284768211
##$SYMM= 0
##$S_DEV= 0
##$TDeff= 32768
##$TDoff= 0
##$TI= <>
##$TILT= no
##$TM1= 0
##$TM2= 0
##$TOPLEV= 0
##$USERP1= <user>
##$USERP2= <user>
##$USERP3= <user>
##$USERP4= <user>
##$USERP5= <user>
##$WDW= 1
##$XDIM= 16384
##$YMAX_p= 442003702
##$YMIN_p= -1873815
$$ End of Bruker specific parameters
$$ ---------------------------------
##NTUPLES= NMR SPECTRUM
##VAR_NAME=  FREQUENCY,     SPECTRUM/REAL,   SPECTRUM/IMAG
##SYMBOL=    X,             R,               I
##VAR_TYPE=  INDEPENDENT,   DEPENDENT,       DEPENDENT
##VAR_FORM=  AFFN,          ASDF,            ASDF
##VAR_DIM=   16384,         16384,           16384
##UNITS=     HZ,            ARBITRARY UNITS, ARBITRARY UNITS
##FACTOR=    0.252644378177508, 1,           1
##FIRST=     3299.83951724647, 0,            0
##LAST=      -839.233330435636, 0,           0
##MIN=       -839.233330435636, -1873815,    0
##MAX=       3299.83951724647, 442003702,    0
$$ Real data points
##PAGE= N=1
##DATA TABLE= (X++(R..R)), XYDATA
$$ [...]
$$ plain form
7895 11594239 10960679 10608114 9458585 10630362 11357154 11311123 11421192 11842287 10323761
7886 10323761 11577097 11790174 11013431 11361453 12252869 11082733 10643017 10242821 11408454
7877 11408454 9786305 9477149 10057189 9715335 11364043 10503883 10156032 11564106 12244861
7868 12244861 11914346 10911858 10581016 10653452 10464037 10034510 10767970 10999379 11581088
7859 11581088 9903433 10232584 7762061 15960729 9799559 10667088 10762073 11774482 11283918
7850 11283918 10745068 11235969 12664554 10572065 10578088 10563299 11090680 10817860 11225394 12251677
7840 12251677 10846450 11172804 11654632 10731959 10630298 11499676 11626850 10576260 9859942
7831 9859942 10541931 11206001 10997533 10856909 12098819 10171255 10142620 10381234 10810857
$$ packed form
7895A1594239o33560l52565j149529J171777P26792m6031J10069M21095j518526
7886A0323761J253336K13077p76743L48022Q91416j170136m39716m00196J165633
7877A1408454j622149l09156N80040l41854J648708q60160l47851J408074O80755
7868A2244861l30515j002488l30842P2436j89415m29527P33460K31409N81709
7859A1581088j677655L29151k470523Q198668o161170Q67529R4985J012409m90564
7850A1283918n38850M90901J428585k092489O023j4789N27381k72820M07534J026283
7840A2251677j405227L26354M81828r22673j01661Q69378J27174j050590p16318
7831I859942O81989O64070k08468j40624J241910j927564k8635K38614M29623
$$ plain form
7822 10810857 10526146 10974772 10646025 11246734 11235931 11162965 11044624 10967595 10387646 11061658
7812 11061658 10923172 11466335 11578550 11321380 10535953 11203785 11624057 11170139 10691522
7803 10691522 11074055 11970360 11282941 11086053 10906741 10177203 10858043 10661012 10805292
7794 10805292 11257314 10449179 11091924 11007378 10971789 11002649 10073399 11111860 10666786 10023110
7784 10023110 10552913 10811909 10349831 11588622 10119947 10584493 10757566 11029412 10965190
7775 10965190 11217411 10274391 11110620 10173530 11043523 10516337 12103504 10221775 11176808
7766 11176808 10793812 10585365 10232550 11157684 10485745 12193330 10945268 10748292 10658537
7757 10658537 10775388 10086638 10990664 9995933 10586816 9780648 10368060 11616198 11757578
$$ packed form
7822A0810857k84711M48626l28747O00709j0803p2966j18341p7029n79949O74012
7812A1061658j38486N43163J12215k57170p85427O67832M20272m53918m78617
7803A0691522L82533Q96305o87419j96888j79312p29538O80840j97031J44280
7794A0805292M52022q08135O42745q4546l5589L0860r29250J038461m45074o43676
7784A0023110N29803K58996m62078J238791j468675M64546J73073K71846o4222
7775A0965190K52221r43020Q36229r37090Q69993n27186J587167j881729R55033
7766A1176808l82996k08447l52815R25134o71939J707585j248062j96976q9755
7757A0658537J16851o88750R04026r94731N90883q06168N87412J248138J41380
$$ plain form
7748 11757578 11534273 10404441 10307277 10767900 10593442 11443254 9997498 11292741 10850563
7739 10850563 10975240 10723659 11261413 11006273 11727939 10055708 9953693 10865594 10850300
7730 10850300 11156806 10588171 11508101 11017980 11657737 10569941 10658679 10370905 10444859 10652962
7720 10652962 11889183 11053999 10451364 10674031 10409696 10880764 10000591 10204689 10948601
7711 10948601 10720208 10738435 11035340 11201842 10878627 9956422 10464424 11125862 11535130 11182102
7701 11182102 10718773 11190993 10218201 10232602 10752416 10483269 11208405 11016771 10483326 11000497
7691 11000497 10651753 10133214 10054725 9740614 10363957 10236488 10526459 9961923 9822937 10923132
7681 10923132 10085081 10652296 10961839 10401346 10929634 11523222 9875170 9018985 10124862
$$ packed form
7748A1757578k23305j129832r7164M60623j74458Q49812j445756J295243m42178
7739A0850563J24677k51581N37754k55140P21666j672231j02015R11901j5294
7730A0850300L06506n68635R19930m90121O39757j087796Q8738k87774P3954K08103
7720A0652962J236221q35184o02635K22667k64335M71068q80173K04098P43912
7711A0948601k28393J8227K96905J66502l23215r22205N08002O61438M09268l53028
7701A1182102m63329M72220r72792J4401N19814k69147P25136j91634n33445N17171
7691A1000497l48744n18539p8489l14111O23343j27469K89971n64536j38986J100195
7681A0923132q38051N67215L09543n60493N28288N93588j648052q56185J105877
$$ plain form
7672 10124862 9497086 10636952 10063345 10873346 11459617 10365215 10754381 10547441 9900912
7663 9900912 9233140 10636673 10255443 11226089 10445386 11034536 10216063 10827767 9843025
7654 9843025 10642060 9578115 10913721 9783671 9633653 9936182 9386243 11370894 10122567
7645 10122567 9693810 10074048 10293187 9542998 10627090 10179602 9754364 9580814 10389176
7636 10389176 9866887 10178066 10964935 9877660 10211026 9682919 9048539 10053826 11208560
7627 11208560 10371327 10311170 9451211 10370142 11001518 9625414 9183497 9349445 10027520
7618 10027520 10329216 10387228 9227665 10055822 10328362 8780887 9736927 9032200 10222505
7609 10222505 9761837 9882374 10139007 9196522 8139007 8692946 9703439 9846332 10847604
$$ packed form
7672A0124862o27776J139866n73607Q10001N86271j094402L89166k06940o46529
7663I900912o67772J403533l81230R70646p80703N89150q18473O11704r84742
7654I843025P99035j063945J335606j130050j50018L02529n49939J984651j248327
7645A0122567m28757L80238K19139p50189J084092m47488m25238j73550Q08362
7636A0389176n22289L11179P86869j087275L33366n28107o34380J005287J154734
7627A1208560q37233o0157q59959R18931O31376j376104m41917J65948O78075
7618A0027520L01696N8012j159563Q28157K72540j547475R56040p04727J190305
7609A0222505m60668J20537K56633r42485j057515N53939J010493J42893J001272
$$ plain form
7600 10847604 9886304 9303160 11192722 10194292 10040455 10034468 9759149 10420837 9497216 9349964
7590 9349964 10560229 9839804 9386900 9424991 10977840 9977658 10334798 9940074 10080335
7581 10080335 9741222 10219756 9270690 9242705 10237315 9722124 10436143 9860225 10121390 9620019
7571 9620019 9910196 9085215 9930000 10005052 9998771 10805626 9661538 10080952 9175829 9060836
7561 9060836 9151803 9076488 9128352 9399231 9259755 10419807 9384640 9165587 10098081 10101136
7551 10101136 8736411 9311997 9928766 9569398 9737625 9928142 10107680 9138207 9273421
7542 9273421 9145103 8820733 9348835 10334699 10217231 9380356 9469466 9825543 9526549 8594894
7532 8594894 9920319 10477234 9674125 9827981 9769441 8311022 9642787 9510616 9216649
$$ packed form
7600A0847604r61300n83144J889562r98430j53837n987k75319O61688r23621j47252
7590I349964J210265p20425m52904L8091J552849j000182L57140l94724J40261
7581A0080335l39113M78534r49066k7985R94610n15191P14019n75918K61165n01371
7571I620019K90177q24981Q44785P5052o281Q06855j144088M19414r05123j14993
7561I060836R0967p5315N1864K70879j39476J160052j035167k19053R32494L055
7551A0101136j364725N75586O16769l59368J68227J90517J79538r69473J35214
7542I273421j28318l24370N28102R85864j17468q36875Q9110L56077k98994r31655
7532H594894J325425N56915q03109J53856n8540j458419J331765j32171k93967
$$ plain form
7523 9216649 9859101 9244365 9313477 9200488 9754301 8072213 9280705 8899443 9665798
7514 9665798 9003527 9471418 8618461 10526646 8277054 9240498 10148066 9083722 9022085
7505 9022085 8886686 9301499 9538207 9264974 9582113 8846205 10204620 8850761 9149960
7496 9149960 9816546 8068066 9046473 9461237 8884153 10056603 9109989 9013373 10201175
7487 10201175 8199767 8232088 8367924 8392311 8224679 8829282 9974486 8830029 8995640
7478 8995640 9269076 10190650 9285078 8848356 9112270 8866113 8109685 9054674 9171370 8876035
7468 8876035 8905008 8600484 8360095 8981418 9607721 8420149 9702610 9228107 8582106
7459 8582106 8583606 9194868 9660230 8793496 8417298 9195669 9108293 8632868 8415828 8334614
$$ packed form
7523I216649O42452o14736O9112j12989N53813j682088J208492l81262P66355
7514I665798o62271M67891q52957J908185k249592R63444R07568j064344o1637
7505I022085j35399M14813K36708k73233L17139p35908J358415j353859K99199
7496I149960O66586j748480R78407M14764n77084J172450r46614r6616J187802
7487A0201175k001408L2321J35836K4387j67632O04603J145204j144457J65611
7478H995640K73436R21574r05572m36722K63914k46157p56428R44989J16696k95335
7468H876035K8973l04524k40389O21323O26303j187572J282461m74503o46001
7459H582106J500O11262M65362q66734l76198P78371q7376m75425k17040q1214
$$ plain form
7449 8334614 8280127 9341800 9045921 8926767 8707489 9171395 7789447 8666805 8019934
7440 8019934 7981906 8875290 8017158 8814512 8850310 7851847 8314770 8549992 8889768 8357514
7430 8357514 8255340 8308716 8274214 7981434 7885270 8211266 8301317 8266582 8488246 8637863
7420 8637863 8381378 8628470 8384985 7790148 8975150 7566932 8275177 6910719 8330852
7411 8330852 7952592 8498325 7553941 8151751 7888811 8095610 8640693 7860391 7007126 7669815
7401 7669815 8023016 8459601 8121222 7757766 8020427 7926095 7990574 8044944 7833204 7637815
7391 7637815 7928501 7871235 9194896 8209557 7751098 7200408 8529224 7633188 8205629
7382 8205629 8249524 8857031 8443616 8095501 6927212 7627723 8275957 7999653 7033224 7980917
$$ packed form
7449H334614n4487J061673k95879j19154k19278M63906j381948Q77358o46871
7440H019934l8028Q93384q58132P97354L5798r98463M62923K35222L39776n32254
7430H357514j02174N3376l4502k92780r6164L25996R0051l4735K21664J49617
7420H637863k56485K47092k43485n94837J185002j408218P08245j364458J420133
7411H330852l78260N45733r44384N97810k62940K06799N45083p80302q53265O62689
7401G669815L53201M36585l38379l63456K62661r4332O4479N4370k11740j95389
7391G637815K90686n7266J323661r85339m58459n50690J328816q96036N72441
7382H205629M3895O07507m13415l48115j168289P00511O48234k76304r66429R47693
$$ plain form
7372 7980917 8341258 7559862 6987295 7499930 7457646 8547179 7489448 8090767 8106771 7695429
7362 7695429 7951700 7458764 7891886 7900422 7390561 7769803 8649630 6779531 7164704 7067988
7352 7067988 7082715 7507194 6205431 7704869 6491209 7818033 7874406 7065874 7929873
7343 7929873 7734468 7783897 7745711 7461113 8199431 7786511 7382189 7597617 7100663 7108022
7333 7108022 7017354 7111025 7027759 7757032 6523231 7682643 6930231 8105907 6800381
7324 6800381 7571728 7972269 8052314 6731506 6755617 6923545 7400545 6416789 7861215 6813132
7314 6813132 6175352 6909439 7013887 7458593 5769712 7647443 6706982 6431599 6522699
7305 6522699 7722711 6705046 6278724 6737855 7043112 6621460 6895049 7016897 6849478
$$ packed form
7372G980917L60341p81396n72567N12635m2284J089533j057731O01319J6004m11342
7362G695429K56271m92936M33122Q536n09861L79242Q79827j870099L85173r6716
7352G067988J4727M24479j301763J499438j213660J326824N6373q08532Q63999
7343G929873j95405M9429l8186k84598P38318m12920m04322K15428m96954P359
7333G108022r0668R3671q3266P29273j233801J159412p52412J175676j305526
7324F800381P71347M00541Q0045j320808K4111J67928M77000r83756J444426j048083
7314F813132o37780P34087J04448M44706j688881J877731r40461k75383R1100
7305F522699J200012j017665m26322M59131L05257m21652K73589J21848j67419
$$ plain form
7296 6849478 7261885 6958807 6624887 6896850 6648822 7188580 6634405 8005314 7650964
7287 7650964 7069755 6758327 6840834 7082032 6854379 7075293 6506501 6963352 7016749 6343526
7277 6343526 7375203 6986674 6918595 6758237 6899827 7235762 6654930 7271234 6954723 7487544
7267 7487544 6707824 6381794 6859181 6809376 6562226 5755423 7022876 6923998 6697976 6777826
7257 6777826 7428634 5708178 6625271 6143052 6963495 7013561 7281542 6094345 6850938
7248 6850938 6075725 6595908 6825603 7156557 6509464 6962511 6508288 6153121 5654496 5147993
7238 5147993 6954357 7296144 7606714 5964068 6405160 6097655 7067711 5994598 7048188
7229 7048188 5873059 6117334 6202017 7377850 7499222 6553979 5612283 5668018 5782079 5066526
$$ packed form
7296F849478M12407l03078l33920K71963k48028N39758n54175J370909l54350
7287G650964n81209l11428Q2507K41198k27653K20914n68792M56851N3397o73223
7277F343526J031677l88529o8079j60358J41590L35935n80832O16304l16511N32821
7267G487544p79720l26030M77387m9805k47150q06803J267453r8878k26022P9850
7257F777826O50808j720456R17093m82219Q20443N0066K67981j187197P56593
7248F850938p75213N20183K29695L30954o47093M53047m54223l55167m98625n06503
7238E147993J806364L41787L10570j642646M41092l07505R70056j073113J053590
7229G048188j175129K44275Q4683J175833J21372r45243r41696N5735J14061p15553
$$ plain form
7219 5066526 7253729 6531599 6120998 6442027 6874210 5849415 6395892 6614821 6032121
7210 6032121 5799729 6211306 6152428 6187101 7647093 5866744 7071027 6720275 5820480
7201 5820480 5543196 5892587 5255926 6572158 5787714 6061127 5360353 6768902 5913701
7192 5913701 6280695 5895482 6034984 5773335 6351314 5558262 5843264 6466996 6597745 5670442
7182 5670442 6164740 5393289 5931671 6326764 6511555 5677830 6473467 5599336 5366120 6947154
7172 6947154 6307491 6407266 4693981 5532257 5639045 5099052 4303400 6144933 5911552
7163 5911552 5113964 4902305 6133116 5902675 5305631 5942602 5825136 5824916 5506114 4808886
7153 4808886 5306804 6026065 6145116 5895033 5286881 4856672 4388956 5776029 6280623
$$ packed form
7219E066526K187203p22130m10601L21029M32183j024795N46477K18929n82700
7210F032121k32392M11577n8878L4673J459992j780349J204283l50752q99795
7201E820480k77284L49391o36661J316232p84444K73413p00774J408549q55201
7192E913701L66994l85213J39502k61649N77979p93052K85002O23732J30749r27303
7182E670442M94298p71451N38382L95093J84791q33725P95637q74131k33216J581034
7172F947154o39663R9775j713285Q38276J06788n39993p95652J841533k33381
7163E911552p97588k11659J230811k30441n97044O36971j17466k20l18802o97228
7153D808886M97918P19261J19051k50083o08152m30209m67716J387073N04594
$$ plain form
7144 6280623 6009237 5567491 5445858 5000209 5171201 5540282 4769917 5806942 5799778 5319691
7134 5319691 5821041 5071391 4787116 5421148 5899914 6889962 5296895 4846243 5195798
7125 5195798 5812268 6398167 5880554 5088446 4405877 5086560 5937020 4604403 5351049
7116 5351049 5640025 4889451 5185031 5385462 5747767 6259169 5874345 5341581 5438605 5018467
7106 5018467 5971800 5512669 6492360 5761999 5219489 4925247 4692995 5012730 4587671 5230695
7096 5230695 5721830 5555262 5229379 5282655 5135817 4434736 5198345 5112453 5771612 5329006
7086 5329006 4460720 5549043 5056577 5668294 4862592 4761298 4511500 5157601 5393964
7077 5393964 5826542 4634096 5746304 5026745 5908595 5170107 4340051 4975077 4940976
$$ packed form
7144F280623k71386m41746j21633m45649J70992L69081p70365J037025p164m80087
7134E319691N01350p49650k84275O34032M78766R90048j593067m50652L49555
7125E195798O16470N85899n17613p92108o82569O80683Q50460j332617P46646
7116E351049K88976p50574K95580K00431L62305N11402l84824n32764R7024m20138
7106E018467R53333m59131R79691p30361n42510k94242k32252L19735m25059O43024
7096E230695M91135j66568l25883N3276j46838p01081P63609q5892O59159m42606
7086E329006q68286J088323m92466O11717q05702j01294k49798O46101K36363
7077E393964M32578j192446J112208p19559Q81850p38488q30056O35026l4101
$$ plain form
7068 4940976 4852275 5132372 4710822 5496909 6222458 4238717 5426902 5019365 5056174 4024400
7058 4024400 5303577 5792774 5230135 5799674 5551340 5332144 4573729 4210705 4884152
7049 4884152 4427870 4616949 4272846 5062794 5467199 6077872 4835124 5227009 4394135
7040 4394135 4410840 5298383 3852759 4894942 5415150 4084401 4619312 4566431 4645580 4813788
7030 4813788 4417263 4535242 4844534 5237156 4280976 4703633 5032782 5346677 5041632 4488165
7020 4488165 4258411 4355031 4221120 4598930 4488356 4984959 5307700 4194818 4696807 5052129
7010 5052129 4002126 5151061 4922834 4277798 5325835 5016643 3952542 4742009 4787157
7001 4787157 3950842 3830467 4685714 5135629 4508280 4056758 3606589 4939368 4639551
$$ packed form
7068D940976q8701K80097m21550P86087P25549j983741J188185m07537L6809j031774
7058D024400J279177M89197n62639N69539k48334k19196p58415l63024O73447
7049D884152m56282J89079l44103P89948M04405O10673j242748L91885q32874
7040D394135J6705Q87543j445624J042183N20208j330749N34911n2881P9149J68208
7030D813788l96525J17979L09292L92622r56180M22657L29149L13895l05045n53467
7020D488165k29754R6620j33911L77810j10574M96603L22741j112882N01989L55322
7010E052129j050003J148935k28227o45036J048037l09192j064101P89467M5148
7001D787157q36315j20375Q55247M49915o27349m51522m50169J332779k99817
$$ plain form
6992 4639551 3490061 4659312 4838191 4283556 4741886 3692841 3793730 4080084 4069207
6983 4069207 3971163 4923259 3204971 4362906 4012136 4191121 3938223 4804954 4622783
6974 4622783 4588136 4677715 4891362 4579555 5063150 3859591 3932550 2343191 4003083 3582787
6964 3582787 5446278 4451307 4837390 4506177 4022008 4707661 5615957 4563282 4859376
6955 4859376 3981323 4068958 3272019 4481957 3995333 4490626 4238392 3935406 4489738 3010873
6945 3010873 4063040 3846122 3938073 4983999 4159401 3869970 4808943 3479441 3918897
6936 3918897 4767891 4716918 2814515 4471702 4423969 4336087 3595198 3611397 3205502 3400700
6926 3400700 4122912 3727361 4146226 4389729 3890124 5153685 3648021 3775070 4135842
$$ packed form
6992D639551j149490J169251J78879n54635M58330j049045J00889K86354j0877
6983D069207r8044R52096j718288J157935l50770J78985k52898Q66731j82171
6974D622783l4647Q9579K13647l11807M83595j203559P2959j589359J659892m20296
6964C582787J863491r94971L86083l31213m84169O85653R08296j052675K96094
6955D859376q78053Q7635p96939J209938m86624M95293k52234l02986N54332j478865
6945C010873J052167k16918R1951J045926q24598k89431R38973j329502M39456
6936C918897Q48994n0973j902403J657187m7733q7882p40889J6199m05895J95198
6926C400700P22212l95551M18865K43503m99605J263561j505664J27049L60772
$$ plain form
6917 4135842 3941369 4048038 3584391 3208192 4694353 3944850 4125829 3880983 4016944
6908 4016944 4219684 3759025 3922751 3460911 3453101 4718523 4899665 4142798 4311938 3778426
6898 3778426 3884647 4281888 3306527 3605104 4332299 4712240 4079586 3837683 3971130 3900150
6888 3900150 2670256 3441690 4409591 4183255 4945149 4357168 4754199 3945676 3714471
6879 3714471 3653158 4657456 4481949 3356501 4500682 3606073 3261703 3913441 4059027
6870 4059027 4194220 4097302 3939479 3276465 3712217 3565149 5048575 4086799 4376806 3596671
6860 3596671 3520667 4693079 4666179 3953578 4776382 4423090 4623748 3009685 4272491
6851 4272491 4173596 4144104 2961265 4105577 3332510 3241606 3946469 4178978 4076972 4202243
$$ packed form
6917D135842j94473J06669m63647l76199J486161p49503J80979k44846J35961
6908D016944K02740m60659J63726m61840p810J265422J81142p56867J69140n33512
6898C778426J06221L97241r75361K98577P27195L79941o32654k41903J33447p0980
6888C900150j229894P71434R67901k26336P61894n87981L97031q08523k31205
6879C714471o1313J004298j75507j125448J144181q94609l44370O51738J45586
6870D059027J35193r6918j57823o63014M35752j47068J483426r61776K90007p80135
6860C596671p6004J172412k6900p12601Q22804l53292K00658j614063J262806
6851D272491r8895k9492j182839J144312p73067r0904P04863K32509j02006J25271
$$ plain form
6841 4202243 4570332 3202824 4054565 4037155 3629578 4126805 3774058 3361639 3602470 3853507
6831 3853507 3917727 4222294 3358947 3666463 3814437 4220094 3453631 3883571 3418499 2298103
6821 2298103 3005991 2769937 3132947 4030143 4044371 3164944 2702460 3126061 3481677 3371190
6811 3371190 4520592 3083915 4015636 4190342 3181507 3278686 3429060 3158402 2720296
6802 2720296 3128837 3313113 3624184 2890768 3049640 2732633 3213539 2624921 3807480
6793 3807480 3498319 3639079 3334789 3919028 3557163 2454436 3301320 3295781 3791099 2859354
6783 2859354 2618729 3589708 2919105 2902300 3315855 4358500 3414622 2654818 3126103 3189943
6773 3189943 3573469 3263952 4366389 3837148 3938740 2801284 3391320 3404476 3065737
$$ packed form
6841D202243L68089j367508Q51741j7410m07577M97227l52747m12419K40831K51037
6831C853507O4220L04567q63347L07516J47974M05657p66463M29940m65072j120396
6821B298103P07888k36054L63010Q97196J4228q79427m62484M23601L55616j10487
6811C371190J149402j436677R31721J74706j008835R7179J50374k70658m38106
6802B720296M08541J84276L11071p33416J58872l17007M80906n88618J182559
6793C807480l09161J40760l04290N84239l61865j102727Q46884n539M95318r31745
6783B859354k40625R70979o70603j6805M13555J042645r43878p59804M71285O3840
6773C189943L83526l09517J102437n29241J01592j137456N90036J3156l38739
$$ plain form
6764 3065737 3800864 3098776 2740606 4440391 2078710 3405702 2669399 3738850 3070380
6755 3070380 3205304 3992894 2917064 3314840 3537796 3517638 3329189 4181748 3239389 3501274
6745 3501274 3374248 3207360 3430611 2912192 2668765 2900906 3276753 3197646 2480383 3900850
6735 3900850 4017977 3670510 2436966 3153917 3071825 4254022 3989048 2888941 3548352
6726 3548352 3581099 2873013 3920627 3558232 3223024 2883564 3313177 2347243 3727064
6717 3727064 3687666 3216229 3394012 3296310 2965606 4086772 3510658 2827184 3867239 3253117
6707 3253117 3563413 3645858 3261991 3991094 3000546 3974941 3461778 2466003 1810703 2700298
6697 2700298 2616190 3189095 3940342 3018510 4157066 2963696 3337806 3456888 3837501
$$ packed form
6764C065737P35127p02088l58170J699785k361681J326992p36303J069451o68470
6755C070380J34924P87590j075830L97776K22956k0158j88449Q52559r42359K61885
6745C501274j27026j66888K23251n18419k43427K32141L75847p9107p17263J420467
6735C900850J17127l47467j233544P16951q2092J182197k64974j100107O59411
6726C548352L2747p08086J047614l62395l35208l39460M29613r65934J379821
6717C727064l9398m71437J77783r7702l30704J121166n76114o83474J040055o14122
6707C253117L10296Q2445l83867P29103r90548R74395n13163r95775o55300Q89595
6697B700298q4108N72905P51247r21832J138556j193370L74110J19082L80613
$$ plain form
6688 3837501 2641224 3068146 3644498 3073535 2857923 3798990 3796282 3853044 3178797 2404978
6678 2404978 3665819 2875924 3240128 2105570 2993617 2974262 3251601 3694370 3195187
6669 3195187 3127729 3318026 2918048 3065333 2222258 3181491 2795979 3430617 2446058 3803078
6659 3803078 2857017 2986404 2930815 2760828 3079896 2397131 3235906 3594847 2538954 2521790
6649 2521790 2887001 3257630 3794942 3544331 3633999 3270333 2565604 2584483 3732750 2518015
6639 2518015 3639054 3028134 3394074 3644664 3349115 2992960 3029975 2680057 2720897 2241207
6629 2241207 2896940 4012971 2991247 2685334 2650171 3286458 4029456 4324467 3144544
6620 3144544 3820432 2784324 3131651 3131327 3111894 2633710 2962525 3112598 3531412 3363117
$$ packed form
6688C837501j196277M26922N76352n70963k15612R41067k708N6762o74247p73819
6678B404978J260841p89895L64204j134558Q88047j9355K77339M42769m99183
6669C195187o7458J90297l99978J47285q43075R59233l85512O34638r84559J357020
6659C803078r46061J29387n5589j69987L19068o82765Q38775L58941j055893j7164
6649B521790L65211L70629N37312k50611Q9668l63666p04729J8879J148267j214735
6639B518015J121039o10920L65940K50590k95549l56155L7015l49918M0840m79690
6629B241207O55733J116031j021724l05913l5163O36287P42998K95011j179923
6620C144544O75888j036108L47327l24j9433m78184L28815J50073M18814j68295
$$ plain form
6610 3363117 2751247 2733607 3179591 3469569 3202799 3602682 4373362 3423237 2939927 3343369
6600 3343369 3220749 2882764 3316658 3720585 4025619 4007526 3495371 4326385 4003883 4104225
6590 4104225 3426085 3995819 5538398 5419635 5335195 4792004 5383105 5625752 4734602 4458362
6580 4458362 4288779 3525768 3470333 3637213 3300800 3642345 4089619 4308972 4458982 4541015
6570 4541015 3995403 4763536 4838073 4274217 5086834 4683499 5464385 5947611 5924974 7185286
6560 7185286 8110290 7710089 8130745 8567150 8749032 7758239 7368728 7258401 6531327 5664811
6550 5664811 5845080 4800869 5638337 4803125 4810510 4639034 4867959 4656346 5357770 5011736
6540 5011736 4792265 5268495 5066133 5594529 5842256 5650396 5156182 6632581 7099543
$$ packed form
6610C363117o11870j7640M45984K89978k66770L99883P70680r50125m83310M03442
6600C343369j22620l37985M33894M03927L05034j8093n12155Q31014l22502J00342
6590D104225o78140N69734J542579j18763q4440n43191N91101K42647q91150k76240
6580D458362j69583p63011n5435J66880l36413L41545M47274K19353J50010Q2033
6570D541015n45612P68133P4537n63856Q12617m03335P80886M83226k2637J260312
6560G185286R25004m00201M20656M36405J81882r90793l89511j10327p27074q66516
6550E664811J80269j044211Q37468q35212P385j71476K28925k11613P01424l46034
6540E011736k19471M76230k02362N28396K47727j91860m94214J476399M66962
$$ plain form
6531 7099543 8466452 8107952 9779620 9753824 8748995 8363736 7215212 6516668 6745124
6522 6745124 6306671 5159246 4550258 4666919 4797492 4599814 3833399 4428249 3721205
6513 3721205 4083317 3804183 4382970 4057969 3894270 3999255 5081066 4375337 4079287
6504 4079287 3993763 5339636 4954393 4564510 4485535 4521020 4661828 3851555 4142600 4869979
6494 4869979 3904893 3128923 4868351 3866786 3465246 3468480 3282332 3196506 2733869 3094926
6484 3094926 3066225 2698352 4173704 3304901 2844506 3138057 2436883 3052106 3440435 2708632
6474 2708632 3139888 2727989 1772814 2567891 1680016 3246902 2765796 3532856 3159546
6465 3159546 2782868 2337529 2875101 2489816 2878849 3169231 3301027 1441047 2981321
$$ packed form
6531G099543J366909l58500J671668k5796j004829l85259j148524o98544K28456
6522F745124m38453j147425o08988J16661J30573j97678p66415N94850p07044
6513C721205L62112k79134N78787l25001j63699J04985J081811p05729k96050
6504D079287q5524J345873l85243l89883p8975L5485J40808q10273K91045P27379
6494D869979r65086p75970J739428j001565m01540L234j86148q5826m62637L61057
6484C094926k8701l67873J475352q68803m60395K93551p01174O15223L88329p31803
6474B708632M31256m11899r55175P95077q87875J566886m81106P67060l73310
6465C159546l76678m45339N37572l85285L89033K90382J31796j859980J540274
$$ plain form
6456 2981321 2657728 970793 3568521 3132501 2255360 2784773 2301831 2292629 3040277 2858336
6446 2858336 1823116 1949161 2749328 2226910 2343329 3093872 2384998 2841871 2284301
6437 2284301 1897764 2693325 2715876 2842180 2328185 2608644 2176816 2579792 3170935 2752250
6427 2752250 2357476 2944575 3050285 1631569 1366323 2025105 2372896 2283696 3151461 2489222
6417 2489222 1635031 1850996 2874240 1861974 2076004 2864931 1645488 3081955 2499908
6408 2499908 2557283 2081277 1672374 1912067 2244344 2172018 3094575 1640776 1677552 1935932
6398 1935932 3275752 1034291 1362727 2512735 2208518 1535735 2722210 1186841 2724892
6389 2724892 2105096 2652937 2784591 1945647 2551314 1151851 2040121 1162549 2893330
$$ packed form
6456B981321l23593j686935K597728m36020q77141N29413m82942r202P47648j81941
6446B858336j035220J26045Q00167n22418J16419P50543p08874M56873n57570
6437B284301l86537P95561K2551J26304n13995K80459m31828M02976N91143m18685
6427B752250l94774N87099J05710j418716k65246O58782L47791q9200Q67765o62239
6417B489222q54191K15965J023244j012266K14030P88927j219443J436467n82047
6408B499908N7375m76006m08903K39693L32277p2326R22557j453799L6776K58380
6398A935932J339820k241461L28436J150008l04217o72783J186475j535369J538051
6389B724892o19796N47841J31654q38944O05667j399463Q88270q77572J730781
$$ plain form
6380 2893330 1476084 1611628 1895153 3427927 1105123 3617486 2640234 1769045 2089030
6371 2089030 2859964 1929016 2257640 2950127 3199166 2197442 2156037 2364001 2384450 2559646
6361 2559646 1505679 3380514 1709398 1399490 2778069 2184269 1259210 3064284 1986824
6352 1986824 3109308 2212060 2813187 3193620 2829862 2283943 3003163 1770328 1853040
6343 1853040 1765935 2436617 1961840 1651032 1586109 477866 1969992 2499306 2228030 1655348
6333 1655348 2414961 2872284 2415992 994047 2116343 1909597 2132150 1749380 3516265
6324 3516265 1842026 3836115 2339383 1896993 3081173 2425818 1942911 908134 1749748
6315 1749748 1247065 2158090 2233939 2322694 2791908 2386864 1051736 2210415 1413892 2276093
$$ packed form
6380B893330j417246J35544K83525J532774k322804K512363r77252q71189L19985
6371B089030P70934r30948L28624O92487K49039j001724m1405K07964K0449J75196
6361B559646j053967J874835j671116l09908J378579n93800r25059J805074j077460
6352A986824J122484q97248O01127L80433l63758n45919P19220j232835Q2712
6343A853040q7105O70682m74777l10808o4923j108243J492126N29314k71276n72682
6333A655348P59613M57323m56292j421945J122296k06746K22553l82770J766885
6324C516265j674239J994089j496732m42390J184180o55355m82907j034777Q41614
6315A749748n02683R11025P5849Q8755M69214m05044j335128J158679p96523Q62201
$$ plain form
6305 2276093 1442993 2239831 2517122 2317466 1773376 1886398 2272512 2663876 2419058 1946704
6295 1946704 2588723 2167486 2155882 1461560 2747954 2608456 1509302 1399963 2543359
6286 2543359 1772714 2014107 1947642 1875719 2027710 2614175 2157749 1848128 1879094 1755789
6276 1755789 3684226 2839084 2253649 1741627 2184757 1902610 2841755 1776646 1269914
6267 1269914 2722257 2681271 1708081 3146134 2090108 1507145 2529717 1371528 1848225
6258 1848225 1558785 1694034 2213075 1507574 1763891 3050128 1609925 1467148 1697226
6249 1697226 2778307 698239 2030611 1907318 2490075 1528532 2442841 1833097 1698827
6240 1698827 1132773 1395343 1440347 1144997 789398 1440338 2311921 2050517 2549839 2619974
$$ packed form
6305B276093q33100P96838K77291j99656n44090J13022L86114L91364k44818m72354
6295A946704O42019m21237j1604o94322J286394j39498j099154j09339J143396
6286B543359p70645K41393o6465p1923J51991N86465m56426l09621L0966j23305
6276A755789J928437q45142n85435n12022M43130k82147R39145j065109n06732
6267A269914J452343m0986r73190J438053j056026n82963J022572j158189M76697
6258A848225k89440J35249N19041p05501K56317J286237j440203j42777K30078
6249A697226J081081k080068J332372j23293N82757r61543R14309o09744j34270
6240A698827n66054K62570M5004k95350l55599O50940Q71583k61404M99322P0135
$$ plain form
6230 2619974 2003768 2595172 1212624 1367900 1893413 1392932 1805180 2505650 1740418
6221 1740418 1461939 1770142 2386539 2793674 1557807 1314637 1688547 1670216 2150546 2501564
6211 2501564 2294832 2258458 1383455 1166984 702072 2083752 1532120 1516943 1471243 2375361
6201 2375361 1440452 2000402 1683983 1961685 920593 1648727 2659751 1724099 1904663
6192 1904663 1524402 3399588 1249265 2016917 2502620 1928121 1484335 624547 2430510
6183 2430510 1585912 1761823 1739392 1741285 2492523 2033537 1285231 2741561 2000810 2027310
6173 2027310 1640352 1379427 2628039 1858316 1754025 3413480 2238683 1897483 2068696
6164 2068696 1864143 1366808 1458753 2286850 2887557 2318620 1696737 1476892 1809585 1096263
$$ packed form
6230B619974o16206N91404j382548J55276N25513n00481M12248P00470p65232
6221A740418k78479L08203O16397M07135j235867k43170L73910j8331M80330L51018
6211B501564k06732l6374q75003k16471m64912J381680n51632j5177m5700R04118
6201B375361r34909N59950l16419K77702j041092P28134J011024r35652J80564
6192A904663l80261J875186k150323P67652M85703n74499m43786q59788J805963
6183B430510q44598J75911k2431J893P51238m58986p48306J456330p40751K6500
6173B027310l86958k60925J248612p69723j04291J659455j174797l41200J71213
6164B068696k04553m97335R1945Q28097O00707n68937o21883k19845L32693p13322
$$ plain form
6154 1096263 1828215 2490297 2829631 1973538 1649275 3087813 1816300 2158369 1849723
6145 1849723 2964103 2115611 2111870 1679136 2147335 1219265 2311256 2555721 2335001 2206597
6135 2206597 2175603 2995676 3177837 2738536 3134625 2382909 936511 903316 1416910 2830990
6125 2830990 1281170 3303674 2548940 1811191 2138690 2246370 2260500 2384513 2451382 1931218
6115 1931218 1842057 1089891 1183478 2083231 2431124 1638894 2418244 1803001 2990355 2332477
6105 2332477 1371291 2002919 2980357 1714182 1375973 1526988 3016081 2187553 2685968
6096 2685968 2292406 1873877 2021325 1940212 1956282 3026312 1852349 1589696 2102345 2194433
6086 2194433 1717255 1540172 2607155 2907816 2762646 2152166 2989484 1645932 1759416
$$ packed form
6154A096263P31952O62082L39334q56093l24263J438538j271513L42069l08646
6145A849723J114380q48492l741m32734M68199r28070J091991K44465k20720j28404
6135B206597l0994Q20073J82161m39301L96089p51716j446398l3195N13594J414080
6125B830990j549820K022504p54734p37749L27499J07680J4130J24013O6869n20164
6115A931218q9161p52166R3587Q99753L47893p92230P79350o15243J187354o57878
6105B332477r61186O31628R77438j266175l38209J51015J489093q28528M98415
6096B685968l93562m18529J47448q1113J6070J070030j173963k62653N12649R2088
6086B194433m77178j77083J066983L00661j45170o10480Q37318j343552J13484
$$ plain form
6077 1759416 2097586 2120868 2148158 2874730 1065293 1636696 2118472 2160463 2451000 2103933
6067 2103933 2108417 2806490 1693920 2113565 2065306 1535002 1880087 2460806 2125162 2319643
6057 2319643 2669633 1875941 1855594 1955130 2037274 2377819 2321577 2159874 1503761 1726096
6047 1726096 2126949 2250715 1436353 1728880 657347 1547020 2255763 2604049 1643618
6038 1643618 2940193 2498544 1521423 2547674 2357726 2510220 2108169 2014782 1539635
6029 1539635 2691681 2685851 2753988 2315038 2516186 2066029 2281643 1931723 1772046 2470436
6019 2470436 2619221 930074 1274004 1095466 1782520 1580695 3093308 1869780 2769799
6010 2769799 1816651 2046151 2397264 1974625 2254410 2323191 1799708 1919962 1434993 1550611
$$ packed form
6077A759416L38170K3282K7290P26572j809437N71403M81776M1991K90537l47067
6067B103933M484O98073j112570M19645m8259n30304L45085N80719l35644J94481
6057B319643L49990p93692k0347R9536Q2144L40545n6242j61703o56113K22335
6047A726096M00853J23766q14362K92527j071533Q89673P08743L48286r60431
6038A643618J296575m41649r77121J026251j89948J52494m02051r3387m75147
6029A539635J152046n830O8137m38950K01148m50157K15614l49920j59677O98390
6019B470436J48785j689147L43930j78538O87054k01825J512613j223528R00019
6010B769799r53148K29500L51113m22639K79785O8781n23483J20254m84969J15618
$$ plain form
6000 1550611 1433861 2814334 2391499 1261870 1318921 1865327 2429826 3042929 2579327
5991 2579327 2903292 2502435 1415187 2246193 1808657 1844093 1962461 2208441 2406097 2471924
5981 2471924 1954001 2480036 1724071 2209270 2305644 1918043 1701894 2259336 2204601 2868425
5971 2868425 1825289 1794303 1642322 2095364 1769852 2864409 2211358 3005987 1828203
5962 1828203 2762328 1631522 2043965 1847066 2898686 2056440 2215083 1845520 1592743
5953 1592743 3127140 2507575 2471614 2236051 1809722 1695450 2201578 1574177 2953972
5944 2953972 3126204 2524655 2097822 1754615 2725113 954394 2510024 3193114 2336095
5935 2336095 2327052 2775792 1499905 2329038 2459850 2503485 2946924 3269292 2269252 2674405
$$ packed form
6000A550611j16750J380473m22835j129629N7051N46406N64499O13103m63602
5991B579327L23965m00857j087248Q31006m37536L5436J18368K45980J97656O5827
5981B471924n17923N26035p55965M85199R6374l87601k16149N57442n4735O63824
5971B868425j043136l0986j51981M53042l25512J094557o53051P94629j177784
5962A828203R34125j130806M12443j96899J051620q42246J58643l69563k52777
5953A592743J534397o19565l5961k35563m26329j14272N06128o27401J379795
5944B953972J72232o01549m26833l43207R70498j770719J555630O83090q57019
5935B336095r043M48740j275887Q29133J30812M3635M43439L22368j000040M05153
$$ plain form
5925 2674405 2254505 2753903 2671562 3036896 2406599 3559612 1765780 2232976 2559184
5916 2559184 2460254 2421321 1882876 2576251 1927269 2711628 2816227 2718335 2752645 2783347
5906 2783347 2949831 2535104 2530120 2985475 1031431 1976315 2378615 2661035 2900759 2672433
5896 2672433 3213633 2173317 2611100 2363000 1751018 2841065 1261291 2532770 3293041
5887 3293041 2461675 1805128 2136664 1563289 2916187 2593139 2533256 3420154 3653544 3343984
5877 3343984 2381763 2670557 1561849 2858162 2566519 1456355 3184578 2743807 1404108
5868 1404108 2546735 2729819 2316191 3262473 2769404 2775867 3379151 2760314 2904782 3743656
5858 3743656 2833945 3503834 3869174 3070615 2299288 2759722 3295396 2160167 2167276 1694020
$$ packed form
5925B674405m19900M99398q2341L65334o30297J153013j793832M67196L26208
5916B559184r8930l8933n38445O93375o48982P84359J04599r7892L4310L0702
5906B783347J66484m14727m984M55355j954044R44884M02300K82420K39724k28326
5896B672433N41200j040316M37783k48100o11982J090047j579774J271479P60271
5887C293041q31366o56547L31536n73375J352898l23048n9883Q86898K33390l09560
5877C343984r62221K88794j108708J296313k91643j110164J728223m40771j339699
5868A404108J142627J83084m13628R46282m93069O463O03284o18837J44468Q38874
5858C743656r09711O69889L65340p98559p71327M60434N35674j135229P109m73256
$$ plain form
5848 1694020 2547676 2367412 2832935 3456740 2317794 2672832 3077591 1343381 3407793
5839 3407793 2452194 3405466 3210185 4192025 2574315 3060237 3123986 3173101 3044248 2903055
5829 2903055 2483293 2303407 2927243 2415521 2414289 3384862 2814052 2753220 2245769 2389684
5819 2389684 3037686 3411375 2782394 2536571 3147138 2014393 2245822 2946686 3253146
5810 3253146 3573082 2506922 2909394 2671265 3302039 2271446 3319430 2948990 2297620
5801 2297620 2260330 2446850 3204653 2877434 2717875 4036534 2586080 2336468 2663468
5792 2663468 2386263 3567400 2216830 2254270 2112912 2629402 3365769 2992357 2727263
5783 2727263 4071296 3210268 3029262 2419515 2827849 2103470 2986353 2619725 3229092
$$ packed form
5848A694020Q53656j80264M65523O23805j138946L55038M04759j734210K064412
5839C407793r55599R53272j95281R81840j617710M85922O3749M9115j28853j41193
5829B903055m19762j79886O23836n11722j232R70573n70810o0832n07451J43915
5819B389684O48002L73689o28981k45823O10567j132745K31429P00864L06460
5810C253146L19936j066160M02472k38129O30774j030593J047984l70440o51370
5801B297620l7290J86520P57803l27219j59559J318659j450454k49612L27000
5792B663468k77205J181137j350570L7440j41358N16490P36367l73412k65094
5783B727263J344033q61028j81006o09747M08334p24379Q82883l66628O09367
$$ plain form
5774 3229092 2857487 3176170 2063077 2948059 3244360 2420991 3038916 2655047 3490756
5765 3490756 3559548 3292736 3647401 3015911 2640626 2760835 2802660 4177199 2304726 3179877
5755 3179877 3035072 2739165 2956345 2559319 3804830 3732454 3871967 3329117 3059410 2879525
5745 2879525 3657887 3968345 3997356 3345818 5884631 3956820 2787081 4192832 3865656
5736 3865656 3978463 3491888 3690528 4315654 4502230 4494982 4217502 3958155 4001622 4024361
5726 4024361 3442757 4708635 4661297 3836975 4592534 4158699 4062913 3995258 5726544 4241333
5716 4241333 6140533 4906406 4196869 4927703 4288366 5102453 5954022 5057377 5356173
5707 5356173 5223650 3910455 4941272 4688209 5335485 5849384 5083502 5187906 5122067
$$ packed form
5774C229092l71605L18683j113093Q84982K96301q23369O17925l83869Q35709
5765C490756O8792k66812L54665o31490l75285J20209M1825J374539j872473Q75151
5755C179877j44805k95907K17180l97026J245511p2376J39513n42850k69707j79885
5745B879525P78362L10458K9011o51538K538813j927811j169739J405751l27176
5736C865656J12807m86575J98640O25126J86576p248k77480k59347M3467K2739
5726D024361n81604J265878m7338q24322P55559m33835r5786o7655J731286j485211
5716D241333J899200j234127p09537P30834o39337Q14087Q51569q96645K98796
5707E356173j32523j313195J030817k53063O47276N13899p65882J04404o5839
$$ plain form
5698 5122067 5402979 5444612 6689786 5843858 5585695 5867989 5796058 5761667 6623806 5731267
5688 5731267 6747271 6470496 6362774 5566753 6674210 6982395 5337955 6148847 5834181
5679 5834181 5679554 6919113 6922626 7665058 7682622 6889606 7155291 7595956 7849808 8714987
5669 8714987 8737966 8626317 8684432 8548345 8321690 7819874 9517386 8630546 9582786 9312586
5659 9312586 9368845 9758093 9543243 9326350 10712299 10201067 11538144 11698507 12219796
5650 12219796 13778933 14174051 14595037 13754289 15290074 15817213 17624436 18002128 19635103
5641 19635103 20529986 21416797 22673259 25080068 26727011 29351719 31851234 32808521 36844100
5632 36844100 39469466 41617186 42926095 46536695 48233807 47621613 46943829 48445619
$$ packed form
5698E122067K80912M1633J245174q45928k58163K82294p1931l4391Q62139q92539
5688E731267J016004k76775j07722p96021J107457L08185j644440Q10892l14666
5679E834181j54627J239559L513P42432J7564p93016K65685M40665K53852Q65179
5669H714987K2979j11649N8115j36087k26655n01816J697512q86840R52240k70200
5659I312586N6259L89248k14850k16893J385949n11232J337077J60363N21289
5650A2219796J559137L95118M20986q40748J535785N27139J807223L77692J632975
5641A9635103Q94883Q86811J256462K406809J646943K624708K499515R57287M035579
5632C6844100K625366K147720J308909L610600J697112o12194o77784J501790
$$ plain form
5624 48445619 46404240 46967267 45361545 44230366 43971563 43371922 41881231 41527740 41453242
5615 41453242 41767005 40499232 40703369 42779665 45107621 46997704 48100644 52029856
5607 52029856 54913911 57958265 62224429 66871700 70687631 75427232 79640762 82978601
5599 82978601 85873185 87841204 88766843 88976480 87615567 84989339 81446901 79151766
5591 79151766 74730851 70587702 66304720 63895706 61071173 57148749 54966164 53982463
5583 53982463 51751711 49267565 49049846 48603233 49360233 50407627 51284861 51910853 53330228
5574 53330228 54390659 55406992 58772264 59970071 62475124 62214250 64071787 64397076
5566 64397076 63612503 61684916 61649307 57985049 55509408 51825213 49290407 45673389 42748228
$$ packed form
5624D8445619k041379N63027j605722j131179k58803n99641j490691l53491p4498
5615D1453242L13763j267773K04137K076296K327956J890083J102940L929212
5607E2029856K884055L044354M266164M647271L815931M739601M213530L337839
5599H2978601K894584J968019R25639K09637j360913k626228l542438k295135
5591G9151766m420915m143149m282982k409014k824533l922424k182585r83701
5583E3982463k230752k484146k17719m46613P57000J047394Q77234O25992J419375
5574E3330228J060431J016333L365272J197807K505053k60874J857537L25289
5566F4397076p84573j927587l5609l664258k475641l684195k534806l617018k925161
$$ plain form
5557 42748228 41890485 39541081 36778909 34782324 34028505 32328287 30703950 29768931 28997205
5548 28997205 27037873 26113188 25786193 26106425 25567418 25568860 25120181 24700206 23860735 23375537
5538 23375537 24298515 23236453 23347888 23183288 22388987 22736500 23537610 22655094 23167904
5529 23167904 23034108 23256876 22574633 22927651 23620007 23727426 24050286 24882938 24072081
5520 24072081 25296239 25216355 25840522 25658746 25695444 27480564 28208232 28612409 30575190
5511 30575190 31675884 32598218 32483199 35345248 36290229 37482894 40257245 40949194 44292836
5502 44292836 46352363 49086919 52827848 55462378 59170708 62224205 67199282 70860972
5494 70860972 76721259 79257893 83401714 87485260 90873016 92813782 96225218 98780607
$$ packed form
5557D2748228q57743k349404k762172j996585p53819j700218j624337r35019p71726
5548B8997205j959332r24685l26995L20232n39007J442m48679m19975q39471m85198
5538B3375537R22978j062062J11435j64600p94301L47513Q01110q82516N12810
5529B3167904j33796K22768o82243L53018O92356J07419L22860Q32652q10857
5520B4072081J224158p9884O24167j81776L6698J785120P27668M04177J962781
5511C0575190J100694R22334j15019K862049R44981J192665K774351O91949L343642
5502D4292836K059527K734556L740929K634530L708330L053497M975077L661690
5494G0860972N860287K536634M143821M083546L387756J940766L411436K555389
$$ plain form
5486 98780607 99217025 99817736 101571292 101213718 101740967 102372000 103211371 105846819 105991829
5477 105991829 108402505 111334704 114385629 117181843 121479529 125542376 129846030 135031689
5469 135031689 138480614 144127938 148106199 153886648 157592800 161492630 164622507 165894887
5461 165894887 168008874 167804649 165535103 164317775 160098017 156194711 150576768 145814233
5453 145814233 140786490 136775439 130882925 126411724 122942481 117286475 113605644 110293803
5445 110293803 108209627 105166306 103541140 100821942 98870096 97863260 96312383 95842017
5437 95842017 95529684 95157014 94077592 94049090 94823275 92996690 92337074 89828420 88252508
5428 88252508 85219702 81087278 77260784 74040442 69511784 65550123 61251859 57720620
$$ packed form
5486I8780607M36418O00711J753556l57574N27249O31033Q39371K635448J45010
5477A05991829K410676K932199L050925K796214M297686M062847M303654N185659
5469A35031689L448925N647324L978261N780449L706152L899830L129877J272380
5461A65894887K113987k04225k269546j217328m219758l903306n617943m762535
5453A45814233n027743m011051n892514m471201l469243n656006l680831l311841
5445A10293803k084176l043321j625166k719198j951846j006836j550877m70366
5437I5842017l12333l72670j079422k8502P74185j826585o59616k508654j575912
5428H8252508l032806m132424l826494l220342m528658l961661m298264l531239
$$ plain form
5420 57720620 54569185 50872250 49183189 46150479 44677279 42607635 40752166 38636652
5412 38636652 37480658 35890150 33961288 32402465 32073626 30397944 30281975 29645166 28779226
5403 28779226 27090258 26881831 26107195 25460048 25012324 23938084 23811942 22662528 22910006
5394 22910006 22366483 21074353 21146122 21356845 20231404 20285281 19940262 19197643 18720415
5385 18720415 18377961 18433627 18909732 17714990 16988927 16953471 18033267 16609581 16978321
5376 16978321 16639893 16538092 16420493 16961694 17164864 16915372 15904956 16010933 14642046
5367 14642046 15866770 15467328 15813852 15481658 14926502 14986961 14770628 14481700 15055794
5358 15055794 14628569 14774997 14706509 14931651 15208577 15471910 16007968 16144934 15747562 16213224
$$ packed form
5420E7720620l151435l696935j689061l032710j473200k069644j855469k115514
5412C8636652j155994j590508j928862j558823l28839j675682j15969o36809q65940
5403B8779226j688968k08427p74636o47147m47724j074240j26142j149414K47478
5394B2910006n43523j292130P1769K10723j125441N3877l45019p42619m77228
5385A8720415l42454N5666M76105j194742p26063l5456J079796j423686L68740
5376A6978321l38428j01801j17599N41201K03170k49492j010416J05977j368887
5367A4642046J224724l99442L46524l32194n55156O0459k16333k88928N74094
5358A5055794m27225J46428o8488K25142K76926K63333N36058J36966l97372M65662
$$ plain form
5348 16213224 15453725 14917913 15186202 15936749 16903590 15633421 16466962 15604612 16365043
5339 16365043 15720749 16228005 17388192 17471094 17890723 17288446 17790562 18373469 18827622
5330 18827622 19583522 19637697 20016343 20312733 20735033 22859032 23386255 24350384 27398289
5321 27398289 29218831 30556109 32787139 34790260 37931153 41820893 43621990 45151873
5313 45151873 47779438 51337733 53673081 57052002 61384381 64565032 66899219 68201163
5305 68201163 69058362 71636722 72985276 76140095 77265899 78009594 76668260 73988483
5297 73988483 72999949 72029600 72002493 70438105 68234370 64790699 62809895 59467606 55770636
5288 55770636 54470046 52950591 50074783 47455078 45756582 42860584 41008325 39630780
$$ packed form
5348A6213224p59499n35812K68289P50547R66841j270169Q33541q62350P60431
5339A6365043o44294N07256J160187Q2902M19629o02277N02116N82907M54153
5330A8827622P55900N4175L78646K96390M22300K123999N27223R64129L047905
5321B7398289J820542J337278K231030K003121L140893L889740J801097J529883
5313D5151873K627565L558295K335348L378921M332379L180651K334187J301944
5305F8201163Q57199K578360J348554L154819J125804P43695j341334k679777
5297G3988483r88534r70349k7107j564388k203735l443671j980804l342289l696970
5288E5770636j300590j519455k875808k619705j698496k895998j852259j377545
$$ plain form
5280 39630780 37824656 36534576 34559667 34267388 33798232 33531932 33823049 32714487 32904543
5271 32904543 32887751 34510913 34406653 34601209 35776216 36787221 36736902 37979994 37548032
5262 37548032 38686084 39521571 40946013 42105062 44093527 43071671 44833793 43559274
5254 43559274 44069160 43501435 41882714 41620152 40713160 40034374 40230647 39592506 40341887
5245 40341887 39051497 39617153 38993513 39043048 39331585 40596433 39867482 41306061 42140625
5236 42140625 44175361 46044272 46011210 49103506 49470608 51268143 53290743 55765264 57435506
5227 57435506 59011751 61798603 64375546 65561273 67345954 69697378 71317030 72509795
5219 72509795 73831594 75760970 77044021 78251390 79826906 81765655 83453924 86089067
$$ packed form
5280C9630780j806124j290080j974909k92279m69156k66300K91117j108562J90056
5271C2904543j6792J623162j04260J94556J175007J011005n0319J243092m31962
5262C7548032J138052Q35487J424442J159049J988465j021856J762122j274519
5254D3559274N09886n67725j618721k62562r06992o78786J96273o38141P49381
5245D0341887j290390N65656o23640M9535K88537J264848p28951J438579Q34564
5236D2140625K034736J868911l3062L092296L67102J797535K022600K474521J670242
5227E7435506J576245K786852K576943J185727J784681K351424J619652J192765
5219G2509795J321799J929376J283051J207369J575516J938749J688269K635143
$$ plain form
5211 86089067 88926255 91474431 93373002 95679550 98299859 99714360 101856914 103701286
5203 103701286 104278814 105170615 106388372 105779652 105199573 103670359 102660492 100932859 99360497
5194 99360497 98300680 95611080 94687304 92941354 91240668 91034015 89544285 89733325 89113606
5185 89113606 88754610 88388322 89446722 88570624 88329558 88081571 89357141 90098729 91616753
5176 91616753 91755280 92526658 94872590 95419578 96956870 100127010 102108465 105758130 110825603
5167 110825603 116277864 124317001 132837865 144198625 157263573 173225235 193007210
5160 193007210 216757596 243647215 276686074 316226991 361100635 400695185 431136212
5153 431136212 442003702 430194311 399200158 358849043 318720393 284482053 253226902
$$ packed form
5211H6089067K837188K548176J898571K306548K620309J414501K142554J844372
5203A03701286N77528Q91801J217757o08720n80079j529214j009867j727633j572362
5194I9360497j059817k689600r23776j745950j700686k06653j489730J89040o19719
5185H9113606l58996l66288J058400q76098k41066k47987J275570P41588J518024
5176I1616753J38527P71378K345932N46988J537292L170140J981455L649665N067473
5167A10825603N452261Q039137Q520864J1360760J3064948J5961662J9781975
5160A93007210K3750386K6889619L3038859L9540917M4873644L9594550L0441027
5153D31136212J0867490j1809391l0994153m0351115m0128650l4238340l1255151
$$ plain form
5146 253226902 221931588 195311101 173656256 156750616 140634017 129536127 117848336
5139 117848336 109592382 102034415 94575820 91032778 86281553 82427444 79121663 74932143
5131 74932143 71097336 68762636 66552447 63373571 61351505 59171992 57188872 54730964
5123 54730964 52666090 50769824 47804240 47045071 45610518 43523443 41847241 41712437
5115 41712437 39686656 37862566 36776579 36412014 34433204 32872058 31069983 31637843
5107 31637843 29837998 28664012 28204234 27672462 27171302 26608934 26412585 25998976 25747067
5098 25747067 24116454 23671154 23473850 22394263 22272781 22477960 22691244 22453146 21563829
5089 21563829 21274474 20375091 19677029 20768583 19602522 19997557 19267278 18666762 19576862
$$ packed form
5146B53226902l1295314k6620487k1654845j6905640j6116599j1097890j1687791
5139A17848336q255954p557967p458595l543042m751225l854109l305781m189520
5131G4932143l834807k334700k210189l178876k022066k179513j983120k457908
5123E4730964k064874j896266k965584p59169j434553k087075j676202j34804
5115D1712437k025781j824090j085987l64565j978810j561146j802075N67860
5107C1637843j799845j173986m59778n31772n01160n62368j96349m13609k51909
5098B5747067j630613m45300j97304j079587j21482K05179K13284k38098q89317
5089B1563829k89355q99383o98062J091554j166061L95035p30279o00516R10100
$$ plain form
5080 19576862 18374372 18838715 17908087 19438724 18540775 17801982 18012283 17381051 16982712
5071 16982712 16859186 16889124 17051556 17466353 18060828 17573793 18116963 16898464 17754073
5062 17754073 18509576 18233393 17707617 19285728 18554388 18178848 19241639 20166867 19788486
5053 19788486 21276154 20827003 22170012 22737516 23307555 24473787 25448088 26270846 26879787
5044 26879787 28813027 28726419 29481029 29387147 28891516 28405971 29714792 29099143 29926132
5035 29926132 29557053 29147814 29337086 30249577 29978875 30891224 30545938 32234878 31819041
5026 31819041 33233885 32950742 35592298 37383006 38788143 39990466 42838657 44291031
5018 44291031 47035845 49591449 51621434 53018265 54668288 56032579 57531427 59279111
$$ packed form
5080A9576862j202490M64343r30628J530637q97949p38793K10301o31232l98339
5071A6982712j23526K9938J62432M14797N94475m87035N43170j218499Q55609
5062A7754073P55503k76183n25776J578111p31340l75540J062791R25228l78381
5053A9788486J487668m49151J343009N67504N70039J166232R74301Q22758O08941
5044B6879787J933240q6608P54610r3882m95631m85545J308821o15649Q26989
5035B9926132l69079m09239J89272R12491k70702R12349l45286J688940m15837
5026C1819041J414844k83143K641556J790708J405137J202323K848191J452374
5018D4291031K744814K555604K029985J396831J650023J364291J498848J747684
$$ plain form
5010 59279111 57297654 57078804 55944832 56135039 54022997 52668504 50936141 50215449 47781390
5001 47781390 48489115 47842872 48195237 47395346 47392314 48773102 49354273 49922299 52400709
4992 52400709 54141617 55687682 57780956 60340042 63225669 65766968 67624543 68218424
4984 68218424 70183064 71393899 71906656 70895663 69936352 68278315 65400597 63521821
4976 63521821 61171856 57525282 55921566 53686468 51470309 49885770 49580091 47773388
4968 47773388 46961253 45209469 45120848 44075235 44381998 44931714 45680044 46264032 46770617
4959 46770617 47945043 48840049 49730364 51156619 51387274 51494482 50635429 51108710 49578497
4950 49578497 47416547 46620316 43738098 42076903 39892350 37857668 35982956 35040975
$$ packed form
5010E9279111j981457k18850j133972J90207k112042j354493j732363p20692k434059
5001D7781390P07725o46243L52365p99891l032J380788N81171N68026K478410
4992E2400709J740908J546065K093274K559086K885627K541299J857575N93881
4984F8218424J964640J210835N12757j010993r59311j658037k877718j878776
4976F3521821k349965l646574j603716k235098k216159j584539l05679j806703
4968D7773388q12135j751784q8621j045613L06763N49716P48330N83988N06585
4959D6770617J174426Q95006Q90315J426255K30655J07208q59053M73281j530213
4950D9578497k161950p96231k882218j661195k184553k034682j874712r41981
$$ plain form
4942 35040975 32735776 31845177 29990098 28786622 27745096 26483995 26112108 25865246 25741466
4933 25741466 25153598 23549263 24719324 24063666 24939040 23836507 23685655 23960012 22525154
4924 22525154 22846602 23565842 21563949 22098239 21998153 21263017 20048541 19084209 17251058
4915 17251058 18166929 17573153 15680157 16271898 15601056 14854405 14786536 14166645 14706374
4906 14706374 13375720 13351358 12581072 13096221 12464134 12178328 11830621 12716979 11955827
4897 11955827 11655873 12004756 11661333 11352924 10351441 10564194 10569853 11225579 10355991 12451056
4887 12451056 10701744 11701987 10884307 10732782 11040401 10815065 10247910 10574491 11075998
4878 11075998 9589478 9532148 10399076 10189786 10299982 9053357 10796599 9883575 9606831
$$ packed form
4942C5040975k305199q90599j855079j203476j041526j261101l71887k46862j23780
4933B5741466n87868j604335J170061o55658Q75374j102533j50852K74357j434858
4924B2525154L21448P19240k001893N34290j00086p35136j214476r64332j833151
4915A7251058R15871n93776j892996N91741o70842p46651o7869o19891N39729
4906A4706374j330654k4362p70286N15149o32087k85806l47707Q86358p61152
4897A1955827k99954L48883l43423l08409j001483K12753N659O55726q69588K095065
4887A2451056j749312J000243q17680j51525L07619k25336n67155L26581N01507
4878A1075998j486520n7330Q66928k09290J10196j246625J743242r13024k76744
$$ plain form
4869 9606831 9836060 10298321 9598467 9772882 10269984 9529972 10547265 10049815 10254526
4860 10254526 9629381 9714895 10272470 10021128 9787461 10288178 9729716 10486447 9466555
4851 9466555 9747560 9491303 9927741 10042764 11203331 10064282 9289183 9697463 10238137
4842 10238137 11250141 10234016 11338515 10968482 11068136 11145350 12198274 11386636 11007733
4833 11007733 12602245 11744663 11266654 11557976 12987551 13343937 12890803 12554990 13048243
4824 13048243 13559437 13311443 14273980 14411012 15265546 15905252 14851038 15210326 15665837
4815 15665837 17200323 16692712 17909855 18265714 18403994 18050537 18601263 19930094 21032933
4806 21032933 21322593 21741836 22759123 22642740 23589962 24747610 25420163 25777761 26273414
$$ packed form
4869I606831K29229M62261o99854J74415M97102p40012J017293m97450K04711
4860A0254526o25145Q5514N57575k51342k33667N00717n58462P56731j019892
4851I466555K81005k56257M36438J15023J160567j139049p75099M08280N40674
4842A0238137J012004j016125J104499l70033R9654P7214J052924q11638l78903
4833A1007733J594512q57582m78009K91322J429575L56386m53134l35813M93253
4824A3048243N11194k47994R62537J37032Q54534O39706j054214L59288M55511
4815A5665837J534486n07611J217143L55859J38280l53457N50726J328831J102839
4806B1032933K89660M19243J017287j16383R47222J157648O72553L57598M95653
$$ plain form
4797 26273414 27626533 27792561 28535987 29215298 29816002 31534078 32710922 31934270 33071229
4788 33071229 35098317 35881092 36469202 38014742 39265796 41013358 41401402 43617667 45936042
4779 45936042 47279237 49598999 52518128 56040578 58523751 60897060 65308803 67679788
4771 67679788 71605373 75881132 79421164 81800206 85606178 89110105 92483483 95427369
4763 95427369 99313405 102253866 106474860 110366043 113493271 117560332 121468918 125990734
4755 125990734 129918733 132848025 135593963 138852956 142154799 145495479 148798569 152665508
4747 152665508 156398911 159702717 162070719 163954872 164811995 166490327 165487450 164519426
4739 164519426 162448326 158182034 155660092 152418536 148808287 146337672 143160819 140833018
$$ packed form
4797B6273414J353119J66028P43426O79311O00704J718076J176844p76652J136959
4788C3071229K027088P82775N88110J545540J251054J747562L88044K216265K318375
4779D5936042J343195K319762K919129L522450K483173K373309M411743K370985
4771F7679788L925585M275759L540032K379042L805972L503927L373378K943886
4763I5427369L886036K940461M220994L891183L127228M067061L908586M521816
4755A25990734L927999K929292K745938L258993L301843L340680L303090L866939
4747A52665508L733403L303806K368002J884153Q57123J678332j002877r68024
4739A64519426k071100m266292k521942l241556l610249k470615l176853k327801
$$ plain form
4731 140833018 137630495 134554477 131236817 129120357 125278494 121563529 116489682 112458821
4723 112458821 109015383 106363520 102940978 99370987 96876498 93885973 90192798 86755262
4715 86755262 83681075 80127889 76305904 73225516 69025400 66401882 62937429 60662253
4707 60662253 58178421 54639358 52089282 50810579 48685151 45310820 44853346 43896509
4699 43896509 42187304 39975853 39040709 37138697 37032346 36173581 34526081 32909009 33612287
4690 33612287 31127948 31287671 29975164 29385193 28496468 27648716 26720636 26212363 23992428
4681 23992428 23728937 23245381 23175267 21873601 20806608 20888469 20140927 18827613 19847949
4672 19847949 18453041 17785183 18611485 16964601 16861822 16358825 15229272 14919801 14797051
$$ packed form
4731A40833018l202523l076018l317660k116460l841863l714965n073847m030861
4723A12458821l443438k651863l422542l569991k494489k990525l693175l437536
4715H6755262l074187l553186l821985l080388m200116k623518l464453k275176
4707F0662253k483832l539063k550076j278703k125428l374331m57474r56837
4699D3896509j709205k211451r35144j902012j06351q58765j647500j617072P03278
4690C3612287k484339J59723j312507n89971q88725q47752r28080n08273k219935
4681B3992428k63491m83556p0114j301666j066993Q1861p47542j313314J020336
4672A9847949j394908o67858Q26302j646884j02779n02997j129553l09471j22750
$$ plain form
4663 14797051 14716172 14760057 13622916 12576928 12957814 13633645 12162051 13252343 12149364
4654 12149364 12417524 11775596 12390548 11542112 10869187 10336421 11020374 10485260 11690819
4645 11690819 10893440 9751758 10289997 10332130 10136159 9624213 8931748 8857522 9266736 9226034
4635 9226034 8679615 8802995 7688840 9198849 8197052 8421760 9044205 8042928 8874133
4626 8874133 7780249 7333123 7844849 6748734 7753356 6888687 7401176 7749606 8101228
4617 8101228 6561035 6996442 6197910 7056480 7554755 7322235 7550558 7144774 6314095
4608 6314095 6453214 6457473 6941735 6845454 7259206 6012037 5358883 6030883 5722838 5867855
4598 5867855 5889117 5989815 6479486 5943351 6261201 6317930 6150542 5568961 5423304 5096980
$$ packed form
4663A4797051q0879M3885j137141j045988L80886O75831j471594J090292j102979
4654A2149364K68160o41928O14952q48436o72925n32766O83953n35114J205559
4645A1690819p97379j141682N38239M2133j95971n11946o92465p4226M09214m0702
4635I226034n46419J23380j114155J510009j001797K24708O22445j001277Q31205
4626H874133j093884m47126N11726j096115J004622q64669N12489L48430L51622
4617H101228j540193M35407p98532Q58570M98275k32520K28323m05784q30679
4608F314095J39119M259M84262r6281M13752j247169o53154O72000l08045J45017
4598E867855K1262J00698M89671n36135L17850N6729j67388n81581j45657l26324
$$ plain form
4588 5096980 5496621 5787578 6308194 5701674 6324145 6389071 5939951 4043360 5971604
4579 5971604 5625150 6334647 6136639 5011821 4931343 5600190 4175841 5881638 5005861
4570 5005861 6101644 5586040 4770179 5279665 5140269 5419768 5423202 5768190 5362244 5090598
4560 5090598 5421808 5562745 4233657 4335015 5536484 5883116 4973585 5879811 5019194
4551 5019194 6943760 5426918 5362591 4822051 5776142 5162588 5555019 5759720 5105253
4542 5105253 4977553 5184222 3837626 4255598 5349450 5042175 5630356 5850053 4691258
4533 4691258 5141928 4522637 4633473 4838522 4663682 4989845 4165002 4711393 5305704 5721422
4523 5721422 4598748 4893102 4298562 5214038 4948646 4946715 5204001 5365657 5014119 4577430
$$ packed form
4588E096980L99641K90957N20616o06520O22471O4926m49120j896591J928244
4579E971604l46454P09497j98008j124818q0478O68847j424349J705797q75777
4570E005861J095783n15604q15861N09486j39396K79499L434L44988m05946k71646
4560E090598L31210J40937j329088J01358J201469L46632r09531R06226q60617
4551E019194J924566j516842o4327n40540R54091o13554L92431K04701o54467
4542E105253j27700K06669j346596M17972J093852l07275N88181K19697j158795
4533D691258M50670o19291J10836K05049j74840L26163q24843N46391N94311M15718
4523E721422j122674K94354n94540R15476k65392j931K57286J61656l51538m36689
$$ plain form
4513 4577430 4673513 4588772 5099801 4210358 4281474 4812173 4533817 4585086 4515910 5412166
4503 5412166 4886092 3537154 4125235 5222550 3843855 5160746 5192714 4719699 5222829
4494 5222829 4402876 4825204 5207046 4616249 4036605 4688165 3711785 3871864 4364366 4150916
4484 4150916 4430418 4898625 4638127 4474201 5053785 3936826 4504924 4836522 5122333
4475 5122333 4991619 3358730 3986181 5399394 4679728 3055423 4480346 4640376 3517979
4466 3517979 5290448 4246325 4452608 5224508 4504136 4065524 4606824 4502404 5826052
4457 5826052 4333039 3989635 4183067 4300746 3447050 4461721 5098462 4849956 3225317
4448 3225317 3770909 4109428 3112842 4293865 5033589 3993515 4263517 4068003 4069316 4526796
$$ packed form
4513D577430R6083q4741N11029q89443P1116N30699k78356N1269o9176Q96256
4503E412166n26074j348938N88081J097315j378695J316891L1968m73015N03130
4494E222829q19953M22328L81842n90797n79644O51560r76380J60079M92502k13450
4484D150916K79502M68207k60498j63926N79584j116959N68098L31598K85811
4475E122333j30714j632889O27451J413213p19666j624305J424923J60030j122397
4466C517979J772469j044123K06283P71900p20372m38612N41300j04420J323648
4457E826052j493013l43404J93432J17679q53696J014671O36741k48506j624639
4448C225317N45592L38519r96586J181023P39724j040074K70002j95514J313M57480
$$ plain form
4438 4526796 4058445 4016492 3238518 3505439 5106777 4481480 4068775 4121239 3604930 3525703
4428 3525703 3441767 3109525 3996401 3704143 4561986 4446061 4252294 4033599 3615810 4243636
4418 4243636 4196850 5027956 5030647 3250364 4166080 3335252 4194014 3958263 4008001 3958710
4408 3958710 3883301 4305241 4171267 4896447 4732413 3946774 3711115 4704415 4018676 4975038
4398 4975038 4033006 4374135 4641028 5011214 4154015 4309967 4520994 4992726 4403064 4789168
4388 4789168 4492047 4404078 4482020 3143293 5333892 3579520 4440799 3437754 4599658
4379 4599658 5172065 4937091 4296213 5605048 5488242 4803870 4706425 5495608 5213167 4492887
4369 4492887 4781020 4995980 5467340 5606280 5193143 4487318 5638381 4603309 5366274
$$ packed form
4438D526796m68351m1953p77974K66921J601338o25297m12705N2464n16309p9227
4428C525703q3936l32242Q86876k92258Q57843j15925j93767k18695m17789O27826
4418D243636m6786Q31106K691j780283R15716q30828Q58762k35751M9738m9291
4408C958710p5409M21940j33974P25180j64034p85639k35659R93300o85739R56362
4398D975038r42032L41129K66893L70186q57199J55952K11027M71732n89662L86104
4388D789168k97121q7969P7942j338727K190599j754372Q61279j003045J161904
4379D599658N72407k34974o40878J308835j16806o84372r7445P89183k82441p20280
4369D492887K88133K14960M71360J38940m13137p05825J151063j035072P62965
$$ plain form
4360 5366274 5328737 5913928 5812720 5196149 6515843 5969992 5812289 4229243 5427189
4351 5427189 6650231 5416374 6159092 6127559 6235826 6792849 5436285 6350477 6918653
4342 6918653 6790921 6885347 7930160 7259745 7511982 8257398 7814331 7723525 9221744 9196059
4332 9196059 10602674 10300961 11298182 12062861 12505264 12669870 12547231 12149799 12439320
4323 12439320 11162579 11049701 10873062 10062497 9996883 10007393 10935426 10675280 10470181 10652520
4313 10652520 11293248 12014762 13521368 12242399 13792986 14127750 14820723 16004159 16402226
4304 16402226 19355939 21091042 21467239 22416876 25533774 24258871 23976892 22327785 20850395
4295 20850395 18464388 17381130 16157083 15139939 14223687 13647461 13195374 12729696 10737401
$$ packed form
4360E366274l7537N85191j01208o16571J319694n45851j57703j583046J197946
4351E427189J223042j233857P42718l1533J08267N57023j356564R14192N68176
4342F918653j27732R4426J044813o70415K52237P45416m43067r0806J498219k5685
4332I196059J406615l01713R97221P64679M42403J64606j22639l97432K89521
4323A2439320j276741j12878j76639q10565o5614J0510R28033k60146k05099J82339
4313A0652520O40728P21514J506606j278969J550587L34764O92973J183436L98067
4304A6402226K953713J735103L76197R49637L116898j274903k81979j649107j477390
4295B0850395k386007j083258j224047j017144r16252n76226m52087m65678j992295
$$ plain form
4286 10737401 9948968 11011297 9886210 9499914 10672342 10503225 10329446 11173092 9932568
4277 9932568 11216302 11347533 11131834 12084826 13053745 12692318 13621754 11644185 11739521
4268 11739521 10748862 10386538 10102045 8384445 8882334 8794580 7228116 7103182 7273559
4259 7273559 6621559 6480141 6108953 6757436 6984389 6657768 5737149 5667053 5883114 5036429
4249 5036429 5019024 4898944 6960429 6497685 5397923 4332399 5389256 4886876 4486893
4240 4486893 5391648 5882917 4958863 4051501 4606843 3396578 4063521 4300976 4294809 4648425
4230 4648425 4068528 4699789 4165048 4224362 4954893 4226371 6005590 4609786 4264474
4221 4264474 4503796 3572355 3994452 3630696 3550030 4342057 2931602 3809126 3298602 4804251
$$ packed form
4286A0737401p88433J062329j125087l86296J172428j69117j73779Q43646j240524
4277I932568J283734J31231k15699R52992R68919l61427R29436j977569R5336
4268A1739521r90659l62324k84493j717600M97889q7754j566464j24934J70377
4259G273559o52000j41418l71188O48483K26953l26621r20619p0096K16061q46685
4249E036429j7405j20080K061485m62744j099762j065524J056857n02380l99983
4240D486893R04755M91269r24054r07362N55342j210265O66943K37455o167L53616
4230D648425n79897O31261n34741N9314P30531p28522J779219j395804l45312
4221D264474K39322r31441M22097l63756q0666P92027j410455Q77524n10524J505649
$$ plain form
4211 4804251 3078979 4372105 3215197 4411953 2891923 5148592 3883769 4020395
4203 4020395 3750009 4079386 3478744 3198662 3753021 3499278 3674922 4939358 3017582
4194 3017582 3481596 3890378 3080722 4411211 2936818 3211259 3947235 3450782 3253697
4185 3253697 3808184 3427076 3784829 3010375 3447010 3306958 3969904 2674278 2544376
4176 2544376 3753483 3607936 3001219 3230584 3633520 3396562 3105113 2848519 2711830
4167 2711830 2618129 2693503 2827762 2763791 3117782 3996530 2321427 2696892 3211404 3124288
4157 3124288 2798002 3550820 2857597 3382736 2040876 1776594 2318604 2986626 2430366
4148 2430366 2971375 2613509 3182157 3004729 2491635 2742671 2578800 2864047 2740465 3562590
$$ packed form
4211D804251j725272J293126j156908J196756j520030K256669j264823J36626
4203D020395k70386L29377o00642k80082N54359k53743J75644J264436j921776
4194C017582M64014M08782q09656J330489j474393K74441P35976m96453j97085
4185C253697N54487l81108L57753p74454M36635j40052O62946j295626j29902
4176B544376J209107j45547o06717K29365M02936k36958k91449k56594j36689
4167B711830r3701P5374J34259o3971L53991Q78748j675103L75465N14512q7116
4157C124288l26286P52818o93223N25139j341860k64282N42010O68022n56260
4148B430366N41009l57866N68648j77428n13094K51036j63871K85247j23582Q22125
$$ plain form
4138 3562590 2261555 2360114 2533155 2973525 2404512 2666723 2292506 2983196 2477476 3255095
4128 3255095 2672943 2496879 1896637 2873078 2319844 2320803 2491267 3535713 3150252 2999774
4118 2999774 1335289 2349470 3421737 2273346 2400776 3004660 2419848 2027445 2303699
4109 2303699 2470631 2194826 2894817 2219580 2308141 3497966 2509910 2088716 3130335
4100 3130335 2440567 3846241 1868315 2302352 2236596 2308920 2556553 2791906 2585818 2480910
4090 2480910 2496778 2717383 3072086 1756606 2980335 2580803 2873421 1948429 3314505
4081 3314505 2683418 2791124 2113011 1737731 2221138 2773977 2669462 2529844 2981728 3130423
4071 3130423 1610432 1927408 2769010 2104670 2569816 1766904 2670254 2720795 2428786 2030958
$$ packed form
4138C562590j301035R8559J73041M40370n69013K62211l74217O90690n05720P77619
4128C255095n82152j76064o00242R76441n53234R59J70464J044446l85461j50478
4118B999774j664485J014181J072267j148391J27430O03884n84812l92403K76254
4109B303699J66932k75805O99991o75237Q8561J189825r88056m21194J041619
4100C130335o89768J405674j977926M34037o5756P2324K47633K35353k06088j04908
4090B480910J5868K20605L54703j315480J223729l99532K92618r24992J366076
4081C314505o31087J07706o78113l75280M83407N52839j04515j39618M51884J48695
4071C130423j519991L16976Q41602o64340M65146q02912R03350N0541k92009l97828
$$ plain form
4061 2030958 2359145 2549161 3127409 2816059 2306510 2064020 3499786 2581781 2614846 2558940
4051 2558940 3318666 2166631 2945319 3019396 2389022 2660095 2644017 2218382 2973068 3810103
4041 3810103 2416703 3560659 3071451 3013779 3331803 3314876 3719789 3291725 3481058 2726631
4031 2726631 3124652 3193088 3421278 3127749 3291456 2263952 2434010 3779311 3544383
4022 3544383 3635696 3633644 3027752 3131860 4220439 3873356 3382004 3819051 3866221 3407468
4012 3407468 3464723 3001821 3211479 3288584 3601980 2832503 3628547 2565915 3543538 2550647
4002 2550647 4009892 2509509 3976768 2813454 3402222 3577098 3944134 3885299 2592706
3993 2592706 3882888 3438023 4146145 3333461 3233878 3381828 4258783 2501513 4174994
$$ packed form
4061B030958L28187J90016N78248l11350n09549k42490J435766r18005L3065n5906
4051B558940P59726j152035P78688P4077o30374K71073j6078m25635P54686Q37035
4041C810103j393400J143956m89208n7672L18024j6927M04913m28064J89333p54427
4031B726631L98021O8436K28190k93529J63707j027504J70058J345301k34928
4022C544383R1313k052o05892J04108J088579l47083m91352M37047M7170m58753
4012C407468N7255m62902K09658P7105L13396p69477P96044j062632R77623r92891
4002B550647J459245j500383J467259j163314N88768J74876L67036n8835j292593
3993B592706J290182m44865P08122q12684r9583J47950Q76955j757270J673481
$$ plain form
3984 4174994 3425873 3531258 3275624 4347452 3114224 2803870 3273160 2633579 3213971
3975 3213971 4120884 3306835 2774107 3200409 2779278 2417107 2787284 2887104 2783660 3082618
3965 3082618 2838354 3273193 2246864 2662105 2860419 3027391 2375163 2787877 2359810
3956 2359810 3469500 3112823 2731803 2968878 2753475 2366428 3386640 1225548 2192287
3947 2192287 986233 2358107 1799358 2579640 1961247 2022848 2202820 2586295 1532070
3938 1532070 1957072 1996478 2111726 2623627 1361297 2587911 1905102 2336474 2483162
3929 2483162 2775384 1325840 2503611 2393766 1760915 2110088 2507728 1950016 1784267
3920 1784267 1866317 2530918 2546118 2525259 1980303 1555307 1592547 1053942 1141992 1684944
$$ packed form
3984D174994p49121J05385k55634J071828j233228l10354M69290o39581N80392
3975C213971R06913q14049n32728M26302m21131l62171L70177R9820j03444K98958
3965C082618k44264M34839j026329M15241J98314J66972o52228M12714m28067
3956B359810J109690l56677l81020K37075k15403l87047J020212k161092R66739
3947B192287j206054J371874n58749P80282o18393O1601J79972L83475j054225
3938A532070M25002L9406J15248N11901j262330J226614o82809M31372J46688
3929B483162K92222j449544J177771j09845o32851L49173L97640n57712j65749
3920A784267Q2050O64601J5200k0859n44956m24996L7240n38605Q8050N42952
$$ plain form
3910 1684944 2080356 2414941 1740745 1315467 1628724 1360619 1518366 2481114 2865091 1063052
3900 1063052 1231821 1326212 1089854 488907 1819441 1411941 1041957 2325333 1879134
3891 1879134 2463375 1816002 882953 1989566 1866743 288672 1934212 1832146 1927838
3882 1927838 1882558 1382561 1614509 2247073 703305 2030109 2500517 2581366 2272005 1531107
3872 1531107 1017677 1480902 953943 1254997 2153968 1822834 2265399 451835 811120
3863 811120 978204 2430477 2631281 2287352 2220446 1206298 1668813 1842976 1274236 1100881
3853 1100881 2480385 1248589 766125 1073004 1331508 743422 2024852 1371492 1753862
3844 1753862 1798676 2042130 928213 2586681 1133435 1243628 649830 1760668 1398191
$$ packed form
3910A684944L95412L34585o74196m25278L13257k68105J57747R62748L83977j802039
3900A063052J68769R4391k36358o00947J330534m07500l69984J283376m46199
3891A879134N84241o47373r33049J106613j22823j578071J645540j02066R5692
3882A927838m5280m99997K31948O32564j543768J326804M70408Q0849l09361p40898
3872A531107n13430M63225n26959L01054Q98971l31134M42565j813564L59285
3863H11120J67084J452273K00804l43929o6906j014148M62515J74163n68740j73355
3853A100881J379504j231796m82464L06879K58504n88086J281430o53360L82370
3844A753862M4814K43454j113917J658468j453246J10193n93798J110838l62477
$$ plain form
3835 1398191 972924 2009458 1468066 1816486 1854954 1803331 718890 625393 916534 2125244
3825 2125244 1489958 1509792 1560586 1189506 1375543 1890909 1596371 1903573 1663883 1566604
3815 1566604 940549 1530634 784888 2509476 1788875 1862493 1604470 1448151 2014494 1517096
3805 1517096 2093126 1347218 1606748 448465 597626 1173636 1807837 877378 44947
3796 44947 649558 1465061 690179 1108215 2156253 1551791 1438063 1375006 1478393 1898606
3786 1898606 1184726 1676991 928591 1037350 2031369 1834981 1945636 578159 1426166
3777 1426166 952122 312062 810764 1323851 464753 1312871 1516358 636649 997510 1827836
3767 1827836 876633 876612 1902633 1898197 1381725 1939933 1830444 1934329 1170238 2130417
$$ packed form
3835A398191m25267J036534n41392L48420L8468n1623j084441r3497K91141J208710
3825B125244o35286J9834N0794l71080J86037N15366k94538L07202k39690r7279
3815A566604o26055N90085p45746J724588p20601P3618k58023j56319N66343m97398
3805A517096N76030p45908K59530j158283J49161N76010O34201r30459q32431
3796D4947O04611Q15503p74882M18036J048038o04462j13728o3057J03387M20213
3786A898606p13880M92265p48400J08759R94019j96388J10655j367477Q48007
3777A426166m74044o40060M98702N13087q59098Q48118K03487q79709L60861Q30326
3767A827836r51203k1J026021m436n16472N58208j09489J03885p64091R60179
$$ plain form
3757 2130417 1207495 1400548 1886485 1178376 1445006 1612387 1057993 212782 1483056
3748 1483056 607719 2111960 1190158 1032685 1439368 1455404 1006184 1870826 1601669 1192387
3738 1192387 1937922 1484318 2386555 1017124 934118 1428731 639507 1054983 636204 810281
3728 810281 1618152 626618 1596394 1166415 1542063 1589899 1241265 929470 2326253 1463876
3718 1463876 1171184 1726083 2312844 1237109 1361614 2007483 1970654 1660792 503930
3709 503930 1412371 100718 1240976 -111903 1929607 828242 1996820 1755517 1987108
3700 1987108 1887396 2561881 1228439 1061615 1609220 999982 1135933 755005 2415088
3691 2415088 1914210 1514511 1183692 1399858 760449 1285683 1433334 1260585 965729 1674087
$$ packed form
3757B130417r22922J93053M85937p08109K66630J67381n54394q45211J270274
3748A483056q75337J504241r21802j57473M06683J6036m49220Q64642k69157m09282
3738A192387P45535m53604R02237j369431q3006M94613p89224M15476m18779J74077
3728H10281Q07871r91534R69776m29979L75648M7836l48634l11795J396783q62377
3718A463876k92692N54899N86761j075735J24505O45869l6829l09862j156862
3709E03930R08441j311653J140258j352879K041510j101365J168578k41303K31591
3700A987108r9712O74485j333442j66824N47605o09238J35951l80928J660083
3691B415088n00878l99699l30819K16166o39409N25234J47651j72749k94856P08358
$$ plain form
3681 1674087 1487473 2250271 1745601 2072694 702133 1228920 1647104 1192575 844564
3672 844564 910042 1919540 1350774 266437 1358702 1971471 1024343 1561590 1594514 710209
3662 710209 941854 1637406 1198291 2021710 1837702 1794113 1355078 1133085 381531 830261
3652 830261 1575597 1227655 1346030 1202761 1658533 1100716 537939 1178360 942371 835252
3642 835252 482682 1345277 1683174 1375743 281489 1166543 477396 739612 1093439 713607
3632 713607 1664820 900086 1355479 33575 913034 1109334 1202169 334866 1890404 1716364
3622 1716364 933100 963029 408163 528870 242419 1437175 1040038 1357052 1244540 1779949
3612 1779949 1052947 1101447 -770767 1272362 1621679 584216 1575030 1283509 824550
$$ packed form
3681A674087j86614P62798n04670L27093j370561N26787M18184m54529l48011
3672H44564O5478J009498n68766j084337J092265O12769r47128N37247L2924q84305
3662G10209K31645O95552m39115Q23419j84008m3589m39035k21993p51554M48730
3652H30261P45336l47942J18375j43269M55772n57817n62777O40421k35989j07119
3642H35252l52570Q62595L37897l07431j094254Q85054o89147K62216L53827l79832
3632G13607R51213p64734M55393j321904Q79459J96300R2835q67303J555538j74040
3622A716364p83264K9929n54866J20707k86451J194756l97137L17014j12512N35409
3612A779949p27002M8500j872214K043129L49317j037463R90814k91521m58959
$$ plain form
3603 824550 2412340 1409641 1136678 1132232 2506319 603369 1822460 1068899 948803
3594 948803 1585176 623215 1596298 1056397 1207491 1249869 2567698 1080841 973674 546139
3584 546139 1747583 1310219 1314926 1850763 1790652 1351206 1581484 1298784 917490 1400776
3574 1400776 1076874 736674 746308 2260004 1688559 1400760 1298430 2237406 1426007 1362081
3564 1362081 1632470 2199902 933603 1394963 1872564 2608678 2698863 2249937 2188571 1589248
3554 1589248 1988425 1561905 2543542 2641282 4091525 1811635 2573303 2063520 2290620
3545 2290620 662724 2009009 1538598 1821220 2675553 841554 730246 1614280 2347023
3536 2347023 1511488 1506223 2102197 2329486 2771034 611091 1433956 1509263 801575 545753
$$ packed form
3603H24550J587790j002699k72963m446J374087j902950J219091p53561j20096
3594I48803O36373r61961R73083n39901J51094M2378J317829j486857j07167m27535
3584E46139J201444m37364M707N35837o0111m39446K30278k82700l81294M83286
3574A400776l23902l40200R634J513696n71445k87799j02330R38976q11399o3926
3564A362081K70389N67432j266299M61360M77601P36114R0185m48926o1366n99323
3554A589248L99177m26520R81637R7740J450243k279890P61668n09783K27100
3545B290620j627896J346285m70411K82622Q54333j833999j11308Q84034P32743
3536B347023q35535n265N95974K27289M41548k159943Q22865P5307p07688k55822
$$ plain form
3526 545753 1034096 230019 1554531 1357707 1707655 2222240 2306931 1068511 1943228 2257181
3516 2257181 1635809 862697 1755188 930745 2262991 1365125 1662780 1638183 1161710 2735230
3506 2735230 1570993 1339328 1320324 748248 1485049 2353174 2340921 2225552 1693664 1201681
3496 1201681 1853671 2338274 1201154 2669987 1383518 1420304 1084894 2162225 1140858
3487 1140858 1312835 1884887 1667018 1466791 1889861 1797929 2166863 2351171 2550906 2073047
3477 2073047 1364954 1548543 1856853 2444721 1301368 2300169 2552164 2380282 2330076 2746430
3467 2746430 1461941 3151833 2183222 2803981 3046861 2754619 1229926 2107797 2271115
3458 2271115 2767983 2305584 2780041 3353727 1523273 2428083 2682913 2637752 3361646 2525369
$$ packed form
3526E45753M88343q04077J324512j96824L49948N14585Q4691j238420Q74717L13953
3516B257181o21372p73112Q92491q24443J332246q97866K97655k4597m76473J573520
3506B735230j164237k31665j9004n72076P36801Q68125j2253j15369n31888m91983
3496A201681O51990M84603j137120J468833j286469L6786l35410J077331j021367
3487A140858J71977N72052k17869k00227M23070r1932L68934J84308J99735m77859
3477B073047p08093J83589L08310N87868j143353R98801K51995j71882n0206M16354
3467B746430j284489J689892r68611O20759K42880k92242j524693Q77871J63318
3458B271115M96868m62399M74457N73686j830454R04810K54830m5161P23894q36277
$$ plain form
3448 2525369 3269582 2889810 3363914 3081935 3079446 3084504 2333481 3379171 3188241 3281099
3438 3281099 3255143 2844900 4322861 2769160 2175691 2547344 2730785 2436335 3080771
3429 3080771 3397842 3091935 4180795 3474652 3556886 3791104 2575294 3710125 4708427
3420 4708427 4146699 4059130 4564938 4539006 4612036 3247242 3043801 4106254 4576334 3461593
3410 3461593 4066216 4134089 4080608 3943458 4188603 4818727 4779253 5015746 5277154 4632684
3400 4632684 4944327 4949067 5313967 5954626 7241396 6220069 6499746 6670890 6610648 6316617
3390 6316617 5974011 5939920 6360396 6363924 6909018 6893066 7032394 5428544 6349585 5897997
3380 5897997 7213766 7068790 7401975 6541873 7563601 8042603 7529492 7284576 8745155
$$ packed form
3448B525369P44213l79772M74104k81979k489N058p51023J045690j90930R2858
3438C281099k5956m10243J477961j553701n93469L71653J83441k94450O44436
3429C080771L17071l05907J088860p06143Q2234K34218j215810J134831R98302
3420D708427n61728q7569N05808k5932P3030j364794k03441J062453M70080j114741
3410C461593O04623O7873n3481j37150K45145O30124l9474K36493K61408o44470
3400D632684L11643M740L64900O40659J286770j021327K79677J71144o0242k94031
3390F316617l42606l4091M20476L528N45094j5952J39328j603850R21041m51588
3380E897997J315769j44976L33185q60102J021728M79002n13111k44916J460579
$$ plain form
3371 8745155 9420474 8781114 8590883 8372255 8986558 9332565 9145297 9198130 9845698 9901991
3361 9901991 9458791 9299795 8549222 10881427 10812003 10379098 11429682 11121499 11183071 12140546
3351 12140546 12861191 13620024 13502925 14327136 14989895 15221777 16639320 18186979 18702721
3342 18702721 18707682 20527086 21927073 23773601 25633410 28133428 29007142 32559517 36081915
3333 36081915 38918119 43490190 48101425 52969391 56143805 64593460 74418009 86298060
3325 86298060 97384748 110707130 135215338 164989000 190927899 219458090 233024244
3318 233024244 227070105 203772438 173956218 146185256 130801904 116185819 97828440
3311 97828440 83573885 73013939 65844468 59137532 53890322 51051564 47276970 43951226
$$ packed form
3371H745155O75319o39360j90231k18628O14303L46007j87268N2833O47568N6293
3361I901991m43200j58996p50573K332205o9424m32905J050584l08183O1572R57475
3351A2140546P20645P58833j17099Q24211O62759K31882J417543J547659N15742
3342A8702721M961J819404J399987J846528J859809K500018Q73714L552375L522398
3333C6081915K836204M572071M611235M867966L174414Q449655R824549J1880051
3325H6298060J1086688J3322382K4508208K9773662K5938899K8530191J3566154
3318B33024244n954139k3297667k9816220k7770962j5383352j4616085j8357379
3311I7828440j4254555j0559946p169471o706936n247210k838758l774594l325744
$$ plain form
3303 43951226 41352700 38053563 36632066 34660870 32396988 30538566 30682148 27501248
3295 27501248 27389374 25668061 24720926 23563118 22915561 21301555 21338827 19574388 19373073
3286 19373073 17941588 18446565 17226431 16794485 15789165 14819350 14300947 13673993 14072175
3277 14072175 12993275 13662151 11432227 11433774 10221129 10879863 10682132 10034029 9328343
3268 9328343 9184732 8312411 9171493 9226357 8299006 9428846 7981421 7370502 7948240
3259 7948240 7344764 7492053 7613490 7787518 7694117 6799930 6772206 6457196 6224582 6526337
3249 6526337 6420866 5347703 4814132 5592258 6268378 5133158 4784154 5735410 5814098
3240 5814098 5353681 4296477 5031790 5634332 5698625 5503523 4869639 5234895 5214121 3967464
$$ packed form
3303D3951226k598526l299137j421497j971196k263882j858422J43582l180900
3295B7501248j11874j721313r47135j157808o47557j614006L7272j764439k01315
3286A9373073j431485N04977j220134m31946j005320r69815n18403o26954L98182
3277A4072175j078900O68876k229924J547j212645O58734j97731o48103p05686
3268I328343j43611q72321Q59082N4864r27351J129840j447425o10919N77738
3259G948240o03476J47289J21437J74028r3401q94187k7724l15010k32614L01755
3249F526337j05471j073163n33571P78126O76120j135220l49004R51256P8688
3240E814098m60417j057204P35313O02542O4293j95102o33884L65256k0774j246657
$$ plain form
3230 3967464 5733270 4332824 3366959 4577352 4475076 3836352 4278283 4587386 3923220
3221 3923220 3308718 2917407 2834290 4200919 4131466 4436625 4013316 2279712 3908061
3212 3908061 3212230 4400710 3230073 3564484 3722917 4325657 3640063 5085645 3067344
3203 3067344 2988974 3831876 3133288 3504863 3839695 3153482 3136908 2798217 2158734 2828142
3193 2828142 2950348 3435503 3272121 2573419 2403755 2458980 2039524 1998601 3169412 2964194
3183 2964194 3304789 2769038 1577348 2983566 2257467 2887542 2993975 2106527 3454223
3174 3454223 2257263 2223337 1773888 2735157 1359812 1758587 2782714 1605464 2612841
3165 2612841 2818089 2486284 1748020 2042536 2024138 2247494 2291281 1480760 2495513 2681451
$$ packed form
3230C967464J765806j400446r65865J210393j02276o38724M41931L09103o64166
3221C923220o14502l91311q3117J366629o9453L05159m23309j733604J628349
3212C908061o95831J188480j170637L34411J58433O02740o85594J445582k018301
3203C067344p8370Q42902o98588L71575L34832o86213j6574l38691o39483O69408
3193B828142J22206M85155j63382o98702j69664N5225m19456m0923J170811k05218
3183B964194L40595n35751j191690J406218p26099O30075J06433q87448J347696
3174C454223j196960l3926m49449R61269j375345L98775J024127j177250J007377
3165B612841K05248l31805p38264K94516j8398K23356M3787q10521J014753J85938
$$ plain form
3155 2681451 1796969 1558494 2048500 2010229 2180270 2113678 1604408 2594278 2327328 1524414
3145 1524414 1343763 2332180 2035017 1409415 2194773 1702330 2945218 866557 947442
3136 947442 1067237 1684956 2414574 2101884 2053831 2039551 1810748 1482921 1554173 2106233
3126 2106233 2407109 1378641 2496101 1921593 2323368 2713179 1128301 2250567 2090519
3117 2090519 1948924 1666113 1159134 2220594 1473381 1464488 1754065 2970298 1583496
3108 1583496 2710432 1517424 1522825 1267029 2582586 1233479 2405709 1809218 1208452
3099 1208452 1686394 2429571 953262 2780918 2267843 1377299 1379549 2865964 2489373
3090 2489373 1645848 1928307 1720570 2463703 2569485 1373605 2974527 3416129 2406851
$$ packed form
3155B681451q84482k38475M90006l8271J70041o6592n09270R89870k66950q02914
3145A524414j80651R88417k97163o25602P85358m92443J242888k078661Q0885
3136I47442J19795O17719P29618l12690m8053j4280k28803l27827P1252N52060
3126B106233L00876j028468J117460n74508M01775L89811j584878J122266j60048
3117B090519j41595k82811n06979J061460p47213q893K89577J216233j386802
3108A583496J126936j193008N401k55796J315557j349107J172230n96491o00766
3099A208452M77942P43177j476309J827656n13075q90544K250J486415l76591
3090B489373q43525K82459k07737P43133J05782j195880J600922M41602j009278
$$ plain form
3081 2406851 2625074 1801291 2402595 2833146 3272980 2868876 2056048 1539967 2367979 929969
3071 929969 1162674 1235885 1449066 1610503 1179762 1499719 1076029 1262636 1933834 1558541
3061 1558541 1804424 2623978 2919126 1755694 2298539 1866962 1937695 643025 1508779
3052 1508779 965227 588775 2760542 1740271 1824724 736223 1804862 1709224 1550180
3043 1550180 1646492 930800 1376607 850002 295119 1132058 1614175 1591319 1203482 1273488
3033 1273488 1055727 1510415 955179 1042667 1104529 1469072 1257191 1211429 1643918 1087564
3023 1087564 1197914 1014694 1736470 327820 1222308 1504620 847078 1058750 1145471 699877
3013 699877 1434053 1200481 1109042 1392092 1487014 445121 1438062 -409564 948350 945833
$$ packed form
3081B406851K18223q23783O01304M30551M39834m04104q12828n16081Q28012j438010
3071I29969K32705P3211K13181J61437m30741L19957m23690J86607O71198l75293
3061A558541K45883Q19554K95148j163432N42845m31577P0733j294670Q65754
3052A508779n43552l76452K171767j020271Q4453j088501J068639r5638j59044
3043A550180R6312p15692M45807n26605n54883Q36939M82117k2856l87837P0006
3033A273488k17761M54688n55236Q7488O1862L64543k11881m5762M32489n56354
3023A087564J10350j83220P21776j408650Q94488K82312o57542K11672Q6721m45594
3013F99877P34176k33572r1439K83050R4922j041893R92941j847626J357914k517
$$ plain form
3003 945833 1503943 1968191 612616 1099958 1564317 1541726 1319489 1220441 974118 268072
2993 268072 708625 950753 756256 1788869 523066 995483 1248061 537121 2335554
2984 2335554 1685411 914659 1702571 1321406 1629012 1731277 1171815 479220 704133 834204
2974 834204 500753 432107 367650 777771 1446720 1105466 1426799 1243724 376520 970249
2964 970249 558454 2049891 1446956 1583337 1506487 519357 1126481 1901148 1447456 1309615
2954 1309615 1404282 1318109 1579286 299496 701000 250113 729762 724913 787319 1142495
2944 1142495 1637064 404997 275538 1070454 779367 377392 1224663 1221282 2843852 1513379
2934 1513379 1279990 1210764 1063489 1185156 617490 1670115 1843101 777263 -202979
$$ packed form
3003I45833N58110M64248j355575M87342M64359k2591k22237r9048k46323p06046
2993B68072M40553K42128j94497J032613j265803M72417K52578p10940J798433
2984B335554o50143p70752P87912l81165L07606J02265n59462o92595K24913J30071
2974H34204l33451o8646o4457M10121O68949l41254L21333j83075q67204N93729
2964I70249m11795J491437o02935J36381p6850r87130O07124P74667m53692j37841
2954A309615R4667q6173K61177j279790M01504m50887M79649m849O2406L55176
2944A142495M94569j232067j29459P94916k91087m01975Q47271l381J622570j330473
2934A513379k33389o9226j47275J21667n67666J052625J72986j065838r80242
$$ plain form
2925 -202979 1725774 409654 895935 1090637 779884 914479 1360532 1427760 817895 1712982
2915 1712982 1730121 858243 1457146 423043 1926892 559035 749113 344232 519884
2906 519884 -24031 142474 1315220 870640 1149714 -178783 1728684 238519 1833514
2897 1833514 1181788 1404332 948554 1050266 983141 1082122 756341 777401 866830 1291117
2887 1291117 1111268 421863 1121056 668955 1329439 -223110 746673 1422858 893375
2878 893375 1130119 2009847 600740 1054003 457055 845490 269690 734840 1290368 1410631
2868 1410631 1138990 351730 1240775 581458 1263715 2205861 2107292 845570 1474688 771585
2858 771585 645149 81091 518588 2011130 973733 33100 1644294 720180 1630542
$$ packed form
2925b02979J928753j316120M86281J94702l10753J34595M46053O7228o09865Q95087
2915A712982J7139q71878N98903j034103J503849j367857J90078m04881J75652
2906E19884n43915J66505J172746m44580K79074j328497J907467j490165J594995
2897A833514o51726K22544m55778J01712o7125R8981l25781K1060Q9429M24287
2887A291117j79849o89405O99193m52101O60484j552549R69783O76185n29483
2878H93375K36744Q79728j409107M53263n96948L88435n75800M65150N55528J20263
2868A410631k71641p87260Q89045o59317O82257R42146r8569j261722O29118p03103
2858G71585j26436n64058M37497J492542j037397r40633J611194r24114R10362
$$ plain form
2849 1630542 -17167 443012 594879 1380086 1433731 1902719 2190395 808357 569863
2840 569863 276559 1071258 878709 768657 139648 534304 587536 621810 1200901 600147
2830 600147 1280106 1313710 1315659 773025 -33365 737991 -224918 565261 837073 291594
2820 291594 1430063 417564 342125 879488 1031374 310052 799222 1030902 1681443 2600437
2810 2600437 1186943 -160892 776913 884205 751676 873064 527601 1123227 810399
2801 810399 811569 1010925 523773 1897973 1025604 950396 1469479 276646 627762 1399781
2791 1399781 -549215 999418 815981 1288962 133856 902900 966251 1466150 1132068
2782 1132068 582049 1318036 1229154 591243 584092 1095359 579317 783393 421108 1776173
$$ packed form
2849A630542j647709M60179J51867P85207N3645M68988K87676j382038k38494
2840E69863k93304P94699j92549j10052o29009L94656N3232L4274N79091o00754
2830F00147O79959L3604J949n42634q06390P71356r62909P90179K71812n45479
2820B91594J138469j012499p5439N37363J51886p21322M89170K31680O50541R18994
2810B600437j413494j347835R37805J07292j32529J21388l45463N95626l12828
2801H10399J170J99356m87152J374200q72369p5208N19083j192833L51116P72019
2791A399781j948996J548633j83437M72981j155106P69044O3351M99899l34082
2782A132068n50019P35987q8882o37911p151N11267n16042K04076l62285J355065
$$ plain form
2772 1776173 -525546 1464114 1119067 1607807 203982 106563 436211 1085172 195570
2763 195570 1378142 1274449 1600887 -173361 819882 1912845 -37451 769147 869906
2754 869906 1784305 1467271 937025 693882 1032167 271846 925917 -154734 1471579
2745 1471579 378111 1230545 1383496 1113117 959221 1723280 382564 746734 798766
2736 798766 1089830 1121418 677255 912033 1171550 1942159 942673 846348 1138417 1128929
2726 1128929 1086768 1028837 45186 1862891 1257880 1327219 1025394 1556268 453818 407588
2716 407588 2291739 880686 757311 1295299 1611671 619462 1365443 -18247 853044
2707 853044 858281 317870 570049 1028118 450359 1661246 185170 1473839 475827 1038917
$$ packed form
2772A776173k301719J989660l45047M88740j403825r7419L29648O48961q89602
2763A95570J182572j03693L26438j774248R93243J092963j950296Q06598J00759
2754H69906R14399l17034n30246k43143L38285p60321O54071j080651J626313
2745A471579j093468Q52434J52951k70379j53896P64059j340716L64170N2032
2736G98766K91064L1588m44163K34778K59517P70609r99486r6325K92069r488
2726A128929m2161n7931r83651J817705o05011O9339l01825N30874j102450m6230
2716D07588J884151j411053j23375N37988L16372r92209P45981j383690Q71291
2707H53044N237n40411K52179M58069n77759J210887j476076J288669r98012N63090
$$ plain form
2697 1038917 948573 1540179 714473 549516 -245792 691156 2018167 1228704 1091402 1609854
2687 1609854 330401 1190670 2292306 930368 1384698 2143392 571378 19588 618043
2678 618043 323813 729740 73386 1018514 812736 272353 1033551 870916 883244 552699
2668 552699 1774484 824877 752858 338486 352141 1063472 1097470 658153 1523969 993515
2658 993515 1212691 942015 -195509 760542 976818 125840 -158415 1024830 1690828
2649 1690828 1369830 281166 139393 1156678 16560 887526 1198487 1713186 1089422
2640 1089422 200164 1222474 680582 714021 204679 1225168 707747 1023957 649283
2631 649283 599160 834872 1217123 1263680 1058016 491007 1056869 176385 1594627 1823396
$$ packed form
2697A038917r0344N91606q25706j64957p95308R36948J327011p89463j37302N18452
2687A609854j279453Q60269J101636j361938M54330P58694j572014n51790N98455
2678F18043k94230M05927o56354R45128k05778n40383P61198j62635J2328l30545
2668E52699J221785r49607p2019m14372J3655P11331L3998m39317Q65816n30454
2658I93515K19176k70676j137524R56051K16276q50978k84255J183245O65998
2649A690828l20998j088664j41773J017285j140118Q70966L10961N14699o23764
2640A089422q89258J022310n41892L3439n09342J020489n17421L16210l74674
2631F49283n0123K35712L82251M6557k05664n67009N65862q80484J418242K28769
$$ plain form
2621 1823396 1859620 1749785 1867320 660112 1111750 691382 315925 289498 514096 895467
2611 895467 943224 1379074 1161539 1998741 1301665 1415750 297474 197999 524474 993206
2601 993206 963921 1293161 1126124 960118 1159994 413035 1605300 535890 849688 727859
2591 727859 1191768 438473 958375 1013699 1139517 230794 827720 550393 460176 -47153
2581 -47153 902059 335089 476631 1053157 -318329 244069 1991690 1453801 1029144 1537338
2571 1537338 166602 803638 1468689 424315 996276 1822827 500076 1674387 872415
2562 872415 1144943 708065 240303 588813 307066 5906 -334979 1039384 645918 1164186
2552 1164186 1829571 830675 1049308 461523 288222 681194 613950 1163363 302324 1240526
$$ packed form
2621A823396L6224j09835J17535j207208M51638m20368l75457k6427K24598L81371
2611H95467M7757M35850k17535Q37202o97076J14085j118276r9475L26475M68732
2601I93206k9285L29240j67037j66006J99876p46959J192265j069410L13798j21829
2591G27859M63909p53295N19902N5324J25818r08723N96926k77327r0217n07329
2581d7153R49212n66970J41542N76526j371486N62398J747621n37889m24657N08194
2571A537338j370736O37036O65051j044374N71961Q26551j322751J174311q01972
2562H72415K72528m36878m67762L48510k81747l01160l40885J374363l93466N18268
2552A164186O65385r98896K18633n87785j73301L92972o7244N49413q61039R38202
$$ plain form
2542 1240526 1093075 618328 433840 1409042 1047616 287755 823580 1010776 433096 1053297
2532 1053297 609710 397778 1439984 1314913 2213875 1532665 1159012 539218 744100
2523 744100 814665 648244 261528 1593511 112363 810970 313046 353402 -512022 11575
2513 11575 425892 475688 344850 217170 639424 1573256 484591 169205 1029479 535607
2503 535607 346908 297405 1276702 1090574 618488 -446786 514197 637593 1299634 -38499
2493 -38499 1190572 121973 611681 610628 -125767 466731 1474887 541832 642743 826068
2483 826068 335240 107964 37282 194540 561107 1981407 13426 1449752 1215407
2474 1215407 951544 582120 560990 -21151 1212700 60098 660363 540250 560273 1045337
$$ packed form
2542A240526j47451m74747j84488R75202l61426p59861N35825J87196n77680O20201
2532A053297m43587k11932J042206j25071Q98962o81210l73653o19794K04882
2523G44100P0565j66421l86716J331983j481148O98607m97924M0356q65424N23597
2513A1575M14317M9796j30838j27680M22254R33832j088665l15386Q60274m93872
2503E35607j88699m9503R79297j86128m72086j065274R60983J23396O62041j338133
2493c8499J229071j068599M89708j053p36395N92498J008156r33055J00911J83325
2483H26068m90828k27276p0682J57258L66567J420300j967981J436326k34345
2474A215407k63863l69424k1130n82141J233851j152602O00265j20113K0023M85064
$$ plain form
2464 1045337 551965 336105 572379 660526 429652 1143604 669475 150495 392766 577136
2454 577136 1246698 1474238 1014251 782618 130677 1328994 -55285 744511 350406
2445 350406 498054 -12265 591440 1097466 409122 1710249 770155 701146 854559 596135
2435 596135 209713 1280699 190403 -37103 436361 718469 544836 654006 378679
2426 378679 630095 1300349 340955 29982 -61359 517551 1138207 176796 1205660 366028
2416 366028 595270 1147727 477860 848673 544760 1466362 -42222 627731 331028 1075624
2406 1075624 43800 727985 943509 992741 259219 748604 1798969 1033660 734342
2397 734342 54998 202053 1596297 314256 663682 266470 1434384 -57585 416402
$$ packed form
2464A045337m93372k15860K36274Q8147k30874P13952m74129n18980K42271J84370
2454E77136O69562K27540m59987k31633o51941J198317j384279P99796l94105
2445C50406J47648n10319O03705N06026o88344J301127r40094o9009J53413k58424
2435E96135l86422J070986j090296k27506M73464K82108j73633J09170k75327
2426C78679K51416O70254r59394l10973r1341N78910O20656r61411J028864q39632
2416C66028K29242N52457o69867L70813l03913R21602j508584O69953k96703P44596
2406A075624j031824O84185K15524M9232p33522M89385J050365p65309k99318
2397G34342o79344J47055J394244j282041L49426l97212J167914j491969M73987
$$ [...]
##END NTUPLES=NMR SPECTRUM
##END=
