##TITLE=abcd
##JCAMPDX= 6.0         $$ Bruker NMR JCAMP-DX V2.0
##DATA TYPE= NMR SPECTRUM
##DATA CLASS= NTUPLES
##ORIGIN= UXNMR, Bruker Analytische Messtechnik GmbH
##OWNER= root
$$ XWIN-NMR		Version 3.5
$$ Wed Mar  4 17:19:35 2026 Russian Standard Time (UT+4h)  servis@DPX200
##.OBSERVE FREQUENCY= 200.131235884673
##.OBSERVE NUCLEUS= ^1H
##.ACQUISITION MODE= SIMULTANEOUS
##.ACQUISITION SCHEME= undefined
##.AVERAGES= 32
##.DIGITISER RES= 18
##SPECTROMETER/DATA SYSTEM= spect
##.PULSE SEQUENCE= zg
##.SOLVENT NAME= DMSO
##.SHIFT REFERENCE= (INTERNAL, DMSO, 0, 16.4885)
##AUDIT TRAIL= $$ (NUMBER, WHEN, WHO, WHERE, WHAT)
$$ ##TITLE= Audit trail, XWIN-NMR		Version 3.5
$$ ##JCAMPDX= 5.01
$$ ##ORIGIN= Bruker BioSpin GmbH
$$ ##OWNER= servis
$$ F:\spectra/data/av/nmr/H1/1/pdata/1/auditp.txt
$$ ##AUDIT TRAIL=  $$ (NUMBER, WHEN, WHO, WHERE, WHAT)
(   1,<2026-03-04 17:18:25.75 +0400>,<servis>,<DPX200>,
      <created by zg, POWCHK disabled, PULCHK disabled
       configuration hash MD5:
       00 E9 B6 7A A2 85 ED C7 34 08 36 98 17 FE 4E 26
       data hash MD5: 32K
       6D 13 0C 9D D7 56 38 BB 25 54 77 71 82 FC D6 F9>)
(   2,<2026-03-04 17:19:12.54 +0400>,<servis>,<DPX200>,
      <Start of raw data processing
       efp BC_mod = 2 LB = 0.05 FT_mod = 6 PKNL = 1 PHC0 = -179.3472 PHC1 = -0.898437 SI = 16K 
       data hash MD5: 16K
       CB C4 15 8A 09 C9 A5 D1 17 0A C4 26 70 F9 5F 37>)
$$ ##END=
$$ 
$$ hash MD5
$$ EA 3C E5 83 4D 2F 74 0C 6F 9B B7 41 EE D9 2C 04
##$RELAX= 
##$RELAX= 
##$RELAX= 
##$RELAX= 
##$RELAX= 
##$RELAX= 
##$RELAX= 
##$RELAX= 
$$ Bruker specific parameters
$$ --------------------------
##$DU= <F:\spectra>
##$EXPNO= 1
##$NAME= <H1>
##$PROCNO= 1
##$TYPE= <nmr>
##$USER= <av>
##$AMP= (0..31)
100 100 100 100 100 100 100 100 100 100 100 100 100 100 100 100 100 100 
100 100 100 100 100 100 100 100 100 100 100 100 100 100 
##$AQSEQ= 0
##$AQ_mod= 1
##$AUNM= <au_zg>
##$AUTOPOS= <>
##$BF1= 200.13
##$BF2= 200.13
##$BF3= 200.13
##$BF4= 200.13
##$BF5= 500.13
##$BF6= 500.13
##$BF7= 500.13
##$BF8= 500.13
##$BYTORDA= 1
##$CFDGTYP= 0
##$CFRGTYP= 5
##$CHEMSTR= <none>
##$CNST= (0..31)
1 1 145 1 1 1 1 1 1 1 1 1 1 1 1 1 1 1 1 1 1 1 1 1 1 1 1 1 1 1 1 1 
##$CPDPRG= <>
##$CPDPRG1= <>
##$CPDPRG2= <>
##$CPDPRG3= <>
##$CPDPRG4= <mlev>
##$CPDPRG5= <mlev>
##$CPDPRG6= <mlev>
##$CPDPRG7= <mlev>
##$CPDPRG8= <mlev>
##$CPDPRGB= <>
##$CPDPRGT= <>
##$D= (0..31)
0 2 0 0 0 0 0 0 0 0.06 0 0 0 0 0 0 0.0002 0 0 0 0 0 0 0 0 0 0 0 0 0 0 
0 
##$DATE= 1772630305
##$DBL= (0..7)
120 120 120 120 120 120 120 120 
##$DBP= (0..7)
150 150 150 150 150 150 150 150 
##$DBP07= 0
##$DBPNAM0= <>
##$DBPNAM1= <>
##$DBPNAM2= <>
##$DBPNAM3= <>
##$DBPNAM4= <>
##$DBPNAM5= <>
##$DBPNAM6= <>
##$DBPNAM7= <>
##$DBPOAL= (0..7)
0.5 0.5 0.5 0.5 0.5 0.5 0.5 0.5 
##$DBPOFFS= (0..7)
0 0 0 0 0 0 0 0 
##$DE= 6
##$DECBNUC= <off>
##$DECIM= 32
##$DECNUC= <off>
##$DECSTAT= 4
##$DIGMOD= 1
##$DIGTYP= 9
##$DL= (0..7)
0 120 120 120 120 120 120 120 
##$DP= (0..7)
150 150 150 150 150 150 150 150 
##$DP07= 0
##$DPNAME0= <>
$$ [...]
##$SUBNAM4= <"">
##$SUBNAM5= <"">
##$SUBNAM6= <"">
##$SUBNAM7= <"">
##$SUBNAM8= <"">
##$SUBNAM9= <"">
##$SW= 20.6817932712277
##$SWIBOX= (0..15)
0 0 3 0 0 0 0 0 0 0 0 0 0 0 0 0 
##$SW_h= 4139.07284768212
##$TD= 32768
##$TD0= 1
##$TE= 0
##$TE2= 300
##$TE3= 300
##$TEG= 300
##$TL= (0..7)
0 120 120 120 120 120 120 120 
##$TP= (0..7)
150 150 150 150 150 150 150 150 
##$TP07= 0
##$TPNAME0= <>
##$TPNAME1= <>
##$TPNAME2= <>
##$TPNAME3= <>
##$TPNAME4= <>
##$TPNAME5= <>
##$TPNAME6= <>
##$TPNAME7= <>
##$TPOAL= (0..7)
0.5 0.5 0.5 0.5 0.5 0.5 0.5 0.5 
##$TPOFFS= (0..7)
0 0 0 0 0 0 0 0 
##$TUNHIN= 0
##$TUNHOUT= 0
##$TUNXOUT= 0
##$USERA1= <user>
##$USERA2= <user>
##$USERA3= <user>
##$USERA4= <user>
##$USERA5= <user>
##$V9= 5
##$VALIST= <valist>
##$VCLIST= <CCCCCCCCCCCCCCC>
##$VD= 0
##$VDLIST= <DDDDDDDDDDDDDDD>
##$VPLIST= <PPPPPPPPPPPPPPP>
##$VTLIST= <TTTTTTTTTTTTTTT>
##$WBST= 1024
##$WBSW= 30
##$XGAIN= (0..3)
0 0 0 0 
##$XL= 0
##$YL= 0
##$YMAX_a= 2877921
##$YMIN_a= -2836668
##$ZGOPTNS= <>
##$ZL1= 120
##$ZL2= 120
##$ZL3= 120
##$ZL4= 120
##$ABSF1= 0
##$ABSF2= 0
##$ABSG= 0
##$ABSL= 0
##$ALPHA= 0
##$AQORDER= 0
##$ASSFAC= 0
##$ASSFACI= 0
##$ASSFACX= 0
##$ASSWID= 0
##$AUNMP= <proc_1d>
##$AZFE= 0.1
##$AZFW= 0.1
##$BCFW= 0
##$BC_mod= 2
##$BYTORDP= 0
##$COROFFS= 0
##$CY= 18.4799938201904
##$DATMOD= 1
##$DC= 0
##$DFILT= <>
##$DTYPP= 0
##$F1P= 9.9274215381318
##$F2P= -0.165520771350173
##$FCOR= 1
##$FTSIZE= 16384
##$FT_mod= 6
##$GAMMA= 0
##$GB= 0
##$INTBC= 1
##$INTSCL= 4.127829e-11
##$ISEN= 128
##$LB= 0.05
##$LEV0= 0
##$LPBIN= 0
##$MAXI= 10000
##$MC2= 0
##$MEAN= 0
##$ME_mod= 0
##$MI= 50
##$NCOEF= 0
##$NC_proc= -1
##$NLEV= 6
##$NOISF1= 3.799351
##$NOISF2= 2.8
##$NSP= 0
##$NTH_PI= 0
##$NZP= 0
##$OFFSET= 16.48848
##$PC= 4
##$PHC0= -179.3472
##$PHC1= -0.898437
##$PH_mod= 1
##$PKNL= yes
##$PPARMOD= 0
##$PSCAL= 4
##$PSIGN= 0
##$REVERSE= no
##$SF= 200.130005582386
##$SI= 16384
##$SIGF1= 3
##$SIGF2= 2
##$SINO= 400
##$SIOLD= 16384
##$SREGLST= <1H.CDCl3>
##$SSB= 0
##$STSI= 16384
##$STSR= 0
##$SW_p= 4139.07284768211
##$SYMM= 0
##$S_DEV= 0
##$TDeff= 32768
##$TDoff= 0
##$TI= <>
##$TILT= no
##$TM1= 0
##$TM2= 0
##$TOPLEV= 0
##$USERP1= <user>
##$USERP2= <user>
##$USERP3= <user>
##$USERP4= <user>
##$USERP5= <user>
##$WDW= 1
##$XDIM= 16384
##$YMAX_p= 384476391
##$YMIN_p= -140935
$$ End of Bruker specific parameters
$$ ---------------------------------
##NTUPLES= NMR SPECTRUM
##VAR_NAME=  FREQUENCY,     SPECTRUM/REAL,   SPECTRUM/IMAG
##SYMBOL=    X,             R,               I
##VAR_TYPE=  INDEPENDENT,   DEPENDENT,       DEPENDENT
##VAR_FORM=  AFFN,          ASDF,            ASDF
##VAR_DIM=   16384,         16384,           16384
##UNITS=     HZ,            ARBITRARY UNITS, ARBITRARY UNITS
##FACTOR=    0.252644378177508, 1,           1
##FIRST=     3299.83951724647, 0,            0
##LAST=      -839.233330435636, 0,           0
##MIN=       -839.233330435636, -140935,     0
##MAX=       3299.83951724647, 384476391,    0
$$ Real data points
##PAGE= N=1
##DATA TABLE= (X++(R..R)), XYDATA
$$ [...]
11459 -106506 -107295 -108106 -108322 -108167 -108835 -109272 -109234 -108891 -108663 -109200 -109207 -109433 -107879 -107803 -107662 -107053 -107482 -107588 -110032
11440 -110032 -108941 -108036 -107448 -107995 -108789 -108540 -107772 -108061 -108931 -109464 -109166 -108074 -109859 -109026 -110036 -107943 -107798
11423 -107798 -107361 -106061 -107270 -107147 -108634 -107656 -108320 -107003 -106627 -107362 -108182 -109915 -109808 -109362 -108771 -109139 -109123
11406 -109123 -108362 -108673 -108546 -109454 -108968 -108141 -107359 -106489 -107887 -107743 -108179 -108657 -108064 -107093 -106232 -105667 -107121 -109471
11388 -109471 -108985 -110583 -109601 -107954 -107301 -107417 -108264 -110237 -109386 -110350 -111118 -110091 -109752 -109004 -108195 -107716 -108410
11371 -108410 -108805 -107774 -107312 -107217 -105951 -107075 -107050 -107921 -107650 -108388 -106907 -108393 -109456 -108803 -109516 -108138 -109236
11354 -109236 -108707 -107455 -107916 -108019 -109232 -109581 -109105 -108739 -107067 -107847 -108052 -108385 -108199 -107150 -104269 -104739 -104685
11337 -104685 -107485 -109751 -109340 -108853 -107376 -107999 -107345 -108762 -108986 -109561 -109850 -110316 -108853 -108309 -106786 -108516
11321 -108516 -109885 -110569 -109193 -107632 -105922 -106252 -107270 -107540 -109363 -108586 -107944 -108235 -109877 -109030 -108781 -107378
11305 -107378 -106264 -109840 -109289 -109307 -108283 -107729 -107817 -108120 -107839 -106923 -107738 -107915 -108411 -108284 -107439 -107572 -108209 -106448
11287 -106448 -107332 -107653 -108768 -107782 -108165 -107740 -107480 -109678 -107929 -107152 -108116 -107813 -109274 -108824 -108519 -108343 -106880
11270 -106880 -107300 -107341 -110067 -107787 -106936 -107257 -107476 -107690 -108936 -109966 -107935 -109141 -108908 -107346 -107667 -107689 -106562
11253 -106562 -108745 -110297 -109665 -108089 -108280 -107907 -109212 -108064 -107738 -108510 -108939 -109034 -108861 -107009 -107891 -108836 -108369
11236 -108369 -107962 -108853 -109163 -108528 -108617 -109674 -109461 -107709 -108813 -108008 -108800 -108972 -108433 -108706 -107842 -108635 -107499 -107707
11218 -107707 -108105 -108308 -109858 -109942 -109490 -107487 -107814 -108620 -109850 -109350 -108229 -107793 -108137 -108365 -107619 -108017 -108225 -108508
11200 -108508 -108165 -108864 -108868 -109228 -108230 -107229 -108508 -109181 -110098 -108535 -108450 -108833 -108263 -107678 -108567 -107306 -108820 -108880
11182 -108880 -108532 -108506 -107491 -109032 -109493 -109245 -109304 -107887 -109084 -107476 -107380 -107455 -107887 -108646 -108532 -108864 -108778 -107952 -108443
11163 -108443 -108877 -108004 -107680 -109030 -107123 -108281 -108047 -108971 -108974 -108926 -108895 -108925 -108972 -108704 -108279 -108579 -108615 -108613 -108375 -108709 -108424
11142 -108424 -108577 -108160 -108716 -108893 -108075 -108932 -108140 -108474 -108552 -107722 -106870 -107329 -108686 -107789 -108948 -108014 -109675 -109909
11124 -109909 -108671 -109853 -108265 -107722 -107671 -108970 -109181 -109063 -109509 -108517 -107861 -107600 -108609 -108179 -108984 -107633 -108239
11107 -108239 -108779 -109350 -107144 -108229 -108692 -107580 -108343 -107857 -108454 -107361 -109011 -108665 -108495 -108647 -108907 -108028 -108567
11090 -108567 -108785 -108184 -108939 -108857 -107565 -108869 -108719 -109675 -109417 -108224 -107956 -109406 -107845 -109595 -108019 -108012 -109082
11073 -109082 -109583 -109053 -107840 -108569 -108393 -108747 -107770 -109363 -108484 -108481 -108050 -108399 -108886 -108743 -109520 -109520 -108921 -108599 -108527 -108538
11053 -108538 -108396 -108841 -108999 -108739 -108632 -109477 -109150 -109373 -108684 -108969 -109370 -109275 -109414 -109922 -109118 -109041 -109772 -109702 -108473
11034 -108473 -108575 -108592 -109843 -109089 -108095 -108685 -108835 -108421 -108547 -108623 -108444 -108670 -108750 -108749 -108342 -108720 -108375 -109045 -108972 -107673
11014 -107673 -109658 -108686 -107971 -109087 -108792 -108376 -108711 -109428 -108407 -108039 -109148 -108668 -108496 -108574 -108449 -108466 -108109 -109071
10996 -109071 -108998 -108717 -108714 -108191 -108124 -107920 -106738 -107759 -108598 -108060 -109626 -108369 -109168 -108472 -108613 -109212 -108664 -108304 -108462
10977 -108462 -109376 -108651 -108480 -109255 -108797 -108327 -106890 -108277 -108231 -108866 -108680 -108581 -108572 -108218 -108538 -108939 -108976 -109305 -108816 -108519
10957 -108519 -108030 -108487 -109036 -108287 -108858 -109073 -108450 -109161 -108579 -108786 -107943 -109563 -109487 -109154 -108095 -107616 -109508 -108548
10939 -108548 -107449 -107969 -109245 -108920 -107931 -108612 -108783 -109222 -108396 -108049 -107447 -108228 -107642 -108287 -108957 -108437 -108519 -108628
10921 -108628 -108778 -109627 -107620 -107817 -107611 -108143 -107510 -108077 -107744 -107389 -107979 -107790 -107744 -107299 -108625 -107992 -108574 -108518 -108529
10902 -108529 -109026 -108869 -108390 -108955 -109208 -109756 -109307 -107889 -107478 -108595 -108666 -108468 -108509 -109577 -108645 -108162 -109084 -109088 -109909
10883 -109909 -109730 -109108 -108296 -110098 -109418 -109586 -109394 -109944 -108558 -109949 -108566 -108337 -109113 -108645 -107999 -109275 -108760
10866 -108760 -108971 -109521 -109359 -108456 -108726 -109422 -108083 -109731 -107386 -109020 -108054 -108522 -108990 -108247 -108495 -108400 -108221 -108428
10848 -108428 -109024 -108537 -108309 -108071 -109462 -108665 -109367 -109406 -108892 -108527 -110181 -108755 -108716 -109612 -108627 -109133 -108174 -109429
10830 -109429 -110458 -109510 -109480 -107480 -109879 -109346 -109185 -108804 -109230 -109837 -109770 -109141 -109633 -109201 -108702 -109774 -108623 -109486
10812 -109486 -108745 -109610 -109322 -109321 -108962 -108877 -109630 -109317 -108905 -109218 -110821 -108666 -109009 -108998 -108223 -108598 -108862 -108682 -108300
10793 -108300 -109331 -108745 -109736 -109047 -108736 -109127 -108721 -109825 -108628 -108469 -109439 -109214 -109610 -110760 -109153 -109206 -108748
10776 -108748 -109225 -108362 -109277 -109263 -109150 -108971 -108264 -109894 -109204 -109657 -110031 -109072 -108566 -109950 -109567 -109591 -108052 -109150
10758 -109150 -107449 -109382 -108636 -109001 -108774 -108331 -108648 -108371 -108715 -109081 -108846 -108120 -109027 -108752 -109387 -108734 -109355 -109493
10740 -109493 -109583 -110302 -108537 -109197 -108545 -108001 -108659 -108576 -108066 -109899 -109810 -109936 -110380 -110090 -109958 -110242 -108886 -108187 -109431
10721 -109431 -110379 -109035 -109358 -110343 -109316 -110580 -109386 -110039 -108606 -109505 -109325 -110238 -109269 -110330 -111062 -108854
10705 -108854 -108412 -109213 -110429 -110316 -108619 -108644 -109507 -110401 -109710 -108674 -109316 -108834 -110464 -110945 -108290 -109994 -108613
10688 -108613 -108862 -109284 -108330 -109411 -109736 -108635 -109447 -109188 -108842 -109869 -110122 -108266 -108174 -109190 -109840 -109928 -109190 -107854
10670 -107854 -108862 -108283 -108822 -109256 -109105 -109589 -109940 -109436 -108828 -109739 -109373 -109501 -109056 -109572 -109005 -108168 -107929 -109331
10652 -109331 -109590 -108882 -109438 -108363 -109408 -109090 -109170 -109792 -109088 -108588 -108929 -109686 -110346 -110490 -110110 -109117 -110158 -108765
10634 -108765 -108917 -110108 -109859 -108707 -109509 -109095 -109465 -109325 -110214 -109621 -109576 -111203 -109387 -110333 -110088 -109818 -109543 -109628
10616 -109628 -109373 -108903 -109173 -109664 -108614 -109954 -109646 -108006 -109092 -107722 -109606 -108246 -108544 -110168 -109874 -110114
10600 -110114 -110024 -108847 -109837 -108909 -109642 -110023 -108368 -109354 -109613 -109433 -110194 -110007 -108843 -108565 -109498 -109555 -108812 -109293
10582 -109293 -109468 -108355 -109078 -108940 -108592 -109726 -109214 -108586 -109376 -109428 -110421 -109205 -109790 -109514 -110001 -110532 -109737 -110203
10564 -110203 -109437 -110611 -110621 -110250 -108729 -108620 -108394 -109030 -110079 -109863 -108561 -108400 -108324 -108033 -108663 -109333 -109073 -109386
10546 -109386 -108716 -108122 -107995 -109063 -109993 -109948 -110094 -110480 -110274 -109557 -110020 -110054 -108904 -109675 -109570 -108855 -108512 -109383 -109689
10527 -109689 -109217 -109973 -109550 -109689 -109588 -110285 -110272 -110267 -110679 -111013 -109978 -109446 -110253 -110126 -109553 -109659 -110192 -110763 -109484
10508 -109484 -109104 -109930 -109336 -110047 -109708 -110129 -109653 -108294 -109142 -108858 -109585 -110725 -111619 -110504 -109345 -109969 -110077
10491 -110077 -110474 -111748 -111940 -108926 -109300 -108724 -108664 -107365 -108275 -109522 -108954 -109641 -107991 -107955 -109049 -109051 -110587 -110231
10473 -110231 -110334 -109270 -109218 -110190 -111288 -110529 -110488 -108478 -108243 -107828 -109075 -109714 -110652 -110932 -111068 -111036 -110156 -109423
10455 -109423 -106899 -107555 -106934 -107513 -109073 -110804 -110138 -110343 -109079 -110261 -111385 -113109 -110892 -110049 -108095 -107853
10439 -107853 -108933 -110133 -109765 -110372 -109283 -108383 -108022 -109275 -109620 -112496 -111456 -110637 -108706 -108062 -106924 -108678
10423 -108678 -109256 -110519 -110258 -109783 -109798 -109541 -111010 -112650 -109910 -109889 -108283 -109017 -109388 -110774 -109647 -109894 -107966
10406 -107966 -108472 -109342 -109925 -111047 -111031 -109980 -110369 -110384 -110380 -110341 -109176 -109655 -110875 -111410 -111919 -111828 -110475 -109732 -108941
10387 -108941 -109818 -110674 -111904 -112027 -111116 -110170 -108535 -107582 -109685 -109578 -110660 -111592 -109651 -108693 -107980 -107291 -108750
10370 -108750 -110085 -103913 -109467 -109644 -109022 -108909 -109955 -111443 -110446 -109610 -108702 -109533 -109868 -110222 -110660 -109761 -109479
10353 -109479 -109815 -109243 -109619 -109875 -108878 -107747 -108042 -107296 -108899 -110139 -112066 -111411 -110961 -110997 -108907 -109683 -109032
10336 -109032 -109455 -110354 -109096 -110590 -109772 -109071 -108874 -109384 -108506 -107972 -108277 -109426 -111042 -110795 -110161 -109384 -108284
10319 -108284 -110590 -112332 -110678 -110052 -110037 -109722 -108451 -109952 -110453 -110238 -109903 -109246 -109806 -108427 -108001 -107791 -107527
10302 -107527 -108733 -109736 -109658 -109890 -109206 -109617 -109831 -110066 -109156 -110226 -111811 -113186 -111156 -110449 -108512 -109390 -109033
10285 -109033 -109590 -109286 -109643 -109338 -110494 -110470 -110147 -110247 -109593 -109192 -108100 -109004 -109643 -110635 -110315 -110519 -110581 -110504 -111047
10266 -111047 -108873 -108666 -108103 -109644 -108883 -108726 -109087 -109643 -112335 -111886 -109824 -109729 -110240 -109820 -110215 -109615 -110597 -110016
10248 -110016 -110153 -111695 -110345 -110985 -109483 -108855 -108030 -110291 -110289 -110794 -108589 -109096 -108155 -108921 -109874 -110468 -109756 -109495
10230 -109495 -110131 -108878 -109612 -110081 -110916 -110322 -111213 -111320 -110474 -109455 -108588 -109645 -110374 -110355 -111609 -109713 -108904
10213 -108904 -111053 -109057 -110197 -110269 -109807 -110285 -110084 -110512 -109573 -110928 -109506 -109241 -109803 -109825 -110057 -111020 -110491 -110118
10195 -110118 -111108 -109751 -110139 -110733 -110487 -111007 -109901 -110468 -110715 -111593 -110669 -110851 -110573 -109882 -109849 -110498 -108597 -110098
10177 -110098 -110353 -110974 -110639 -111098 -110322 -109950 -109298 -108849 -109452 -108614 -110603 -109841 -111634 -110772 -110851 -111597 -110482 -108507
10159 -108507 -108718 -110599 -110180 -109275 -111045 -110405 -109704 -109680 -109250 -108650 -109095 -110848 -109806 -109164 -108308 -109495 -110378
10142 -110378 -111056 -110041 -110311 -110520 -110440 -110414 -109853 -109589 -110598 -109898 -109942 -110791 -110020 -111087 -110088 -109915 -110145 -110030 -110036
10123 -110036 -109993 -110946 -111008 -108375 -109460 -108716 -108344 -110314 -110468 -109528 -110096 -109737 -109703 -109381 -109562 -110500 -110750 -110668 -110297
10104 -110297 -109718 -110009 -109935 -110255 -109849 -110458 -111023 -109785 -110477 -110635 -110628 -111059 -110652 -111101 -110913 -110183 -110221 -109847 -109914 -109537
10084 -109537 -110095 -109968 -110006 -109834 -110192 -110402 -110763 -110209 -109848 -109764 -110380 -109518 -110458 -109922 -110544 -109449 -110322 -109500 -110820
10065 -110820 -110124 -109965 -110981 -109732 -110224 -109633 -109718 -111022 -110828 -109901 -110557 -108891 -109604 -111476 -110095 -110357 -109818
10048 -109818 -110363 -110517 -110430 -110089 -110014 -110111 -109777 -110157 -110449 -110215 -110127 -109423 -110688 -110059 -110645 -109811 -110395 -110478 -110112 -110137
10028 -110137 -109870 -110056 -110442 -111141 -111440 -110676 -110736 -110253 -111622 -110057 -110414 -109793 -110023 -110839 -110930 -110110 -110818 -110915 -111034
10009 -111034 -110218 -110790 -110432 -110435 -110673 -110347 -110674 -109290 -111147 -110954 -110401 -110572 -110763 -110566 -111268 -111246 -110743 -111375 -110989
9990 -110989 -110281 -109876 -109992 -109679 -110463 -110473 -110659 -110601 -110667 -110785 -110070 -110113 -110955 -110531 -111164 -110659 -108651 -109189 -110705 -109980
9970 -109980 -110914 -111496 -110334 -109906 -112078 -111512 -112430 -111537 -110082 -110235 -111281 -110179 -110325 -111475 -110493 -110931 -110485
9953 -110485 -110311 -111058 -111230 -110286 -111257 -110546 -109465 -109799 -110787 -110708 -111679 -110139 -110676 -111044 -109938 -109939 -110631 -110016 -110506
9934 -110506 -110085 -110293 -109963 -110151 -109814 -110396 -110715 -110390 -111179 -109923 -110348 -110034 -110431 -110218 -111636 -110419 -110529 -109771
9916 -109771 -111210 -110481 -110895 -109825 -110988 -111656 -111412 -110123 -110137 -110386 -110640 -111350 -111045 -111009 -110423 -109793 -110065 -109588
9898 -109588 -110243 -109220 -109651 -110291 -110401 -110789 -111047 -110788 -110458 -110471 -110838 -110337 -109686 -109983 -110654 -109786 -110701 -111349 -111636
9879 -111636 -110896 -109829 -110577 -110630 -110633 -111014 -109525 -109888 -109851 -110897 -110583 -111334 -111508 -110416 -111157 -109977 -110188 -110900 -110202
9860 -110202 -110295 -111142 -109848 -109698 -110211 -110221 -110417 -109822 -109992 -109770 -110228 -110674 -109950 -109597 -110022 -111042 -111321 -112123 -110913
9841 -110913 -111130 -111096 -111052 -110059 -111984 -110871 -111410 -111107 -110215 -110574 -110986 -111006 -111224 -110048 -110797 -110675 -110094 -110315 -111915
9822 -111915 -110573 -110352 -111648 -110958 -111032 -111537 -110239 -111278 -110340 -110326 -111615 -111049 -110350 -111223 -111354 -111164 -111420 -111308
9804 -111308 -110718 -110840 -109442 -109768 -110232 -110164 -110930 -111300 -110961 -110989 -110134 -112034 -110007 -110598 -110178 -109852 -110109 -109962 -110792
9785 -110792 -110342 -111046 -110336 -111032 -110729 -111235 -110512 -111530 -110484 -110763 -110814 -110734 -110677 -111043 -109950 -111622 -110441 -110461 -110350
9766 -110350 -110415 -110559 -110385 -111504 -109854 -111083 -110420 -111110 -111478 -110192 -110866 -110755 -111062 -110788 -111370 -111800 -111318 -110433
9748 -110433 -111873 -110173 -111404 -111365 -111055 -110583 -109533 -111389 -110663 -110568 -110943 -111035 -110864 -111819 -111103 -111220 -110750 -111923
9730 -111923 -110324 -111136 -110137 -112383 -112068 -111696 -111095 -112219 -110475 -110401 -111806 -111213 -110907 -110533 -110206 -110616 -110829 -111136
9712 -111136 -111735 -112337 -110032 -110533 -110968 -109587 -110597 -109968 -110274 -110111 -111030 -111007 -111548 -111363 -111664 -111019 -111236 -111697
9694 -111697 -110374 -110989 -111090 -110887 -110658 -110781 -110428 -110344 -111739 -110649 -111361 -110348 -110269 -109871 -110371 -112277 -111525 -110883
9676 -110883 -111657 -110677 -110200 -110279 -110391 -111245 -111198 -110864 -111432 -111921 -110979 -111091 -111005 -110931 -110637 -110393 -110733 -110509 -110403 -110544
9656 -110544 -110577 -110628 -111291 -109895 -110236 -110573 -110677 -110880 -112799 -111896 -111401 -111350 -111527 -111104 -111991 -111963 -112476 -112046 -110716
9637 -110716 -110293 -112832 -112278 -111740 -112100 -111900 -110735 -109815 -111949 -111365 -111782 -111614 -111388 -111247 -110280 -109773 -110530 -111172
9619 -111172 -111450 -112405 -112101 -112190 -111844 -112757 -112455 -111651 -110559 -110102 -110983 -111703 -111131 -111769 -110750 -110824 -110908 -111531 -111389
9600 -111389 -111072 -111970 -110228 -111155 -111949 -111577 -111255 -110476 -110184 -109223 -110474 -110647 -111128 -111425 -111129 -110019 -109563 -110055
9582 -110055 -111596 -111537 -110998 -110094 -108346 -109943 -111199 -112375 -110966 -112089 -112619 -111373 -109718 -110559 -112727 -113092
9566 -113092 -114448 -113570 -112025 -111431 -111566 -110169 -109675 -109677 -109495 -109972 -109651 -110312 -109941 -110076 -111476 -112113 -112513 -113938
9548 -113938 -113232 -113239 -112982 -112596 -112848 -112283 -112078 -112525 -112039 -111458 -112654 -111943 -110458 -109584 -111615 -111026 -111723 -110096
9530 -110096 -109946 -109939 -110401 -111717 -111858 -110228 -111326 -113097 -113049 -112971 -113230 -112777 -112779 -113214 -113038 -112382 -112441 -112587 -110331 -110023
9510 -110023 -110014 -109768 -109076 -109846 -110687 -111539 -111125 -111539 -111792 -110964 -111481 -112517 -113378 -113837 -112864 -112133 -110534 -110939 -110381
9491 -110381 -111503 -112587 -112702 -113131 -112466 -111198 -110749 -109787 -110761 -110640 -112708 -111463 -109440 -109608 -110043 -111142 -112959
9474 -112959 -112321 -112505 -111383 -111773 -112712 -112367 -113067 -112287 -112059 -111604 -111172 -111548 -111525 -110813 -110753 -110556 -110059 -111442 -111498
9455 -111498 -111614 -113855 -112649 -113827 -112816 -110298 -111518 -111679 -111460 -112030 -110344 -110982 -110915 -111149 -110983 -111735 -112084
9438 -112084 -111334 -111601 -112236 -111890 -111791 -111049 -110500 -111967 -111467 -112839 -112175 -111718 -112127 -111815 -111265 -111852 -112469 -113406 -112687
9419 -112687 -111340 -110892 -110569 -112115 -112993 -112901 -111758 -110812 -113224 -114221 -114527 -111340 -110515 -112144 -111903 -112548 -111529
9402 -111529 -113222 -111794 -110925 -111009 -111399 -110906 -111522 -113040 -112352 -113338 -111949 -111133 -108424 -108277 -111806 -113451 -113077
9385 -113077 -111939 -111739 -112529 -114856 -113192 -110862 -110680 -110107 -111362 -111124 -111746 -111556 -109356 -109608 -110805 -112700
9369 -112700 -113417 -113304 -112125 -112122 -111080 -110338 -109242 -108574 -108328 -111727 -112406 -112863 -112353 -112269 -111412 -111790 -112329 -111807 -110633
9350 -110633 -109914 -111213 -111948 -113099 -111478 -111268 -111697 -111961 -112819 -112733 -113146 -112903 -112735 -112205 -113292 -113306 -112710 -111980
9332 -111980 -110937 -110815 -110984 -111171 -112046 -112441 -111001 -111016 -109973 -110353 -112077 -113533 -112593 -113685 -111944 -111532 -112218
9315 -112218 -111683 -111728 -110857 -111549 -111917 -112662 -113083 -112853 -114196 -114004 -112999 -110973 -110973 -113834 -112947 -112785 -111850 -112845 -111344
9296 -111344 -109480 -112229 -112227 -112719 -111476 -110893 -109753 -111179 -111705 -112212 -111690 -111286 -111102 -111594 -111615 -111328 -111382 -111688 -111731
9277 -111731 -112754 -112331 -112512 -113211 -114382 -112850 -112466 -114625 -112297 -112356 -111735 -111973 -112189 -111528 -110322 -110831 -111923
9260 -111923 -110253 -110347 -110955 -111540 -109523 -110412 -111768 -111854 -110299 -110788 -111488 -112339 -113115 -112955 -111314 -111903 -111901 -111329 -111929
9241 -111929 -113465 -112097 -112325 -112186 -112430 -112539 -110932 -111531 -112344 -110876 -111016 -110567 -110417 -110891 -110703 -111088 -111968 -111087
9223 -111087 -110028 -111540 -111984 -111570 -111572 -112448 -111885 -111748 -112309 -111806 -112597 -111405 -111548 -111532 -112132 -112707 -112877 -113621 -113070
9204 -113070 -112960 -112911 -113894 -113173 -113211 -111665 -112558 -112498 -112402 -112788 -111976 -112924 -112131 -112667 -111453 -111964 -112287 -111699 -112157 -111466
9184 -111466 -111711 -111182 -109287 -116683 -112994 -112503 -112900 -112922 -112500 -113251 -113238 -113585 -112637 -112333 -112456 -112287 -112766 -112449 -111403
9165 -111403 -112203 -113421 -111916 -112307 -111082 -111971 -112128 -112164 -112531 -113355 -112691 -112514 -111990 -111933 -111170 -112547 -111533 -112717
9147 -112717 -111253 -111215 -111844 -112522 -111386 -112691 -112901 -112807 -111642 -113329 -113185 -112834 -113073 -112274 -113870 -112705 -113851
9130 -113851 -113151 -111449 -112604 -112631 -112218 -111750 -111764 -112085 -113043 -113241 -112193 -112395 -111251 -111228 -112306 -112630 -111727 -111929
9112 -111929 -113197 -113222 -113491 -113617 -113283 -112744 -111751 -112569 -112382 -113936 -111792 -113055 -112617 -113414 -112701 -113868 -113966 -111820
9094 -111820 -113256 -112713 -113088 -112695 -113278 -113600 -113441 -112924 -113272 -111969 -112295 -113406 -113547 -112585 -112208 -111127 -112350
9077 -112350 -112552 -112000 -112900 -112232 -113522 -113878 -113522 -113549 -112975 -112312 -113095 -112915 -111673 -112862 -113740 -112666 -113353 -113537
9059 -113537 -113225 -113841 -112716 -112132 -113511 -112886 -113001 -113049 -113036 -112474 -113056 -112796 -113832 -113891 -112790 -112345 -113204 -112471 -112254
9040 -112254 -113122 -113264 -112891 -112423 -112963 -112170 -114534 -113010 -112626 -112531 -112514 -112584 -112497 -112986 -114029 -114918 -113808 -113700 -113212
9021 -113212 -112792 -113268 -113575 -113107 -113367 -113338 -113036 -112619 -113912 -113014 -112958 -113594 -113372 -113105 -112574 -112059 -111704 -112621 -113238
9002 -113238 -113763 -114435 -113107 -112651 -113066 -113859 -113415 -113006 -114584 -112996 -113284 -113167 -113269 -112310 -112270 -112794 -112492 -113646
8984 -113646 -113946 -112704 -112810 -113221 -112266 -112772 -113120 -112561 -112767 -113490 -114123 -114729 -113489 -113963 -113494 -114018 -113392 -113078
8966 -113078 -113395 -113375 -114180 -114173 -114925 -113187 -114143 -113644 -112884 -113661 -113401 -112988 -112893 -112963 -112025 -113093 -113003 -113205 -112500 -113168
8946 -113168 -113499 -113712 -113501 -113460 -113406 -113694 -113962 -113267 -113648 -113767 -113683 -113970 -113248 -114338 -113497 -114176 -114233 -114319 -114541 -114075
8926 -114075 -114366 -113121 -113332 -113617 -113292 -113535 -113250 -114504 -114074 -113859 -113419 -114754 -113742 -114318 -113010 -113503 -113698
8909 -113698 -114625 -113526 -114141 -113968 -113715 -114371 -112739 -113146 -113864 -113455 -113727 -113788 -114424 -114221 -114027 -113595 -113225 -114601
8891 -114601 -113343 -114098 -113942 -113978 -115052 -114655 -114590 -113496 -113987 -112976 -111988 -113946 -114481 -113931 -113802 -114287 -113102 -113750
8873 -113750 -114857 -113946 -112956 -113192 -114417 -113299 -114681 -113313 -112714 -112639 -113916 -113991 -113638 -113122 -114400 -113287 -113796
8856 -113796 -115044 -115286 -113027 -113255 -114073 -113068 -115222 -113984 -114475 -114910 -113644 -114564 -114515 -113608 -113479 -113813 -113984
8839 -113984 -114101 -112769 -113169 -114297 -115336 -115690 -113412 -113314 -114124 -114372 -113882 -114627 -114108 -113771 -115471 -114951 -115318 -113930
8821 -113930 -113770 -113377 -113859 -114348 -114028 -113824 -113504 -113787 -115053 -114380 -114017 -114317 -113104 -113403 -114230 -114291 -113149 -114183
8803 -114183 -114562 -114895 -114693 -113508 -114104 -113998 -114050 -113970 -114922 -114580 -114757 -114727 -114449 -114011 -114801 -115225 -115470 -116456 -115408
8784 -115408 -115025 -115240 -114165 -116048 -115559 -115609 -114486 -114648 -115229 -115656 -115080 -114498 -113852 -113826 -113153 -115044 -115383 -113996
8766 -113996 -113984 -115429 -115003 -115488 -115369 -116201 -115344 -113809 -115457 -114870 -115976 -114237 -115160 -115450 -114707 -114570 -115988
8749 -115988 -115128 -116244 -114199 -114602 -115391 -114672 -115343 -114595 -115206 -114787 -115395 -115191 -115276 -115309 -115802 -114982 -115873 -115608 -114928
8730 -114928 -115004 -115481 -114542 -114774 -115178 -114728 -115021 -116039 -114871 -115174 -115419 -115488 -114509 -114156 -115485 -115665 -115375 -115330 -114279
8711 -114279 -115496 -115185 -115831 -115763 -116327 -115355 -117227 -116385 -116878 -116891 -115144 -116753 -115793 -115574 -117339 -117211 -115181 -114942
8693 -114942 -115987 -115774 -116601 -116695 -115844 -115579 -117081 -116167 -116504 -116111 -116012 -117045 -115313 -116942 -117010 -116925 -116930 -116046 -114969
8674 -114969 -116521 -117375 -117067 -117455 -117933 -115888 -116394 -115894 -115823 -117633 -116237 -118086 -116602 -115150 -116419 -117181 -117813
8657 -117813 -117614 -116105 -117152 -117316 -116892 -116897 -117728 -117845 -118680 -117608 -115899 -116417 -118205 -118050 -118714 -117695 -117496 -116725
8639 -116725 -117245 -116637 -116322 -117361 -116563 -117338 -118143 -116648 -117281 -116801 -116983 -118038 -117715 -118997 -120093 -117711 -116716
8622 -116716 -116032 -115704 -117527 -118524 -117707 -118484 -117893 -117625 -117062 -119195 -117870 -119375 -119525 -119357 -120063 -118917 -119954
8605 -119954 -119463 -117936 -118835 -118811 -117439 -118164 -119359 -119152 -118713 -119209 -120287 -120373 -118900 -120349 -120156 -119807 -120998
8588 -120998 -120542 -121466 -120002 -119626 -118869 -118178 -119279 -121888 -123263 -120884 -120776 -119950 -120170 -120797 -122287 -122926 -121738
8571 -121738 -121012 -117915 -119626 -121683 -122727 -122903 -123435 -122391 -121698 -122946 -124513 -123483 -123160 -123901 -123790 -123556
8555 -123556 -123281 -123843 -121666 -120954 -121448 -123233 -122892 -124808 -125281 -125206 -127002 -129433 -129836 -129786 -129346 -125602 -125646 -125347
8537 -125347 -120484 -124250 -129764 -129174 -129307 -127450 -129408 -129257 -130028 -132083 -131620 -133456 -132563 -132483 -131769 -131421 -134397
8520 -134397 -134336 -134308 -133220 -130590 -128831 -132998 -134170 -133445 -132361 -130984 -132540 -131229 -131566 -132448 -131480 -131088 -130426
8503 -130426 -129376 -129305 -128373 -130160 -130258 -132730 -134485 -138031 -140935 -138484 -133800 -130753 -127995 -128698 -129402 -126340
8487 -126340 -121895 -119359 -121079 -123165 -123548 -122646 -121491 -117089 -119620 -120786 -123081 -124127 -122149 -120078 -117273
8472 -117273 -117404 -115920 -116717 -117941 -117005 -115966 -115642 -115328 -114674 -114423 -113680 -111334 -111313 -113953 -113585 -111022 -108773
8455 -108773 -108437 -106617 -106235 -107668 -110315 -110268 -109677 -108553 -107763 -106766 -107123 -106618 -106630 -105255 -103515 -102771 -102276 -104128
8437 -104128 -104862 -104531 -106210 -105451 -106278 -106044 -107910 -108617 -106991 -106531 -106326 -105756 -106680 -106542 -107163 -106540 -104866 -102355
8419 -102355 -104592 -105704 -106493 -106554 -105644 -106812 -106800 -108515 -107371 -107195 -106353 -106725 -107708 -107517 -107711 -108000 -105446 -105747
8401 -105747 -105104 -107462 -108474 -107712 -106789 -105462 -105089 -105387 -107326 -106999 -107139 -109071 -107515 -106760 -104024 -107738
8385 -107738 -106662 -107411 -107172 -107279 -108849 -108192 -109737 -108696 -109134 -109978 -110280 -109995 -107636 -107962 -106875 -108121 -107217
8368 -107217 -106459 -108639 -110415 -108518 -108416 -108980 -106707 -109197 -108459 -107950 -109976 -108908 -109184 -107210 -107821 -110040
8352 -110040 -109282 -111385 -107217 -107322 -109631 -112728 -112646 -112496 -109991 -108877 -109153 -109606 -107892 -109350 -108609 -110856
8336 -110856 -109219 -109059 -109527 -108592 -107921 -109794 -108779 -110277 -110313 -108221 -106709 -110007 -110831 -110378 -108978 -107094
8320 -107094 -110283 -112527 -110639 -110731 -109357 -111464 -111019 -110111 -109794 -108479 -109109 -110494 -110512 -111740 -111346 -112865 -109897
8303 -109897 -108786 -107744 -110627 -107610 -106618 -110379 -108904 -110751 -112790 -111970 -111072 -110294 -112717 -111220 -109963
8288 -109963 -109369 -110961 -111539 -111133 -109733 -108419 -110990 -112132 -109778 -111201 -111594 -110801 -112043 -112221 -110432 -109986
8272 -109986 -111147 -110950 -109141 -110008 -112450 -110110 -108305 -108957 -110606 -111665 -111463 -111209 -109667 -109405 -109780 -109355
8256 -109355 -108537 -110630 -110996 -111106 -110992 -109963 -110571 -113141 -109884 -110582 -110326 -110222 -109601 -111922 -109553 -110855 -109212
8239 -109212 -110470 -109010 -109686 -110575 -111380 -111166 -110431 -111461 -110032 -108947 -111644 -111063 -112005 -110040 -113960 -109017
8223 -109017 -109393 -108340 -109706 -111238 -111469 -109486 -112333 -112008 -113773 -110800 -110662 -108435 -113199 -109673 -112570
8208 -112570 -112255 -109688 -108474 -112316 -113301 -109264 -116746 -108627 -112916 -112270 -111576 -108956 -112769 -110887 -106902
8193 -106902 -120794 -109376 -111837 -98596 -107702 -113320 -108889 -109409 -112494 -110449 -107274 -113108 -108563 -111860
8179 -111860 -112959 -110197 -112961 -112787 -111522 -111712 -111252 -110073 -110154 -113024 -109609 -110400 -110847 -112837 -112695 -111525
8163 -111525 -111409 -109927 -112174 -109908 -110814 -111713 -112800 -110996 -113534 -111358 -112053 -111331 -110275 -112289 -110323 -110882
8147 -110882 -111624 -109865 -111233 -112903 -110671 -113486 -112013 -114214 -112939 -111713 -109958 -112241 -112038 -111664 -110800
8132 -110800 -112807 -111119 -110503 -112992 -113993 -111445 -113418 -113460 -112400 -112776 -112010 -112651 -110778 -112021 -112125 -113096
8116 -113096 -112277 -110221 -111506 -111334 -111871 -111315 -112643 -110873 -113256 -112884 -112722 -111724 -112757 -111720 -112646 -111850 -111757
8099 -111757 -110781 -111713 -112013 -112183 -111541 -112472 -111452 -112251 -111061 -112596 -111102 -112417 -110842 -111158 -112216 -112550 -110804
8082 -110804 -112427 -111917 -111877 -112396 -111650 -111348 -112638 -112801 -111647 -111614 -112257 -113350 -113024 -112463 -112158 -111700 -111802 -111638
8064 -111638 -112499 -111138 -113389 -112390 -111969 -112373 -113100 -111968 -112553 -112350 -111989 -112058 -112838 -111110 -111809 -111844 -113333 -113890
8046 -113890 -112808 -111578 -112650 -112539 -111703 -113170 -112208 -112768 -112259 -112709 -111459 -111602 -112042 -112893 -112064 -112675 -112052
8029 -112052 -112713 -111892 -113551 -112075 -112914 -112327 -112338 -112251 -112304 -113780 -113044 -113940 -112000 -110422 -111998 -113686 -111704
8012 -111704 -111399 -112315 -111785 -111934 -111255 -111919 -111614 -111592 -111429 -111151 -112045 -112509 -111705 -112893 -111261 -112929 -113209 -112417
7994 -112417 -114798 -113868 -113318 -112246 -111513 -113057 -112325 -111451 -113246 -113602 -112695 -113142 -113832 -112878 -112144 -111888 -111485 -112833
7976 -112833 -113061 -114089 -113734 -114059 -113700 -114185 -112836 -112357 -113259 -113811 -112716 -112416 -113709 -112545 -113254 -113596 -112542
7959 -112542 -113059 -112620 -112833 -114200 -113836 -113301 -112564 -113083 -112475 -112778 -113648 -113590 -113729 -112569 -112241 -113921 -113145 -111721
7941 -111721 -114062 -113240 -114186 -113822 -112558 -112992 -113573 -112202 -112523 -113093 -111794 -113195 -113164 -113309 -112984 -114241 -113973
7924 -113973 -113711 -113876 -113077 -112031 -114526 -114192 -111987 -113177 -114731 -113663 -113423 -113395 -113259 -113012 -113923 -112817 -115185
7907 -115185 -113539 -113348 -114130 -113090 -113523 -113435 -112454 -113542 -112958 -114179 -115571 -113183 -113593 -114052 -112891 -113545 -114326
7890 -114326 -112641 -113198 -113749 -114230 -114316 -113767 -114192 -113359 -113957 -113736 -112958 -113541 -113828 -113504 -114082 -114208 -113481 -114147 -112903
7871 -112903 -114467 -113078 -115200 -114719 -113694 -114807 -115237 -115025 -114224 -112751 -114745 -115123 -113552 -114870 -115068 -114904
7855 -114904 -114593 -115426 -115715 -116553 -118183 -121745 -130698 -106322 -95164 -106805 -108946 -110593 -110971 -111116 -111075 -111332
7839 -111332 -112550 -112412 -111881 -111989 -112054 -112701 -112213 -112522 -112308 -112973 -113493 -112739 -112769 -111799 -112981 -112637 -112547 -113696 -114583
7820 -114583 -112529 -113426 -113149 -113514 -112959 -112923 -112476 -113016 -113404 -114717 -112085 -112822 -112830 -113867 -113579 -113590 -114024 -113651 -114056
7801 -114056 -113641 -113325 -113970 -114269 -114558 -113329 -112146 -113571 -113677 -113221 -112957 -113534 -112736 -113528 -113489 -112890 -113388 -112564
7783 -112564 -112837 -113850 -112700 -112888 -114257 -113574 -113781 -113201 -113323 -113360 -113873 -113577 -113157 -112527 -113124 -113337 -113447 -113685
7765 -113685 -112395 -113870 -114245 -113011 -114804 -111967 -114358 -113605 -112893 -112745 -112945 -112978 -113013 -113155 -112976 -112822 -112318 -112423
7747 -112423 -113238 -112277 -111459 -112319 -112527 -112133 -112402 -113319 -112662 -112470 -112988 -113067 -112575 -113348 -113042 -113877 -114173 -114939 -113573
7728 -113573 -114111 -113805 -113581 -113632 -111551 -112841 -112980 -113117 -111927 -112953 -112319 -113013 -113014 -113030 -113369 -112478 -111528 -113226 -112065
7709 -112065 -112690 -112263 -112711 -112037 -112462 -112137 -112937 -112644 -112122 -112943 -111328 -112083 -113058 -112564 -112550 -112615 -111715 -113482 -112934
7690 -112934 -112656 -112898 -111842 -112233 -111522 -111238 -111372 -111405 -112452 -111617 -111821 -112681 -112014 -111630 -112275 -111298 -111978 -112454 -110695
7671 -110695 -111741 -111764 -112655 -113519 -111984 -112639 -111264 -112526 -112010 -112915 -113120 -113554 -113758 -112204 -111041 -113438 -112716
7654 -112716 -112762 -112991 -112518 -112281 -113382 -113251 -112694 -112421 -112492 -113165 -110824 -112141 -111878 -111696 -112562 -112470 -112258 -110254 -111820
7635 -111820 -112396 -111517 -112141 -111992 -112279 -111118 -112187 -112663 -111232 -111788 -112396 -112559 -111438 -113004 -112327 -113645 -113525
7618 -113525 -111347 -110882 -111994 -110812 -111599 -112135 -110604 -111798 -112291 -112006 -111025 -111901 -110749 -111746 -112212 -112282 -111587
7601 -111587 -112398 -113866 -112052 -108145 -109336 -110662 -111674 -111642 -110864 -112052 -110898 -112390 -111017 -111829 -111128 -109893
7585 -109893 -112700 -112698 -112627 -112381 -111472 -111860 -111413 -111033 -111975 -111291 -110729 -111075 -112802 -113017 -111818 -111873 -111514 -111870 -111783 -111914
7565 -111914 -111819 -109922 -109727 -110795 -111110 -110923 -111285 -111564 -112179 -112925 -111072 -111161 -111414 -111347 -112329 -112456 -111151 -111240 -109248
7546 -109248 -110204 -112808 -112957 -112121 -111182 -110438 -110448 -110868 -110647 -111613 -111277 -108630 -110647 -110095 -111371 -110357 -109238
7529 -109238 -108902 -109409 -109849 -109218 -108454 -106438 -106865 -105846 -107526 -109045 -108853 -109026 -108996 -107703 -109245 -110499 -110682
7512 -110682 -110426 -109781 -110076 -111750 -112824 -113620 -112943 -112126 -111306 -110933 -112418 -112350 -111279 -113730 -112171 -113296 -113156
7495 -113156 -113181 -113520 -115693 -115969 -116251 -116283 -113243 -112922 -114782 -115717 -115818 -115657 -114263 -111694 -113066 -115247 -116044
7478 -116044 -115868 -115338 -115211 -112617 -114949 -115193 -115628 -115273 -114124 -114691 -113608 -113924 -112975 -112668 -112693 -111863 -112065 -115949
7460 -115949 -119828 -122163 -117513 -115744 -112756 -110688 -110638 -108774 -108146 -109915 -114534 -116254 -112717 -111392 -111114
7445 -111114 -112076 -113082 -111910 -112127 -111572 -111554 -110193 -109248 -107915 -107577 -108042 -110782 -112945 -116682 -117827 -115459
7429 -115459 -112164 -110591 -107174 -107775 -105847 -104762 -106145 -112422 -112901 -110205 -106313 -105243 -107024 -107911 -109501
7414 -109501 -109861 -108907 -107040 -107080 -106124 -106238 -108366 -107878 -107929 -106641 -107546 -108855 -111072 -110553 -107660 -106031 -105118
7397 -105118 -105550 -107554 -108568 -107323 -103711 -102691 -101323 -102956 -103817 -104713 -104503 -102051 -103144 -103762 -103122 -102537
7381 -102537 -103301 -102869 -103389 -102437 -101758 -99984 -102799 -102383 -103368 -102389 -101815 -100292 -100027 -101838 -103202 -101844 -99344
7364 -99344 -98808 -100935 -101929 -101870 -101879 -101272 -100681 -101209 -102381 -102783 -100789 -103155 -102084 -100811 -101114 -100880 -100699 -100817
7346 -100817 -99468 -100143 -100343 -100428 -101009 -100163 -99781 -99428 -100498 -101798 -100857 -102410 -100836 -100079 -99932 -101187 -101790
7329 -101790 -100922 -98465 -99099 -99638 -100287 -99240 -99311 -99585 -100315 -100692 -100993 -99711 -98792 -98607 -98058 -97453 -99284 -97295
7311 -97295 -97790 -98284 -99354 -100205 -100474 -101000 -100621 -99894 -99823 -100994 -101181 -100147 -101772 -100865 -100715 -100029 -101159 -102498
7293 -102498 -100365 -102523 -101528 -101506 -101360 -100957 -101434 -100868 -99695 -100565 -101557 -102088 -103173 -101901 -100915 -101441 -102166 -101514
7275 -101514 -101027 -100284 -100717 -100931 -103950 -103424 -102000 -102273 -102193 -101646 -100336 -101023 -101899 -101901 -102454 -102286 -102003 -101753 -100607
7256 -100607 -101826 -102706 -102325 -101718 -102340 -101169 -101855 -103040 -103588 -102809 -102469 -101041 -102158 -102700 -101621 -101573 -101213
7239 -101213 -101516 -101727 -101251 -102069 -101670 -102011 -100525 -101946 -100914 -100716 -100400 -100789 -101371 -100610 -101975 -101284 -100440 -101133
7221 -101133 -100466 -100659 -100381 -101492 -101325 -101607 -100641 -101201 -102076 -100985 -102005 -101831 -100592 -100372 -100786 -100903 -100272 -99968
7203 -99968 -100868 -105020 -101324 -101421 -101132 -100511 -100368 -100216 -100644 -100510 -100795 -99722 -98753 -100103 -100260 -100963 -100553 -101372
7185 -101372 -101028 -100242 -99748 -100560 -98750 -99221 -99028 -99545 -98727 -99739 -100436 -100205 -99831 -99480 -100530 -99440 -98156
7168 -98156 -100040 -99942 -100395 -100749 -100135 -100055 -100662 -100207 -101374 -100615 -100150 -99201 -99704 -100703 -100354 -100803 -100387 -99418 -99764
7149 -99764 -100013 -100134 -100405 -100490 -98740 -99597 -100438 -100613 -99982 -99909 -100657 -99074 -99278 -99822 -99009 -99255 -99390 -100219 -99471
7130 -99471 -98532 -98756 -99188 -99331 -98705 -99522 -100248 -99597 -99006 -98080 -99955 -98765 -100621 -99340 -99317 -99009 -99249 -101171
7112 -101171 -98926 -99791 -100136 -100186 -99537 -99572 -100068 -99315 -99294 -99283 -99168 -99419 -100736 -99276 -97869 -99017 -98144 -100310
7094 -100310 -99054 -100266 -100254 -100005 -100290 -98515 -100184 -100321 -100101 -98505 -98767 -99685 -99607 -99060 -98788 -99644 -100361 -98256
7076 -98256 -96813 -97553 -98229 -97445 -97895 -97941 -97713 -97143 -97545 -97356 -96945 -97077 -97085 -97687 -98030 -97192 -97807 -98125 -97824 -96599
7056 -96599 -96732 -97977 -97407 -97869 -98101 -97783 -97805 -97714 -97775 -98200 -97636 -97457 -96776 -96120 -96716 -97595 -97878 -96302 -96455 -96654
7036 -96654 -95165 -97367 -96915 -96205 -96681 -98270 -97256 -97731 -95926 -97478 -97795 -97294 -96059 -97014 -97057 -96607 -96664 -96267
7018 -96267 -96509 -96013 -97273 -96101 -96751 -97063 -95778 -97014 -95951 -97021 -96990 -97910 -96947 -96543 -97137 -97293 -96734 -97793
7000 -97793 -96629 -95976 -96843 -96687 -97028 -95836 -96198 -96506 -96494 -95774 -96762 -96139 -96225 -96661 -96916 -96413 -95892 -96224 -96621
6981 -96621 -97620 -96028 -96437 -97402 -96478 -96812 -97541 -96998 -96427 -96047 -96635 -97101 -96221 -95735 -95915 -95686 -96488 -96339 -96373
6962 -96373 -95578 -96224 -96530 -96383 -95608 -96624 -96403 -95523 -96915 -96300 -95546 -95034 -96410 -96306 -95301 -95248 -96965 -96067
6944 -96067 -95028 -95710 -95666 -96149 -96436 -95400 -95593 -96399 -94704 -94834 -94632 -95213 -95769 -96244 -96082 -94792 -95919 -95395
6926 -95395 -94638 -95750 -94755 -95207 -95339 -95626 -96640 -96159 -96619 -97001 -95728 -95892 -96072 -95720 -95145 -95480 -95496 -95896 -95318
6907 -95318 -95484 -95956 -95844 -94870 -95732 -95724 -95598 -94698 -95162 -94717 -94029 -94109 -94919 -94332 -94961 -95405 -95252 -94195 -95723 -95384
6887 -95384 -95366 -95366 -95059 -95246 -95252 -95322 -94251 -95660 -95178 -94658 -94553 -93432 -93924 -93115 -93860 -94843 -94620 -94203 -95258 -95538
6867 -95538 -95152 -94960 -94529 -94925 -94512 -94475 -92649 -94235 -94502 -94764 -94427 -94742 -94177 -94672 -93782 -94594 -94275 -94389 -93828
6848 -93828 -94584 -94512 -94390 -95263 -96550 -95635 -95654 -95429 -96107 -96812 -95836 -95744 -95493 -95210 -94261 -94480 -95229 -95533 -94731 -94547
6828 -94547 -93842 -95504 -93980 -95274 -94894 -95057 -94064 -95600 -94239 -93747 -94667 -95590 -94649 -93761 -94712 -94163 -94509 -93658
6810 -93658 -94474 -93941 -93395 -97069 -94902 -94092 -96102 -94406 -94166 -94239 -94611 -93656 -95336 -95368 -93693 -92844 -95136 -95412
6792 -95412 -94586 -94522 -93272 -93410 -93942 -95155 -95181 -94226 -94888 -94135 -95062 -94969 -94649 -95151 -94865 -94577 -93314 -95491 -94956
6773 -94956 -94847 -96705 -95164 -94777 -94748 -94873 -95517 -95731 -94781 -95900 -95420 -95723 -95873 -95965 -94800 -95187 -94569 -95478 -95785
6754 -95785 -96153 -95728 -95323 -95362 -94995 -95644 -96053 -95849 -96270 -95242 -95655 -95652 -95938 -96233 -96078 -95504 -96316 -95911 -95957 -95630
6734 -95630 -98005 -96863 -96899 -97885 -97173 -97041 -97503 -97208 -97054 -96589 -96386 -97815 -97436 -98597 -99267 -97979 -98623 -97163
6716 -97163 -97985 -96968 -98858 -98955 -98895 -98305 -98647 -99427 -99477 -99364 -98586 -99219 -98272 -98643 -99914 -100337 -100638 -100713 -100670 -99378
6696 -99378 -101105 -101472 -100350 -100484 -99906 -99172 -100105 -101508 -99732 -101731 -101169 -100597 -100694 -101716 -102052 -101571 -101363 -100317
6678 -100317 -100690 -100562 -100610 -101554 -101436 -100550 -101330 -101250 -101489 -101384 -102916 -101810 -101527 -101013 -101063 -101383 -102813 -104088 -103797
6659 -103797 -102621 -101330 -102515 -102199 -102596 -102871 -102375 -102126 -103040 -103409 -104471 -103829 -104023 -102777 -103834 -103784 -103362
6642 -103362 -104028 -102638 -102884 -103285 -104350 -104839 -105101 -105187 -104700 -105133 -103914 -105175 -105735 -106896 -104834 -105180 -104489
6625 -104489 -105468 -105231 -106382 -106375 -106878 -104576 -105619 -104524 -105270 -107036 -106810 -107179 -106182 -106687 -107226 -107653 -108153 -108248
6607 -108248 -107882 -107740 -108054 -108954 -108695 -109686 -109905 -109681 -109962 -110090 -109940 -111142 -110291 -107982 -108550 -108951 -111281 -111315
6589 -111315 -110907 -110782 -111331 -112141 -112872 -113650 -112406 -110977 -110770 -110318 -111000 -112045 -112848 -112413 -112154 -111246 -111387 -112062
6571 -112062 -114099 -114342 -114713 -114858 -112530 -113703 -113965 -114438 -113757 -114390 -112939 -110922 -110700 -110858 -111852 -111874 -111289 -109880
6553 -109880 -108300 -106911 -107905 -109212 -108770 -110442 -108008 -107903 -108618 -107636 -109796 -109721 -109928 -109975 -108607 -108800 -108225
6536 -108225 -107911 -109537 -108369 -106581 -104571 -105294 -105987 -106277 -105169 -104112 -102834 -102367 -100649 -100562 -101440 -102655
6520 -102655 -102689 -101406 -101201 -100948 -102027 -102026 -101499 -102378 -100084 -99525 -98948 -98569 -98847 -100141 -100369 -99689 -98743 -98008 -99048
6501 -99048 -100852 -100486 -99563 -98788 -98337 -97649 -97098 -97571 -99012 -98647 -96825 -96290 -97442 -97842 -99102 -98151 -98718 -99338
6483 -99338 -100932 -100848 -99495 -98951 -99000 -99999 -99098 -98835 -98577 -98410 -99284 -98220 -98231 -97742 -98766 -98783 -99416 -99245 -97296
6464 -97296 -98460 -98160 -98082 -98871 -97997 -97017 -98231 -99290 -100655 -100946 -99415 -98808 -100327 -100570 -99150 -99453 -98776
6447 -98776 -99791 -99164 -99395 -99433 -99533 -98920 -99656 -99921 -101488 -99937 -98432 -98135 -100595 -101997 -101684 -98964 -97962
6430 -97962 -99468 -102363 -102097 -98837 -97484 -99364 -102816 -102353 -101631 -98729 -100802 -101597 -98062 -96814 -101489 -103059
6414 -103059 -103560 -99975 -100789 -96889 -103847 -101238 -99457 -100198 -101644 -103025 -100758 -98503 -100800 -103092 -102125
6399 -102125 -99818 -98482 -101734 -106209 -103890 -103108 -97864 -101697 -103525 -96928 -95493 -100439 -103783 -103902 -102240
6384 -102240 -101142 -104683 -105424 -103468 -100566 -100502 -103785 -103545 -101777 -99274 -100059 -103168 -103249 -102159 -102977 -103803 -106196
6367 -106196 -104219 -102896 -100988 -102459 -103125 -99917 -98543 -101400 -103634 -103530 -102617 -101890 -103346 -102999 -102732 -99080
6351 -99080 -99327 -101616 -103168 -101793 -100909 -100612 -102717 -103878 -102351 -101602 -101966 -104255 -104259 -103763 -105496 -101908 -103296
6334 -103296 -102352 -102322 -104188 -103296 -103213 -102034 -102640 -102763 -103243 -102305 -100950 -103113 -102320 -103560 -104644 -102686 -102118
6317 -102118 -101861 -102070 -101558 -100161 -101355 -101334 -103605 -103213 -103178 -101962 -101974 -101283 -103454 -103542 -101708 -101427 -101668 -102408
6299 -102408 -102216 -102439 -101945 -101877 -103565 -102297 -102821 -103240 -101914 -102816 -102165 -101468 -101318 -102694 -103148 -103069 -101717 -101649
6281 -101649 -101216 -101837 -102065 -101463 -102548 -103161 -102494 -102881 -103310 -103511 -104535 -104076 -105397 -106262 -106828 -106330 -104821 -104451
6263 -104451 -106033 -105887 -105199 -104403 -105187 -105617 -104760 -104080 -103217 -104164 -104418 -104486 -105940 -105538 -106568 -106578 -104974 -105263
6245 -105263 -106172 -106496 -105459 -105700 -106450 -106936 -108636 -106842 -106902 -107652 -107756 -106513 -107056 -106782 -106687 -107342 -108177 -108192 -108079
6226 -108079 -107244 -107766 -107693 -107588 -108011 -108031 -106895 -106341 -108999 -108170 -109552 -108033 -107524 -107220 -107176 -106964 -108959 -107659
6208 -107659 -108761 -107287 -108011 -108220 -108224 -108766 -108926 -108961 -108037 -108444 -108212 -109017 -109033 -107900 -108452 -108831 -107411 -107970 -109279
6189 -109279 -108762 -108622 -108757 -109860 -108340 -108258 -107971 -108055 -108953 -108720 -107863 -109152 -108601 -109509 -109197 -108269 -107398 -107561 -108617
6170 -108617 -108726 -108700 -108223 -109451 -108086 -109033 -108506 -107925 -109595 -109177 -108421 -108264 -109578 -110245 -110033 -109924 -110978 -109571
6152 -109571 -110248 -109999 -109294 -109258 -110065 -109068 -109539 -108806 -109302 -109539 -109197 -109193 -109645 -109642 -109471 -110044 -110312 -110366 -109780 -111001 -109939
6131 -109939 -110204 -109755 -109297 -111242 -110886 -110154 -110456 -109874 -110980 -109822 -110414 -109995 -109746 -111068 -111045 -111102 -110798 -111188
6113 -111188 -110892 -110950 -111290 -111129 -112292 -112029 -111334 -111376 -111646 -111247 -110964 -111295 -111049 -111490 -111091 -110161 -109758 -109503 -110233
6094 -110233 -109604 -109046 -109032 -107917 -108545 -108538 -108808 -108836 -109411 -109605 -110619 -109886 -111606 -110367 -111149 -112420 -109651 -111750
6076 -111750 -111679 -110634 -111777 -111517 -110862 -112557 -113040 -112573 -111512 -111815 -111914 -111317 -110567 -111364 -110769 -111293 -111957 -111530
6058 -111530 -111673 -112262 -111784 -111042 -111949 -111143 -111874 -112865 -112131 -112579 -111538 -112332 -113144 -112738 -111934 -111116 -111105 -112472 -111366
6039 -111366 -111756 -111794 -111486 -112369 -112057 -111814 -111889 -112687 -111731 -112075 -110378 -111369 -111118 -110686 -110814 -111926 -111174 -112898 -111379
6020 -111379 -111145 -111899 -111263 -111939 -112537 -105588 -107695 -109689 -108961 -109593 -110113 -109762 -109812 -109086 -109950 -110498 -110912 -109659
6002 -109659 -110644 -110025 -110246 -111466 -110819 -110114 -110029 -109813 -110173 -111677 -110693 -110428 -111555 -110849 -111405 -110188 -110576 -109118
5984 -109118 -109906 -108706 -108625 -109690 -108712 -108157 -108763 -107017 -108858 -107199 -108495 -108860 -107811 -108437 -108220 -108020 -107490
5967 -107490 -107751 -107978 -107268 -106888 -106556 -106506 -106457 -106984 -105065 -105529 -106752 -105762 -106239 -105625 -105335 -105016 -105733 -104759 -105090
5948 -105090 -105420 -105361 -103749 -104144 -104947 -104780 -104916 -102964 -102121 -103659 -103603 -102552 -101685 -102587 -103020 -102205 -101205 -101749
5930 -101749 -101672 -101526 -101516 -100928 -100451 -99579 -99712 -100807 -99693 -99808 -100742 -99303 -98637 -98452 -97478 -96985 -97264 -96922 -96700
5911 -96700 -95606 -95811 -94284 -93842 -94813 -93237 -93785 -92757 -91703 -90682 -88997 -88469 -88011 -86823 -84866 -82486
5895 -82486 -79477 -75719 -70670 -68108 -65736 -64361 -64341 -62953 -64155 -64225 -64646 -66150 -67285 -69562 -70591 -71945
5879 -71945 -72489 -73483 -74780 -75436 -74482 -76562 -75855 -75606 -76014 -75783 -76301 -75365 -76168 -75577 -73859 -73301 -73895 -73258
5861 -73258 -73884 -72886 -72813 -72271 -72928 -71386 -70034 -70462 -69361 -69013 -66939 -66566 -66194 -65657 -65824 -65295 -63185 -62424
5843 -62424 -60707 -60322 -58357 -58074 -57146 -56449 -55834 -54934 -54697 -53159 -52867 -50767 -50748 -49863 -49310 -48246 -48491 -47436
5825 -47436 -45982 -45563 -44483 -43522 -42147 -40749 -38702 -37145 -36691 -36095 -34782 -33774 -32097 -31514 -30933 -29554
5809 -29554 -28102 -26747 -26713 -25570 -23108 -21931 -22015 -20893 -19394 -17961 -16963 -15603 -16722 -14910 -14663 -12742
5793 -12742 -12459 -10789 -10148 -6224 -6156 -2749 114 1693 5773 10584 12509 16412 17783 21802 24129 27407
5777 27407 30183 31727 33991 34408 37468 39881 41736 43705 46359 47784 49644 51117 52679 55483 57707
5762 57707 59976 63201 64884 66993 68121 70095 72897 74719 78586 79407 82903 84024 87324 88852 92904
5747 92904 96986 99316 102416 104874 107527 111496 116797 120532 123669 126222 127553 129645 131821 135247 138685
5732 138685 142486 142996 145352 146997 150113 154083 159732 163285 167635 169534 172276 176189 180085 185199 190052
5717 190052 192977 197116 199591 202819 207245 213377 219759 223885 229201 233442 237604 242728 248228 255670
5703 255670 261141 267158 271267 275745 280349 285683 290694 295910 302239 307244 310965 315955 322928 329834
5689 329834 338059 346766 356275 363834 371670 380553 391202 399621 408851 415728 421925 427448 433154 439507
5675 439507 446558 455123 465592 473712 481792 488456 493474 503062 513707 525394 535463 545724 558040
5662 558040 565094 575793 587982 601374 616599 632269 642013 652800 661693 674972 691191 708896
5650 708896 725040 737775 746420 757776 774369 798166 822853 846561 867372 886182 905511 927953
5638 927953 954704 981194 1007213 1027788 1048171 1065165 1085064 1106221 1128125 1149623 1167913 1185702
5626 1185702 1201921 1220763 1240756 1266148 1291974 1319799 1344782 1369034 1393189 1419883 1455361
5615 1455361 1496721 1535439 1571312 1594767 1616120 1639637 1670406 1699628 1726344 1745519 1757025
5604 1757025 1772119 1794199 1823373 1857956 1889538 1917993 1941508 1968857 2003837 2047395 2095188
5593 2095188 2140920 2177977 2211405 2247956 2292262 2344139 2402004 2461290 2514847 2563391 2615261
5582 2615261 2675257 2742637 2817015 2888275 2948300 3006626 3066373 3131893 3202204 3274868 3348688
5571 3348688 3418850 3488574 3558115 3630346 3709680 3793793 3880791 3968017 4055200 4146402 4245567
5560 4245567 4351734 4466337 4582815 4697293 4814034 4934444 5063809 5203773 5344508 5485584
5550 5485584 5633386 5791193 5958821 6130164 6307819 6491521 6684622 6890667 7110009 7340934
5540 7340934 7582598 7839182 8113836 8409725 8730627 9069594 9418657 9778784 10153579 10555474
5530 10555474 11000440 11493933 12041144 12643124 13313103 14055251 14873492 15802797 16860341
5521 16860341 18057073 19427749 21022700 22873913 24991393 27402497 30163839 33339025
5513 33339025 36972959 41091133 45703581 50868911 56783027 63736457 72042003 82036228
5505 82036228 93986013 108257585 125445647 146496523 172488161 205026382 245530706
5498 245530706 291218374 333483322 365546913 382752848 384476391 379748065 373021458
5491 373021458 362637865 346841943 325292656 298131032 266490719 233302203 201899738
5484 201899738 173903898 149943823 129872337 112948058 98413411 85905024 75223143
5477 75223143 66130263 58471248 52201244 47091484 42875819 39344869 36343696 33763825
5469 33763825 31524777 29564043 27833469 26282819 24884202 23621523 22483270 21442871
5461 21442871 20477983 19581355 18754968 17982021 17248702 16556728 15910341 15305606 14736154
5452 14736154 14194978 13687199 13201923 12736895 12302126 11897274 11509443 11127351 10753585
5443 10753585 10395675 10056861 9738500 9429616 9127409 8839782 8568892 8315245 8074164
5434 8074164 7842208 7620580 7405704 7198345 7001400 6811968 6631879 6461126 6298402 6137586
5424 6137586 5978875 5822861 5671782 5530806 5398523 5270741 5143253 5014219 4884485 4762043
5414 4762043 4647539 4544757 4449160 4350999 4248528 4148515 4056858 3972866 3897482 3825108 3751436
5403 3751436 3673947 3592589 3512456 3440501 3372348 3310054 3245785 3177781 3105075 3033034 2965852
5392 2965852 2905865 2852088 2800112 2743671 2678702 2609645 2545162 2487815 2433279 2377076 2312106
5381 2312106 2239981 2168481 2109702 2061694 2020751 1980884 1935137 1888474 1843909 1805945 1775786
5370 1775786 1749450 1723458 1690521 1656046 1620632 1587638 1555696 1527781 1501850 1472999 1442571
5359 1442571 1407364 1372208 1340157 1313371 1290186 1266073 1241310 1213909 1183841 1161109 1143629
5348 1143629 1131286 1119587 1104401 1084290 1064169 1045555 1033014 1021971 1009740 993085 973703
5337 973703 954948 935844 918457 905072 891226 876318 861986 842188 827535 811000 797429 784317
5325 784317 770044 755705 739062 723852 708160 695029 683249 673102 660203 645970 631167 615627
5313 615627 601557 587936 577820 566866 552462 537765 524424 513227 504309 497208 489102 479647
5301 479647 470954 461642 451385 446794 440580 434944 423420 415231 407440 398355 392180 383309 374412 364902
5287 364902 358334 351748 345598 337038 332726 325066 317977 311288 304458 297466 292200 288979 281677 275905
5273 275905 269554 263311 257260 254169 247878 243734 238067 231770 227733 223472 218123 213497 208539 203178
5259 203178 200638 196753 192970 187825 181768 175920 171102 167302 162012 157577 154100 149594 147505 144992
5245 144992 140454 139238 136579 134300 132622 130267 127494 124389 123303 120781 117773 115995 114081 110620
5231 110620 107162 104451 102566 100431 97884 95829 94118 92222 91584 87057 85090 83654 80793 76886 75935
5216 75935 73608 73273 71154 70135 68506 65431 64226 63380 61874 61952 61116 62143 61878 62056 61648 61161 62309
5199 62309 62390 61638 61764 60864 59687 59567 58282 56356 53398 54546 51581 51774 50526 49456 47657 47204 46621
5182 46621 44575 43409 42867 40783 41533 40334 39326 38868 38716 37284 36752 36333 35602 34029 33668 34435 32419
5165 32419 31952 32343 31629 31812 30236 31365 29156 28433 27586 26785 26081 25277 25199 24310 23593 23533 22408 21822 21903
5146 21903 21542 20232 20814 19868 18978 18221 18388 17723 16635 16319 15644 16224 15402 15468 14433 13340 13752 12300
5128 12300 11923 12798 11283 11320 10486 11074 10820 8211 7883 8096 6023 5705 5065 3332 2341 2784 1177 -486
5110 -486 -2274 -2256 -3812 -6288 -8018 -9838 -13134 -15404 -18942 -20958 -23031 -23115 -22882 -21171 -21573 -20967 -18938
5093 -18938 -18702 -16532 -14714 -13264 -11565 -9748 -8564 -7969 -5324 -6035 -4866 -8112 -5865 -7281 -7935 -7017
5077 -7017 -7010 -6961 -6671 -5738 -7292 -7635 -7046 -8276 -7538 -9170 -9020 -10195 -9121 -9965 -11063 -10623 -10673 -11614 -10711
5058 -10711 -11202 -11215 -11883 -13091 -12592 -12303 -13142 -12878 -13481 -14135 -14099 -14042 -15177 -15056 -15354 -15664 -16192 -15539 -16797
5039 -16797 -16966 -16595 -17943 -16582 -17432 -16689 -17947 -17911 -17735 -18834 -19022 -19837 -18771 -18832 -19086 -20284 -18496 -21029
5021 -21029 -20905 -20297 -21877 -21387 -20167 -20427 -21908 -21684 -22680 -22460 -23048 -23079 -23443 -23783 -23478 -22966 -23832 -22869 -24166
5002 -24166 -23384 -23176 -23326 -23430 -23965 -24069 -24374 -23472 -24092 -24539 -25270 -24065 -25215 -24463 -26076 -26310 -26744 -28447
4984 -28447 -27607 -28257 -28446 -28827 -29393 -29629 -28702 -29941 -29212 -29231 -30238 -29472 -30904 -30064 -31714 -31074 -30225 -30748
4966 -30748 -31769 -31925 -32724 -31146 -31915 -31634 -31806 -32933 -32667 -32731 -32314 -32507 -32311 -31833 -32832 -32368 -32723 -33858
4948 -33858 -33369 -33466 -33863 -33678 -33268 -33681 -34387 -35148 -32598 -34051 -35041 -35146 -35094 -35350 -34532 -35622 -35055 -36459 -35534
4929 -35534 -35673 -36271 -35982 -36551 -35688 -35467 -37217 -37074 -36662 -36929 -36710 -37246 -36603 -37721 -37588 -35937 -36792 -37535
4911 -37535 -38172 -38091 -37907 -39082 -38114 -38106 -38567 -37651 -38422 -38731 -38615 -39567 -40981 -40864 -41340 -40273 -40453 -40940 -41409
4892 -41409 -41579 -41536 -40247 -40358 -40177 -40922 -39476 -39446 -38547 -37947 -38913 -37456 -39011 -37870 -38632 -37281 -37246 -37329 -38656
4873 -38656 -37060 -36687 -36245 -36293 -35318 -36660 -36115 -37774 -38213 -37915 -39616 -39626 -38374 -38990 -37713 -36769 -36773 -36418 -36985
4854 -36985 -36315 -36121 -37204 -37415 -39271 -38979 -37554 -37639 -37119 -36282 -35684 -33906 -30839 -28815 -27978 -28555 -28816 -29902
4836 -29902 -31356 -32658 -32905 -35379 -35391 -33888 -33042 -34094 -33980 -33561 -33955 -34985 -35802 -36245 -36739 -36678 -36884 -36401
4818 -36401 -35510 -36597 -34507 -33309 -30596 -26924 -25074 -26872 -27078 -28002 -27352 -28839 -31276 -31360 -32041 -33012 -32009
4801 -32009 -33379 -32712 -33432 -32675 -33379 -33330 -33788 -33335 -32765 -33331 -32027 -31203 -30898 -30586 -29248 -27045 -26394 -25205
4783 -25205 -25270 -24908 -24129 -23658 -21664 -21356 -20490 -19067 -15971 -13622 -9652 -1256 14149 37926 63896 74070
4767 74070 66883 63024 55201 45650 33978 23479 14321 7945 3225 -399 -1879 -2495 -4274 -3860 -2953
4752 -2953 -360 1579 5114 8891 14074 19896 28770 39923 63712 110555 180759 260976 296212
4739 296212 275518 256677 233332 203329 167170 130135 99433 74204 56023 45199 37513 32187
4727 32187 28414 25563 24942 24025 24509 26108 29542 33633 39490 47872 60127 83959 130503 201939
4713 201939 281639 319514 296441 275077 250957 217947 181623 144344 112170 86287 66564 54660
4701 54660 45779 39745 34330 32277 28991 26766 25061 23859 24673 27078 27558 31311 35080 43214 57135
4686 57135 81810 109362 121584 115645 107668 99225 87266 75642 64175 55384 46065 40751 35396
4673 35396 31554 28980 27722 27145 28208 27333 25944 26189 25908 26392 27793 27774 29724 30821 29418 29606 29473
4656 29473 31241 33101 33912 35374 35693 36769 37461 39020 42276 44001 46061 44870 45902 47342 47641 48593
4640 48593 48918 50048 52727 55567 56688 59062 60464 62146 64430 66069 66922 67578 69828 73611 76790
4625 76790 78152 79528 80450 84174 87618 90256 92249 91069 94760 98311 102297 104074 103723 102223 105370
4610 105370 110249 116648 122996 128919 132341 131105 134750 138872 145489 149544 151735 152612 153692 155760 157619
4595 157619 163514 169926 175727 176625 175842 176071 180637 190412 197633 201820 204485 202949 203021 207432 218645
4580 218645 232206 246030 253703 253810 253784 260925 271299 284077 287949 286675 281018 283152 287861 297326
4566 297326 308470 319114 323646 322930 323777 331016 343477 358327 369442 373901 375111 374318 380244 394948
4552 394948 416880 436738 449807 451690 452858 464012 482695 501523 512936 516789 518047 521731 530728
4539 530728 547493 564696 580022 591327 601246 609958 621975 640034 663538 685477 702940 713276
4527 713276 722656 739645 764229 794111 818599 838777 860256 879326 906699 936779 971743 1009539
4515 1009539 1041432 1071924 1106368 1151347 1205079 1263867 1326278 1393381 1468706 1553932 1644389
4504 1644389 1738628 1843884 1962035 2092122 2244691 2429276 2649656 2914207 3248359 3683721
4494 3683721 4303394 5374566 7575726 11300261 16182790 19918350 19712489 18577175 17436599
4485 17436599 15823488 13784232 11656388 9733575 8165860 7064690 6372595 5952714
4477 5952714 5725887 5621204 5594135 5648218 5788222 6047326 6427913 6942645 7614821 8524853
4467 8524853 9794601 11645894 14851635 21398586 32604410 47115259 58964610 58015870
4459 58015870 53852032 50246217 45315798 38876574 32003532 25680031 20400392 16533035
4451 16533035 13953576 12176843 10973553 10150316 9544099 9089117 8804856 8716460 8816703
4442 8816703 9105966 9621450 10420574 11613404 13413938 16596729 23147397 34462766 49161907
4433 49161907 61273126 60347223 55795233 51893060 46685138 39920126 32693659 26024898
4425 26024898 20429001 16273311 13442427 11426117 10002725 8964526 8145377 7458622
4417 7458622 6912952 6507937 6231114 6073272 6060027 6180199 6444956 6932660 7914587 10090869
4407 10090869 13900856 18944762 22869732 22473058 20890374 19357576 17363291 14909999
4399 14909999 12359185 10036086 8095617 6643617 5615981 4868117 4314524 3895308 3547514
4390 3547514 3248340 2989694 2766248 2570514 2408214 2286016 2184997 2089871 1999906 1918043
4380 1918043 1841218 1776034 1717899 1665197 1617531 1564655 1507497 1455530 1411087 1372953 1336782
4369 1336782 1299340 1261721 1222918 1185343 1150010 1118922 1093173 1069167 1043069 1010168 972487
4358 972487 943141 919607 904041 887095 863443 829809 797543 771346 756635 744657 727368 700889
4346 700889 670677 643092 628075 619684 612176 600754 588756 571584 554058 538506 530912 524961
4334 524961 517751 506969 487970 470994 455797 446474 442219 436808 429797 412908 396486 381706 372820
4321 372820 368838 364849 351055 330715 310922 300261 297979 299463 296932 295657 286963 276520 267588
4308 267588 264535 263482 261190 254068 244282 234678 227559 222052 218866 216279 213458 208551 199457 190013
4294 190013 183767 180224 177403 173511 167539 158757 151327 148000 145318 147032 146722 143655 138880 132298 128719
4279 128719 125741 124900 122788 118535 111105 105777 102398 98244 96327 95961 95587 92858 88101 84551 82168
4264 82168 81022 80925 79013 75855 71838 67546 64537 64023 61319 62127 59104 57467 53294 50559 48693 46851
4248 46851 46163 42371 40458 36115 34486 35163 34075 33905 33523 31386 29165 27311 27385 26633 25787 23831 23729
4231 23729 21517 20634 20020 19464 19080 18492 18742 19812 22783 29836 42689 58198 60095 52107 48683 45584
4215 45584 39613 33887 28678 25972 22633 25568 31150 45686 66342 89947 96328 90180 81736 74491
4201 74491 62456 52000 41124 31352 23206 20214 18548 18985 19215 17378 15104 13284 12645 10618 12050
4186 12050 14061 18409 23195 30804 43317 67371 115087 185347 260278 289504 266937 246530 223511
4173 223511 190969 154294 118667 87408 63554 47313 35557 27871 20842 17075 14294 12735 11613
4160 11613 9237 11188 13750 16211 22516 30126 43298 67473 115044 187284 265248 297380 272140
4147 272140 249782 224100 189594 152019 113628 80663 54333 37277 24045 16050 9498 3961
4135 3961 -851 -4133 -6424 -9277 -9579 -9640 -9440 -9105 -7603 -3637 5182 21795 45725 71546 79574
4120 79574 72051 64096 53584 40696 27316 14177 1646 -6469 -14368 -19176 -21259 -23110 -25402
4107 -25402 -26550 -29858 -30764 -32022 -31739 -32628 -33261 -35364 -34610 -35898 -35668 -36187 -37374 -37538 -38560 -37651 -38909
4090 -38909 -39509 -39632 -41277 -41399 -41791 -41982 -40810 -41755 -41809 -42384 -42573 -42137 -41689 -44099 -42652 -42831 -42513 -42431 -43031
4071 -43031 -42227 -43736 -44708 -45331 -46556 -48524 -48852 -48347 -48122 -48684 -47985 -48482 -48110 -47718 -45869 -47245 -47465 -47905
4053 -47905 -47488 -47382 -48122 -47555 -47895 -48796 -47979 -48537 -48562 -49358 -49908 -48918 -51182 -51333 -52158 -52865 -53989 -53101 -52660
4034 -52660 -53232 -52289 -50936 -50059 -50047 -50734 -51012 -51260 -50817 -50353 -50122 -51869 -50802 -51595 -51788 -50888 -51937 -51424
4016 -51424 -52011 -52019 -51921 -52847 -53200 -52838 -53200 -52939 -52837 -52013 -53903 -52622 -52138 -52795 -52709 -52368 -51889 -52449 -51960 -52767
3996 -52767 -52603 -52662 -52153 -50921 -52838 -53459 -52816 -52668 -52529 -53982 -53610 -53793 -53492 -51980 -52428 -52873 -52790 -52374 -54009
3977 -54009 -53093 -53831 -53440 -55143 -54426 -53407 -53168 -53571 -54097 -54386 -54960 -54982 -54197 -53060 -53794 -54400 -54384 -53916 -53957
3958 -53957 -54072 -53633 -54591 -54266 -55096 -54720 -54426 -55345 -55033 -54638 -55504 -54704 -55469 -54639 -55754 -55672 -54867 -55183 -55648
3939 -55648 -55643 -55901 -55317 -54509 -55053 -54517 -56469 -55709 -55340 -56366 -55827 -56560 -56154 -55940 -56582 -56731 -56745 -56429 -56772 -56399
3919 -56399 -55550 -57763 -57611 -57092 -56270 -56717 -56881 -56010 -55645 -54849 -54437 -55364 -56104 -55433 -56021 -55797 -55521 -55364 -56116
3900 -56116 -56696 -54823 -56235 -56081 -55802 -56061 -56308 -56676 -56423 -56001 -57359 -56613 -56072 -55629 -55514 -56341 -55534 -55152
3882 -55152 -56746 -56588 -55498 -56119 -56614 -55723 -56718 -55970 -56090 -56606 -57069 -56441 -56694 -56477 -58307 -58382 -57131 -57844
3864 -57844 -57122 -57371 -57864 -57247 -57658 -58056 -58148 -57083 -56866 -57614 -56978 -56047 -57447 -57611 -57562 -56572 -57344 -55844 -56800
3845 -56800 -57206 -56731 -56444 -57789 -57285 -56426 -56600 -56631 -57000 -56503 -56978 -57262 -56682 -57629 -57607 -57425 -58094 -57797 -58373 -57243
3825 -57243 -58112 -57322 -57817 -58302 -57366 -56538 -57861 -56182 -56998 -57743 -57866 -57142 -57524 -56900 -56368 -55819 -56878 -56572
3807 -56572 -56776 -57733 -57127 -58228 -57687 -57943 -57282 -56899 -58324 -58150 -58501 -57627 -59307 -57958 -57553 -57958 -58809 -57844
3789 -57844 -59015 -58050 -56933 -58135 -57732 -57063 -58140 -58478 -57528 -57684 -57101 -58483 -58007 -58018 -57826 -58370 -57589 -58218
3771 -58218 -58258 -59151 -58944 -59869 -60042 -59460 -59270 -60487 -59066 -58946 -59370 -59015 -58103 -59389 -58961 -59362 -59100 -60158
3753 -60158 -59548 -59244 -59249 -60510 -60990 -60023 -59709 -59036 -59687 -59148 -59971 -59337 -60136 -60323 -61189 -60725 -59631 -60213 -60560
3734 -60560 -60672 -61363 -59603 -61796 -61552 -61847 -61304 -61734 -62094 -61025 -61301 -60579 -61513 -62397 -62191 -59947 -59865 -60381
3716 -60381 -61035 -60733 -60009 -60217 -60462 -60716 -61287 -61076 -62035 -61363 -60397 -61650 -61812 -62297 -61617 -62705 -61484 -62335
3698 -62335 -63691 -63913 -62836 -63399 -61595 -62337 -63507 -62891 -64221 -64102 -62576 -63101 -63757 -64074 -63944 -63946 -63471 -63494
3680 -63494 -62708 -63756 -64081 -64839 -62787 -63026 -63175 -63579 -64335 -65245 -65037 -65182 -64747 -63740 -65031 -65165 -65313 -65619
3662 -65619 -65195 -63738 -63148 -64010 -65903 -65799 -66122 -63834 -62384 -63746 -63366 -64541 -65539 -64231 -63526 -64873 -65185
3645 -65185 -65601 -66805 -66330 -65408 -64562 -64884 -66716 -67236 -66730 -68134 -66637 -66741 -66516 -67789 -67349 -67229 -66899 -64489
3627 -64489 -66301 -67791 -68562 -69682 -68782 -67546 -68503 -71446 -70756 -70021 -69047 -67037 -67875 -68945 -70189 -70294 -68718
3610 -68718 -69357 -68539 -70081 -69046 -69950 -71056 -71869 -70902 -71180 -69216 -69474 -71193 -72635 -72815 -69550 -67529 -66627
3593 -66627 -66728 -68328 -70638 -69214 -68615 -67082 -67321 -69578 -69704 -70146 -68965 -69193 -69820 -69408 -69148 -68437 -68834
3576 -68834 -67763 -66929 -67904 -71595 -75470 -76716 -75650 -70772 -70458 -65979 -66847 -65246 -63995 -67522 -72352 -72228
3560 -72228 -70952 -68874 -68308 -67814 -68914 -70394 -70098 -69836 -68230 -65985 -65420 -65737 -65287 -65778 -66429 -69090 -73006
3543 -73006 -74966 -73784 -71464 -67645 -63978 -65284 -63388 -62366 -65784 -69538 -70511 -67169 -65658 -63554 -63992
3528 -63992 -65600 -66739 -65856 -65167 -64336 -62968 -63116 -62808 -64277 -65299 -64172 -63430 -62706 -65423 -66622 -66205 -64838
3511 -64838 -62246 -61934 -62758 -63520 -63417 -63926 -61317 -60981 -59952 -60442 -61732 -63293 -61836 -60980 -61736 -61778 -63590
3494 -63590 -63136 -62049 -62076 -62195 -62845 -62555 -60556 -61724 -62509 -62369 -62937 -63515 -62012 -63295 -63849 -63198 -61797 -61204
3476 -61204 -61257 -61781 -60932 -62814 -62969 -61565 -61719 -61930 -62632 -63643 -63965 -62155 -61733 -63697 -64247 -65440 -64140
3459 -64140 -62445 -61169 -63403 -63575 -62938 -64083 -63487 -63016 -61899 -62065 -62582 -63607 -63447 -62113 -61895 -62173 -62104
3442 -62104 -65303 -65232 -61980 -62578 -63189 -64448 -66203 -65777 -64689 -63792 -63481 -64066 -65233 -65584 -63910 -63141 -62577
3425 -62577 -64866 -64253 -64279 -63217 -63581 -62800 -63677 -64413 -63690 -63737 -63435 -63679 -64726 -63096 -63925 -63673 -64550 -64906 -65315
3406 -65315 -63225 -62293 -62474 -64116 -64975 -65294 -63106 -62755 -62240 -62439 -65084 -64230 -63741 -61197 -61003 -62115 -63355
3389 -63355 -63651 -61907 -61517 -60839 -63588 -62915 -63172 -63121 -62761 -63392 -63022 -61347 -59613 -59949 -60652 -62691 -64860 -62643
3371 -62643 -61563 -62196 -62885 -63934 -63095 -61775 -61281 -61227 -60726 -60857 -61898 -62602 -62328 -62064 -63054 -62271 -62815 -62021
3353 -62021 -61403 -61750 -62765 -62808 -61632 -59935 -60293 -59104 -58764 -57636 -58402 -58017 -59044 -59370 -59102 -59451 -59760 -59397
3335 -59397 -60242 -58567 -58202 -57498 -59968 -59713 -58114 -57605 -58067 -55766 -58080 -57755 -57909 -59091 -59672 -60581 -59694
3318 -59694 -59251 -59887 -60741 -61553 -61747 -61879 -61599 -62255 -61604 -61766 -63390 -62481 -62208 -61282 -62100 -62017 -62634 -63273 -62540
3299 -62540 -62807 -62376 -62390 -63289 -61745 -61713 -61475 -62428 -61877 -61937 -61875 -63036 -62143 -63334 -63085 -62376 -62087 -62176 -62821 -63847
3279 -63847 -61969 -61972 -62443 -61677 -61948 -62011 -62522 -61668 -63040 -63235 -62526 -63082 -62404 -62493 -62807 -62104 -62211 -62636 -63696 -62928
3259 -62928 -62582 -63636 -64317 -63152 -62559 -62769 -62669 -62979 -62642 -63632 -64219 -63964 -63489 -62891 -62962 -62373 -63270 -62845 -63202
3240 -63202 -63110 -63819 -62713 -62627 -61811 -61970 -62556 -62219 -61306 -61621 -61405 -60920 -61826 -62515 -61516 -60539 -60528 -60364 -60574 -60121
3220 -60121 -60737 -60336 -60161 -59113 -60095 -58044 -56954 -57614 -55299 -55080 -53369 -52386 -51469 -48624 -48578 -47118 -43770
3203 -43770 -39683 -32307 -19994 -1965 15826 27641 47243 82071 122619 131237 108522 91799
3191 91799 74100 53782 33867 12082 -5021 -18909 -27806 -35408 -40759 -43055 -45063 -47543 -50126
3178 -50126 -50360 -53027 -54886 -55828 -56386 -57236 -56638 -57360 -56999 -59005 -58808 -59930 -59222 -59649 -60324 -58808 -61546
3161 -61546 -60483 -60683 -60940 -61058 -62605 -62095 -61675 -62226 -61213 -61597 -61008 -62059 -61088 -61962 -63209 -63114 -62686 -63017
3143 -63017 -62937 -62396 -62647 -62513 -62716 -63852 -63286 -62921 -62576 -63105 -62651 -62127 -63322 -63937 -62850 -63666 -62663 -62829
3125 -62829 -63456 -63162 -63721 -63721 -63592 -65038 -63857 -64774 -63162 -64197 -63912 -63477 -62678 -64699 -63839 -63802 -63773 -65358 -64382
3106 -64382 -64203 -63951 -65024 -64799 -65084 -64106 -63484 -62792 -63522 -63037 -64225 -64079 -63784 -64051 -65027 -65020 -64091 -65242 -64446
3087 -64446 -63315 -64516 -64545 -64328 -64700 -65465 -64574 -64284 -65128 -64202 -65193 -65074 -65043 -64129 -64077 -65554 -64295 -64401 -62683
3068 -62683 -64194 -63646 -63427 -64265 -64923 -64620 -63585 -64285 -63693 -63913 -64565 -64354 -63071 -64436 -64428 -64161 -63703 -63621 -64184
3049 -64184 -65159 -63325 -63258 -63718 -63573 -63316 -63577 -63713 -62960 -63320 -62471 -63227 -63326 -63252 -62757 -63968 -63802 -63688 -62893 -63202
3029 -63202 -62880 -63130 -63529 -62752 -63766 -63595 -64620 -63656 -64541 -62747 -63651 -63530 -63822 -62623 -61728 -62741 -63104 -63575
3011 -63575 -62996 -62267 -62710 -62314 -63253 -62863 -63211 -64627 -62992 -63800 -61567 -63105 -61750 -62923 -63165 -62992 -62968 -61791
2993 -61791 -61890 -63436 -63399 -61976 -62101 -62165 -62452 -61163 -61839 -61630 -60985 -60098 -61437 -62223 -60068 -62122 -61761 -62409
2975 -62409 -61608 -62376 -62283 -61091 -61133 -61135 -61160 -60700 -60595 -59813 -61231 -60598 -59903 -58962 -59574 -58202 -58471 -58658 -58341 -59619
2955 -59619 -56850 -58298 -58223 -58577 -59621 -59408 -59036 -57601 -59200 -58060 -57529 -57230 -56964 -56811 -57298 -55135 -55681
2938 -55681 -54603 -53918 -53935 -53479 -53802 -54356 -53427 -54325 -53716 -52580 -51318 -52212 -51167 -51959 -51806 -52445 -51787 -51840 -53120
2919 -53120 -53017 -52232 -52604 -52182 -51642 -52097 -50691 -50253 -50887 -48670 -48292 -48544 -48181 -49161 -48536 -50437 -49808 -47985
2901 -47985 -46844 -45497 -42493 -42791 -42997 -42873 -43620 -44549 -44221 -45356 -45592 -45742 -44743 -44271 -43793 -42403 -42616 -41352
2883 -41352 -42685 -41769 -41901 -42468 -41602 -42995 -41963 -42637 -42535 -42684 -41952 -41089 -39677 -39631 -39939 -38973 -38743 -39159
2865 -39159 -37633 -38539 -36711 -37262 -36020 -35655 -35278 -34513 -34789 -34052 -31891 -33461 -33408 -33376 -34720 -35175 -33932 -33573
2847 -33573 -35452 -33342 -33966 -32832 -32225 -32032 -32650 -32367 -31275 -31776 -30335 -29843 -30150 -27815 -25853 -25172 -24544
2830 -24544 -23867 -24366 -23368 -23819 -22456 -24036 -22638 -23320 -22823 -21911 -21453 -19539 -19377 -18561 -18364 -17352 -17352 -16455
2812 -16455 -15157 -15220 -13317 -12104 -11634 -10418 -8529 -7268 -5708 -5502 -4728 -3691 -651 805 2980 4045
2796 4045 3897 4978 7416 9253 13796 17758 19266 22971 26068 31652 35883 43023 51146 62291 81374
2781 81374 119231 183676 269039 335083 331141 312144 292588 265570 229174 191928 155951 127902
2769 127902 108888 98305 90558 84840 82710 79379 79522 82636 85891 90655 96478 101934 110437 124043
2755 124043 142728 177807 251578 377582 549067 681900 655599 614429 576082 518336 446142
2744 446142 368433 298952 239686 201473 176915 160086 146840 137755 129790 125915 123835 122286 121901
2731 121901 121528 123147 123895 128814 137826 154864 189213 248561 327080 390871 386013 364556 344749
2718 344749 319172 285528 248150 214691 187112 168292 157497 151887 148827 148818 147815 148273 144728 142088
2704 142088 139817 138218 135880 132929 132126 129827 131301 132939 135548 137100 140412 142460 145932 150372 153847
2689 153847 155490 155901 158796 164751 169870 172044 172876 174654 181643 190220 198813 203034 202280 200848 201427
2674 201427 204088 209657 213109 216102 216980 217507 220095 224104 228005 234870 241901 248972 249485 247630 247328
2659 247328 255174 269839 278589 282955 281599 280189 284733 293333 307847 323555 336638 343093 343175 345116
2645 345116 356598 368138 378535 381011 378570 373565 374302 381368 393325 406872 419455 423246 419022
2632 419022 418392 425182 442199 462168 475034 479798 478977 476894 481563 504233 536203 568101 583683
2619 583683 583160 581659 594361 620242 649773 663167 658717 649371 646477 654410 672177 693419 710917
2606 710917 721172 724676 725347 736157 758606 785948 809179 824041 828307 831261 844621 874001 915078
2593 915078 953556 976439 987601 991426 1013243 1047980 1081440 1107588 1126004 1137499 1154397 1176998
2581 1176998 1207672 1240163 1268347 1291173 1311670 1335610 1364417 1400201 1441833 1484961 1522454
2570 1522454 1554954 1588440 1629481 1678763 1729377 1773889 1820310 1873929 1938557 2005619 2056793
2559 2056793 2132806 2234305 2329329 2419246 2520243 2644869 2784006 2932338 3095209 3278075
2549 3278075 3487758 3725953 3981901 4248938 4527663 4849714 5231979 5715062 6317613 7031752
2539 7031752 7797585 8693886 9886173 11555931 14441361 20716849 32136256 47866089
2531 47866089 61769907 62081945 57677478 53889488 48810610 42096983 34902511 28307531
2523 28307531 22841948 18919948 16419605 14759789 13720799 13095874 12694180 12481557 12489140
2514 12489140 12823258 13483246 14445129 15581703 17079960 19212055 22263446 27672267 40276089
2505 40276089 62738987 92710224 117948139 115702538 107753323 100918647 91430573 78612718
2497 78612718 64516578 51274274 39966413 31631633 26050825 22025828 19237639 17265025
2489 17265025 15727858 14422337 13403303 12708934 12311067 12187747 12335227 12717529 13446097
2480 13446097 14653545 16980924 22355118 32538782 46886262 60093206 60661391 55995463
2472 55995463 51983840 46848206 40132115 32915187 26245907 20625565 16433072 13572750
2464 13572750 11485675 9971301 8854229 7943859 7132533 6431310 5835995 5331899 4917509
2455 4917509 4613273 4369668 4151398 3954709 3784520 3636871 3510631 3376551 3260226 3163939
2445 3163939 3061163 2947004 2835683 2737392 2650428 2571653 2492872 2414530 2333882 2254827 2184107
2434 2184107 2120889 2064323 2008877 1949881 1882638 1814196 1754529 1712596 1678389 1640275 1592032
2423 1592032 1532785 1470338 1427184 1399348 1370599 1337126 1291336 1240968 1197068 1165824 1145111
2412 1145111 1128187 1105878 1077473 1046254 1013032 984703 964961 950325 938229 914779 881941
2401 881941 847345 818900 802442 795896 788736 771775 741600 709258 678664 666800 665674 655891
2389 655891 629288 590526 553506 537451 534448 534908 529219 523334 507686 490358 477359 470608 467289
2376 467289 463027 452904 435858 417047 402468 391444 388315 383945 379401 369979 353565 335568 321815
2363 321815 316456 314641 305142 289212 265273 249648 245512 246375 248836 252321 248767 238321 228646 223792
2349 223792 222044 221915 217138 207714 196796 188719 182205 177550 173047 172445 170739 165221 157425 147352
2335 147352 143431 139023 139565 138274 133741 125225 116124 111793 111628 113806 113281 110901 104431 99096 94975
2320 94975 94104 92821 89970 83807 76874 72359 69043 66624 67023 67067 66610 63058 60660 58334 58938 62760
2304 62760 63547 62180 59429 55493 53465 51900 51095 51709 50394 50365 49362 49807 52954 56180 59534 62305
2288 62305 66408 73965 86218 107780 155139 236198 337380 416999 412580 384227 359478 330283
2276 330283 293733 254046 210508 173629 146064 127385 110690 98040 85652 78471 71257 67654
2264 67654 67720 68853 75350 80758 90723 107609 137036 181909 259486 375602 534060 684056 671648
2251 671648 616858 571890 513837 437603 353339 276817 212317 164027 128847 101462 81654 64969
2239 64969 51662 39954 32791 26047 23339 22146 20083 20049 22334 27766 39805 68264 121761 196476
2225 196476 265582 267266 241025 220353 192734 154838 115050 78903 48129 24207 8584 -1522
2213 -1522 -11855 -18325 -23613 -27890 -30785 -33511 -35723 -38062 -40441 -41588 -44042 -46103 -47510 -49370 -48934
2198 -48934 -51494 -51966 -54473 -53604 -53725 -54837 -56228 -56381 -58101 -59409 -58965 -60037 -60435 -60252 -60720 -61562 -60589
2181 -60589 -61025 -61437 -62231 -61416 -63348 -63125 -62326 -63282 -64913 -64670 -65227 -65682 -65538 -65545 -66518 -66837 -66213 -66533 -67932
2162 -67932 -66914 -68273 -69827 -67458 -69011 -69136 -68806 -70167 -71007 -70188 -69937 -69829 -70996 -70760 -71266 -71766 -70760
2145 -70760 -71005 -71900 -71525 -72093 -71258 -71780 -72537 -73964 -75080 -75356 -76120 -74546 -75906 -74954 -76121 -75287 -74464 -75763
2127 -75763 -74332 -73451 -74292 -74432 -73630 -74608 -74926 -74702 -74816 -75078 -73431 -76105 -75786 -75282 -74836 -76730 -76409 -78494
2109 -78494 -80298 -83373 -82982 -82379 -80980 -79847 -80132 -78635 -78295 -76922 -75395 -76072 -75723 -75674 -75220 -77043 -75915
2092 -75915 -76152 -76659 -76916 -76322 -76758 -77910 -77324 -77082 -76890 -77971 -77610 -79553 -79783 -80611 -81033 -78913 -78347 -78049
2074 -78049 -78334 -78483 -76408 -77051 -76428 -76693 -77522 -77059 -77357 -76657 -76693 -76553 -77342 -76940 -77429 -78099 -78378 -77409 -77677
2055 -77677 -76743 -77527 -77325 -76986 -76446 -77455 -77333 -77464 -77452 -77980 -78127 -77907 -78388 -77927 -77730 -77411 -77338 -77124 -77055 -77849
2035 -77849 -78164 -77893 -77251 -78335 -77129 -78017 -76579 -77790 -76862 -76938 -77561 -77142 -78180 -77271 -77770 -77915 -77230 -78169
2017 -78169 -78001 -78930 -79594 -78949 -77857 -78843 -78811 -78922 -79054 -78659 -77486 -79516 -76955 -78445 -79054 -78968 -78107 -77969
1999 -77969 -76923 -77939 -78093 -78683 -77927 -79130 -78782 -78461 -79271 -79098 -78654 -80150 -78767 -80993 -79968 -80028 -80801
1982 -80801 -79779 -79114 -79225 -79001 -79118 -78176 -79419 -78349 -77962 -80125 -79134 -78913 -79427 -78676 -79480 -79151 -78612 -79692
1964 -79692 -79086 -79734 -79349 -79060 -79372 -79958 -80845 -77911 -79083 -79409 -79127 -79215 -79163 -80109 -80289 -79650 -79681 -78760 -79085 -80156
1944 -80156 -79322 -80220 -79426 -79352 -79415 -80087 -80953 -80278 -80090 -81102 -80393 -80376 -80703 -79669 -79934 -80635 -79671 -80269 -79965 -79367
1924 -79367 -80242 -79681 -78705 -80296 -79645 -80216 -80211 -79967 -80287 -79876 -80717 -81349 -80366 -80975 -81775 -81213 -82433 -81530 -81485 -81666
1904 -81666 -80394 -81619 -81848 -81287 -80175 -80738 -80506 -81112 -80042 -80457 -80515 -80364 -80198 -80588 -80348 -80759 -80778 -81786
1886 -81786 -80425 -81180 -81338 -80361 -80924 -82455 -81539 -81131 -81138 -80161 -80277 -80463 -81933 -81633 -80450 -80808 -80869 -80697 -80920
1867 -80920 -81203 -81401 -80984 -79855 -80878 -81605 -80529 -81238 -81237 -80598 -80356 -79132 -80761 -80948 -80640 -79738 -79697 -81142
1849 -81142 -81248 -80924 -80971 -81330 -81144 -81088 -80049 -81063 -81758 -81630 -81206 -81878 -81283 -81237 -79999 -81557 -81096 -81410 -80972
1830 -80972 -80198 -80847 -80988 -81064 -80639 -81368 -79819 -80729 -80762 -80464 -80882 -79863 -79890 -80337 -81122 -80895 -80066 -81223 -81194 -81278
1810 -81278 -80140 -79877 -80558 -80365 -81277 -80577 -80718 -81412 -80858 -81800 -81327 -82010 -82296 -82435 -81350 -81037 -81635 -81649 -82346
1791 -82346 -80164 -80829 -81908 -80728 -80783 -79825 -79540 -79926 -81317 -80813 -79510 -81195 -81649 -80759 -81523 -80791 -81436 -82335
1773 -82335 -80889 -81783 -81724 -81359 -81762 -81715 -82423 -81142 -80880 -82044 -82439 -80769 -81145 -80840 -81493 -81511 -81671 -81317 -80842
1754 -80842 -81601 -81904 -82279 -80729 -80626 -80495 -80943 -81612 -82014 -81771 -81168 -81226 -79797 -80818 -80178 -81927 -81068 -81056 -80854
1735 -80854 -81746 -81913 -81845 -81701 -82577 -81255 -82023 -81886 -81964 -81792 -83078 -81115 -81150 -80081 -81070 -81009 -81458 -81293 -80700
1716 -80700 -80527 -82176 -81497 -79922 -80793 -81148 -83054 -81991 -82358 -81319 -81512 -82178 -82642 -82661 -80706 -80991 -81983 -82190
1698 -82190 -81882 -81688 -81746 -82769 -81634 -82646 -82625 -81327 -81727 -80893 -80348 -81867 -81285 -82162 -82373 -83128 -84318 -82383
1680 -82383 -81357 -82098 -81804 -82574 -82126 -81713 -81266 -81325 -81844 -82890 -82335 -81622 -81161 -81428 -82134 -83222 -81805 -82567
1662 -82567 -81757 -82254 -81490 -80222 -80749 -82564 -82389 -82668 -82146 -82377 -82381 -82626 -81589 -83063 -82031 -82405 -83699 -84569
1644 -84569 -83414 -81258 -80881 -79958 -81766 -82621 -82195 -81766 -80037 -81444 -84381 -85504 -82130 -81043 -80934 -81170
1628 -81170 -81637 -79789 -81125 -81967 -81993 -82655 -83748 -83350 -83669 -83579 -85212 -84794 -83228 -80637 -80286 -79627 -81381 -84060
1610 -84060 -83058 -80950 -81926 -82725 -85143 -85537 -82779 -81170 -79156 -80856 -82151 -84509 -82826 -81535 -81988 -82978
1594 -82978 -82851 -84693 -85383 -84255 -83772 -84121 -85353 -84459 -81945 -82502 -82478 -81951 -81980 -83351 -82595 -83612 -83913 -82670
1576 -82670 -82275 -80994 -82061 -82935 -84104 -83388 -84319 -83242 -82167 -83448 -85173 -85731 -85532 -83247 -82390 -84498
1560 -84498 -86136 -87193 -86931 -84671 -83095 -83389 -84249 -85605 -84084 -84987 -83453 -82926 -83196 -83800 -85132 -85700 -83758
1543 -83758 -84650 -84805 -85328 -85532 -86009 -85736 -85001 -85049 -85272 -86963 -86345 -86825 -85752 -85636 -84109 -86137 -86515 -85510
1525 -85510 -83888 -85617 -86824 -86824 -86415 -86395 -85464 -86445 -85892 -85491 -84222 -85002 -86101 -86384 -86264 -85269 -85537 -87713
1507 -87713 -88586 -89742 -88226 -87156 -85182 -85844 -87125 -89160 -89097 -87183 -85502 -85649 -87863 -87856 -88254 -88054 -86856
1490 -86856 -87574 -88408 -88897 -88455 -87541 -86775 -85189 -85601 -86459 -87821 -90681 -89361 -88910 -86917 -85657 -85916 -89009
1473 -89009 -91199 -91250 -89535 -89932 -89163 -84859 -80923 -80483 -82474 -85377 -88533 -88858 -88730 -87783 -89449 -88315 -85353
1456 -85353 -83104 -82942 -84098 -84342 -85930 -86430 -86639 -84321 -82982 -84145 -86250 -87857 -90330 -87177 -86729 -85182
1440 -85182 -79811 -77636 -76134 -77954 -80942 -83331 -83664 -81811 -82667 -83454 -83221 -81448 -80745 -78985 -77620 -78571
1424 -78571 -78655 -81212 -80896 -81451 -79132 -79193 -79708 -80570 -83220 -82266 -79541 -78697 -76932 -77315 -79603 -80377 -77715 -78175
1406 -78175 -77237 -77150 -78533 -78010 -78173 -77047 -77625 -77834 -78583 -78990 -78617 -77812 -79016 -77971 -76755 -76212 -77127 -77354
1388 -77354 -78706 -78920 -78128 -76665 -76786 -77845 -79248 -79006 -76702 -76199 -77032 -76828 -77093 -77809 -77090 -78143 -76716
1371 -76716 -78844 -78969 -79620 -80094 -77633 -76815 -76569 -78405 -78294 -78612 -77712 -77133 -76619 -78794 -78608 -77842 -77996 -78168
1353 -78168 -76994 -77927 -78716 -79062 -78415 -78584 -77911 -79850 -78940 -79335 -78115 -78382 -78753 -78925 -78351 -78758 -78261 -78780
1335 -78780 -79794 -79661 -78402 -77767 -77356 -77182 -77992 -79123 -78529 -78541 -77892 -78156 -78223 -79133 -79670 -79057 -79120 -79317 -79921
1316 -79921 -79125 -79545 -78623 -77250 -76713 -78638 -78629 -79302 -78656 -78793 -78958 -80166 -79896 -78725 -78680 -77977 -78710 -78995 -78806
1297 -78806 -79265 -79588 -78952 -78652 -80545 -79118 -78877 -79189 -79329 -78144 -78255 -78707 -79117 -79503 -79985 -79452 -79399 -78552 -77757
1278 -77757 -77982 -78252 -79601 -79314 -78588 -77300 -78829 -79585 -79365 -78420 -78454 -79156 -78705 -78282 -79039 -78467 -79042 -80840
1260 -80840 -79412 -79970 -79743 -79211 -78777 -77945 -79636 -79000 -81042 -79574 -79654 -78920 -80162 -79792 -79049 -78506 -79106 -78457
1242 -78457 -79417 -79771 -79549 -79618 -79908 -80379 -79548 -79613 -78991 -79674 -79566 -80199 -79806 -79139 -78347 -79653 -79751 -80706 -80191 -80186 -80520
1221 -80520 -81236 -78953 -79277 -79739 -80016 -78128 -80024 -79588 -80066 -79737 -79249 -79576 -80228 -79987 -79866 -79856 -79605 -79401 -78668
1202 -78668 -78693 -80257 -80860 -80524 -79668 -79969 -80048 -80399 -81061 -80368 -79719 -79521 -79191 -79497 -80036 -79539 -80684 -79104 -80009
1183 -80009 -79447 -79555 -79617 -79420 -79549 -79717 -80609 -79327 -80420 -79668 -79982 -80723 -81364 -80034 -80041 -78944 -80232 -80564 -80787
1164 -80787 -79685 -80618 -82746 -79835 -80588 -80463 -80112 -78102 -80606 -80205 -79823 -79403 -81251 -80643 -79994 -79664 -79834
1147 -79834 -79516 -79145 -79907 -79161 -79634 -80573 -81380 -80876 -79860 -81506 -80158 -80837 -81009 -79926 -79709 -80006 -79599 -79796
1129 -79796 -79450 -79891 -79781 -80102 -80496 -81069 -81501 -80863 -80956 -80970 -81195 -80788 -80611 -80263 -80536 -81808 -81201 -81557 -79976
1110 -79976 -80668 -79997 -80843 -80732 -81255 -80317 -80948 -80628 -80646 -80438 -79439 -80197 -80622 -79466 -80436 -81153 -80556 -79167 -81193
1091 -81193 -80561 -80353 -80074 -80545 -80431 -80742 -80155 -80832 -79713 -80471 -80554 -80061 -80138 -80315 -80618 -80908 -79663 -80653 -79859
1072 -79859 -79858 -80028 -80309 -80628 -80049 -80804 -80734 -80505 -80425 -80837 -81081 -80007 -79633 -80523 -80494 -80536 -80093 -79869 -81023 -80309 -80339
1051 -80339 -79853 -79696 -80289 -80800 -81053 -80516 -79582 -80362 -80309 -81132 -80595 -81467 -81284 -80167 -81002 -81538 -80014 -80330 -80501
1032 -80501 -81793 -80810 -80503 -80650 -80018 -80519 -80583 -80374 -79910 -80452 -79495 -80536 -80295 -80281 -80616 -79522 -80275 -79649 -81304
1013 -81304 -81044 -80964 -80268 -80686 -79643 -79936 -80938 -79170 -80685 -80951 -80395 -81050 -81789 -80714 -80937 -81122 -80880 -80385
995 -80385 -80895 -81036 -81010 -80065 -80400 -79947 -80669 -81199 -81887 -81406 -80458 -80731 -80611 -79802 -80417 -80524 -80157 -81007 -80724 -80282
975 -80282 -80849 -80206 -80360 -80250 -81736 -81034 -79338 -81566 -80155 -80549 -80794 -81769 -79330 -81151 -80751 -81263 -80607 -80959
957 -80959 -79926 -80320 -80392 -81687 -81438 -81479 -80822 -81250 -81177 -81300 -80971 -79935 -81451 -80178 -80391 -80420 -80965 -80461 -80822
938 -80822 -80881 -80887 -81053 -80851 -79795 -80561 -80605 -80887 -81301 -80600 -82079 -81513 -81169 -80863 -82147 -81337 -80122 -81571 -80455
919 -80455 -81281 -81382 -80955 -79488 -81233 -80401 -81458 -79316 -79268 -80202 -80244 -80838 -81440 -80389 -80657 -80724 -81746 -81114 -80694
900 -80694 -81145 -80813 -80521 -80391 -80734 -80632 -81063 -81420 -81948 -80806 -80729 -81256 -80863 -80421 -80584 -80508 -80541 -80581 -80030 -81471
880 -81471 -81229 -81289 -81815 -81655 -81257 -80682 -80124 -80060 -80055 -80409 -81775 -81708 -80841 -80687 -81182 -81549 -80579 -80316 -80403 -82151 -81692
859 -81692 -81071 -81174 -80718 -82112 -80986 -80326 -81930 -80274 -80981 -80538 -80265 -81441 -81097 -80782 -79788 -80652 -80089 -80612
841 -80612 -80676 -80863 -81011 -81376 -81509 -81802 -81024 -82375 -81873 -81621 -82308 -81421 -81376 -80349 -80308 -81391 -81310 -81282 -81297 -80324 -81253
820 -81253 -80896 -80996 -82136 -81530 -80521 -81605 -80258 -80284 -80992 -80841 -81721 -81212 -80844 -81571 -81589 -80438 -81203 -79647
802 -79647 -79453 -80369 -81195 -81023 -81722 -81187 -80101 -80198 -82498 -81846 -81643 -81469 -81969 -81841 -80891 -81848 -80155 -80322 -82265
783 -82265 -82215 -79878 -81495 -81285 -80550 -81026 -80251 -80736 -80805 -81655 -81633 -80990 -81730 -80931 -81236 -81535 -80815 -81375 -81178 -81739
763 -81739 -81163 -81446 -82260 -80432 -80970 -80613 -81431 -82103 -82213 -80954 -82159 -82867 -82179 -81893 -81938 -81351 -80478 -81147 -80814
744 -80814 -80626 -80522 -80683 -81725 -80808 -79649 -81369 -80944 -79919 -80850 -81463 -80295 -80623 -81173 -81527 -80723 -81557 -80960
726 -80960 -81579 -81377 -81470 -80996 -80699 -82364 -80736 -81304 -81127 -81721 -82637 -81956 -80852 -81214 -80617 -79571 -80474 -80957 -82091
707 -82091 -82103 -81555 -80943 -81101 -81584 -82227 -80795 -80734 -81698 -83064 -83423 -81270 -80030 -80750 -81164 -81731 -80503 -81438 -82573
688 -82573 -82000 -82597 -83112 -82126 -82883 -83119 -84104 -83403 -82897 -82988 -82016 -82297 -83061 -83316 -82205 -81502 -81454 -81828 -83403 -82372
668 -82372 -81999 -81934 -82978 -83815 -81314 -80587 -81896 -82157 -81938 -82292 -81193 -81538 -82821 -83244 -83171 -81627 -81756 -81723 -82226
649 -82226 -82346 -82358 -81859 -81004 -82897 -83848 -81975 -82008 -80641 -81698 -83354 -84608 -82734 -81213 -79888 -82896 -81194
632 -81194 -84352 -82237 -78557 -80840 -80386 -81225 -81929 -81646 -81497 -80940 -82582 -83776 -83745 -82138 -81063 -82158 -83964
615 -83964 -84436 -82016 -81012 -81595 -82797 -82862 -80882 -79661 -83942 -86432 -84846 -83435 -78430 -82547 -84520 -79009
599 -79009 -77206 -81381 -85542 -83830 -82122 -80630 -84175 -85323 -84119 -81878 -81422 -83555 -83514 -80246 -80095 -81358
583 -81358 -81336 -77649 -75424 -80874 -89720 -94783 -89512 -80676 -75655 -88589 -87306 -73821 -68477 -79434 -86878
568 -86878 -87606 -83906 -80211 -81642 -85574 -85762 -82659 -81070 -80222 -78862 -78097 -79132 -82017 -83125 -79217 -77618
552 -77618 -79907 -88419 -93459 -89458 -80784 -74577 -88074 -86819 -73317 -68026 -79265 -86869 -87318 -83740
538 -83740 -81715 -80180 -83127 -83469 -80000 -79362 -79850 -81015 -79024 -79435 -81535 -84664 -83316 -81173 -79323 -82153
522 -82153 -85605 -85201 -84640 -78476 -80908 -82065 -79099 -76570 -80261 -82019 -82256 -80746 -80392 -81781 -82826 -82126
506 -82126 -79596 -79119 -81129 -81366 -80992 -79094 -80690 -82425 -84144 -83002 -80958 -79682 -82129 -81782 -82821 -82774
490 -82774 -79500 -80097 -79778 -81332 -81083 -79607 -79036 -80586 -79952 -81332 -81358 -79498 -79353 -79472 -79687 -80697 -81479 -81557
472 -81557 -79089 -79607 -80611 -81273 -81425 -79949 -79451 -79933 -79415 -82080 -80175 -80483 -79899 -81763 -81670 -79783 -80366 -80669
454 -80669 -81153 -80105 -80735 -79566 -81480 -81925 -81124 -81236 -82453 -81370 -80952 -80424 -80142 -81511 -81857 -81367 -80978 -80594
436 -80594 -80178 -80047 -81675 -81325 -82449 -81307 -81312 -81041 -81896 -82977 -82994 -80406 -79592 -80807 -81400 -82137 -82363 -81134
418 -81134 -79986 -80201 -81062 -80073 -80589 -81283 -83479 -81985 -82172 -80374 -80553 -81345 -82137 -82442 -81798 -83121 -81184 -80912
400 -80912 -82876 -81944 -82749 -82158 -80164 -80818 -79743 -80613 -80628 -82155 -80997 -80320 -79662 -81384 -82370 -82015 -82370 -83180
382 -83180 -81327 -80765 -80289 -81625 -81324 -82599 -81535 -80995 -81513 -82124 -81689 -81848 -81998 -81001 -81088 -80670 -80108 -81125
364 -81125 -81995 -82172 -81600 -80399 -80956 -81050 -80784 -81851 -81114 -81961 -81926 -81499 -81611 -81733 -81325 -81711 -82431 -80345 -80473
345 -80473 -81927 -80880 -80483 -81718 -81105 -81377 -82436 -81852 -81336 -81160 -81872 -82171 -81787 -82045 -82986 -81522 -80199 -81691
327 -81691 -81301 -81675 -81920 -81200 -81147 -81761 -80896 -82079 -82019 -82049 -80940 -81739 -81396 -81992 -81330 -81636 -81964 -82617 -81533 -81285
307 -81285 -80516 -81556 -81791 -82191 -82075 -80799 -81846 -80742 -81880 -82038 -82799 -82202 -81426 -81911 -81064 -80768 -81395 -83621
289 -83621 -82276 -82390 -81683 -81198 -82163 -81215 -81535 -81745 -80987 -83312 -81856 -81144 -81848 -80451 -81641 -81083 -80985 -81444
271 -81444 -81700 -82568 -81961 -82311 -82098 -82724 -81471 -82150 -81666 -82647 -82860 -82008 -81889 -82231 -81350 -81835 -81455 -82032 -82399
252 -82399 -83189 -83740 -83351 -82144 -81672 -82776 -82805 -82971 -82060 -82383 -83171 -82749 -83093 -84660 -83165 -82700 -83221 -82286 -82611
233 -82611 -82882 -82579 -83088 -83665 -83612 -83549 -83162 -83186 -82860 -84495 -83681 -82660 -83585 -84057 -84387 -83116 -83928 -83890 -83859 -84547
213 -84547 -84145 -84659 -84394 -83998 -84075 -83277 -83311 -84118 -85079 -83426 -85013 -84298 -83776 -84491 -83868 -84252 -84752 -84181 -84763 -85161
193 -85161 -84799 -84861 -84601 -86074 -85267 -85308 -83699 -85188 -85069 -85097 -85279 -84508 -85740 -84893 -86271 -86280 -86621 -85966 -85932 -86221
173 -86221 -85703 -86640 -86242 -85610 -85722 -86330 -85160 -86729 -86242 -86495 -86715 -85569 -87012 -86594 -86127 -86774 -87771 -87062
155 -87062 -87502 -87708 -87534 -87344 -87921 -87745 -87102 -87459 -88101 -87943 -88762 -88840 -88613 -88823 -88782 -89433 -89638 -89380 -89343 -88623 -89626
134 -89626 -90354 -90590 -90804 -89739 -90008 -89966 -89533 -89337 -89685 -89923 -90350 -89951 -91170 -90760 -90933 -90714 -91390 -91723 -91074
115 -91074 -91072 -91185 -91688 -91027 -91914 -91483 -91790 -93019 -92578 -92663 -92674 -92840 -92853 -93864 -92939 -93633 -94570 -93612 -94144 -93817 -93357
94 -93357 -95330 -95402 -94215 -94938 -94136 -93924 -94473 -94107 -95127 -95776 -96755 -96305 -95461 -95975 -96837 -96916 -96944 -96863 -97146 -97638
74 -97638 -97901 -97677 -97575 -97661 -97854 -98046 -98463 -97991 -98356 -97892 -98943 -99042 -99091 -98594 -100017 -98717 -99968 -99402 -100527
55 -100527 -100168 -100275 -100264 -101538 -100724 -101128 -101499 -101752 -102672 -102052 -102435 -102137 -102744 -102557 -103351 -101956 -102655 -102785 -103847
36 -103847 -104117 -104662 -104322 -104902 -104930 -104604 -104934 -105646 -105300 -106234 -104581 -105211 -106512 -106457 -106044 -106390 -107050 -106561 -108180
$$ [...]
##END NTUPLES=NMR SPECTRUM
##END=
