##TITLE=abcd
##JCAMPDX= 6.0         $$ Bruker NMR JCAMP-DX V2.0
##DATA TYPE= NMR SPECTRUM
##DATA CLASS= NTUPLES
##ORIGIN= UXNMR, Bruker Analytische Messtechnik GmbH
##OWNER= root
$$ XWIN-NMR		Version 3.5
$$ Wed Mar  4 17:14:14 2026 Russian Standard Time (UT+4h)  servis@DPX200
##.OBSERVE FREQUENCY= 200.131235884673
##.OBSERVE NUCLEUS= ^1H
##.ACQUISITION MODE= SIMULTANEOUS
##.ACQUISITION SCHEME= undefined
##.AVERAGES= 32
##.DIGITISER RES= 18
##SPECTROMETER/DATA SYSTEM= spect
##.PULSE SEQUENCE= zg
##.SOLVENT NAME= DMSO
##.SHIFT REFERENCE= (INTERNAL, DMSO, 0, 16.4885)
##AUDIT TRAIL= $$ (NUMBER, WHEN, WHO, WHERE, WHAT)
$$ ##TITLE= Audit trail, XWIN-NMR		Version 3.5
$$ ##JCAMPDX= 5.01
$$ ##ORIGIN= Bruker BioSpin GmbH
$$ ##OWNER= servis
$$ F:\spectra/data/av/nmr/H1/1/pdata/1/auditp.txt
$$ ##AUDIT TRAIL=  $$ (NUMBER, WHEN, WHO, WHERE, WHAT)
(   1,<2026-03-04 17:06:43.21 +0400>,<servis>,<DPX200>,
      <created by zg, POWCHK disabled, PULCHK disabled
       configuration hash MD5:
       00 E9 B6 7A A2 85 ED C7 34 08 36 98 17 FE 4E 26
       data hash MD5: 32K
       A2 13 92 01 D8 7A 37 40 BB C3 BE 7C D9 90 AC 3C>)
(   2,<2026-03-04 17:13:17.23 +0400>,<servis>,<DPX200>,
      <Start of raw data processing
       efp BC_mod = 2 LB = 0.05 FT_mod = 6 PKNL = 1 PHC0 = -184.1201 PHC1 = 6.301564 SI = 16K 
       data hash MD5: 16K
       F0 BB 2B 68 01 35 CE 1C D5 4B 6B C6 61 91 BB 97>)
(   3,<2026-03-04 17:14:02.21 +0400>,<servis>,<DPX200>,
      <pk PHC0 = 4.772899 PHC1 = -7.200001 
       data hash MD5: 16K
       FA CE 75 8D C9 CE 90 40 D1 A0 53 E8 C1 93 55 B1>)
$$ ##END=
$$ 
$$ hash MD5
$$ 3E 5F 7D 31 97 75 56 25 1D A2 15 49 97 73 8A C2
##$RELAX= 
##$RELAX= 
##$RELAX= 
##$RELAX= 
##$RELAX= 
##$RELAX= 
##$RELAX= 
##$RELAX= 
$$ Bruker specific parameters
$$ --------------------------
##$DU= <F:\spectra>
##$EXPNO= 1
##$NAME= <H1>
##$PROCNO= 1
##$TYPE= <nmr>
##$USER= <av>
##$AMP= (0..31)
100 100 100 100 100 100 100 100 100 100 100 100 100 100 100 100 100 100 
100 100 100 100 100 100 100 100 100 100 100 100 100 100 
##$AQSEQ= 0
##$AQ_mod= 1
##$AUNM= <au_zg>
##$AUTOPOS= <>
##$BF1= 200.13
##$BF2= 200.13
##$BF3= 200.13
##$BF4= 200.13
##$BF5= 500.13
##$BF6= 500.13
##$BF7= 500.13
##$BF8= 500.13
##$BYTORDA= 1
##$CFDGTYP= 0
##$CFRGTYP= 5
##$CHEMSTR= <none>
##$CNST= (0..31)
1 1 145 1 1 1 1 1 1 1 1 1 1 1 1 1 1 1 1 1 1 1 1 1 1 1 1 1 1 1 1 1 
##$CPDPRG= <>
##$CPDPRG1= <>
##$CPDPRG2= <>
##$CPDPRG3= <>
##$CPDPRG4= <mlev>
##$CPDPRG5= <mlev>
##$CPDPRG6= <mlev>
##$CPDPRG7= <mlev>
##$CPDPRG8= <mlev>
##$CPDPRGB= <>
##$CPDPRGT= <>
##$D= (0..31)
0 2 0 0 0 0 0 0 0 0.06 0 0 0 0 0 0 0.0002 0 0 0 0 0 0 0 0 0 0 0 0 0 0 
0 
##$DATE= 1772629602
##$DBL= (0..7)
120 120 120 120 120 120 120 120 
##$DBP= (0..7)
150 150 150 150 150 150 150 150 
##$DBP07= 0
##$DBPNAM0= <>
##$DBPNAM1= <>
##$DBPNAM2= <>
##$DBPNAM3= <>
##$DBPNAM4= <>
##$DBPNAM5= <>
##$DBPNAM6= <>
##$DBPNAM7= <>
##$DBPOAL= (0..7)
0.5 0.5 0.5 0.5 0.5 0.5 0.5 0.5 
##$DBPOFFS= (0..7)
0 0 0 0 0 0 0 0 
##$DE= 6
##$DECBNUC= <off>
$$ [...]
##$SUBNAM4= <"">
##$SUBNAM5= <"">
##$SUBNAM6= <"">
##$SUBNAM7= <"">
##$SUBNAM8= <"">
##$SUBNAM9= <"">
##$SW= 20.6817932712277
##$SWIBOX= (0..15)
0 0 3 0 0 0 0 0 0 0 0 0 0 0 0 0 
##$SW_h= 4139.07284768212
##$TD= 32768
##$TD0= 1
##$TE= 0
##$TE2= 300
##$TE3= 300
##$TEG= 300
##$TL= (0..7)
0 120 120 120 120 120 120 120 
##$TP= (0..7)
150 150 150 150 150 150 150 150 
##$TP07= 0
##$TPNAME0= <>
##$TPNAME1= <>
##$TPNAME2= <>
##$TPNAME3= <>
##$TPNAME4= <>
##$TPNAME5= <>
##$TPNAME6= <>
##$TPNAME7= <>
##$TPOAL= (0..7)
0.5 0.5 0.5 0.5 0.5 0.5 0.5 0.5 
##$TPOFFS= (0..7)
0 0 0 0 0 0 0 0 
##$TUNHIN= 0
##$TUNHOUT= 0
##$TUNXOUT= 0
##$USERA1= <user>
##$USERA2= <user>
##$USERA3= <user>
##$USERA4= <user>
##$USERA5= <user>
##$V9= 5
##$VALIST= <valist>
##$VCLIST= <CCCCCCCCCCCCCCC>
##$VD= 0
##$VDLIST= <DDDDDDDDDDDDDDD>
##$VPLIST= <PPPPPPPPPPPPPPP>
##$VTLIST= <TTTTTTTTTTTTTTT>
##$WBST= 1024
##$WBSW= 30
##$XGAIN= (0..3)
0 0 0 0 
##$XL= 0
##$YL= 0
##$YMAX_a= 2831496
##$YMIN_a= -2931008
##$ZGOPTNS= <>
##$ZL1= 120
##$ZL2= 120
##$ZL3= 120
##$ZL4= 120
##$ABSF1= 0
##$ABSF2= 0
##$ABSG= 0
##$ABSL= 0
##$ALPHA= 0
##$AQORDER= 0
##$ASSFAC= 0
##$ASSFACI= 0
##$ASSFACX= 0
##$ASSWID= 0
##$AUNMP= <proc_1d>
##$AZFE= 0.1
##$AZFW= 0.1
##$BCFW= 0
##$BC_mod= 2
##$BYTORDP= 0
##$COROFFS= 0
##$CY= 18.4799938201904
##$DATMOD= 1
##$DC= 0
##$DFILT= <>
##$DTYPP= 0
##$F1P= 9.9274215381318
##$F2P= -0.165520771350173
##$FCOR= 1
##$FTSIZE= 16384
##$FT_mod= 6
##$GAMMA= 0
##$GB= 0
##$INTBC= 1
##$INTSCL= 4.127829e-11
##$ISEN= 128
##$LB= 0.05
##$LEV0= 0
##$LPBIN= 0
##$MAXI= 10000
##$MC2= 0
##$MEAN= 0
##$ME_mod= 0
##$MI= 50
##$NCOEF= 0
##$NC_proc= -1
##$NLEV= 6
##$NOISF1= 3.799351
##$NOISF2= 2.8
##$NSP= 0
##$NTH_PI= 0
##$NZP= 0
##$OFFSET= 16.48848
##$PC= 4
##$PHC0= -179.3472
##$PHC1= -0.8984365
##$PH_mod= 1
##$PKNL= yes
##$PPARMOD= 0
##$PSCAL= 4
##$PSIGN= 0
##$REVERSE= no
##$SF= 200.130005582386
##$SI= 16384
##$SIGF1= 3
##$SIGF2= 2
##$SINO= 400
##$SIOLD= 16384
##$SREGLST= <1H.CDCl3>
##$SSB= 0
##$STSI= 16384
##$STSR= 0
##$SW_p= 4139.07284768211
##$SYMM= 0
##$S_DEV= 0
##$TDeff= 32768
##$TDoff= 0
##$TI= <>
##$TILT= no
##$TM1= 0
##$TM2= 0
##$TOPLEV= 0
##$USERP1= <user>
##$USERP2= <user>
##$USERP3= <user>
##$USERP4= <user>
##$USERP5= <user>
##$WDW= 1
##$XDIM= 16384
##$YMAX_p= 349447052
##$YMIN_p= -188471
$$ End of Bruker specific parameters
$$ ---------------------------------
##NTUPLES= NMR SPECTRUM
##VAR_NAME=  FREQUENCY,     SPECTRUM/REAL,   SPECTRUM/IMAG
##SYMBOL=    X,             R,               I
##VAR_TYPE=  INDEPENDENT,   DEPENDENT,       DEPENDENT
##VAR_FORM=  AFFN,          ASDF,            ASDF
##VAR_DIM=   16384,         16384,           16384
##UNITS=     HZ,            ARBITRARY UNITS, ARBITRARY UNITS
##FACTOR=    0.252644378177508, 1,           1
##FIRST=     3299.83951724647, 0,            0
##LAST=      -839.233330435636, 0,           0
##MIN=       -839.233330435636, -188471,     0
##MAX=       3299.83951724647, 349447052,    0
$$ Real data points
##PAGE= N=1
##DATA TABLE= (X++(R..R)), XYDATA
$$ [...]
$$ plain form
9548 -114132 -114425 -116070 -116415 -115822 -116263 -115729 -115753 -116313 -116970 -117136 -117947 -117230 -116922 -117167 -114650 -115964 -115721 -114720
9530 -114720 -115796 -114351 -114477 -114023 -116193 -116103 -114921 -114027 -116363 -116471 -115354 -115458 -116325 -117187 -117232 -115774 -115288
9513 -115288 -115167 -114354 -115986 -114378 -115444 -115888 -115898 -115176 -115267 -115724 -115915 -115930 -116670 -115984 -115717 -115821 -115331 -115629 -116286
9494 -116286 -117306 -115766 -116255 -115502 -115021 -115777 -115786 -115554 -115917 -116523 -115469 -114426 -114592 -113020 -113958 -115276 -116207 -114884
9476 -114884 -115563 -115634 -115818 -116397 -116242 -115798 -116045 -116071 -116128 -114939 -114686 -115137 -115682 -114786 -114729 -115082 -114560 -115213 -115501 -116024
9456 -116024 -115998 -115111 -116320 -114970 -114787 -116769 -116708 -116011 -115026 -115508 -115855 -116871 -116861 -116616 -114780 -115498 -115110 -115193 -115385
9437 -115385 -115239 -116209 -117217 -117557 -116251 -114568 -115867 -114742 -115100 -116311 -115262 -115763 -115958 -115458 -117106 -116390
9421 -116390 -117282 -116131 -117055 -117593 -117699 -117729 -116474 -116220 -115339 -113750 -115950 -115549 -115953 -115942 -118017 -118080 -118468 -117042
$$ packed form
9548a14132k93j645l45N93m41N34k4n60o57j66q11P17L08k45K517j314K43J001
9530a14720j076J445j26M54k170R0J182Q94k336j08J117j04q67q62m5J458M86
9513a15288J21Q13j632J608j066m44j0P22r1m57j91j5p40O86K67j04M90k98o57
9494a16286j020J540m89P53M81p56rK32l63o06J054J043j66J572r38j318r31J323
9476a14884o79p1j84n79J55M44k47k6n7J189K53m51n45Q96N7l53N22o53k88n23
9456a16024K6Q87j209J350J83j982O1O97R85m82l47j016J0K45J836p18L88q3j92
9437a15385J46r70j008l40J306J683j299J125l58j211J049n01j95N00j648P16
9421a16390q92J151r24n38j06l0J255K54Q81J589k200M01m04J1k075o3l88J426
$$ plain form
9403 -117042 -115654 -115183 -115203 -115103 -115423 -114291 -114496 -115712 -116516 -118103 -117897 -118563 -117562 -117416 -117721 -116715 -116867
9386 -116867 -116886 -115205 -115407 -115081 -114506 -114891 -115540 -116822 -117367 -118330 -115087 -115363 -115948 -114410 -115513 -113632 -114578
9369 -114578 -114675 -115294 -115536 -117443 -116240 -117972 -117521 -116365 -117549 -117082 -116426 -115542 -116106 -116228 -114620 -115494 -117037
9352 -117037 -115655 -116152 -115793 -115764 -115571 -115019 -115096 -115662 -114904 -116440 -116489 -115569 -115547 -115314 -116483 -117189 -116752 -117661 -117446
9333 -117446 -117492 -117328 -117791 -118283 -118072 -118082 -117158 -116961 -116134 -114415 -114398 -115474 -114749 -116009 -115651 -115697 -115210 -116035 -117259
9314 -117259 -115397 -115201 -115939 -117083 -116465 -116240 -117523 -116644 -117866 -117803 -118039 -117520 -117115 -118418 -116590 -117444 -117090
9297 -117090 -117644 -116223 -115377 -116635 -115760 -116626 -114613 -115802 -115092 -116341 -115285 -115410 -116082 -117636 -116534 -116644
9281 -116644 -116190 -116234 -116371 -116817 -117307 -116652 -117218 -117788 -116623 -116687 -116877 -117126 -117315 -117102 -116688 -115699 -115846 -116269 -115061
$$ packed form
9403a17042J388M71k0J00l20J132k05j216q04j587K06o66J001J46l05J006j52
9386a16867j9J681k02L26N75l85o49j282n45r63L243k76n85J538j103J881r46
9369a14578r7o19k42j907J203j732M51J156j184M67O56Q84n64j22J608q74j543
9352a17037J382m97L59K9J93N52p7n66P58j536m9R20K2K33j169p06M37r09K15
9333a17446m6J64m63m92K11j0R24J97Q27J719J7j076P25j260L58m6M87q25j224
9314a17259J862J96p38j144O18K25j283Q79j222O3k36N19M05j303J828q54L54
9297a17090n54J421Q46j258Q75q66K013j189P10j249J056j25o72j554J102j10
9281a16644M54m4j37m46m90O55n66n70J165o4j90k49j89K13M14R89j47m23J208
$$ plain form
9262 -115061 -115661 -115055 -115467 -116496 -115980 -116455 -116252 -116221 -115935 -116220 -115911 -116387 -116216 -116167 -115723 -115456 -116737 -116476 -117613
9243 -117613 -117078 -116536 -116365 -116336 -116768 -117466 -118255 -116064 -116850 -117725 -116972 -118145 -116326 -116570 -117031 -116626 -116944 -116302
9225 -116302 -115796 -116807 -116374 -117095 -116012 -116844 -116202 -118833 -117036 -116852 -117793 -117245 -117057 -115592 -116771 -116522 -115940
9208 -115940 -117206 -115899 -117147 -116656 -117894 -116260 -116662 -117605 -117342 -117757 -118189 -117799 -117532 -117063 -117060 -117394 -117248 -117851
9190 -117851 -117801 -116040 -116297 -116374 -117083 -117243 -115937 -116422 -115463 -113777 -115950 -116392 -116948 -115768 -116233 -117538 -116135
9173 -116135 -118247 -117661 -117561 -117390 -117538 -118513 -117018 -118206 -117479 -117671 -117872 -117573 -117993 -118335 -118256 -117114 -116487 -116476
9155 -116476 -116409 -117658 -117022 -116755 -117535 -117856 -116940 -116961 -116710 -116629 -116214 -116677 -117525 -116654 -117053 -115867 -117095 -117458 -118193
9136 -118193 -117041 -118058 -116457 -117862 -118919 -118239 -118310 -118408 -118142 -117978 -117680 -118135 -116528 -116744 -117434 -117473 -116647 -116386
$$ packed form
9262a15061o00O06m12j029N16m75K03L1K86k85L09m76J71M9M44K67j281K61j137
9243a17613N35N42J71K9m32o98p89K191p86q75P53j173J819k44m61M05l18O42
9225a16302N06j011M33p21J083q32O42k631J797J84r41N48J88J465j179K49N82
9208a15940j266J307j248M91j238J634m02r43K63m15m32L90K67M69Ll34J46o03
9190a17851N0J761k57p7p09j60J306m85R59J686k173m42n56J180m65j305J403
9173a16135k112N86J00J71j48r75J495j188P27j92k01K99m20l42P9J142O27J1
9155a16476O7j249O36K67p80l21R16k1K51Q1M15m63q48Q71l99J186j228l63p35
9136a18193J152j017J601j405j057O80p1r8K66J64K98m55J607k16o90l9Q26K61
$$ plain form
9118 -116386 -117786 -116985 -116756 -116431 -116936 -116444 -116557 -116632 -116006 -117705 -116498 -116067 -116044 -117889 -117578 -118338 -116638 -116908
9100 -116908 -117284 -117161 -117095 -116951 -117025 -117541 -118105 -118396 -117842 -118201 -117066 -117143 -117700 -117341 -117382 -116513 -116500 -116814 -117292 -117412
9080 -117412 -118077 -117631 -117706 -116686 -116702 -117311 -117563 -118022 -117202 -117268 -118048 -118939 -118336 -117326 -118616 -118360 -118503 -118220 -118015
9061 -118015 -118061 -118553 -117890 -118455 -117828 -118192 -118358 -118299 -117508 -118092 -117811 -119003 -118902 -118214 -117936 -118080 -117809 -117558 -117409
9042 -117409 -117656 -119038 -116916 -117502 -118185 -117284 -117458 -118681 -116966 -118728 -117631 -118956 -119002 -118299 -118631 -118658 -118228
9025 -118228 -117831 -117093 -116948 -118345 -116985 -118007 -118001 -117589 -119171 -117146 -117307 -118337 -117682 -117600 -117636 -116611 -118367 -117810
9007 -117810 -117335 -117540 -118091 -117841 -117134 -118605 -116933 -117971 -116603 -117651 -118608 -117430 -117534 -118421 -117416 -117874 -116673
8990 -116673 -118603 -118128 -118218 -118772 -118752 -118181 -117653 -118846 -117362 -118256 -118824 -118051 -118365 -119033 -117566 -117501 -118006 -118851 -118707
$$ packed form
9118a16386j400Q01K29L25n05M92j13p5O26j699J207M31K3j845L11p60J700k70
9100a16908l76J23O6J44p4n16n64k91N54l59J135p7n57L59m1Q69J3l14m78j20
9080a17412o65M46p5J020j6o09k52m59Q20o6p80q91O03J010j290K56j43K83K05
9061a18015m6m92O63n65O27l64j66N9P91n84K81j192J01O88K78j44K71K51J49
9042a17409k47j382K122n86o83R01j74j223J715j762J097j325m6P03l32k7M30
9025a18228L97P38J45j397J360j022OM12j582K025j61j030O55Q2l6J025j756N57
9007a17810M75k05n51K50P07j471J672j038J368j048r57J178j04q87J005m58J201
8990a16673j930M75r0n54K0N71N28j193J484q94n68P73l14o68J467O5n05q45J44
$$ plain form
8971 -118707 -118750 -117885 -118132 -118247 -117266 -117033 -118511 -118891 -117659 -117342 -117803 -116876 -119789 -117947 -118785 -118282 -118573 -118324
8953 -118324 -118076 -117848 -119030 -117730 -119083 -118878 -119662 -118970 -118781 -118926 -118359 -118409 -118610 -118179 -119020 -118665 -118314 -118722
8935 -118722 -118757 -118196 -118541 -118792 -118070 -117700 -118459 -118287 -118403 -119060 -117386 -118991 -118768 -117371 -117473 -117497 -119307 -118910
8917 -118910 -118061 -119030 -119871 -118184 -117943 -118415 -117145 -117996 -117791 -118037 -118235 -118599 -118073 -118709 -117647 -118032 -118088 -118588
8899 -118588 -118512 -117490 -117238 -118994 -118586 -118818 -118056 -117983 -118973 -118169 -118722 -118291 -118278 -117364 -117967 -117921 -118156 -118007 -118895 -118910
8879 -118910 -119839 -120240 -119578 -120360 -117907 -119296 -117942 -119146 -118913 -118716 -118117 -117939 -118588 -119546 -118987 -118523 -119153 -119400
8861 -119400 -118695 -119593 -119944 -119888 -119489 -119136 -119846 -119584 -119733 -119329 -118894 -118611 -118113 -119117 -119719 -119007 -119076 -119018 -117877
8842 -117877 -117755 -120091 -120117 -120208 -119308 -119370 -119136 -118843 -118741 -118993 -120075 -119350 -120788 -120432 -119655 -118894 -118213 -120709 -119617
$$ packed form
8971a18707m3Q65k47j15R81K33j478l80J232L17m61R27k913J842q38N03k91K49
8953a18324K48K28j182J300j353K05p84O92J89j45N67n0k01M31q41L55L51m08
8935a18722l5N61l45k51P22L70p59J72j16o57J674j605K23J397j02k4j810L97
8917a18910Q49r69q41J687K41m72J270q51K05k46j98l64N26o36J062l85n6n00
8899a18588P6J022K52j756M08k32P62P3r90Q04n53M31J3R14o03M6k35J49q88j5
8879a18910r29m01O62p82K453j389J354j204K33J97N99J78o49r58N59M64o30k47
8861a19400P05q98l51N6L99L53p10K62j49M04M35K83M98j004o02P12o9N8J141
8842a17877J22k336k6r1R00o2K34K93J02k52j082P25j438L56P77P61O81k496J092
$$ plain form
8823 -119617 -118854 -119864 -118888 -119177 -119211 -120216 -120317 -119748 -119560 -119021 -119527 -119149 -119374 -119563 -118763 -119923 -119746 -119065
8805 -119065 -119364 -119110 -119218 -118221 -119757 -120335 -120185 -119954 -118344 -120830 -120477 -119671 -120398 -118870 -119348 -119770 -120291 -119000
8787 -119000 -119584 -118591 -118143 -119865 -120562 -117117 -119884 -119842 -119434 -119636 -119396 -120540 -119479 -119668 -118917 -120499 -120087
8770 -120087 -120657 -120210 -120250 -119628 -120371 -120140 -120328 -120411 -120434 -120055 -120026 -119336 -121412 -119390 -119395 -119524 -120254 -121545 -119571 -119946
8750 -119946 -119814 -119685 -119304 -120464 -120640 -121877 -122489 -121194 -120741 -120710 -120670 -120117 -119295 -120205 -121005 -120654 -120391 -120130 -121368
8731 -121368 -120114 -121072 -120444 -121933 -120480 -119846 -120172 -120515 -121362 -119094 -120613 -121665 -120476 -121409 -120990 -119646
8715 -119646 -120881 -120890 -120477 -121469 -121393 -120920 -120729 -121462 -120705 -121168 -121066 -121176 -121252 -120643 -121903 -121596 -121286 -121081 -121808 -122600
8695 -122600 -121553 -121876 -120093 -121369 -121474 -121920 -120748 -120893 -121133 -121371 -120927 -119616 -121047 -121668 -121400 -121960 -122186
$$ packed form
8823a19617P63j010R76k89l4j005j01N69J88N39n06L78k25j89Q00j160J77O81
8805a19065k99K54j08R97j536n78J50K31J610k486L53Q06p27J528m78m22n21J291
8787a19000n84R93M48j722o97L445k767M2M08k02K40j144J061j89P51j582M12
8770a20087n70M47m0O22p43K31j88q3k3L79K9O90k076K022nj29p30j291J974l75
8750a19946J32J29L81j160j76j237o12J295M53L1M0N53Q22r10q00L51K63K61j238
8731a21368J254r58O28j489J453O34l26l43q47K268j519j052J189r33M19J344
8715a19646j235rM13r92P6M73J91p33P57m63J02j10p6O09j260L07L10K05p27p92
8695a22600J047l23J783j276j05m46J172j45k40k38M44J311j431o21K68n60k26
$$ plain form
8678 -122186 -122231 -122123 -121527 -121991 -122137 -121335 -121971 -121139 -122290 -122610 -122781 -122598 -121922 -123467 -121164 -121401 -121603 -121586 -123386
8659 -123386 -122343 -122360 -122047 -122641 -121887 -121862 -121584 -121550 -122283 -122612 -124079 -123238 -122524 -122792 -122342 -123551 -124275 -122529 -121251
8640 -121251 -120985 -122422 -120940 -123213 -123339 -123969 -122740 -122365 -123177 -122124 -121702 -123128 -122521 -121651 -121789 -123085 -123338
8623 -123338 -123296 -122868 -123741 -123272 -123223 -122939 -122586 -123224 -123060 -124029 -124453 -125154 -125345 -126428 -125090 -124340 -123721 -124649 -123773
8604 -123773 -123788 -124980 -125510 -125894 -126833 -126061 -126145 -126308 -125518 -125249 -123096 -124149 -124808 -125060 -126704 -126897 -127896 -128265
8586 -128265 -128273 -128066 -128356 -127011 -126595 -126613 -127159 -127299 -127501 -126092 -127013 -127526 -127480 -127044 -126064 -125439 -127250 -126918 -129418
8567 -129418 -131007 -131966 -131912 -131894 -131914 -130458 -130128 -129161 -129417 -129265 -129684 -130862 -131270 -130033 -131362 -131669 -131687 -133722
8549 -133722 -134009 -133548 -132554 -132878 -134039 -134303 -133389 -132675 -133367 -132729 -131641 -133453 -132629 -134652 -188471 -131339
$$ packed form
8678a22186m5J08N96m64j46Q02o36Q32j151l20j71J83O76j545K303k37k02J7j800
8659a23386J043j7L13n94P54K5K78L4p33l29j467Q41P14k68M50j209p24J746J278
8640a21251K66j437J482k273j26o30J229L75q12J053M22j426O07Q70j38j296k53
8623a23338M2M28q73M69M9K84L53o38J64r69m24p01j91j083J338P50O19r28Q76
8604a23773j5j192n30l84r39P72q4j63P90K69K153j053o59k52j644j93r99l69
8586a28265qK07k90J345M16j8n46j40k02J409r21n13M6M36R80O25j811L32k500
8567a29418j589r59N4J8k0J456L30R67k56J52m19j178m08J237j329l07j8k035
8549a33722k87M61R94l24j161k64R14P14o92O38J088j812Q24k023n3819N7132
$$ plain form
8533 -131339 -132338 -131556 -132787 -130937 -131524 -132309 -132441 -133219 -133018 -132581 -133671 -131523 -131152 -133247 -135065 -135802 -139065
8516 -139065 -137889 -137980 -136042 -131507 -127597 -126452 -124168 -122514 -120544 -122800 -123083 -125211 -125148 -126426 -128059 -128168
8500 -128168 -126797 -125102 -125054 -123768 -122265 -122628 -122014 -121794 -121548 -122190 -120466 -120152 -119664 -120498 -119714 -118941 -119687 -118332
8482 -118332 -117118 -117574 -116680 -116337 -116881 -116648 -116632 -115573 -114066 -114688 -113732 -113984 -113667 -114826 -114632 -113771 -112739 -111721
8464 -111721 -112801 -112112 -112016 -109924 -110099 -108974 -111021 -113368 -114738 -114629 -114232 -115999 -116410 -114715 -114569 -111413
8448 -111413 -110043 -111156 -110243 -113174 -112630 -113101 -112264 -112050 -112228 -111443 -111369 -112752 -114668 -115848 -114738 -116721 -115060
8431 -115060 -114685 -114759 -114660 -114310 -112859 -112973 -111296 -113085 -112532 -112827 -112985 -113072 -115737 -116243 -115538 -115605 -111530 -112717
8413 -112717 -113985 -115402 -117423 -116607 -113867 -113997 -114480 -115712 -115287 -115146 -115307 -115359 -116316 -114698 -114658 -114012 -115641
$$ packed form
8533a31339r99P82j231J850n87p85j32p78K01M37j090K148L71k095j818p37l263
8516a39065J176r1J938M535L910J145K284J654J970k256k83k128O3j278j633j09
8500a28168J371J695M8J286J503l63O14K20K46o42J724L14M88q34P84P73p46J355
8482a18332J214m56Q94L43n44K33J6J059J507o22R56k52L17j159J94Q61J032J018
8464a11721j080O89R6K092j75J125k047k347j370J09L97j767m11J695J46L156
8448a11413J370j113R13k931N44m71Q37K14j78P85P4j383j916j180J110j983J661
8431a15060L75p4R9L50J451j14J677j789N53k95j58q7k665n06P05o7M075j187
8413a12717j268j417k021Q16K740j30m83j232M25J41j61n2r57J618M0O46j629
$$ plain form
8396 -115641 -116136 -117115 -115048 -114177 -113008 -115343 -114735 -117649 -116625 -115767 -115030 -115825 -117011 -118478 -115674 -113410
8380 -113410 -113063 -113658 -116371 -114883 -115599 -116157 -116975 -115938 -114260 -113740 -113289 -114375 -116170 -116697 -116468 -114949 -114671
8363 -114671 -115488 -117812 -117856 -117959 -114311 -113728 -114533 -114519 -117972 -115838 -115692 -114271 -114914 -115336 -116023 -116703 -117005 -117813
8345 -117813 -117676 -116129 -115411 -112341 -114654 -116584 -119476 -117977 -116325 -114597 -114818 -117360 -119137 -117061 -115878
8330 -115878 -113611 -115656 -117125 -116300 -118763 -117032 -115798 -114381 -116410 -116156 -117132 -116935 -117381 -117261 -115392 -114755
8314 -114755 -115029 -114689 -114564 -116663 -115766 -116455 -114349 -115584 -114574 -118826 -118507 -119094 -118082 -116009 -116621 -117658
8298 -117658 -117747 -118601 -116249 -116738 -115650 -117667 -117184 -117833 -116209 -116993 -117971 -118757 -118249 -116170 -117099 -114661 -116525
8281 -116525 -115904 -116088 -118319 -117665 -119383 -117558 -119359 -117052 -118538 -118675 -120824 -118553 -115997 -117693 -117980 -119656
$$ packed form
8396a15641m95r79K067Q71J169k335O08k914J024Q58P37p95j186j467K804K264
8380a13410L47n95k713J488p16n58q18J037J678N20M51j086j795n27K29J519K78
8363a14671q17k324m4j03L648N83q05J4l453K134J46J421o43m22o87o80l02q08
8345a17813J37J547P18L070k313j930k892J499J652J728k21k542j777K076J183
8330a15878K267k045j469Q25k463J731J234J417k029K54r76J97m46J20J869O37
8314a14755k74L40J25k099Q97o89K106j235J010m252L19n87J012K073o12j037
8298a17658q9q54K352m89J088k017M83o49J624p84r78p86N08K079r29K438j864
8281a16525O21j84k231O54j718J825j801K307j486j37k149K271K556j696k87j676
$$ plain form
8265 -119656 -119425 -117902 -116177 -117492 -117329 -116544 -117753 -117631 -116835 -116697 -118222 -118404 -119165 -118814 -118207 -115731 -116027
8248 -116027 -116509 -116975 -117652 -117624 -116491 -118595 -118459 -116806 -117175 -115310 -118253 -118036 -118875 -117168 -117578 -117089 -116068
8231 -116068 -116678 -118965 -115985 -117076 -116915 -115248 -118931 -117242 -117296 -116024 -119204 -119172 -115836 -116811 -115495 -120670
8215 -120670 -119916 -118405 -118303 -115959 -118450 -116706 -119891 -117958 -119629 -116195 -120373 -115739 -114754 -113068 -116745
8200 -116745 -118050 -119860 -113158 -113661 -118142 -120272 -116191 -117816 -125748 -108526 -114094 -118756 -121508 -113335
8186 -113335 -115127 -119004 -120124 -120318 -122799 -118192 -120238 -120739 -117718 -121288 -118922 -118965 -117976 -117192 -120409 -117460
8170 -117460 -117619 -120124 -118652 -117236 -117178 -116726 -115505 -121634 -118697 -118528 -120437 -119818 -118585 -120759 -117408 -117675
8154 -117675 -118008 -116302 -118062 -120158 -118752 -116338 -116506 -119885 -118361 -117173 -119068 -118500 -120109 -117805 -117177
$$ packed form
8265a19656K31J523J725j315J63P85j209J22P96J38j525j82p61L51O07K476k96
8248a16027m82m66o77K8J133k104J36J653l69J865k943K17q39J707m10M89J021
8231a16068o10k287K980j091J61J667l683J689n4J272l180L2L336r75J316n175
8215a20670P54J511J02K344k491J744l185J933j671L434m178M634R85J686l677
8200a16745j305j810O702n03m481k130M081j625p932J7222n568m662k752Q173
8186a13335j792l877j120j94k481M607k046n01L021l570K366m3R89P84l217K949
8170a17460j59k505J472J416N8M52J221o129K937J69j909O19J233k174L351k67
8154a17675l33J706j760k096J406K414j68l379J524J188j895N68j609K304O28
$$ plain form
8139 -117177 -119308 -118991 -119108 -118327 -119144 -119322 -116497 -118971 -117108 -117490 -117882 -117587 -119482 -119250 -118691 -120669 -119129
8122 -119129 -120135 -118253 -118754 -120010 -120099 -119851 -118839 -118031 -119500 -118617 -116589 -116601 -119072 -117909 -117382 -118534 -118062
8105 -118062 -119420 -120337 -117894 -119966 -117764 -119025 -119159 -118527 -120004 -119477 -117700 -118437 -119300 -120216 -119704 -120881
8089 -120881 -121280 -119675 -119610 -120327 -121106 -119868 -119908 -118667 -118661 -120345 -120112 -119886 -120016 -119407 -119473 -120504 -118870 -120412
8071 -120412 -119831 -119600 -119725 -119587 -118742 -120582 -121342 -120113 -119123 -120133 -119151 -118901 -119952 -119634 -120285 -118712 -120175
8054 -120175 -119933 -119274 -120565 -120373 -119811 -119793 -120893 -119154 -121223 -120535 -119432 -119727 -120653 -120550 -120840 -120116 -121061 -119774
8036 -119774 -119304 -119634 -120327 -119890 -118967 -118541 -119287 -119014 -121143 -119416 -120068 -120099 -119663 -120015 -119811 -119954 -119590 -120027 -120851
8017 -120851 -118914 -120971 -119822 -118553 -120142 -120093 -119309 -119610 -119828 -119898 -120807 -121405 -119236 -121562 -120493 -122112 -120785
$$ packed form
8139a17177k131L17j17P81q17j78K825k474J863l82l92K95j895K32N59j978J540
8122a19129j006J882n01j256q9K48J012Q08j469Q83K028j2k471J163N27j152M72
8105a18062j358r17K443k072K202j261j34O32j477N27J777p37q63r16N12j177
8089a20881l99J605O5p17p79J238m0J241Oj684K33K26j30O09o6j031J634j542
8071a20412N81K31j25J38Q45j840p60J229R90j010R82K50j051L18o51J573j463
8054a20175K42O59j291J92N62J8j100J739k069O88J103k95r26J03k90P24r45J287
8036a19774M70l30o93M37R23M26p46K73k129J727o52l1M36l52K04j43L64m37q24
8017a20851J937k057J149J269j589M9P84l01k18p0r09n98K169k326J069j619J327
$$ plain form
8000 -120785 -121170 -122066 -121547 -120342 -120521 -121759 -119394 -119670 -121784 -119981 -118505 -120452 -121117 -121627 -119427 -120570
7984 -120570 -121483 -120544 -120457 -121118 -119797 -120202 -121739 -122155 -122094 -120503 -120677 -120258 -120375 -120445 -122059 -120152 -120450 -120620
7966 -120620 -119966 -121400 -120671 -120630 -119959 -120425 -121270 -121693 -120632 -120271 -121651 -120438 -120738 -121867 -121169 -121596 -121154 -121386
7948 -121386 -121194 -121054 -120999 -121726 -120638 -120043 -121606 -122070 -120347 -120805 -120848 -120659 -120516 -121815 -121657 -122729 -120624 -121162
7930 -121162 -120950 -121737 -120703 -121113 -120944 -120342 -121016 -121438 -120975 -120962 -119522 -121008 -121437 -122053 -122001 -120363 -119544 -121473
7912 -121473 -120131 -121125 -120053 -121453 -121422 -121141 -121911 -120404 -121489 -121462 -121090 -121882 -121587 -121735 -120552 -122157 -120411
7895 -120411 -122137 -121576 -121005 -120660 -121246 -121406 -121091 -121262 -122110 -121175 -121011 -121102 -121438 -121314 -121261 -120799 -122496 -122557 -121541
7876 -121541 -122323 -122135 -122121 -122129 -121949 -122185 -122624 -122977 -122974 -122560 -122696 -122644 -121880 -122286 -123359 -122725 -123498 -123772 -123792 -123058 -124793
$$ packed form
8000a20785l85q96N19J205j79j238K365k76k114J803J476j947o65n10K200j143
7984a20570r13R39Q7o61J321m05j537m16O1J591j74M19j17p0j614J907k98j70
7966a20620O54j434P29M1O71m66q45m23J061L61j380J213l00j129O98m27M42k32
7948a21386J92J40N5p27J088N95j563m64J723m58m3J89J43j299J58j072K105n38
7930a21162K12p87J034m10J69O02o74m22M63J3J440j486m29o16N2J638Q19j929
7912a21473J342r94J072j400L1K81p70J507j085K7L72p92K95j48J183j605J746
7895a20411j726N61N71L45n86j60L15j71q48R35J64r1l36J24N3M62j697o1J016
7876a21541p82J88J4qJ80k36m39l53LM14j36N2P64m06j073O34p73k74k0P34j735
$$ plain form
7855 -124793 -125641 -126533 -127634 -130948 -134098 -150813 -128596 -104223 -109372 -114522 -115985 -116355 -117437 -117977 -117532
7840 -117532 -119682 -118571 -118320 -119184 -118908 -119875 -119969 -119749 -120352 -120578 -120346 -120231 -120523 -120957 -120528 -119382 -121492 -120112
7822 -120112 -119936 -120333 -119923 -121180 -119748 -121001 -121454 -121038 -121177 -120551 -120483 -119993 -120157 -120054 -120724 -121619 -121514 -121227
7804 -121227 -120876 -121330 -119998 -119913 -121861 -120795 -120881 -121758 -122186 -120938 -120934 -121260 -122154 -121594 -121360 -120842 -120724 -121153 -120895
7785 -120895 -120903 -121168 -121122 -121607 -121398 -120831 -120219 -120266 -120556 -121552 -120436 -120815 -120351 -121426 -121202 -121396 -122262 -119649 -121223
7766 -121223 -120651 -120077 -120224 -120108 -120945 -121272 -120989 -120941 -119146 -120919 -121557 -121240 -121373 -121370 -121542 -121025 -121489 -121098 -121657
7747 -121657 -121981 -121380 -120871 -122558 -120967 -119979 -120265 -120784 -119842 -119879 -119966 -119100 -120454 -119326 -120588 -119884 -120499 -121605
7729 -121605 -121510 -121062 -120063 -120726 -121064 -120315 -120292 -120779 -119589 -121108 -120652 -119856 -121033 -121131 -121833 -121534 -120344 -121517
$$ packed form
7855a24793q48q92j101l314l150j6715K2217K4373n149n150j463l70j082n40M45
7840a17532k150J111K51q64K76r67r4K20o03k26K32J15k92m34M29J146k110J380
7822a20112J76l97M10j257J432j253m53M16j39O26O8M90j64J03o70q95J05K87
7804a21227L51m54J332Q5j948J066q6q77m28J248Ml26q94N60K34N18J18m29K58
7785a20895qk65M6m85K09N67O12m7k90r96J116l79M64j075K24j94q66K613j574
7766a21223N72N74j47J16q37l27K83M8J795j773o38L17j33Lj72N17m64L91n59
7747a21657l24O01N09j687J591R88k86n19R42l7q7Q66j354J128j262P04o15j106
7729a21605R5M48R99o63l38P49K3m87J190j519M56P96j177r8p02K99J190j173
$$ plain form
7711 -121517 -121297 -121601 -121579 -120878 -121759 -121969 -121158 -121623 -121234 -122768 -121390 -122370 -123588 -122011 -122841 -122138 -122024 -121447
7693 -121447 -122122 -121673 -119318 -121039 -120698 -120549 -119407 -120761 -121684 -120685 -120649 -121522 -121577 -121771 -121474 -122274 -120905 -120815
7675 -120815 -121219 -120159 -119586 -121320 -120631 -120372 -120564 -120103 -119926 -120758 -119293 -119782 -120818 -120270 -120835 -120715 -120964 -120522
7657 -120522 -120552 -121436 -120680 -121258 -120179 -120666 -121560 -121391 -120423 -120439 -121273 -121744 -121127 -121102 -120677 -120288 -119123 -121654 -121230
7638 -121230 -120254 -121180 -119988 -120072 -119955 -119818 -119406 -120205 -120321 -121264 -122392 -122328 -122461 -122066 -120717 -121206 -121228 -122046 -122018
7619 -122018 -121314 -121274 -121512 -120817 -121257 -121211 -120840 -120529 -120815 -120935 -120732 -120710 -119245 -120669 -121395 -121648 -122240 -120945 -121806
7600 -121806 -121597 -120970 -122586 -121784 -121620 -122155 -120219 -122097 -121894 -120490 -121538 -119734 -119677 -120486 -122049 -121382 -121019
7583 -121019 -120171 -121579 -121714 -121771 -122471 -123230 -121910 -121128 -120173 -121190 -121020 -121302 -121939 -121056 -121937 -122833 -121439 -122355
$$ packed form
7711a21517K20l04K2P01q81k10Q11m65L89j534J378r80j218J577q30P03J14N77
7693a21447o75M49K355j721L41J49J142j354r23R99L6q73n5j94K97q00J369R0
7675a20815m04J060N73j734O89K59j92M61J77q32J465m89j036N48n65J20k49M42
7657a20522l0q84P56n78J079m87q94J69R68j6q34m71O17K5M25L89J165k531M24
7638a21230R76r26J192q4J17J37M12p99j16r43j128O4j33L95J349m89k2q18K8
7619a22018P04M0k38O95m40M6L71L11k86j20K03K2J465j424p26k53n92J295q61
7600a21806K09O27j616Q02J64n35J936j878K03J404j048J804N7q09j563O67L63
7583a21019Q48j408j35n7p00p59J320P82R55j017J70k82o37Q83q81q96J394r16
$$ plain form
7565 -122355 -122066 -122179 -120354 -120185 -119173 -120576 -120636 -121517 -121240 -121201 -120195 -119763 -120335 -120507 -121577 -120773 -119232 -120480
7547 -120480 -120565 -120688 -120349 -120824 -121638 -121119 -121225 -121157 -120387 -120503 -121453 -122862 -123394 -123405 -123341 -121618 -121754 -122158 -122236 -122860
7527 -122860 -123723 -123080 -122991 -122577 -122507 -123144 -124051 -125043 -125447 -125699 -125713 -124134 -123704 -124004 -125335 -123422 -125335 -124879 -124658
7508 -124658 -124084 -124479 -123630 -124532 -123254 -122567 -122499 -123533 -123281 -125331 -124834 -126433 -124869 -123964 -124007 -125133 -124909 -125092
7490 -125092 -123148 -122687 -124153 -127760 -128729 -129176 -128031 -128145 -126340 -125915 -122940 -119394 -119099 -120077 -122454 -122754
7474 -122754 -123859 -124684 -124719 -125435 -125276 -123873 -124357 -121611 -120600 -121409 -121025 -120311 -120199 -120621 -121604 -124845 -126715
7457 -126715 -126920 -125901 -125405 -122774 -120833 -118856 -114671 -113884 -116872 -118786 -118397 -119880 -118906 -120866 -121763 -119936
7441 -119936 -119438 -117747 -116111 -114827 -114268 -117138 -116736 -117140 -117190 -117235 -116994 -117752 -118507 -117850 -118008 -117353 -116233 -116140
$$ packed form
7565a22355K89j13J825J69J012j403o0q81K77L9J006M32n72j72j070Q04J541j248
7547a20480q5j23L39m75q14N19j06O8P70j16r50j409n32j1O4J723j36m04p8o24
7527a22860q63O43Q9M14P0o37r07r92m04k52j4J579M30l00j331J913j913M56K21
7508a24658N74l95Q49r02J278O87O8j034K52k050M97j599J564R05m3j126K24j83
7490a25092J944M61j466l607r69m47J145j14J805M25K975L546K95r78k377l00
7474a22754j105q25l5p16J59J403m84K746J011q09L84P14J12m22r83l241j870
7457a26715k05J019M96K631J941J977M185P87k988j914L89j483R74j960q97J827
7441a19936M98J691J636J284N59k870M02m04n0m5K41p58p55O57j58O55J120R3
$$ plain form
7423 -116140 -115583 -116515 -116734 -115546 -114803 -113219 -113417 -113246 -114946 -114252 -116224 -115549 -115398 -114607 -114144 -112316 -112923
7406 -112923 -112145 -113216 -112339 -112270 -112539 -111512 -111882 -112007 -111809 -113907 -113685 -115330 -115773 -114172 -113331 -112285 -111848
7389 -111848 -112488 -113345 -112199 -111768 -112560 -112957 -112316 -113685 -113713 -112694 -112914 -111561 -111947 -112056 -111244 -111759 -112770 -111127
7371 -111127 -112705 -113054 -113049 -111919 -112672 -112259 -113585 -112131 -112024 -113275 -113186 -113140 -112837 -110581 -111602 -111162 -111086 -111740
7353 -111740 -113109 -112635 -112750 -113160 -111922 -110792 -111106 -110732 -111496 -111427 -112972 -111778 -109626 -110598 -109903 -111268 -110581
7336 -110581 -111362 -111050 -110258 -110069 -110325 -111339 -111493 -110987 -112080 -111204 -111190 -110815 -111818 -111329 -112256 -111841 -111888 -111495 -111640
7317 -111640 -111109 -111576 -110688 -111195 -111411 -112464 -112878 -112686 -112610 -112383 -112158 -112168 -111055 -111285 -111282 -111324 -112025 -110813 -111826
7298 -111826 -111777 -111537 -111965 -112507 -112362 -111660 -112276 -112560 -113173 -112891 -112648 -113003 -113305 -114328 -114460 -114650 -112543 -112096 -113031
$$ packed form
7423a16140N57r32k19J188P43J584j98J71j700O94j972O75J51P91M63J828o07
7406a12923P78j071Q77O9k69J027l70j25J98k098K22j645m43J601Q41J046M37
7389a11848o40q57J146M31p92l97O41j369k8J019k20J353l86j09Q12n15j011J643
7371a11127j578l49NJ130p53M13j326J454J07j251Q9M6L03K256j021M40P6o54
7353a11740j369M74j15m10J238J130l14L74p64O9j545J194K152r72O95j365O87
7336a10581p81L12P92J89k56j014j54N06j093Q76J4L75j003M89r27M15m7L93j45
7317a11640N31m67Q88n07k16j053m14J92P6K27K25j0J113k30Lm2p01J212j013
7298a11826M9K40m28n42J45P02o16k84o13K82K43l55l02j023j32j90K107M47r35
$$ plain form
7279 -113031 -113047 -112737 -112778 -112559 -112961 -111779 -111874 -112419 -111379 -113114 -114122 -114055 -113419 -112880 -111436 -111379 -111970 -112084 -113652
7260 -113652 -112076 -112594 -111328 -112834 -112233 -112552 -112611 -112041 -111577 -112543 -112760 -111700 -111687 -111971 -112120 -113348 -112808 -112645
7242 -112645 -112257 -112724 -112079 -112253 -112644 -113327 -112865 -112914 -112385 -112601 -111700 -110404 -111883 -112880 -111571 -111959 -112731 -112845
7224 -112845 -112904 -111946 -112910 -112543 -111731 -112331 -113168 -112442 -112929 -111716 -111838 -111343 -112399 -111885 -111721 -111070 -111270 -110622 -111601
7205 -111601 -111846 -112690 -116195 -112261 -112542 -112481 -110305 -111736 -110785 -111301 -111509 -112096 -111261 -112065 -112105 -111620 -110922 -112122
7187 -112122 -112384 -111880 -111870 -111373 -111811 -112159 -110242 -111613 -109989 -111429 -112351 -112190 -112787 -112381 -112584 -113285 -112069 -112623
7169 -112623 -112233 -112624 -112629 -112777 -112569 -111862 -113758 -111125 -112004 -112869 -111112 -111799 -112109 -111984 -112011 -111330 -111946 -111920 -111059
7150 -111059 -112159 -112470 -112915 -112758 -112666 -112643 -111815 -112034 -112410 -111277 -112001 -112832 -111074 -111164 -111255 -110835 -111422 -112201 -111051
$$ packed form
7279a13031j6L10m1K19m02J182r5n45J040j735j008O7O36N39J444N7n91j14j568
7260a13652J576n18J266j506O01l19n9N70M64r66k17J060J3k84j49j228N40J63
7242a12645L88m67O45j74l91o83M62m9N29k16R01J296j479r97J309l88p72j14
7224a12845n9R58r64L67Q12o00q37P26m87J213j22M95j056N14J64O51k00O48r79
7205a11601k45q44l505L934k81O1K176j431R51n16k08n87Q35q04m0M85O98j200
7187a12122k62N04J0M97m38l48J917j371J624j440r22J61n97M06k03p01J216n54
7169a12623L90l91nj48K08P07j896K633q79q65J757o87l10J25k7O81o16K6Q61
7150a11059j100l11m45J57R2K3Q28k19l76J133p24q31J758r0r1M20n87p79J150
$$ plain form
7131 -111051 -111594 -110444 -110928 -111488 -112480 -112365 -111551 -111935 -111104 -110804 -111956 -111782 -111803 -110838 -111828 -111984 -112677 -111851 -111572
7112 -111572 -112006 -111177 -111200 -112042 -113216 -112806 -113220 -112704 -112636 -112245 -112475 -112151 -111930 -112438 -112983 -112737 -113431 -112566 -112788
7093 -112788 -112636 -113352 -112071 -112230 -112060 -111732 -111434 -111875 -111839 -112403 -112106 -112331 -112254 -111931 -111790 -111601 -111826 -111420 -112272
7074 -112272 -111560 -111718 -112356 -112334 -111553 -112218 -111813 -112522 -111272 -110783 -111933 -111929 -111224 -110694 -112012 -112190 -111366 -111694 -111448
7055 -111448 -111661 -111294 -111807 -111072 -110585 -110932 -112104 -111434 -110758 -111486 -111763 -112453 -112268 -112315 -112820 -110453 -111281 -111427 -111252
7036 -111252 -111536 -112281 -111412 -112619 -112262 -111404 -111354 -111711 -111174 -111019 -111623 -111679 -112117 -112179 -110572 -112695 -111620 -111498 -112104
7017 -112104 -112132 -111945 -111814 -110798 -112633 -110797 -111152 -111302 -111618 -111461 -110553 -110741 -110877 -110057 -112340 -111564 -112012 -111846
6999 -111846 -110467 -110466 -111585 -110176 -109719 -110673 -111267 -111870 -112219 -111316 -110628 -110496 -112441 -110460 -111573 -111644 -111726 -110807
$$ packed form
7131a11051n43J150m84n60r92J15Q14l84Q31L00j152J74k1R65r90j56o93Q26K79
7112a11572m34Q29k3q42j174M10m14N16O8L91k30L24K21n08n45K46o94Q65k22
7093a12788J52p16J281j59J70L28K98m41L6n64K97k25P7L23J41J89k25M06q52
7074a12272P12j58o38K2P81o65M05p09J250M89j150MP05N30j318j78Q24l28K46
7055a11448k13L67n13P35M87l47j172O70O76p28k77o90J85m7n05K367q28j46J75
7036a11252k84p45Q69j207L57Q58N0l57N37J55o04n6m38o2J607k123J075J22o06
7017a12104k8J87J31J016j835J836l55j50l16J57R08j88j36Q20k283P76m48J66
6999a11846J379Jj119J409M57r54n94o03l49R03O88J32j945J981j113p1q2R19
$$ plain form
6981 -110807 -110244 -110829 -110597 -109832 -111505 -110315 -110029 -111164 -110540 -109877 -110773 -110822 -110902 -110991 -111449 -111792 -110566 -111456 -110796
6962 -110796 -110307 -109631 -110821 -109449 -110909 -111000 -110626 -110440 -110344 -109975 -110239 -110228 -109908 -110695 -109216 -111241 -110530 -111048
6944 -111048 -110681 -110394 -111188 -111213 -111182 -110404 -110566 -110206 -109614 -111513 -110500 -111303 -111141 -109971 -109671 -111068 -110560 -111701
6926 -111701 -110317 -110662 -110704 -110856 -111226 -111151 -111113 -110335 -110213 -109995 -110796 -111231 -110177 -110160 -110538 -110702 -110678 -111051 -110882 -112121
6906 -112121 -110896 -111561 -111422 -111854 -111404 -112247 -110989 -112090 -111706 -111152 -111615 -111236 -110555 -111513 -111678 -112621 -111208 -110529
6888 -110529 -110719 -111020 -111221 -111550 -110742 -112063 -111517 -111609 -111295 -111561 -112067 -110687 -111559 -110758 -110963 -111313 -111271 -110334 -110460
6869 -110460 -111345 -110979 -111295 -110824 -111530 -111708 -111061 -111923 -111214 -111981 -111796 -112346 -110546 -112290 -110815 -110334 -110990 -111815
6851 -111815 -110745 -111201 -111377 -111175 -110267 -110981 -110519 -111015 -111210 -110761 -111376 -112204 -110832 -111987 -111338 -111142 -111063 -110757
$$ packed form
6981a10807N63n85K32P65j673J190K86j135O24O63q96m9q0q9m58l43J226q90O60
6962a10796M89O76j190J372j460r1L74J86R6L69k64J1L20p87J479k025P11n18
6944a11048L67K87p94k5L1P78j62L60N92j899J013q03J62J170L00j397N08j141
6926a11701J384l45m2j52l70P5L8P78J22K18q01m35J054J7l78j64K4l73J69j239
6906a12121J225o65J39m32M50q43J258j101L84N54m63L79O81r58j65r43J413O79
6888a10529j90l01k01l29Q08j321N46r2L14k66n06J380q72Q01k05l50M2R37j26
6869a10460q85L66l16M71p06j78O47q62P09p67J85n50J800j744J475M81o56q25
6851a11815J070m56j76K02R08p14M62m96j95M49o15q28J372j155O49J96P9L06
$$ plain form
6833 -110757 -111554 -111762 -111615 -111070 -112550 -111278 -111383 -110875 -111582 -110180 -111473 -111640 -112013 -112191 -111689 -112079 -111785 -112160
6815 -112160 -111854 -112085 -111939 -111278 -112507 -112921 -113484 -113774 -112602 -111251 -111834 -111848 -112355 -112685 -111999 -113080 -113032 -113562
6797 -113562 -112151 -111610 -111601 -112774 -112697 -112780 -111777 -113636 -113463 -113434 -114229 -114078 -113131 -113410 -113422 -113643 -113450 -112477 -113273 -112697
6777 -112697 -112733 -113285 -113711 -114357 -114107 -114379 -113982 -113825 -114245 -113920 -114254 -114027 -114132 -114355 -115415 -114572 -116125 -114939
6759 -114939 -115615 -114898 -117014 -115172 -115578 -115705 -117172 -116676 -116074 -116300 -115641 -116225 -116502 -115701 -116589 -116075 -116254 -115328
6741 -115328 -115769 -117162 -117550 -117102 -116680 -117107 -116961 -117048 -116860 -116758 -116887 -117471 -116944 -118558 -117305 -117692 -117864 -117803 -118880
6722 -118880 -117400 -117468 -117038 -116759 -117248 -117791 -118733 -118799 -118264 -117827 -117866 -118801 -118743 -118164 -117988 -119252 -119110 -119920 -120028 -119304
6702 -119304 -119404 -119418 -119089 -120527 -119208 -119664 -118401 -119113 -119150 -120059 -120765 -119015 -118711 -119798 -120043 -120704 -119345 -118898
$$ packed form
6833a10757p97k08J47N45j480J272j05N08p07J402j293j67l73j78N02l90K94l75
6815a12160L06k31J46O61j229m14n63k90J172J351n83j4n07l30O86j081M8n30
6797a13562J411N41Rj173P7q3J003j859J73K9p95J51R47k79j2k21J93R73p96N76
6777a12697l6n52m26o46K50k72L97J57m20L25l34K27j05k23j060Q43j553J186
6759a14939o76P17k116J842m06j27j467M96O02k26O59n84k77Q01q88N14j79R26
6741a15328m41j393l88M48M22m27J46q7J88J02j29n84N27j614J253l87j72O1j077
6722a18880J480o8M30K79m89n43r42o6N35M37l9r35N8N79J76j264J42q10j08P24
6702a19304j00j4L29j438J319m56J263p12l7r09p06J750L04j087k45o61J359M47
$$ plain form
6684 -118898 -120030 -121199 -121490 -119964 -120804 -120906 -121386 -120710 -121923 -121643 -121125 -121969 -121782 -121541 -122862 -121819 -122138
6667 -122138 -121517 -120864 -122497 -121765 -121869 -122421 -121971 -123152 -122435 -123763 -124177 -123827 -122702 -122907 -121890 -123567 -122973
6650 -122973 -122463 -122107 -122709 -123142 -124462 -123677 -123990 -124670 -124605 -123777 -123942 -124468 -124795 -125113 -125092 -124673 -126161 -126388 -125537
6631 -125537 -125187 -126005 -125540 -125304 -125886 -124867 -125272 -125816 -127233 -126675 -126744 -126522 -127046 -126841 -126696 -127101 -126762 -126918 -126612
6612 -126612 -128602 -128808 -130027 -128983 -128891 -128832 -127738 -127703 -128533 -128418 -127537 -127286 -128498 -128698 -128746 -129589 -130544 -130647 -130590
6593 -130590 -130743 -130200 -130432 -129221 -129931 -129361 -129696 -129208 -129272 -128488 -127780 -126196 -126816 -126914 -126723 -126970 -126635 -125012 -125130
6574 -125130 -125833 -124961 -126210 -126664 -125827 -126112 -126422 -126327 -126863 -126426 -126576 -126536 -125826 -124413 -124499 -125668 -126233 -124909 -124082
6555 -124082 -122257 -123417 -122842 -123118 -123305 -121264 -121543 -121622 -120620 -120669 -121617 -121369 -121314 -121053 -121642 -121615 -120348 -120870 -121288
$$ packed form
6684a18898j132j169k91J526q40j02m80O76j213K80N18q44J87K41j321J043l19
6667a22138O21O53j633P32j04n52M50j181P17j328m14L50J125k05J017j677N94
6650a22973N10L56o02m33j320P85l13o80O5Q28j65n26l27l18K1M19j488k27Q51
6631a25537L50q18M65K36n82J019m05n44j417N58o9K22n24K05J45m05L39j56L06
6612a26612j990k06j219J044R2N9J094L5q30J15Q81K51j212k00m8q43r55j03N7
6593a30590j53N43k32J211p10N70l35M88o4P84P08J584o20r8J91k47L35J623j18
6574a25130p03Q72j249m54Q37k85l10R5n36M37j50M0P10J413q6j169n65J324Q27
6555a24082J825j160N75k76j87K041k79p9J002m9r48K48N5K61n89K7J267n22m18
$$ plain form
6536 -121288 -121684 -121519 -120461 -120050 -119676 -119124 -119934 -120742 -119835 -121034 -120246 -120863 -120593 -118401 -118584 -117974 -117730 -119419
6518 -119419 -121203 -118346 -117805 -116568 -117026 -119276 -119957 -119118 -119215 -117416 -117932 -117840 -119220 -118148 -120529 -120023 -119434
6501 -119434 -119149 -117870 -118288 -119269 -119301 -121049 -119146 -119591 -120009 -120482 -120157 -119512 -118624 -118426 -118462 -119626 -120767 -119816
6483 -119816 -120645 -120756 -120058 -120707 -121114 -120605 -122126 -122199 -120000 -120433 -119533 -121119 -121534 -121047 -119148 -119738 -120723 -122902
6465 -122902 -123330 -122280 -120487 -120221 -119819 -123615 -123684 -124199 -121351 -118762 -119428 -122793 -124221 -124960 -122189 -120270
6449 -120270 -120481 -118230 -119539 -120648 -119645 -124262 -125734 -125523 -121618 -119679 -120017 -122728 -125741 -123876 -119742
6434 -119742 -118213 -120688 -122837 -125662 -124735 -122002 -119081 -119111 -124844 -127231 -128439 -124310 -121381 -122067 -119858
6419 -119858 -121495 -118793 -119467 -125377 -128809 -126710 -122004 -118537 -121489 -125081 -125954 -126207 -121990 -118527 -117463
$$ packed form
6536a21288l96J65J058M11L74N52q10q08R07j199P88o17K70K192j83O10K44j689
6518a19419j784K857N41J237m58k250o81Q39r7J799n16R2j380J072k381N06N89
6501a19434K85J279m18r81l2j748J903m45m18m73L25O45Q88J98l6j164j141R51
6483a19816q29j11O98o49m07N09j521p3K199m33R00j586m15M87J899n90r85k179
6465a22902m28J050J793K66M02l796o9n15K848K589o66l365j428p39K771J919
6449a20270k11K251j309j109J003m617j472K11L905J939l38k711l013J865M134
6434a19742J529k475k149k825R27K733K921l0n733k387j208M129K929o86K209
6419a19858j637K702o74n910l432K099M706L467k952l592q73k53M217L463J064
$$ plain form
6404 -117463 -122097 -126266 -126769 -124097 -122387 -121842 -124746 -127275 -127860 -125162 -123111 -123017 -122020 -121998 -120953 -121032 -125836
6387 -125836 -127300 -125976 -124580 -122134 -122500 -124305 -126789 -126249 -123112 -121151 -122434 -122326 -124377 -126878 -124998
6372 -124998 -124096 -123157 -122861 -125633 -125927 -126437 -125884 -124716 -124606 -125247 -124681 -124552 -125690 -126203 -125970 -125032 -124810 -124588
6354 -124588 -125862 -125556 -125666 -123524 -124745 -124741 -124897 -123976 -123063 -123202 -123515 -124072 -124037 -124488 -125252 -125449 -125167 -126123 -125880
6335 -125880 -126176 -128071 -126061 -125605 -123945 -125671 -125272 -126103 -126497 -126710 -125103 -124883 -123955 -125268 -126159 -126504 -124252
6318 -124252 -123308 -122812 -123443 -123609 -122969 -125076 -123318 -124096 -124155 -124639 -125148 -125892 -126106 -127412 -127437 -127053 -126791 -127504 -126879
6299 -126879 -128708 -128423 -127318 -128069 -127693 -128227 -128764 -128121 -126957 -126921 -127732 -128672 -128807 -127700 -126941 -128218 -128451 -128921
6281 -128921 -128115 -129411 -127729 -127988 -128516 -130142 -129988 -129189 -129306 -128191 -128015 -128973 -130036 -129566 -130014 -129985 -130394 -129255
$$ packed form
6404a17463m634m169n03K672J710N45k904k529n85K698K051R4R97K2J045p9m804
6387a25836j464J324J396K446l66j805k484N40L137J961j283J08k051k501J880
6372a24998R02R39K96k772k94n10N53J168J10o41N66J29j138n13K33R38K22K22
6354a24588j274L06j10K142j221Mj56R21R13j39l13n57L5m51p64j97K82r56K43
6335a25880k96j895K010M56J660j726L99q31l94k13J607K20R28j313q91l45K252
6318a24252R44M96o31j66O40k107J758p78n9m84n09p44k14j306k5L84K62p13O25
6299a26879j829K85J105p51L76n34n37O43J164L6q11r40j35J107P59j277k33m70
6281a28921Q06j296J682k59n28j626J54P99j17J115J76r58j063M70m48K9m09J139
$$ plain form
6263 -129255 -129167 -128905 -130376 -129499 -129660 -129561 -129035 -129719 -131303 -130656 -130557 -131088 -131079 -129424 -129811 -129854 -130288 -130905 -130985 -129667
6243 -129667 -131141 -131411 -131958 -132357 -130474 -131594 -130762 -131829 -131144 -132616 -132767 -131982 -131044 -131510 -132623 -132279 -131729
6226 -131729 -131856 -131766 -133429 -132390 -133766 -132473 -132751 -132509 -133220 -134284 -133891 -133345 -134124 -132301 -132856 -133539 -133226
6209 -133226 -133150 -133734 -133385 -133481 -133023 -132655 -132943 -133039 -132853 -134109 -133678 -133819 -133172 -132577 -133441 -133607 -133652 -132664 -133219 -134037
6189 -134037 -132712 -134350 -133507 -133598 -133626 -133208 -133986 -134090 -133185 -133917 -132863 -134340 -135253 -134663 -134059 -133326 -134420 -135622
6171 -135622 -136527 -136346 -136571 -136214 -135720 -134872 -134707 -134670 -135608 -135260 -136429 -135422 -135047 -135277 -135843 -135952 -135952 -134804 -134430
6152 -134430 -135237 -134761 -135557 -136376 -135259 -136287 -135874 -135035 -135301 -136043 -136829 -136866 -136567 -136880 -135481 -136359 -137215 -135788
6134 -135788 -136569 -136759 -135447 -136734 -136099 -137537 -136328 -136359 -135985 -136355 -135986 -136601 -134969 -135966 -135212 -135860 -136551 -136749
$$ packed form
6263a29255Q8K62j471Q77j61R9N26o84j584O47R9n31RJ655l87m3m34o17q0J318
6243a29667j474k70n47l99J883j120Q32j067O85j472j51P85R38m66j113L44N50
6226a31729j27R0j663J039j376J293k78K42p11j064L93N46p79J823n55o83L13
6209a33226P6n84L49r6M58L68k88r6J86j256M31j41O47N95q64j66m5R88n55q18
6189a34037J325j638Q43r1k8M18p78j04R05p32J054j477r13N90O04P33j094j202
6171a35622r05J81k25L57M94Q48J65L7r38L48j169J007L75k30n66j09%J148L74
6152a34430q07M76p96q19J117j028M13Q39k66p42p86l7K99l13J399q78q56J427
6134a35788p81j90J312j287O35j438J209l1L74l70L69o15J632r97P54o48o91j98
$$ plain form
6116 -136749 -136176 -137447 -136665 -137323 -137576 -137312 -138777 -139052 -137959 -137744 -138747 -137666 -138181 -138348 -138413 -138727 -138698 -138515
6098 -138515 -139118 -138273 -139584 -139162 -138691 -138697 -139848 -138509 -139689 -139503 -139744 -139345 -138685 -138980 -139525 -138283 -138938 -138646
6080 -138646 -139376 -138775 -139602 -139922 -139218 -139376 -138136 -138511 -140323 -140129 -140215 -139450 -138847 -138658 -139216 -139300 -139765 -140077 -139660
6061 -139660 -140518 -139409 -139957 -139680 -139144 -138760 -139048 -139385 -138794 -138944 -139070 -139534 -139356 -139229 -139054 -138319 -138449 -139063 -140229
6042 -140229 -138704 -139816 -138373 -139156 -140661 -141086 -140509 -139443 -138750 -139769 -140040 -139577 -139620 -139766 -139602 -140213 -139507
6025 -139507 -140235 -139332 -140067 -140592 -140785 -139616 -140884 -140315 -140947 -141671 -138988 -138697 -139436 -140394 -140161 -140958 -139240 -140362
6007 -140362 -139557 -140345 -140391 -140380 -139717 -140988 -139261 -140292 -139636 -139176 -139322 -140162 -140632 -140282 -138467 -139723 -139641 -138905
5989 -138905 -138108 -137923 -138715 -137323 -138374 -138379 -138376 -137321 -136979 -137679 -137692 -136338 -137342 -136641 -136268 -136668 -136610 -136749 -135972
$$ packed form
6116a36749N73j271P82o58k53K64j465k75J093K15j003J081n15j67o5l14K9J83
6098a38515o03Q45j311M22M71oj151J339j180J86k41L99O60k95n45J242o55K92
6080a38646p30O01q27l20P04j58J240l75j812J94q6P65O03J89n58q4m65l12M17
6061a39660q58J109n48K77N36L84k88l37N91j50j26m64J78J27J75P35j30o14j166
6042a40229J525j112J443p83j505m25N77J066O93j019k71M63m3j46J64o11P06
6025a39507p28R03p35n25j93J169j268N69o32p24K683K91p39r58K33p97J718j122
6007a40362Q05p88m6J1O63j271J727j031O56M60j46q40m70L50J815j256Q2P36
5989a38905P97J85p92J392j051nLJ055L42p00j3J354j004P01L73m00N8j39P77
$$ plain form
5970 -135972 -136954 -135335 -136409 -135006 -135899 -135272 -135592 -135005 -134871 -135309 -135468 -134124 -134410 -133556 -133211 -132806 -133891
5953 -133891 -133321 -133049 -132106 -131947 -131717 -131355 -130788 -130880 -131371 -131435 -130346 -129540 -129358 -128876 -128621 -128505 -128043 -126977 -126903
5934 -126903 -127462 -127758 -126851 -126167 -125312 -125581 -125041 -124911 -124361 -123105 -122549 -123282 -122119 -122948 -123241 -121788 -121874 -122445
5916 -122445 -122021 -122342 -121403 -121638 -122163 -122223 -121469 -120904 -120419 -119577 -119181 -119165 -118370 -118617 -117674 -116884 -116561 -115360 -116070
5897 -116070 -115786 -115953 -113969 -115345 -114330 -114299 -113100 -111080 -112512 -111674 -110814 -110815 -109469 -109310 -108574 -108614 -107933 -105896
5879 -105896 -106773 -105833 -104692 -105087 -103816 -104139 -103116 -101648 -101835 -100619 -99492 -99511 -96899 -95635 -95906 -94922 -94575
5862 -94575 -93616 -91837 -92953 -90909 -92023 -89988 -89500 -88414 -88705 -87387 -87485 -87088 -85855 -85269 -84264 -84187 -82456
5845 -82456 -82103 -80866 -79434 -78750 -76908 -76025 -75102 -74255 -72676 -70180 -70694 -69423 -66781 -65442 -63763 -63352
$$ packed form
5970a35972r82J619j074J403q93O27l20N87J34m38j59J344k86Q54L45M05j085
5953a33891N70K72R43J59K30L62N67r2m91o4J089Q06J82M82K55J16M62J066P4
5934a26903n59k96R07O84Q55k69N40J30N50J256N56p33J163q29k93J453q6n71
5916a22445M24l21R39k35n25o0P54N65M85Q42L96J6P95k47R43P90L23J201p10
5897a16070K84j67J984j376J015L1J199K020j432Q38Q60jJ346J59P36m0O81K037
5879a05896q77R40J141l95J271l23J023J468j87J216J127j9K612J264k71R84L47
5862i4575R59J779j116K044j114K035M88J086k91J318r8L97J233N86J005P7J731
5845h2456L53J237J432O84J842Q83R23Q47J579K496n14J271K642J339J679M11
$$ plain form
5829 -63352 -62121 -62979 -61269 -60378 -58775 -57728 -57173 -54972 -53165 -51096 -48943 -47340 -44438 -42054 -39229
5814 -39229 -36872 -35263 -31998 -30797 -28534 -25609 -24055 -20918 -20751 -18397 -17112 -15657 -14639 -13405 -12615
5799 -12615 -9197 -9252 -8223 -6882 -5759 -4016 -2758 -379 797 4522 5301 7187 9896 12779 14144
5784 14144 15406 17935 20491 22719 23587 25160 26399 28609 31053 32713 34451 37475 39075 43124 45765
5769 45765 48571 51187 54584 58481 59922 62966 65271 66331 67446 69950 72333 75718 77337 81407 86104
5754 86104 91200 95980 99997 104441 111718 117492 123896 131541 137283 142271 148465 154771 160020 165483 170783
5739 170783 176885 182857 186857 192196 196081 200518 204933 211893 217005 221105 226466 230453 234986 241799
5725 241799 246624 254598 261022 269405 276707 284807 292002 298881 306596 316030 321477 330763 336152 342379
$$ packed form
5829f3352J231q58J710Q91J603J047N55K201J807K069K153J603K902K384K825
5814c9229K357J609L265J201K263K925J554L137J67K354J285J455J018J234P90
5799a2615L418n5J029J341J123J743J258K379J176L725P79J886K709K883J365
5784A4144J262K529K556K228Q68J573J239K210K444J660J738L024J600M049K641
5769D5765K806K616L397L897J441L044K305J060J115K504K383L385J619M070M697
5754H6104N096M780M017M444P277N774O404P645N742M988O194O306N249N463N300
5739A70783O102N972M000N339L885M437M415O960N112M100N361L987M533O813
5725B41799M825P974O424Q383P302Q100P195O879P715R434N447R286N389O227
$$ plain form
5711 342379 349220 354846 361035 367773 374233 382249 388823 398724 407678 418157 428714 440879 453780
5698 453780 466468 477187 487729 496250 506355 516897 526727 538411 551588 563216 571524 575828
5686 575828 574858 571659 565281 560758 552629 546750 541615 538163 537859 539398 545078 554845 567114 582938
5672 582938 598955 618607 638670 661779 686790 713182 738092 761849 785658 807829 829056 848823
5660 848823 870936 892877 916896 939461 961858 986079 1009445 1034744 1061064 1090464 1122773 1158297
5648 1158297 1193355 1228728 1260658 1289051 1311595 1333239 1353674 1374601 1396195 1418863 1440704
5637 1440704 1467101 1494769 1525772 1558576 1592735 1625202 1657643 1693100 1726801 1760207 1797054
5626 1797054 1835493 1872875 1914866 1957548 2002007 2043328 2084742 2130497 2177279 2224324 2273525
$$ packed form
5711C42379O841N626O189O738O460Q016O574R901Q954J0479J0557J2165J2901
5698D53780J2688J0719J0542Q521J0105J0542R830J1684J3177J1628Q308M304
5686E75828r70l199o378m523q129n879n135l452l04J539N680R767J2269J5824
5672E82938J6017J9652K0063K3109K5011K6392K4910K3757K3809K2171K1227J9767
5660H48823K2113K1941K4019K2565K2397K4221K3366K5299K6320K9400L2309L5524
5648A158297L5058L5373L1930K8393K2544K1644K0435K0927K1594K2668K1841
5637A440704K6397K7668L1003L2804L4159L2467L2441L5457L3701L3406L6847
5626A797054L8439L7382M1991M2682M4459M1321M1414M5755M6782M7045M9201
$$ plain form
5615 2273525 2321759 2371597 2422648 2473444 2517627 2557852 2596018 2635220 2682061 2734630 2795030
5604 2795030 2861670 2939640 3022054 3109004 3194702 3271234 3344235 3417336 3489330 3561212 3633326
5593 3633326 3709013 3794434 3886139 3983386 4080759 4178164 4277280 4381995 4494272 4617937 4755880
5582 4755880 4907696 5071019 5248280 5435505 5625410 5819380 6021407 6236479 6458887 6675781
5572 6675781 6886202 7091927 7299528 7518755 7756569 8017476 8301888 8613077 8956973 9327771
5562 9327771 9726294 10146294 10588561 11060556 11576840 12134161 12715314 13314905 13949262 14629513
5552 14629513 15352976 16115035 16925438 17812608 18820492 19975496 21303780 22838200 24627172
5543 24627172 26727940 29203380 32112358 35532392 39557490 44308015 49944785 56671442
$$ packed form
5615B273525M8234M9838N1051N0796M4183M0225L8166L9202M6841N2569O0400
5604B795030O6640P7970Q2414Q6950Q5698P6532P3001P3101P1994P1882P2114
5593C633326P5687Q5421R1705R7247R7373R7405R9116J04715J12277J23665J37943
5582D755880J51816J63323J77261J87225J89905J93970K02027K15072K22408K16894
5572F675781K10421K05725K07601K19227K37814K60907K84412L11189L43896L70798
5562I327771L98523M20000M42267M71995N16284N57321N81153N99591O34357O80251
5552A4629513P23463P62059Q10403Q87170J007884J155004J328284J534420J788972
5543B4627172K100768K475440K908978L420034M025098M750525N636770O726657
$$ plain form
5535 56671442 64791116 74713904 86913082 101983209 120742732 144171844 173214972
5528 173214972 208131213 247050145 285120082 317144492 339135762 349447052 348279765
5521 348279765 335148426 311775938 282531181 250844038 219200912 189749427 163540663
5514 163540663 140838201 121549205 105260788 91585370 80268317 71030886 63499962
5507 63499962 57305344 52141591 47783474 44085256 40918133 38166301 35728580 33533631
5499 33533631 31545631 29770171 28203052 26794298 25499341 24303470 23212302 22225771
5491 22225771 21320558 20464685 19658562 18923088 18246211 17612599 17016535 16445777 15889443
5482 15889443 15358612 14867881 14414234 13988078 13572845 13162324 12760687 12367353 11985664
$$ packed form
5535E6671442Q119674R922788J2199178J5070127J8759523K3429112K9043128
5528A73214972L4916241L8918932L8069937L2024410K1991270J0311290j167287
5521C48279765j3131339k3372488k9244757l1687143l1643126k9451485k6208764
5514A63540663k2702462j9288996j6288417j3675418j1317053r237431p530924
5507F3499962o194618n163753m358117l698218l167123k751832k437721k194949
5499C3533631j988000j775460j567119j408754j294957j195871j091168r86531
5491B2225771r05213q55873q06123p35474o76877o33612n96064n70758n56334
5482A5889443n30831m90731m53647m26156m15233m10521m01637l93334l81689
$$ plain form
5473 11985664 11612291 11253664 10908592 10579878 10265977 9968201 9683745 9410680 9152818
5464 9152818 8909819 8680206 8467517 8271261 8085811 7912721 7743421 7574617 7400868 7223564
5454 7223564 7042742 6859818 6677437 6497021 6325981 6162493 6007999 5861392 5727430 5603931
5444 5603931 5483254 5359066 5232668 5103526 4974689 4849610 4726192 4603655 4483501 4370691
5434 4370691 4265960 4167749 4072373 3981869 3892912 3807525 3725489 3647864 3571943 3500714 3432252
5423 3432252 3365273 3299581 3236845 3177621 3120651 3067483 3014687 2966779 2919569 2877401 2836009
5412 2836009 2792087 2750021 2710735 2668622 2626031 2581380 2537546 2495867 2454699 2417017 2376108
5401 2376108 2332518 2287274 2239961 2193091 2147513 2104845 2063815 2025000 1988091 1950423 1914940
$$ packed form
5473A1985664l73373l58627l45072l28714l13901k97776k84456k73065k57862
5464I152818k42999k29613k12689j96256j85450j73090j69300j68804j73749j77304
5454G223564j80822j82924j82381j80416j71040j63488j54494j46607j33962j23499
5444E603931j20677j24188j26398j29142j28837j25079j23418j22537j20154j12810
5434D370691j04731r8211r5376r0504q8957q5387q2036p7625p5921p1229o8462
5423C432252o6979o5692o2736n9224n6970n3168n2796m7908m7210m2168m1392
5412B836009m3922m2066l9286m2113m2591m4651m3834m1679m1168l7682m0909
5401B376108m3590m5244m7313m6870m5578m2668m1030l8815l6909l7668l5483
$$ plain form
5390 1914940 1879350 1846478 1814591 1787409 1758917 1730607 1701141 1674037 1649700 1626485 1605908
5379 1605908 1586607 1569724 1556309 1543778 1531070 1517337 1501736 1485686 1469343 1453980 1436383
5368 1436383 1416569 1394298 1370498 1340178 1306742 1267433 1226355 1187248 1149864 1114521 1084806
5357 1084806 1056751 1034534 1016168 996873 976512 955970 936453 917556 897889 880419 865050
5346 865050 850801 836424 823377 808653 793450 776948 761799 747409 732805 719062 706039 694938
5334 694938 682947 671598 660562 651190 640440 629126 619844 608375 601159 593540 585260 575970 568638
5321 568638 559152 550725 542754 533230 523953 514880 506725 497517 489330 481321 473197 466767 459291 451824
5307 451824 444217 437054 430000 424910 419951 414369 408371 400834 394228 387962 381259 376499 371821 366441
$$ packed form
5390A914940l5590l2872l1887k7182k8492k8310k9466k7104k4337k3215k0577
5379A605908j9301j6883j3415j2531j2708j3733j5601j6050j6343j5363j7597
5368A436383j9814k2271k3800l0320l3436l9309m1078l9107l7384l5343k9715
5357A084806k8055k2217j8366j9295k0361k0542j9517j8897j9667j7470j5369
5346H65050j4249j4377j3047j4724j5203j6502j5149j4390j4604j3743j3023j1101
5334F94938j1991j1349j1036r372j0750j1314r282j1469p216p619q280r290p332
5321E68638r486q427p971r524r277r073q155r208q187q009q124o430p476p467
5307D51824p607p163p054n090m959n582n998p537o606o266o703m760m678n380
$$ plain form
5293 366441 362953 358540 355193 349649 344036 337328 330121 324268 318986 312454 305818 299398 293994 289488
5279 289488 284427 279779 276636 271862 267218 264820 260295 256421 252468 249397 244423 241395 237686 233820
5265 233820 228413 224597 219803 218976 214192 211039 209059 205450 202003 199102 196377 193381 190935 187184 184371
5250 184371 180723 177031 173627 170228 166608 163832 160852 157747 154475 151576 148372 147165 144836 143490
5236 143490 141684 139869 137768 137056 134782 134993 134056 134120 133436 131326 132620 131404 130667 127563 126078 123718
5220 123718 122623 121830 118548 116237 115199 113494 111660 109019 107898 106481 105015 104472 103242 102381 101803
5205 101803 101468 98605 98234 97472 95504 95132 92543 92134 90538 88660 89256 87119 85516 84562 83644 81540
5189 81540 79824 78403 78195 76826 75483 75367 73022 73196 72723 71517 70496 70032 69503 68889 69255 67599 67056
$$ packed form
5293C66441l488m413l347n544n613o708p207n853n282o532o636o420n404m506
5279B89488n061m648l143m774m644k398m525l874l953l071m974l028l709l866
5265B33820n407l816m794q27m784l153j980l609l447k901k725k996k446l751k813
5250A84371l648l692l404l399l620k776k980l105l272k899l204j207k329j346
5236A43490j806j815k101p12k274K11r37O4o84k110J294j216p37l104j485k360
5220A23718j095p93l282k311j038j705j834k641j121j417j466n43j230q61n78
5205A01803l35k863l71p62j968l72k589m09j596j878N96k137j603r54r18k104
5189H1540j716j421k08j369j343j16k345J74m73j206j021m64n29o14L66j656n43
$$ plain form
5172 67056 67178 66288 66014 65220 65202 63604 62778 60569 61396 60047 59533 58397 58526 57740 57516 55563 54963 54637
5154 54637 54319 53971 51815 52668 51651 51206 51254 50153 49365 48820 49073 48432 49105 47813 47657 45934 44149 45200
5136 45200 43184 43039 42637 42780 41593 40945 39768 37314 37689 36758 35442 34838 33712 33217 32223 33346 32620
5119 32620 32089 33096 32502 32231 31268 30900 29933 29737 30187 30146 29495 29146 27943 26838 27019 27164 25961 26151
5101 26151 25608 25999 25575 25024 24333 23630 23179 24284 23261 23085 22615 21649 21389 22382 20486 20577 19510 19797
5083 19797 18974 18653 19057 18809 18135 17448 17615 17940 17293 16577 16670 15885 14627 14721 13481 14440 13701 13589 12257
5064 12257 11790 11781 12095 10553 10492 10963 10486 10105 10053 10355 8767 8735 7871 8857 7875 6729 7629 7229 5673 6492
5044 6492 5364 4667 5464 4593 5011 3112 5076 2841 4000 3032 3845 3492 2878 2451 1876 1305 1096 936
$$ packed form
5172F7056J22q90k74p94j8j598q26k209Q27j349n14j136J29p86k24j953o00l26
5154E4637l18l48k156Q53j017m45M8j101p88n45K53o41O73j292j56j723j785J051
5136D5200k016j45m02J43j187o48j177k454L75r31j316o04j126m95r94J123p26
5119C2620n31J007n94k71r63l68r67j96M50m1o51l49j203j105J81J45j203J90
5101B6151n43L91m24n51o91p03m51J105j023j76m70r66k60R93j896R1j067K87
5083A9797q23l21M04k48o74o87J67L25o47p16R3p85j258R4j240R59p39j12j332
5064A2257m67rL14j542o1M71m77l81n2L02j588l2q64R86r82j146R00m00j556Q19
5044F492j128o97P97q71M18j899J964k235J159r68Q13l53o14m27n75n71k09j60
$$ plain form
5026 936 116 656 -71 -924 402 -1058 -2554 -2498 -2181 -4083 -3074 -3135 -2973 -4747 -5591 -5158 -5650 -6076 -5146
5007 -5146 -7131 -7090 -6401 -6271 -7063 -8323 -7969 -7949 -8678 -8132 -7330 -9051 -9992 -10146 -8782 -10235 -10116 -9724 -10367
4988 -10367 -10147 -11696 -11483 -11164 -11975 -12542 -12174 -12496 -12594 -13609 -13427 -14224 -13652 -14719 -13369 -13799 -15021 -14288
4970 -14288 -15827 -15387 -14396 -15147 -15433 -14555 -15157 -15835 -15973 -15911 -16581 -17235 -16274 -16126 -16623 -17031 -17880 -17437 -18257
4951 -18257 -19295 -17501 -18902 -18087 -19026 -18927 -19273 -19861 -19374 -19603 -19150 -20305 -19301 -19314 -18504 -17828 -18325 -19434
4933 -19434 -18881 -19536 -20139 -20848 -21117 -21597 -23161 -22860 -23563 -22719 -23862 -23069 -24029 -22617 -23928 -24437 -24146 -23869
4915 -23869 -23120 -24780 -24758 -24645 -23866 -23287 -23237 -22605 -21990 -22940 -22104 -22312 -22156 -21709 -22938 -22143 -22615 -21982 -21331
4896 -21331 -23235 -24459 -24072 -23332 -23859 -23492 -22950 -23478 -24929 -25245 -26118 -24419 -24513 -24783 -24929 -24725 -24280 -23352
$$ packed form
5026I36q20N40p27q53J326j460j496N6L17j902J009o1J62j774q44M33m92m26R30
5007e146j985M1O89J30p92j260L54K0p29N46Q02j721r41j54J364j453J19L92o43
4988a0367K20j549K13L19q11n67L68l22r8j015J82p97N72j067J350m30j222P33
4970a4288j539M40R91p51k86Q78o02o78j38O2o70o54R61J48m97m08q49M43q20
4951a8257j038J794j401Q15r39R9l46n88M87k29M53j155J004j3Q10O76m97j109
4933a9434N53o55o03p09k69m80j564L01p03Q44j143P93r60J412j311n09K91K77
4915b3869P49j660K2J13P79N79N0O32O15r50Q36k08J56M47j229P95m72O33O51
4896b1331j904j224L87P40n27L67N42n28j451l16q73J699r4k70j46K04M45R28
$$ plain form
4878 -23352 -22580 -23798 -23914 -21594 -19553 -17556 -16462 -16487 -17740 -18731 -20656 -22426 -22549 -22837 -23729 -22910 -24035
4861 -24035 -23572 -24238 -24534 -24792 -24525 -24483 -24246 -24832 -24710 -24848 -23618 -23420 -23882 -23430 -21407 -18789 -17469 -15221
4843 -15221 -15049 -16184 -16715 -17598 -18012 -19501 -21117 -19822 -19623 -19960 -20201 -20897 -18961 -19628 -17321 -18547 -17445
4826 -17445 -18811 -18580 -18576 -17249 -18129 -16392 -17146 -15976 -14864 -13377 -13675 -12039 -10372 -9656 -8887 -7557 -7706
4809 -7706 -5186 -3824 -511 4427 10215 18752 35845 58855 87981 110424 116034 107865 86175 63906
4795 63906 48202 37091 27722 22422 18981 15993 13810 13603 14165 15017 15945 19260 21527 25873 30035
4780 30035 36245 42596 54701 72003 99467 147373 218318 306473 378012 395863 366612 295255
4768 295255 227097 175425 137282 109345 90634 74832 66409 58994 54602 50692 48875 48453 48996
$$ packed form
4878b3352P72j218j16K320K041J997J094k5j253r91j925j770j23k88q92Q19j125
4861b4035M63o66k96k58K67M2K37n86J22j38J230J98m62M52K023K618J320K248
4843a5221J72j135n31q83m14j489j616J295J99l37k41o96J936o67K307j226J102
4826a7445j366K31MJ327q80J737p54J170J112J487k98J636J667P16P69J330j49
4809g706K520J362L313M938N788Q537J7093K3010K9126K2443N610q169k1690k2269
4795F3906j5704j1111r369n300l441k988k183k07N62Q52R28L315K267M346M162
4780C0035O210O351J2105J7302K7464M7906P0945Q8155P1539J7851k9251p1357
4768B95255o8158n1672l8143k7937j8711j5802q423p415m392l910j817m22N43
$$ plain form
4755 48996 48831 52709 56436 61058 67099 78973 95328 124283 172329 245106 333991 404797 421439
4742 421439 390421 317195 244156 192162 151609 122934 102662 88050 76548 68570 62084 57813
4730 57813 54124 52054 50974 49657 49609 50613 53227 54960 59031 65045 74983 91774 117622 147694
4716 147694 171317 177419 166468 140322 117490 101043 88632 79363 73625 67686 64781 63125 60621
4703 60621 58376 57274 56707 55984 56537 56622 57437 58227 59790 62092 63408 64749 64176 64313 67371 69152 70727
4686 70727 74049 75676 77353 79626 80317 78401 77770 76836 77566 79393 79244 80486 81830 81049 83721 84348
4670 84348 87305 90383 94856 97813 103262 106478 107897 109293 112556 114949 117984 122632 127304 132716 137814
4655 137814 139218 137021 132058 127336 125659 125278 127741 129890 132075 134335 136873 139552 144909 149467 155892
$$ packed form
4755D8996j65L878L727M622O041J1874J6355K8955M8046P2777Q8885P0806J6642
4742D21439l1018p3226p3039n1994m0553k8675k0272j4612j1502p978o486m271
4730E7813l689k070j080j317m8J004K614J733M071O014R938J6791K5848L0072
4716A47694K3623O102j0951k6146k2832j6447j2411r269n738n939k905j656k504
4703F0621k245j102n67p23N53Q5Q15P90J563K302J316J341n73J37L058J781J575
4686G0727L322J627J677K273O91j916o31r34P30J827j49J242J344p81K672O27
4670H4348K957L078M473K957N449L216J419J396L263K393L035M648M672N412N098
4655A37814J404k197m963m722j677l81K463K149K185K260K538K679N357M558O425
$$ plain form
4640 155892 161332 168220 172812 177173 181251 186865 191176 196008 200704 205812 213696 221193 227760 231897
4626 231897 230877 230443 228927 229220 232613 234640 237959 243897 251599 259993 267003 274946 281989 288515 295115
4611 295115 303410 313075 319796 325717 331864 335391 342008 348873 358426 369238 380089 390002 397734 406972
4597 406972 414028 422994 430654 439208 446025 452783 464202 476370 489257 503466 514961 525208 535235
4584 535235 548009 562476 576953 589130 598838 607814 618434 628714 644094 657578 672376 692598
4572 692598 716591 744809 768512 788092 802486 818620 835496 856090 875484 894495 916106 938886
4560 938886 965068 994857 1025224 1055202 1084649 1114375 1147659 1182337 1217365 1256178 1293037 1334540
4548 1334540 1374974 1411226 1452237 1496772 1553371 1621463 1689196 1757870 1824648 1895421 1979733
$$ packed form
4640A55892N440O888M592M361M078N614M311M832M696N108P884P497O567M137
4626B31897j020m34j516K93L393K027L319N938P702Q394P010P943P043O526O600
4611B95115Q295R665O721N921O147L527O617O865R553J0812J0851R913P732R238
4597D06972P056Q966P660Q554O817O758J1419J2168J2887J4209J1495J0247J0027
4584E35235J2774J4467J4477J2177R708Q976J0620J0280J5380J3484J4798K0222
4572F92598K3993K8218K3703J9580J4394J6134J6876K0594J9394J9011K1611K2780
4560I38886K6182K9789L0367K9978K9447K9726L3284L4678L5028L8813L6859M1503
4548A334540M0434L6252M1011M4535N6599O8092O7733O8674O6778P0773Q4312
$$ plain form
4537 1979733 2080760 2195910 2326150 2474595 2645482 2850099 3105594 3417354 3798331 4299406
4527 4299406 5006022 6080947 7847207 10912979 15410931 20939095 25046181 26048882
4519 26048882 24046931 19760502 15810184 12881825 10704186 9161062 8104659 7360476
4511 7360476 6872163 6561895 6395105 6355481 6444941 6657923 6964295 7390101 7981556 8763976
4501 8763976 9790988 11220548 13320740 16574555 21943787 31225472 44734913 60748856
4493 60748856 72723784 75344170 69839944 56629649 43983825 34618036 27505952 22359282
4485 22359282 18760526 16108471 14216949 12833323 11797228 11059245 10632587 10457792 10460017
4476 10460017 10641313 11024910 11640875 12536042 13863496 15887079 19101004 24488029 33865011
$$ packed form
4537A979733J01027J15150J30240J48445J70887K04617K55495L11760L80977N01075
4527D299406P06616J074925J766260L065772M497952N528164M107086J002701
4519B6048882k001951m286429l950318k928359k177639j543124j056403p44183
4511G360476m88313l10268j66790l9624Q9460K12982L06372M25806N91455P82420
4501H763976J027012J429560K100192L253815N369232R281685J3509441J6013943
4493F0748856J1974928K620386n504226j3210295j2645824r365789p112084n146670
4485B2359282l598756k652055j891522j383626j036095p37983m26658j74795K225
4476A0460017J81296L83597O15965Q95167J327454K023583L213925N387025R376982
$$ plain form
4467 33865011 47558008 63741434 75741450 78110330 72190678 58419825 45230357
4460 45230357 35451698 28002954 22582807 18756179 15895582 13797735 12206384 10939831
4452 10939831 9948782 9247650 8767816 8435413 8223454 8118591 8123926 8246657 8528540 9047303
4442 9047303 9982011 11685538 14805342 19457054 25115669 29079386 29599764 26925764 21913594
4433 21913594 17372117 13984241 11416111 9545810 8197729 7170737 6388327 5770633
4425 5770633 5257722 4836335 4509195 4253416 4039717 3855741 3692203 3546503 3411703 3285556
4415 3285556 3163747 3046198 2935913 2832026 2739710 2649698 2565642 2484644 2405851 2331178 2259660
4404 2259660 2192176 2132008 2081592 2033494 1986985 1937344 1887465 1840787 1791583 1746197 1701772
$$ packed form
4467C3865011J3692997J6183426J2000016K368880n919652j3770853j3189468
4460D5230357r778659p448744n420147l826628k860597k097847j591351j266553
4452A0939831r91049p01132m79834l32403k11959j04863N335J22731K81883N18763
4442I047303R34708J703527L119804M651712N658615L963717N20378k674000n012170
4433B1913594m541477l387876k568130j870301j348081j026992p82410o17694
4425E770633n12911m21387l27140k55779k13699j83976j63538j45700j34800j26147
4415C285556j21809j17549j10285j03887r2316r0012q4056q0998p8793p4673p1518
4404B259660o7484o0168n0416m8098m6509m9641m9879m6678m9204m5386m4425
$$ plain form
4393 1701772 1658162 1614740 1571864 1531896 1492740 1457731 1422712 1391706 1360903 1329987 1298981
4382 1298981 1267935 1235600 1205644 1173946 1142439 1114757 1089589 1064867 1042437 1020419 1001276
4371 1001276 981958 965381 944354 923918 901234 880882 862637 846290 831129 811901 792768
4360 792768 771924 753060 736911 724529 712438 698890 685722 671976 662157 649630 636867 623425
4348 623425 609376 599656 587443 579577 572030 565268 557329 546285 535037 522729 511320 503542 497688
4335 497688 490817 478940 465319 450296 432908 419308 407672 400569 394137 389230 385121 380375 375597
4322 375597 368451 359053 351573 347389 344097 343290 339889 334950 330043 324097 317296 312161 307642 302207 297784
4307 297784 292023 284388 274448 262335 250760 240402 233439 227997 224245 221356 219858 217551 215791 213076
$$ packed form
4393A701772m3610m3422m2876l9968l9156l5009l5019l1006l0803l0916l1006
4382A298981l1046l2335k9956l1698l1507k7682k5168k4722k2430k2018j9143
4371A001276j9318j6577k1027k0436k2684k0352j8245j6347j5161j9228j9133
4360G92768k0844j8864j6149j2382j2091j3548j3168j3746r819j2527j2763j3442
4348F23425j4049r720j2213p866p547o762p939j1044j1248j2308j1409p778n854
4335D97688o871j1877j3621j5023j7388j3600j1636p103o432m907m109m746m778
4322C75597p146r398p480m184l292q07l401m939m907n946o801n135m519n435m423
4307B97784n761p635r940j2113j1575j0358o963n442l752k889j498k307j760k715
$$ plain form
4293 213076 208502 201988 196062 191453 188412 187221 185780 183799 180183 175988 172307 169405 165098 162506
4279 162506 158352 154524 151573 146768 141073 135589 134011 131413 130673 130379 128268 126330 125244 122218 119753
4264 119753 117296 114501 113427 113391 113167 115596 118397 125045 132088 140089 143008 140291 132242 125940 124775
4249 124775 124660 122757 118470 115062 111509 111467 113585 119470 132587 153599 178663 195955 195947 182223 159934
4234 159934 137684 122683 109920 101912 96577 90568 87237 85140 85458 86997 90502 95072 96504 97193
4220 97193 96274 96136 97659 101394 109936 125683 153804 202872 274483 359960 421461 429046 392653
4207 392653 317812 251220 202613 165430 138896 119767 105069 94997 86576 79704 75433 72533
4195 72533 70155 70589 71324 71813 75107 79537 85458 96858 113067 143518 193855 267685 354949 417655
$$ packed form
4293B13076m574o514n926m609l041j191j441j981l616m195l681k902m307k592
4279A62506m154l828k951m805n695n484j578k598p40k94k111j938j086l026k465
4264A19753k457k795j074l6k24K429K801O648P043Q001K919k717q049o302j165
4249A24775j15j903m287l408l553m2K118N885J3117K1012K5064J7292qj3724k2289
4234A59934k2250j5001j2763q008n335o009l331k097L18J539L505M570J432O89
4220I7193r19j38J523L735Q542J5747K8121M9068P1611Q5477O1501P585l6393
4207C92653p4841o6592m8607l7183k6534j9129j4698j0072q421o872m271k900
4195G2533k378M34P35M89L294M430N921J1400J6209L0451N0337P3830Q7264O2706
$$ plain form
4181 417655 425936 385578 308221 237409 185725 146931 118346 97990 83363 72825 64728 58259
4169 58259 52876 49192 45847 45239 42739 42385 41493 40880 43124 44856 51014 60380 77241 101363 130426
4154 130426 147955 149838 134464 107979 84698 65926 52197 41306 34281 29164 25185 20816 19427
4141 19427 17535 14893 12810 11794 9947 8736 7422 6685 5580 5183 4096 3648 1601 -10 1334
4126 1334 -1658 -2673 -2061 -3204 -4577 -4845 -5326 -4475 -5982 -5790 -6487 -6439 -5891 -7276 -8103 -8089 -8555 -8731
4108 -8731 -9150 -9563 -10570 -9812 -11234 -11869 -12837 -12693 -12234 -13392 -14381 -13562 -15436 -15366 -15511 -16905 -16735 -17398
4090 -17398 -16490 -17811 -17222 -17558 -16840 -18682 -16702 -18043 -18048 -18285 -18194 -18952 -19539 -19567 -20579 -19153 -19708 -20257 -20061
4071 -20061 -21723 -21368 -22068 -21963 -23271 -23243 -23569 -22679 -22926 -24209 -23261 -22966 -22577 -22885 -22158 -24153 -22365 -22012
$$ packed form
4181D17655Q281m0358p7357p0812n1684l8794k8585k0356j4627j0538q097o469
4169E8259n383l684l345o08k500l54q92o13K244J732O158R366J6861K4122K9063
4154A30426J7529J883j5374k6485k3281j8772j3729j0891p025n117l979m369j389
4141A9427j892k642k083j016j847j211j314p37j105l97j087m48k047j611J344
4126A334k992j015O12j143j373k68m81Q51j507J92o97M8N48j385q27J4m66j76
4108h731m19m13j007P58j422o35r68J44M59j158r89Q19j874P0j45j394J70o63
4090a7398R08j321N89l36P18j842J980j341nk37R1p58n87k8j012J426n55n49J96
4071b0061j662L55p00J05j308K8l26Q90k47j283R48K95L89l08P27j995J788L53
$$ plain form
4053 -22012 -23126 -23006 -24109 -24333 -24775 -24776 -25145 -25172 -25706 -25444 -25181 -24889 -26244 -25231 -24996 -25570 -25049 -25505 -25168
4034 -25168 -25824 -25633 -25973 -27274 -25834 -25516 -26962 -25872 -26567 -26635 -26563 -26977 -26670 -26340 -27143 -27990 -27581 -27470 -28586
4015 -28586 -29059 -26753 -26532 -28073 -28158 -28982 -26751 -28513 -29248 -29027 -29402 -29641 -29116 -27749 -27523 -29369 -29272 -29661
3997 -29661 -29697 -28664 -29360 -29723 -30848 -30547 -30549 -30535 -30797 -30937 -29754 -31456 -30794 -31076 -30702 -31062 -32103 -31929 -31310
3978 -31310 -30815 -31278 -30430 -31516 -31721 -31409 -31278 -32336 -31423 -31431 -32599 -32108 -32470 -32671 -32663 -31847 -31136 -31398 -31769 -32576
3958 -32576 -33922 -32473 -33147 -32931 -31847 -32358 -32983 -32757 -32718 -33492 -32563 -33846 -34431 -33524 -32642 -33182 -33328 -32919
3940 -32919 -34046 -34072 -34937 -35311 -34657 -35094 -36020 -35089 -35013 -35813 -34638 -35131 -36417 -35410 -36403 -37522 -36537 -36493 -36364
3921 -36364 -37039 -37157 -36923 -36671 -37302 -36992 -37045 -36888 -36689 -37891 -36978 -37587 -37769 -37038 -36589 -36988 -37435 -37578 -37627 -38960
$$ packed form
4053b2012j114J20j103k24m42jl69k7n34K62K63K92j355J013K35n74N21m56L37
4034b5168o56J91l40j301J440L18j446J090o95o8P2m14L07L30q03q47M09J11j116
4015b8586m73K306K21j541q5q24K231j762p35K21l75k39N25J367K26j846R7l89
3997b9661l6J033o96l63j125L01kJ4k62j40J183j702O62k82L74l60j041J74O19
3978c1310M95m63Q48j086k05L12J31j058R13qj168M91l62k01QQ16P11k62l71q07
3958c2576j346J449o74K16J084n11o25K26L9p74R29j283n85R07Q82n40j46M09
3940c2919j127k6q65l74O54m37r26R31P6q00J175m93j286J007r93j119R85M4J29
3921c6364o75j18K34K52o31L10n3J57J99j202R13o09j82P31M49l99m47j43m9j333
$$ plain form
3901 -38960 -37975 -37553 -37618 -38204 -37602 -38253 -38682 -37448 -37937 -38010 -39279 -38862 -39411 -38335 -38885 -39193 -37774 -37496 -38198
3882 -38198 -37852 -38556 -39306 -39027 -38635 -38419 -38426 -38753 -38036 -39110 -39188 -38097 -38755 -39456 -38619 -39636 -39277 -39663 -39645 -39688
3862 -39688 -40675 -40348 -40416 -40078 -39828 -40389 -40273 -39997 -40663 -39914 -40115 -40349 -40345 -40591 -40148 -39959 -39827 -39790 -39696 -39609 -39399
3841 -39399 -40083 -40988 -41984 -42289 -42049 -41999 -41445 -41583 -41431 -42468 -42002 -42445 -44219 -42820 -41899 -41527 -41353 -41051 -42225
3822 -42225 -42804 -42550 -41268 -41162 -41543 -42268 -42772 -41521 -41005 -43212 -41512 -42533 -42585 -40940 -42023 -42766 -42683 -42375
3804 -42375 -43175 -43267 -42023 -42164 -43255 -44280 -42814 -44559 -43995 -44660 -44019 -44049 -43420 -44073 -45168 -45180 -44413 -44029
3786 -44029 -45581 -44804 -45172 -44655 -45812 -44229 -46248 -45520 -45530 -44750 -44999 -44978 -46511 -45756 -45480 -45651 -45460 -45909
3768 -45909 -45349 -46261 -46277 -46419 -46015 -46887 -46912 -46624 -46053 -47358 -46065 -47593 -48583 -47064 -47250 -47770 -47511 -47624 -46957
$$ packed form
3901c8960R85M22o5n86O02o51m29J234m89p3j269M17n49J076n50l08J419K78p02
3882c8198L46p04p50K79L92K16pl27P17j074p8J091o58p01Q37j017L59l86J8m3
3862c9688r87L27o8L38K50n61J16K76o66P49k01k34Mk46M43J89J32L7R4Q7K10
3841c9399o84r05r96l05K40N0N54j38J52j037M66m43j774J399R21L72J74L02j174
3822d2225n79K54J282J06l81p25n04J251N16k207J700j021n2J645j083p43Q3L08
3804d2375q00r2J244j41j091j025J466j745N64o65O41l0O29o53j095j2P67L84
3786d4029j552P77l68N17j157J583k019P28j0P80k49K1j533P55K76j71J91m49
3768d5909N60r12j6j42M04q72k5K88N71j305J293j528r90J519j86n20K59j13O67
$$ plain form
3749 -46957 -48260 -47969 -48717 -48904 -48887 -47964 -48021 -48123 -49782 -48197 -48397 -48274 -48864 -50303 -50112 -48840 -49861 -49062
3731 -49062 -50715 -49621 -50065 -50460 -50456 -49672 -49450 -48399 -50572 -52280 -50724 -51150 -50263 -48072 -48680 -49978 -50532
3714 -50532 -51051 -52001 -52215 -51575 -51488 -51602 -51582 -51988 -51938 -52071 -51670 -52485 -51667 -51884 -52772 -53755 -54388 -54099 -53851 -53425
3694 -53425 -52748 -51988 -52319 -52725 -52919 -53416 -52341 -53332 -53004 -53498 -52650 -52000 -51363 -52084 -51374 -50718 -52350 -53533
3676 -53533 -54472 -54939 -54369 -54895 -54900 -55219 -55747 -55733 -55321 -54733 -55489 -55306 -56548 -56132 -55125 -56325 -54751 -55224 -54446
3657 -54446 -54738 -52976 -55708 -55827 -56532 -57671 -57146 -55984 -56366 -56417 -57798 -57564 -57615 -56700 -57569 -58257 -58001 -57420
3639 -57420 -58029 -58405 -59548 -60356 -58684 -59354 -58818 -59991 -59674 -59300 -58181 -57200 -57217 -58736 -57022 -57106 -58968 -58951
3621 -58951 -58177 -56666 -56997 -58060 -59400 -60918 -59726 -59380 -60309 -58678 -58610 -58507 -59026 -57794 -58700 -60124 -63010
$$ packed form
3749d6957j303K91p48j87J7R23n7j02j659J585k00J23n90j439J91J272j021P99
3731d9062j653J094m44l95MP84K22J051k173j708J556m26Q87K191o08j298n54
3714e0532n19r50k14O40Q7j14K0m06N0j33M01q15Q18k17q88r83o33K89K48M26
3694e3425O77P60l31m06j94m97J075r91L28m94Q48O50O37p21P10O56j632j183
3676e3533r39m67N70n26nl19n28J4M12N88p56J83j242M16J007j200J574m73P78
3657e4446k92J762k732j19p05j139N25J162l82n1j381K34n1R15q69o88K56N81
3639e7420o09l76j143q08J672o70N36j173L17L74J119R81j7j519J714q4j862J7
3621e8951P74J511l31j063j340j518J192L46r29J631O8J03n19J232r06j424k886
$$ plain form
3604 -63010 -64772 -64547 -63753 -63256 -63085 -60191 -57520 -54898 -54284 -55103 -56310 -58182 -60194 -59203 -60453 -61301 -60039
3587 -60039 -59644 -58148 -57096 -55645 -56717 -57667 -57433 -56238 -56960 -57295 -60684 -61094 -61760 -61009 -61946 -61667 -59427
3570 -59427 -55181 -51925 -51602 -51328 -52933 -54792 -55984 -56825 -57348 -57288 -56842 -55369 -54601 -54290 -53406 -54164 -54208 -53774
3552 -53774 -53921 -52987 -53904 -54265 -55405 -55832 -56335 -55050 -54923 -55279 -54504 -53852 -53072 -53776 -53785 -52403 -51220 -52851
3534 -52851 -51873 -52015 -53415 -53254 -54360 -54683 -54502 -52816 -51512 -52043 -53863 -53538 -53555 -53265 -52097 -52036 -53329 -52288
3516 -52288 -51557 -54016 -54071 -55111 -54850 -54128 -53417 -52852 -53397 -53757 -54172 -53383 -53205 -53432 -53997 -54856 -55296 -55596 -54453
3497 -54453 -54068 -54033 -54220 -54490 -54093 -52904 -53468 -55039 -55415 -54217 -55429 -54257 -53729 -53227 -54224 -53957 -54549 -54815
3479 -54815 -54817 -56438 -55574 -55432 -55276 -54247 -55872 -55035 -55409 -55769 -56491 -55717 -54351 -54924 -54918 -56141 -56315 -56779 -55899
$$ packed form
3604f3010j762K25P94M97J71K894K671K622O14q19j207j872k012R91j250q48J262
3587f0039L95J496J052J451j072r50K34J195p22l35l389m10o66P51r37K79K240
3570e9427M246L256L23K74j605j859j192q41n23O0M46J473P68L11Q84p58m4M34
3552e3774j47R34r17l61j140m27n03J285J27l56P75O52P80p04rJ382J183j631
3534e2851R78j42j400J61j106l23J81J686J304n31j820L25j7K90J168O1j293J041
3516e2288P31k459n5j040K61P22P11N65n45l60m15P89J78k27n65q59m40l00J143
3497e4453L85L5j87k70L97J189n64j571l76J198j212J172N28N02r97K67n92k66
3479e4815kj621Q64J42J56J029j625Q37l74l60p22P74J366n73Oj223j74m64Q80
$$ plain form
3460 -55899 -56030 -54635 -53458 -55456 -54418 -56218 -56126 -55193 -56263 -56325 -56404 -56031 -56836 -56946 -57717 -58051 -56408 -56121
3442 -56121 -56601 -55178 -55588 -54690 -55111 -54893 -54213 -55418 -54488 -55637 -55582 -55706 -54831 -54843 -55360 -55036 -53892 -54807 -54317
3423 -54317 -55463 -56410 -57426 -56224 -56724 -55831 -56002 -55852 -56258 -55282 -55110 -55228 -54105 -53319 -54664 -54503 -54133 -54327
3405 -54327 -53544 -54188 -53528 -56227 -54049 -53402 -52694 -54000 -54209 -54929 -56096 -55304 -55203 -54687 -55727 -55408 -55707 -55361
3387 -55361 -56120 -55011 -54811 -54884 -54747 -53892 -52587 -54665 -54956 -54829 -54000 -52992 -52966 -53424 -53929 -53570 -54789 -54399
3369 -54399 -53779 -54878 -54630 -53477 -55020 -53280 -54290 -53739 -55131 -54391 -53067 -52472 -52823 -53564 -53577 -53655 -53855 -53195
3351 -53195 -53145 -52740 -52991 -54569 -55225 -53725 -53907 -54428 -54068 -55515 -53710 -53986 -55494 -54734 -55159 -55662 -57136 -56597
3333 -56597 -55676 -56871 -56634 -54571 -55821 -55700 -55843 -56766 -56245 -56299 -56455 -55975 -55943 -56203 -56796 -57236 -57014 -57673 -56769
$$ packed form
3460e5899j31J395J177j998J038j800R2R33j070o2p9L73q05j10p71l34J643K87
3442e6121m80J423m10Q98m21K18O80j205R30j149N5j24Q75j2n17L24J144r15M90
3423e4317j146r47j016J202n00Q93j71J50m06R76J72j18J123P86j345J61L70j94
3405e4327P83o44O60k699K178O47P08j306k09p20j167P92J01N16j040L19k99L46
3387e5361p59J109K00p3J37Q55J305k078k91J27Q29J008K6m58n05L59j219L90
3369e4399O20j099K48J153j543J740j010N51j392P40J324N95l51p41j3p8k00O60
3351e3195N0M05k51j578o56J500j82n21L60j447J805k76j508P60m25n03j474N39
3333e6597R21j195K37K063j250J21j43r23N21n4j56M80L2k60n93m40K22o59R04
$$ plain form
3314 -56769 -57383 -56593 -57719 -56581 -57827 -57465 -57778 -56622 -56745 -57077 -57366 -57153 -57913 -57348 -57493 -56470 -56941 -56794
3296 -56794 -58309 -58106 -59225 -57934 -56922 -57813 -56846 -58125 -57331 -57252 -58252 -58153 -58807 -58769 -57882 -58639 -58852 -58039
3278 -58039 -57124 -57509 -57518 -58221 -58368 -58285 -59436 -58151 -58829 -57334 -57649 -58854 -57274 -58023 -58275 -57491 -57679 -59091
3260 -59091 -56920 -56856 -56810 -57312 -57657 -57711 -57119 -57160 -57830 -57344 -57753 -56809 -55323 -56630 -55035 -55266 -55862 -56011 -55661
3241 -55661 -55732 -54544 -53688 -53510 -52055 -52326 -50136 -49638 -47999 -44207 -36400 -27579 -17199 -12107 -11139 -14044
3225 -14044 -18045 -16659 -7224 12783 40906 64103 69597 62623 39451 15212 -1630 -15956 -25485
3212 -25485 -33351 -37816 -41921 -44980 -46550 -47582 -49511 -50411 -51707 -53283 -54796 -53148 -54302 -55402 -54800
3197 -54800 -55940 -55661 -55875 -56378 -56418 -57390 -58200 -58758 -57971 -57852 -57285 -58281 -57444 -58117 -58554 -59010 -59543 -59043 -59730
$$ packed form
3314e6769o14P90j126J138j246L62l13J156j23l32k89K13p60N65j45J023m71J47
3296e6794j515K03j119J291J012q91R67j279P94P9j000R9o54L8Q87p57k13Q13
3278e8039R15l85rp03j47Q3j151J285o78J495l15j205J580p49k52P84j88j412
3260e9091K171O4M6n02l45n4N92m1o70M86m09R44J486j307J595k31n96j49L50
3241e5661p1J188Q56J78J455k71K190M98J639L792P807Q821J0380N092R68k905
3225a4044m001J386R435K0007K8123K3197N494o974k3172k4239j6842j4326r529
3212b5485p866m465m105l059j570j032j929r00j296j576j513J648j154j100O02
3197e4800j140K79k14n03m0r72q10n58P87J19N67r96Q37o73m37m56n33N00o87
$$ plain form
3178 -59730 -59633 -59460 -59579 -59223 -59768 -59626 -59827 -60093 -60293 -58397 -60727 -59444 -60331 -61393 -61442 -59662 -60510 -59886
3160 -59886 -60642 -60967 -61871 -61914 -61598 -61583 -61395 -61761 -62154 -62196 -62012 -62076 -61440 -61609 -60882 -60799 -61437 -61886 -61450 -61787 -61835
3139 -61835 -61294 -61822 -61845 -61834 -61910 -62444 -60959 -61617 -62147 -62274 -63765 -63102 -62705 -63626 -63273 -62500 -62853 -63378 -62081
3120 -62081 -63199 -62410 -62934 -62538 -63590 -62925 -62994 -62449 -62500 -62469 -63182 -62667 -62817 -62306 -62734 -63665 -62981 -62942 -62673 -62658
3100 -62658 -62753 -63442 -62676 -62512 -63373 -63553 -63222 -62385 -63772 -62698 -62945 -63699 -62233 -62350 -62796 -61953 -62632 -61728 -63580
3081 -63580 -63065 -63460 -62707 -64447 -62438 -63525 -62712 -64029 -62480 -62828 -62968 -63030 -63033 -63444 -63219 -63072 -62891 -63847 -63410
3062 -63410 -62712 -63468 -63096 -62406 -64117 -63999 -62984 -61463 -63963 -62478 -62892 -62850 -63110 -63232 -62003 -63516 -61368
3045 -61368 -63350 -62790 -63560 -61888 -62227 -62302 -62941 -63910 -62969 -63909 -62942 -63059 -62738 -62874 -62647 -62778 -63116 -63842 -61866
$$ packed form
3178e9730R7J73j19L56n45J42k01k66k00J896k330J283q87j062m9J780q48O24
3160e9886p56l25r04m3L16J5J88l66l93m2J84o4O36j69P27Q3o38m49M36l37m8
3139f1835N41n28k3J1p6n34J485o58n30j27j491O63L97r21L53P73l53n25J297
3120f2081j118P89n24L96j052O65o9N45n1L1p13N15j50N11m28r31O84L9K69J5
3100f2658r5o89P66J64q61j80L31Q37j387J074k47p54J466j17m46Q43o79R04j852
3081f3580N15l95P53j740K009j087Q13j317J549l48j40o2lm11K25J47J81r56M37
3062f3410O98p56L72O90j711J18J015J521k500J485m14M2k60j22J229j513K148
3045f1368j982N60p70J672l39p5o39r69R41r40R67j17L21j36K27j31l38p26J976
$$ plain form
3026 -61866 -61156 -61093 -61927 -61133 -60744 -60395 -60749 -60822 -60677 -61448 -60650 -60342 -61817 -61685 -61808 -61793 -60968 -61119 -61307 -60864
3006 -60864 -60934 -59468 -59562 -59346 -59350 -58796 -58914 -59806 -58824 -59050 -57613 -57002 -56787 -56062 -56608 -57383 -57475 -56320 -57688 -56759
2986 -56759 -57412 -56921 -56981 -57325 -55714 -56073 -55146 -53241 -54198 -54447 -54211 -54111 -53577 -53812 -53959 -53428 -52967 -54043 -51007
2967 -51007 -50407 -50559 -50149 -49756 -51049 -51687 -50766 -51825 -51122 -50916 -50519 -49341 -48012 -48771 -47738 -46232 -45672
2950 -45672 -44790 -45875 -46237 -47081 -47334 -48516 -47750 -47546 -46313 -46417 -46582 -46069 -46576 -46421 -47228 -47007 -46584 -46441
2932 -46441 -46436 -45036 -45788 -43623 -42435 -41195 -39246 -38353 -37486 -37600 -38625 -39299 -40471 -41165 -42479 -41970 -42199
2915 -42199 -41770 -41945 -41883 -40648 -41257 -41357 -40170 -39600 -39517 -39174 -38360 -37306 -36130 -34511 -34450 -32921 -31198 -30701
2897 -30701 -30898 -30206 -32215 -32046 -33324 -34815 -34920 -33979 -33769 -35062 -34187 -34196 -32807 -32652 -32598 -32623 -31886 -29263 -29161
$$ packed form
3026f1866P10O3q34P94L89L49l54p3J45p71P98L08j475J32j23J5Q25j51j88M43
3006f0864p0J466r4K16mN54j18q92R82k26J437O11K15P25n46p75r2J155j368R29
2986e6759o53M91o0l44J611l59R27J905r57k49K36J00N34k35j47N31M61j076L036
2967e1007O00j52M10L93j293o38R21j059P03K06L97J178J329p59J033J506N60
2950d5672Q82j085l62q44k53j182P66K04J233j04j65N13n07J55q07K21M23J43
2932d6441NJ400p52K165J188J240J949Q93Q67j14j025o74j172o94j314N09k29
2915d2199M29j75O2J235o09j00J187N70Q3L43Q14J054J176J619O1J529J723M97
2897c0701j97O92k009J69j278j491j05R41K10j293Q75rJ389J55N4k5P37K623J02
$$ plain form
2878 -29161 -28752 -27372 -25688 -25331 -23575 -22421 -20818 -20371 -19611 -21178 -21239 -21602 -21967 -21210 -18817 -19920 -18473
2861 -18473 -19239 -18473 -16976 -17638 -15968 -15898 -14638 -13605 -12666 -12477 -11721 -7955 -8300 -6313 -5653 -3920 -2495
2844 -2495 -2854 -468 -349 1994 1807 3091 5903 8659 9292 10198 12244 12391 14068 16054 18293 21294
2828 21294 23620 25819 29795 31495 35784 40538 47140 54417 63624 75061 90397 115259 163796 236944
2814 236944 333502 416815 444929 422989 352806 280378 225576 186322 157700 138043 124610 113985
2802 113985 106690 100649 98408 98846 100324 103773 108868 116642 124299 137081 150371 170330 197592 247491
2788 247491 338287 481625 674227 831364 879385 829190 678909 534118 426849 348099
2778 348099 289944 250779 223653 204288 190681 180312 172718 168632 166048 164976 164765 165991 167105
$$ packed form
2878b9161M09J380J684L57J756J154J603M47P60j567o1l63l65P57K393j103J447
2861a8473p66P66J497o62J670P0J260J033R39J89P56L766l45J987O60J733J425
2844b495l59K386J19K343j87J284K812K756O33R06K046J47J677J986K239L001
2828B1294K326K199L976J700M289M754O602P277R207J1437J5336K4862M8537P3148
2814B36944R6558Q3313K8114k1940p0183p2428n4802l9254k8622j9657j3433j0625
2802A13985p295o041k241M38J478L449N095P774P657J2782J3290J9959K7262M9899
2788B47491R0796J43338J92602J57137M8021n0195j50281j44791j07269p8750
2778C48099n8155l9165k7126j9365j3607j0369p594m086k584j072k11J226J114
$$ plain form
2765 167105 171252 175184 184134 197601 223505 267039 336217 422980 497635 522512 500068 432761
2753 432761 362437 308760 271721 244353 227323 217740 212869 210173 211854 215190 219667 220581 218356
2740 218356 213557 208820 204561 201437 200718 198590 198364 202099 207087 209652 214831 220166 221895 220269 215711
2725 215711 210167 207252 208399 211717 214618 217375 222891 230117 238357 246819 258155 266303 273372 274994
2711 274994 276304 276473 276627 278046 281620 286197 291152 298447 306772 317056 325260 329799 325993 320584 311064
2696 311064 306923 305775 306738 310678 316823 324865 335222 343481 354062 364386 372488 381913 391145 399796
2682 399796 407630 416101 422970 430440 439083 448061 460664 473507 486543 498703 505137 511059 515790
2669 515790 520868 525855 533143 540375 550044 562588 580294 599244 616672 630421 640806 651201 662895
$$ packed form
2765A67105M147L932Q950J3467K5904M3534O9178Q6763P4655K4877k2444o7307
2753D32761p0324n3677l7039k7368j7030r583m871k696J681L336M477R14k225
2740B18356m799m737m259l124p19k128k26L735M988K565N179N335J729j626m558
2725B15711n544k915J147L318K901K757N516P226Q240Q462J1336Q148P069J622
2711B74994J310J69J54J419L574M577M955P295Q325J0284Q204M539l806n409r520
2696C11064m141j148R63L940O145Q042J0357Q259J0581J0324Q102R425R232Q651
2682C99796P834Q471O869P470Q643Q978J2603J2843J3036J2160O434N922M731
2669E15790N078M987P288P232R669J2544J7706J8950J7428J3749J0385J0395J1694
$$ plain form
2656 662895 680338 699092 713581 723638 730059 737472 747601 761146 776522 795191 813492 833547
2644 833547 855503 877568 897256 914258 931812 951502 973468 993591 1012893 1032157 1053970 1077667
2632 1077667 1102081 1128811 1155246 1183124 1207790 1228040 1248945 1269568 1295903 1323224 1354473
2621 1354473 1383185 1408384 1437654 1475375 1527602 1591769 1651195 1698279 1730513 1756419 1789505
2610 1789505 1830155 1870937 1913861 1959017 2011879 2073394 2142275 2214046 2280723 2339499 2403189
2599 2403189 2484651 2576880 2675003 2770853 2862194 2963499 3069691 3169975 3266622 3370423 3491636
2588 3491636 3636171 3786176 3954252 4129175 4318219 4537394 4804573 5110692 5468659 5898112
2578 5898112 6400382 7014566 7785612 8726751 9810444 11164009 13033516 15880478 20652611
$$ packed form
2656F62895J7443J8754J4489J0057O421P413J0129J3545J5376J8669J8301K0055
2644H33547K1956K2065J9688J7002J7554J9690K1966K0123J9302J9264K1813K3697
2632A077667K4414K6730K6435K7878K4666K0250K0905K0623K6335K7321L1249
2621A354473K8712K5199K9270L7721N2227O4167N9426M7084L2234K5906L3086
2610A789505M0650M0782M2924M5156N2862O1515O8881P1771O6677N8776O3690
2599B403189Q1462R2229R8123R5850R1341J01305J06192J00284R6647J03801J21213
2588C491636J44535J50005J68076J74923J89044K19175K67179L06119L57967M29453
2578E898112N02270O14184P71046R41139J083693J353565J869507K846962M772133
$$ plain form
2569 20652611 29336855 43028525 60430574 75531701 80719605 76680414 63467345 49230985
2561 49230985 38638213 30788742 25193769 21458990 18861372 17085761 15848770 14969502
2553 14969502 14380529 14155672 14288294 14690322 15392544 16463502 17916543 19716029 22112081
2544 22112081 25555195 30980534 40371174 57901244 84290108 116480034 141183027 148816831
2536 148816831 142277030 118352100 92178760 71740174 55899469 44318893 36384738
2529 36384738 30641243 26518964 23400542 20876320 18811457 17358290 16422859 15834088
2521 15834088 15539236 15506528 15730461 16186831 16955324 18227646 20415593 24378639 31952760
2512 31952760 44272600 60198435 74186319 78776503 74581864 61659305 47666395
$$ packed form
2569B0652611Q684244J3691670J7402049J5101127N187904m039191j3213069j4236360
2561D9230985j0592772p849471n594973l734779k597618j775611j236991q79268
2553A4969502n88973k24857J32622M02028P02222J070958J453041J799486K396052
2544B2112081L443114N425339R390640J7530070K6388864L2189926K4702993P633804
2536A48816831o539801k3924930k6173340k0438586j5840705j1580576p934155
2529C6384738n743495m122279l118422k524222k064863j453167r35431n88771
2521A5834088k94852l2708K23933M56370P68493J272322K187947L963046P574121
2512C1952760J2319840J5925835J3987884M590184m194639j2922559j3992910
$$ plain form
2505 47666395 37173075 29305888 23600461 19684568 16834584 14714199 13066756 11677491
2497 11677491 10476916 9545622 8845586 8286467 7826096 7427549 7074350 6762703 6481555
2488 6481555 6214526 5972088 5742822 5528686 5330267 5143591 4968443 4792899 4633895 4483474
2478 4483474 4337383 4195443 4061228 3945531 3848568 3758846 3661843 3567026 3469392 3368143
2468 3368143 3273763 3184559 3094241 3004704 2917511 2835050 2758407 2688987 2623392 2557870 2495376
2457 2495376 2433943 2378088 2318598 2258873 2197278 2129567 2067489 2006184 1956113 1912806 1873311
2446 1873311 1833645 1796183 1756009 1716798 1679372 1642252 1603515 1564243 1525613 1488527 1451476
2435 1451476 1414528 1378686 1346976 1321631 1300564 1281840 1259637 1236430 1210867 1183447 1159930
$$ packed form
2505D7666395j0493320p867187n705427l915893k849984k120385j647443j389265
2497A1677491j200575r31294p00036n59119m60371l98547l53199l11647k81148
2488F481555k67029k42438k29266k14136j98419j86676j75148j75544j59004j50421
2478D483474j46091j41940j34215j15697r6963q9722r7003r4817r7634j01249
2468C368143r4380q9204r0318q9537q7193q2461p6643o9420o5595o5522o2494
2457B495376o1433n5855n9490n9725o1595o7711o2078o1305n0071m3307l9495
2446A873311l9666l7462m0174l9211l7426l7120l8737l9272l8630l7086l7051
2435A451476l6948l5842l1710k5345k1067j8724k2203k3207k5563k7420k3517
$$ plain form
2424 1159930 1135786 1112106 1087767 1062348 1039562 1017093 997358 983761 970085 953323 934448
2413 934448 913546 891609 870871 854106 840432 828839 813442 793318 769400 744076 721946 705782
2401 705782 692913 683934 673145 663836 654371 644119 633716 619454 606346 596152 589052 584073 581939
2388 581939 577777 571317 562995 551051 538150 528923 521693 515164 507672 495653 480563 456857 433936
2375 433936 412701 398263 388361 380519 374397 372308 368004 362072 353684 343535 335501 328588 325472 321745
2361 321745 320901 318948 314709 310530 303778 299104 293619 289453 283309 279573 273477 264957 254619 242406
2347 242406 232871 225034 221086 217773 216962 216002 217097 217199 216704 214340 209263 203193 197683 194317 194023 193414
2331 193414 196025 196446 196039 198012 199497 203121 208291 214056 223828 240189 265074 310261 389100 505580
$$ packed form
2424A159930k4144k3680k4339k5419k2786k2469j9735j3597j3676j6762j8875
2413I34448k0902k1937k0738j6765j3674j1593j5397k0124k3918k5324k2130j6164
2401G05782j2869q979j0789r309r465j0252j0403j4262j3108j0194p100m979k134
2388E81939m162o460q322j1944j2901r227p230o529p492j2019j5090k3706k2921
2375D33936k1235j4438r902p842o122k089m304n932q388j0149q034o913l116l727
2361C21745q44j953m239m179o752m674n485m166o144l736o096q520j0338j2213
2347B42406r535p837l948l313q11r60J095J02m95k364n077o070n510l366k94o09
2331A93414K611M21m07J973J485L624N170N765R772J6361K4885M5187P8839J16480
$$ plain form
2317 505580 635701 727900 740693 683052 583529 495977 439877 398685 364398 332848 301539
2306 301539 274740 255181 237522 222255 212691 205829 204230 206362 213383 223457 236356 256167 289711
2293 289711 345285 430885 553696 707712 888932 1009571 1019962 941940 776755 631377
2283 631377 522467 433337 364378 311926 270181 235919 208303 183825 164222 149825 140857 134569
2271 134569 128447 126062 125591 124494 127713 131598 141312 163401 204422 271141 355593 422792 435697
2258 435697 403246 328515 254412 199414 157897 126957 107057 89787 78755 67803 60374 52347
2246 52347 47030 43025 39389 36491 33162 31795 31502 28261 25154 22831 20763 17020 15693 13968 11536
2231 11536 9454 7140 7021 4556 3248 1079 1155 624 -1152 -2776 -3761 -4073 -4621 -5215 -6063 -5341 -7313
$$ packed form
2317E05580J30121R2199J2793n7641r9523q7552n6100m1192l4287l1550l1309
2306C01539k6799j9559j7659j5267r564o862j599K132P021J0074J2899J9811L3544
2293B89711N5574Q5600J22811J54016J81220J20639J0391p8022j65185j45378
2283F31377j08910q9130o8959n2452m1745l4262k7616k4478j9603j4397q968o288
2271A34569o122k385m71j097L219L885R714K2089M1021O6719Q4452O7199J2905
2258D35697l2451p4731p4103n4998m1517l0940j9900j7270j1032j0952p429q027
2246E2347n317m005l636k898l329j367k93l241l107k323k068l743j327j725k432
2231A1536k082k314j19k465j308k169P6n31j776j624r85l12n48n94q48P22j972
$$ plain form
2214 -7313 -8107 -9516 -10063 -9212 -9987 -11035 -12096 -14098 -13944 -14553 -16237 -17317 -17793 -18582 -19947 -19690 -20927
2197 -20927 -20590 -20838 -21703 -23234 -23151 -23677 -22695 -23568 -23161 -23995 -23386 -24991 -24940 -26750 -26868 -26986 -26791 -26404 -27316
2178 -27316 -28254 -28277 -29539 -28536 -29618 -28940 -30033 -30644 -31056 -32378 -32294 -32889 -32759 -32209 -33266 -33630 -35090 -35280
2160 -35280 -34308 -35175 -34999 -34725 -36176 -35683 -35898 -36538 -37039 -36801 -36931 -36695 -37748 -37342 -36646 -36640 -38541 -38745 -38366
2141 -38366 -39032 -39509 -40950 -40455 -40425 -38740 -40759 -39515 -40115 -39076 -40408 -41282 -40433 -40128 -40327 -40430 -39292
$$ packed form
2214g313p94j409n47Q51p75j048j061k002J54o09j684j080m76p89j365K57j237
2197b0927L37k48q65j531Q3n26R82q73M07q34O09j605N1j810j18j18J95L87r12
2178b7316r38k3j262J003j082O78j093o11m12j322Q4n95J30N50j057l64j460j90
2160c5280R72q67J76K74j451M93k15o40n01K38j30K36j053M06O96Oj901k04L79
2141c8366o66m77j441M95L0J685k019J244o00J039j332q74Q49L05j99j03J138
$$ [...]
##END NTUPLES=NMR SPECTRUM
##END=
