##TITLE=abcd
##JCAMPDX= 6.0         $$ Bruker NMR JCAMP-DX V2.0
##DATA TYPE= NMR SPECTRUM
##DATA CLASS= NTUPLES
##ORIGIN= UXNMR, Bruker Analytische Messtechnik GmbH
##OWNER= root
$$ XWIN-NMR		Version 3.5
$$ Wed Apr  8 18:06:06 2026 Russian Standard Time (UT+4h)  servis@DPX200
##.OBSERVE FREQUENCY= 200.131235884673
##.OBSERVE NUCLEUS= ^1H
##.ACQUISITION MODE= SIMULTANEOUS
##.ACQUISITION SCHEME= undefined
##.AVERAGES= 32
##.DIGITISER RES= 18
##SPECTROMETER/DATA SYSTEM= spect
##.PULSE SEQUENCE= zg
##.SOLVENT NAME= CDCl3
##.SHIFT REFERENCE= (INTERNAL, CDCl3, 0, 16.4885)
##AUDIT TRAIL= $$ (NUMBER, WHEN, WHO, WHERE, WHAT)
$$ ##TITLE= Audit trail, XWIN-NMR		Version 3.5
$$ ##JCAMPDX= 5.01
$$ ##ORIGIN= Bruker BioSpin GmbH
$$ ##OWNER= servis
$$ F:\spectra/data/av/nmr/H1/1/pdata/1/auditp.txt
$$ ##AUDIT TRAIL=  $$ (NUMBER, WHEN, WHO, WHERE, WHAT)
(   1,<2026-04-08 18:03:27.04 +0400>,<servis>,<DPX200>,
      <created by zg, POWCHK disabled, PULCHK disabled
       configuration hash MD5:
       00 E9 B6 7A A2 85 ED C7 34 08 36 98 17 FE 4E 26
       data hash MD5: 32K
       B4 50 D1 49 20 E2 69 08 DD 7C 1B 73 D0 AE D0 DA>)
(   2,<2026-04-08 18:05:44.84 +0400>,<servis>,<DPX200>,
      <Start of raw data processing
       efp BC_mod = 2 LB = 0.05 FT_mod = 6 PKNL = 1 PHC0 = -177.3018 PHC1 = -0.898437 SI = 16K 
       data hash MD5: 16K
       8B C9 1A FC EC CC 62 78 25 53 56 41 C8 D2 59 5B>)
$$ ##END=
$$ 
$$ hash MD5
$$ 61 2A 57 7F 14 7A 06 9F 56 DA D2 F0 5A 94 BD 60
##$RELAX= 
##$RELAX= 
##$RELAX= 
##$RELAX= 
##$RELAX= 
##$RELAX= 
##$RELAX= 
##$RELAX= 
$$ Bruker specific parameters
$$ --------------------------
##$DU= <F:\spectra>
##$EXPNO= 1
##$NAME= <H1>
##$PROCNO= 1
##$TYPE= <nmr>
##$USER= <av>
##$AMP= (0..31)
100 100 100 100 100 100 100 100 100 100 100 100 100 100 100 100 100 100 
100 100 100 100 100 100 100 100 100 100 100 100 100 100 
##$AQSEQ= 0
##$AQ_mod= 1
##$AUNM= <au_zg>
##$AUTOPOS= <>
##$BF1= 200.13
##$BF2= 200.13
##$BF3= 200.13
##$BF4= 200.13
##$BF5= 500.13
##$BF6= 500.13
##$BF7= 500.13
##$BF8= 500.13
##$BYTORDA= 1
##$CFDGTYP= 0
##$CFRGTYP= 5
##$CHEMSTR= <none>
##$CNST= (0..31)
1 1 145 1 1 1 1 1 1 1 1 1 1 1 1 1 1 1 1 1 1 1 1 1 1 1 1 1 1 1 1 1 
##$CPDPRG= <>
##$CPDPRG1= <>
##$CPDPRG2= <>
##$CPDPRG3= <>
##$CPDPRG4= <mlev>
##$CPDPRG5= <mlev>
##$CPDPRG6= <mlev>
##$CPDPRG7= <mlev>
##$CPDPRG8= <mlev>
##$CPDPRGB= <>
##$CPDPRGT= <>
##$D= (0..31)
0 2 0 0 0 0 0 0 0 0.06 0 0 0 0 0 0 0.0002 0 0 0 0 0 0 0 0 0 0 0 0 0 0 
0 
##$DATE= 1775657006
##$DBL= (0..7)
120 120 120 120 120 120 120 120 
##$DBP= (0..7)
150 150 150 150 150 150 150 150 
##$DBP07= 0
##$DBPNAM0= <>
##$DBPNAM1= <>
##$DBPNAM2= <>
##$DBPNAM3= <>
##$DBPNAM4= <>
##$DBPNAM5= <>
##$DBPNAM6= <>
##$DBPNAM7= <>
##$DBPOAL= (0..7)
0.5 0.5 0.5 0.5 0.5 0.5 0.5 0.5 
##$DBPOFFS= (0..7)
0 0 0 0 0 0 0 0 
##$DE= 6
##$DECBNUC= <off>
##$DECIM= 32
##$DECNUC= <off>
##$DECSTAT= 4
##$DIGMOD= 1
##$DIGTYP= 9
##$DL= (0..7)
0 120 120 120 120 120 120 120 
##$DP= (0..7)
150 150 150 150 150 150 150 150 
##$DP07= 0
$$ [...]
##$SUBNAM4= <"">
##$SUBNAM5= <"">
##$SUBNAM6= <"">
##$SUBNAM7= <"">
##$SUBNAM8= <"">
##$SUBNAM9= <"">
##$SW= 20.6817932712277
##$SWIBOX= (0..15)
0 0 3 0 0 0 0 0 0 0 0 0 0 0 0 0 
##$SW_h= 4139.07284768212
##$TD= 32768
##$TD0= 1
##$TE= 0
##$TE2= 300
##$TE3= 300
##$TEG= 300
##$TL= (0..7)
0 120 120 120 120 120 120 120 
##$TP= (0..7)
150 150 150 150 150 150 150 150 
##$TP07= 0
##$TPNAME0= <>
##$TPNAME1= <>
##$TPNAME2= <>
##$TPNAME3= <>
##$TPNAME4= <>
##$TPNAME5= <>
##$TPNAME6= <>
##$TPNAME7= <>
##$TPOAL= (0..7)
0.5 0.5 0.5 0.5 0.5 0.5 0.5 0.5 
##$TPOFFS= (0..7)
0 0 0 0 0 0 0 0 
##$TUNHIN= 0
##$TUNHOUT= 0
##$TUNXOUT= 0
##$USERA1= <user>
##$USERA2= <user>
##$USERA3= <user>
##$USERA4= <user>
##$USERA5= <user>
##$V9= 5
##$VALIST= <valist>
##$VCLIST= <CCCCCCCCCCCCCCC>
##$VD= 0
##$VDLIST= <DDDDDDDDDDDDDDD>
##$VPLIST= <PPPPPPPPPPPPPPP>
##$VTLIST= <TTTTTTTTTTTTTTT>
##$WBST= 1024
##$WBSW= 30
##$XGAIN= (0..3)
0 0 0 0 
##$XL= 0
##$YL= 0
##$YMAX_a= 60149
##$YMIN_a= -74850
##$ZGOPTNS= <>
##$ZL1= 120
##$ZL2= 120
##$ZL3= 120
##$ZL4= 120
##$ABSF1= 0
##$ABSF2= 0
##$ABSG= 0
##$ABSL= 0
##$ALPHA= 0
##$AQORDER= 0
##$ASSFAC= 0
##$ASSFACI= 0
##$ASSFACX= 0
##$ASSWID= 0
##$AUNMP= <proc_1d>
##$AZFE= 0.1
##$AZFW= 0.1
##$BCFW= 0
##$BC_mod= 2
##$BYTORDP= 0
##$COROFFS= 0
##$CY= 18.4799938201904
##$DATMOD= 1
##$DC= 0
##$DFILT= <>
##$DTYPP= 0
##$F1P= 9.9274215381318
##$F2P= -0.165520771350173
##$FCOR= 1
##$FTSIZE= 16384
##$FT_mod= 6
##$GAMMA= 0
##$GB= 0
##$INTBC= 1
##$INTSCL= 4.127829e-11
##$ISEN= 128
##$LB= 0.05
##$LEV0= 0
##$LPBIN= 0
##$MAXI= 10000
##$MC2= 0
##$MEAN= 0
##$ME_mod= 0
##$MI= 50
##$NCOEF= 0
##$NC_proc= -7
##$NLEV= 6
##$NOISF1= 3.799351
##$NOISF2= 2.8
##$NSP= 0
##$NTH_PI= 0
##$NZP= 0
##$OFFSET= 16.48848
##$PC= 4
##$PHC0= -177.3018
##$PHC1= -0.898437
##$PH_mod= 1
##$PKNL= yes
##$PPARMOD= 0
##$PSCAL= 4
##$PSIGN= 0
##$REVERSE= no
##$SF= 200.130005582386
##$SI= 16384
##$SIGF1= 3
##$SIGF2= 2
##$SINO= 400
##$SIOLD= 16384
##$SREGLST= <1H.CDCl3>
##$SSB= 0
##$STSI= 16384
##$STSR= 0
##$SW_p= 4139.07284768211
##$SYMM= 0
##$S_DEV= 0
##$TDeff= 32768
##$TDoff= 0
##$TI= <>
##$TILT= no
##$TM1= 0
##$TM2= 0
##$TOPLEV= 0
##$USERP1= <user>
##$USERP2= <user>
##$USERP3= <user>
##$USERP4= <user>
##$USERP5= <user>
##$WDW= 1
##$XDIM= 16384
##$YMAX_p= 289111191
##$YMIN_p= -2207304
$$ End of Bruker specific parameters
$$ ---------------------------------
##NTUPLES= NMR SPECTRUM
##VAR_NAME=  FREQUENCY,     SPECTRUM/REAL,   SPECTRUM/IMAG
##SYMBOL=    X,             R,               I
##VAR_TYPE=  INDEPENDENT,   DEPENDENT,       DEPENDENT
##VAR_FORM=  AFFN,          ASDF,            ASDF
##VAR_DIM=   16384,         16384,           16384
##UNITS=     HZ,            ARBITRARY UNITS, ARBITRARY UNITS
##FACTOR=    0.252644378177508, 1,           1
##FIRST=     3299.83951724647, 0,            0
##LAST=      -839.233330435636, 0,           0
##MIN=       -839.233330435636, -2207304,    0
##MAX=       3299.83951724647, 289111191,    0
$$ Real data points
##PAGE= N=1
##DATA TABLE= (X++(R..R)), XYDATA
$$ [...]
9581 -154539 -178692 -158010 -208553 -174254 -51711 -141097 -131514 -121954 -186991 -261124 -183538 -156441
9569 -156441 -101713 -196638 -196041 -129039 -59342 -113060 -115447 -168104 -104574 -106925 -136727 -106177
9557 -106177 -139693 -104686 -146972 -166117 -130566 -86849 -168163 -892 -98759 -150935 -110339
9546 -110339 -77550 -112670 -59377 -78000 4397 89228 30671 135719 146967 220334 305967
9535 305967 340953 366614 390670 426185 537111 518247 509767 530038 380958 276013 236523
9524 236523 159266 223967 65530 149714 21870 84433 6500 46933 21348 -70663 -191404
9513 -191404 -95271 -74767 -95793 -7459 -40694 -14122 -126763 -98372 -72969 13319 -123951
9502 -123951 -26898 -109891 -78674 -69902 -62072 -6641 -61841 -60049 -78670 40223 -85056 -54671
9490 -54671 -24345 -34322 -13726 -43773 -73880 -22082 -26156 -34467 -133800 -51498 22964 -77572
9478 -77572 13564 20087 27281 -2935 125384 54173 -20431 16018 43235 90449 52348 100696
9466 100696 9713 52590 20315 134108 136217 208513 203910 110611 82607 225616 208900 250740
9454 250740 161590 159560 173903 232364 220629 314571 280818 271713 263345 203417 271189 362619
9442 362619 267136 310281 296559 338084 375825 474958 400694 557335 617598 579539 750341
9431 750341 831685 931747 940968 1137226 1222992 1412892 1606329 2113348 2648290 3451692
9421 3451692 4367956 5409286 6405005 7235318 7896954 8260170 8746079 9028638 9400303
9412 9400303 9554864 9606151 9240364 8662942 7898729 7013040 5830503 4824446 4029365
9403 4029365 3382605 2795678 2340963 2093900 1850631 1663237 1529560 1429803 1423283 1293100
9393 1293100 1245356 1121741 1088587 1028389 1060146 1025426 970549 932380 995527 957178 813451
9382 813451 841409 810405 827794 695355 742379 700638 708113 705155 696467 800660 754913 802363
9370 802363 604927 758605 753880 805028 784580 882620 882486 932760 939750 991459 994578 899992
9358 899992 816962 864947 857344 819002 757609 744254 780232 657639 680723 712975 710715 683006
9346 683006 666596 717259 705531 643043 750594 764695 728607 787634 755390 792518 846450
9335 846450 844588 908655 962179 900922 890662 876679 929121 996050 978114 982786 999718 929243
9323 929243 914463 1007636 1007288 987905 1033953 1039906 1150990 1177916 1266751 1459937 1796210 2033948
9311 2033948 2497734 2974804 3336418 3589344 3672176 3664277 3544565 3502395 3553525 3536868 3445856
9300 3445856 3275993 2973598 2716959 2341652 2109757 1913635 1889951 1775522 1832134 1803808
9290 1803808 1904378 1923843 2065119 2099079 2212052 2238287 2469245 2675905 3113830 3753646
9280 3753646 4696821 5842793 6984075 8074175 8855122 9208322 9320786 9260988 9434395
9271 9434395 9661428 9768881 9675736 9094793 8102634 7060740 6100816 5235885 4611091 4116914
9261 4116914 3891620 3801134 3725024 3765672 3577029 3639658 3578777 3712354 3557338 3458830 3538460
9250 3538460 3738186 4035830 4243277 4744132 5402932 6510386 8062038 10079495 12126997
9241 12126997 13561297 14054639 13438099 12243308 11020042 9889679 8818615 7869455 6813802
9232 6813802 5850540 4944895 4277044 3854652 3510836 3317627 3035347 2844756 2700901 2792105
9222 2792105 2686044 2555317 2586416 2595934 2659329 2715929 2795023 2844192 2961042 3374437 3809650
9211 3809650 4496528 5132158 5551210 5753380 5596891 5221181 4764058 4438893 4097192 3831868
9201 3831868 3505927 3076097 2737607 2545862 2388146 2242434 2171694 2111637 2039120 1962135
9191 1962135 1976566 1902775 1928143 1967558 1912690 1904006 1894203 1988794 1998698 2275791 1691022 1761777
9179 1761777 1847189 1869754 1921704 1848343 1895598 1850914 1901243 1877449 1888775 1950190 1838355
9168 1838355 1839602 1932841 1888371 1976296 1998775 1994449 1995167 1994284 2112857 2188589 2107315 2148569
9156 2148569 2140908 2173099 2307358 2250044 2301933 2319852 2421166 2418774 2443905 2444835 2504387 2578769
9144 2578769 2629077 2636952 2687661 2737635 2781842 2814284 2940183 2989120 3096644 3099274 3110162
9133 3110162 3174585 3280953 3436873 3504434 3611031 3630518 3682777 3795851 4017572 4221339
9123 4221339 4355590 4503034 4732995 4958920 5124951 5289437 5530448 5647969 5759270 5865491
9113 5865491 6034399 6277667 6399754 6603929 6770303 7120897 7393130 7744801 8299072 9027343
9103 9027343 9697410 10446244 10964268 11330889 11681088 11943840 12376220 12967316 13955111 15376961
9093 15376961 17161426 18930447 20362722 21493315 22996446 25879841 29631151 30477616
9085 30477616 29229421 26342627 23676873 22038705 21391159 21081571 20848114 20578211 20399863
9076 20399863 20560375 21212196 22307811 24033395 26573333 30015993 33971206 37749069
9068 37749069 40362258 41611545 41974177 42156016 42829693 44904704 49552268 58243782 71965938
9059 71965938 89829834 107804758 121312427 127385022 127031899 124125687 123383608 127489043
9051 127489043 135903379 143514892 143832653 134151313 116107655 95571063 76804899 62340770
9043 62340770 52090589 45025297 40316555 37476778 36084884 35234819 34068404 32436900
9035 32436900 30293602 28145921 26249806 24913916 24083078 23796188 23850852 24121533 24336306
9026 24336306 24236865 23810249 23448054 23207527 23284082 23903034 24550803 25007880 25143745 25173154
9016 25173154 24967092 24300739 22707626 20596156 18412304 16495807 14913964 13674716
9008 13674716 12799614 12169173 11741029 11330841 11190765 10884839 10560792 10231538 9769537
8999 9769537 9483233 9138948 8863991 8482601 8144228 7847561 7432887 7174437 6830633 6446056
8989 6446056 6267632 6062307 5906706 5794970 5687280 5482313 5238336 5069030 4998581 4827800
8979 4827800 4733044 4659312 4478284 4358250 4320687 4224699 4168783 4102069 4011912 3925794 3860489
8968 3860489 3780014 3737010 3634962 3515677 3478920 3347848 3179146 3150980 3021926 2960822
8958 2960822 2883125 2842218 2795449 2706405 2684154 2622544 2610053 2487542 2431050 2398398 2316541
8947 2316541 2311673 2353588 2239489 2182934 2218509 2222614 2057970 2007641 2000704 1939655 1942315 1966515
8935 1966515 1873151 1945856 1836298 1834977 1825740 1900301 1794584 1902872 1863976 1725500 1730470
8924 1730470 1749397 1633939 1584704 1481695 1395729 1480603 1388742 1299145 1313678 1321187 1288746
8913 1288746 1229206 1241253 1149304 1090250 1169292 1119467 1156589 1140461 1023222 1149852 1008789
8902 1008789 990402 1022778 1014594 1013340 1003899 1040983 964068 1037697 996579 1018774 894471 878239
8890 878239 895800 826796 624727 691995 704640 752695 728980 629723 626049 678214 591354 590686
8878 590686 598169 586992 599663 480956 507441 640143 603452 524013 565465 461388 496366
8867 496366 441355 476243 474595 436439 433835 466821 524332 447351 485417 373234 470705 449650
8855 449650 462774 397850 364354 408633 446842 369695 423317 399285 374817 391844 332217 311967
8843 311967 309418 278827 276059 335624 330107 380169 313260 333642 379812 307783 257005 329835
8831 329835 240802 282542 257554 219408 240967 267714 341193 293390 253550 248338 230761 240130
8819 240130 274076 280240 153553 202219 68444 207421 197181 161561 183008 190862 139006
8808 139006 193407 129630 257369 180735 153815 161996 140289 152596 167087 212620 167022 102478
8796 102478 128419 138465 232544 108380 171734 155470 169596 162221 84950 39543 -315474
8785 -315474 365393 345634 230112 347088 201652 280086 203386 191869 274881 314962 268063
8774 268063 303167 340845 325980 365056 430086 336527 302342 310685 424258 238735 298745
8763 298745 306986 290605 129766 198372 155659 176128 189161 286748 236955 266263 313970 329044
8751 329044 326652 319966 351298 445568 423656 408800 441608 413798 475855 517025 520459 463777
8739 463777 410247 386225 310878 274030 285493 352672 257511 267726 215476 210968 174764 324336
8727 324336 260178 216568 180090 189030 255255 197308 212544 249495 234221 220065 177380 248384
8715 248384 250499 189888 286315 264488 141719 230787 198918 264804 145172 183623 120432
8704 120432 124459 54640 90751 84401 157678 58704 -30282 23538 -949 32729 80768 86882
8692 86882 73309 58742 23377 -29721 57816 1981 160540 -45368 65811 -64038 30631
8681 30631 35336 23751 7791 -80541 27664 -27983 115062 -1727 62164 10259 57685
8670 57685 35731 67053 59885 115956 17584 -30008 -7117 -10759 57655 -65304 -22385 -83523
8658 -83523 -7809 9789 64912 -2093 6977 -12073 -20260 37305 10934 -5998 -73654 -9583
8646 -9583 44378 -47713 -7443 -32375 28685 -39771 -41347 -22847 12594 -9038 -74725 -93456
8634 -93456 8448 -44555 -16450 -94786 -72771 -27303 -5218 -25344 -9412 4749 -73861 -19004
8622 -19004 -47589 -102225 434 -114047 -53721 23262 -8558 60073 -8518 -45249 -42395 -55310
8610 -55310 -98576 36851 -41283 34826 -20539 -112391 -55538 -112326 1716 -47497 -66575
8599 -66575 -101152 -93522 -12636 -53385 -37869 4567 5013 1392 -126571 -24884 -68545 -106259
8587 -106259 -148322 -166395 -87134 -104533 -40044 -305 -23990 -82378 -41883 -78989 -127906 -78633
8575 -78633 11749 -54302 -66494 -121651 -151098 -142238 -117340 -217162 -76404 -118979 -87217 -91193
8563 -91193 -96596 -134515 -46908 -131984 -67301 -161609 -158319 -75735 -123724 -64211 -37311 -111935
8551 -111935 -31779 -107126 -88236 -18441 10253 -121297 -63337 -99420 -130575 -88257 -130414
8540 -130414 -27959 -164801 -199071 -316071 -1144963 1302040 -104601 -43073 53959 -105447
8530 -105447 -21997 -91386 -127591 -46916 -129378 -17736 -99303 -77812 -128921 -108470 -84461
8519 -84461 -78799 -211793 -166905 -112197 -181194 -102722 -23629 -73965 -115866 -118283 -161049 -87253
8507 -87253 -101110 -129334 -64866 -71541 -49342 -129260 -37109 -38713 -109446 -236294 -55530 -53218
8495 -53218 -136256 -142330 -65407 -135511 -85565 -134191 -137395 -132689 -48977 -70691 -20408 -42536
8483 -42536 -59650 -122197 -129018 -88160 38623 -55357 -99599 -161827 -122697 -126678 -73267 -56333
8471 -56333 -60179 -15865 -59449 -87778 -64476 -158989 -78492 -160837 -150929 -144292 -142272 -149627 -92942
8458 -92942 -70884 -119810 -87503 -145564 -123378 -163892 -49936 -65985 -123076 -31534 -113691 -22459
8446 -22459 -179246 -101738 -66949 -72857 -71071 -75697 -220150 -69088 -71301 -118720 -121065 -127930
8434 -127930 -103822 -80308 -86294 -115705 -48598 -93415 -125336 -100922 -75361 -105943 -96643 -114476
8422 -114476 -156113 -26748 -85869 -133923 -40202 -40667 -104106 -159664 -44070 -80119 -129547 -128879
8410 -128879 -142287 -141046 -148941 -76511 -32928 -192386 -62868 -124525 -196007 -135439 -103303 -125053
8398 -125053 -145222 -121375 -109646 -104205 -83808 -65300 -59033 -80009 38867 -144808 -136579 -203609
8386 -203609 -64356 -145841 -130192 -163469 -184099 -124602 -88977 -188146 -26497 -189014 -125820
8375 -125820 -168709 -144228 -175379 -219599 -170295 -89663 -75157 -86474 -160702 -33402 -69193
8364 -69193 -228206 -263003 -185763 -109058 18907 -12102 -76309 -13067 -189796 -136346 -41224
8353 -41224 -153382 -69819 -131259 -124862 -225445 -82534 -105024 -99227 -165426 -99455 -60820 -153838
8341 -153838 -123465 -96779 -182812 -153704 -183433 -144496 -228399 -191761 -132846 -161812 -235396 -100870
8329 -100870 -222561 -126724 -124887 -10863 -113265 -230657 -80687 -184369 -44280 -105291
8319 -105291 -63903 -91533 -57101 -138266 -94049 -132550 -120421 24662 -51489 -40352 -41598 112446
8307 112446 -107845 -33817 -61507 2732 -119950 -78942 -194358 -142912 -22132 26163 -200401
8296 -200401 -62033 -241169 -73842 -90369 26595 -42360 -122060 -121985 -62443 -170655 -113188
8285 -113188 -14176 -121823 -167034 -71982 -140747 -32534 -98065 -8548 -212191 -137905 29375
8274 29375 -30427 -69540 -90068 -254115 -276570 -179567 -177192 -158922 -267126 -127500 -151937
8263 -151937 -253521 -96201 -98640 -147829 -187643 -178033 -163851 -193429 -43640 -200876 -80433
8252 -80433 -189173 -330707 -144388 -174632 -215560 -177960 -215460 -111690 -96050 -206250 -113502
8241 -113502 -141817 -71251 -68385 -13339 -204605 -99312 -159413 -125260 -199094 -135848 -160071
8230 -160071 -335411 -290279 -278586 -166347 -142900 -230779 -165924 -150977 -85766 -335730 -7088
8219 -7088 -219319 -26763 -157290 -187090 -272450 -253618 -118630 -224402 -32662 -207125 -226938
8208 -226938 -132647 69959 -238565 -186220 -252689 -139726 -215428 -311164 -114721 -93817 -256106
8197 -256106 -319888 -358837 -907893 -471198 -1055224 -750543 193941 753882 -23669 115305
8187 115305 -107210 238453 87161 -117677 -2214 -54598 4264 -35363 -147496 -11869
8177 -11869 -8993 -380112 -113004 -267845 -203092 -59083 -128611 -96497 -19999 -298291 -90474
8166 -90474 -117092 -61991 -142795 -137113 -143937 106492 -47281 -201377 -39583 -146222 -251165
8155 -251165 -198852 -302045 -259583 -116745 -107348 -65040 -149959 35122 -99708 -171404 -18572
8144 -18572 -177771 -165843 -128313 -93739 -42841 -97560 -82799 -159620 -141995 -234968 -84041
8133 -84041 -210944 -153658 -194509 -179121 -38359 -99064 -48897 -199871 -97469 -66757 -91912
8122 -91912 -171015 -182674 -234266 -151521 -193847 -112803 -162876 -168003 -73942 -141196 -180273 -148999
8110 -148999 -150227 -222791 -88020 -179765 -248633 -64943 -176093 -197273 -202775 -209767 -92555
8099 -92555 -136770 -130605 -209813 -177641 -45807 -125410 -102951 -297891 -127015 -89481 -85356 -271207
8087 -271207 -179307 -108930 -234549 -119375 -176404 -167414 -88170 -203314 -121678 -7955 -196491
8076 -196491 -123740 -118473 -139452 -196433 -240470 -117899 -192228 -253433 -196654 -83323 -177940
8065 -177940 -63537 -118477 -83138 -192110 -169223 -203243 -235393 -247913 -167519 -120231 -166008
8054 -166008 -149183 -186052 -125677 -243526 -142746 -106513 -304730 -250697 -157840 -223439 -109230
8043 -109230 -212107 -121194 -173505 -165801 -80299 -197687 -113990 -214657 -201342 -92381 -131220
8032 -131220 -173849 -153800 -197613 -142790 -202899 -199225 -141943 -146784 -126480 -239501 -113252 -208508
8020 -208508 -144094 -202021 -203601 -133186 -247272 -232993 -196552 -174426 -172255 -226669 -211445 -127741
8008 -127741 -156436 -132598 -208644 -292421 -231517 -197386 -230797 -203156 -187643 -172055 -197138 -125807
7996 -125807 -162852 -207397 -109841 -151600 -140070 -130343 -235347 -205059 -191436 -184587 -212988 -90788
7984 -90788 -98818 -102558 -144139 -200638 -131867 -177536 -82530 -208105 -167190 -203159 -121526 -144873
7972 -144873 -153806 -230632 -146844 -156017 -168350 -207854 -230518 -175280 -217157 -96176 -81242 -177523
7960 -177523 -172673 -87074 -88010 -110278 -153404 -195429 -143756 -166009 -214848 -124398 -104550 -165433
7948 -165433 -164798 -112564 -159283 -142497 -131672 -110091 -194423 -213167 -102507 -220411 -164494 -122598
7936 -122598 -155641 -261338 -172862 -161243 -165921 -121475 -164821 -92032 -174941 -217205 -200016 -140136
7924 -140136 -151439 -257594 -226213 -154352 -144307 -236103 -86241 -149101 -137009 -149750 -272979
7913 -272979 -232363 -262147 -206408 -204250 -281873 -227699 -133822 -186296 -210786 -233437 -158720 -129579
7901 -129579 -171377 -118725 -248366 -179923 -199857 -200334 -134548 -207008 -113812 -156599 -166081 -150905
7889 -150905 -210351 -168706 -134075 -287209 -302900 -283031 -228698 -226358 -109883 -216313 -227407
7878 -227407 -196373 -220116 -260961 -221401 -186421 -178584 -119960 -274864 -182232 -256794 -142076
7867 -142076 -213264 -224382 -225388 -246508 -149481 -249799 -240112 -161122 -162095 -256301 -194924 -327553
7855 -327553 -306833 -242402 -245415 -248955 -341825 -562482 -2207304 493659 179187 182823 110726
7844 110726 11181 -58612 -123979 -55479 -25898 6620 -21170 -83944 -72725 -90847 -93977 -82927
7832 -82927 -68934 -200682 -153403 -172322 -146733 -143388 -92171 -136059 -116335 -188112 -107260 -218024
7820 -218024 -134715 -198797 -195774 -109863 -108029 -191426 -157247 -148243 -149418 -126749 -203116 -184506
7808 -184506 -200404 -117525 -122126 -125332 -139864 -202846 -194902 -186956 -196944 -182867 -104133 -89580 -215216
7795 -215216 -230989 -266019 -221414 -109162 -153175 -253166 -219100 -195089 -156717 -163605 -119514 -147611
7783 -147611 -175142 -180083 -181749 -129772 -158245 -109822 -104802 -239858 -180523 -246968 -213457 -148475
7771 -148475 -113086 -168003 -135406 -209663 -157692 -102489 -84143 -119388 -126815 -108504 -186227 -227048
7759 -227048 -211165 -240294 -160445 -108712 -204022 -58588 -115114 -97577 -99955 -13998 -91968 -26523
7747 -26523 -43605 -39167 -26492 2132 -22039 -44092 -41579 -202572 -133175 -214974 -189166 -173575
7735 -173575 -68770 -189488 -176939 -178904 -88050 -124734 -185162 -145077 -158732 -76509 -147697
7724 -147697 -137465 -148607 -129818 -165236 -163263 -221810 -200807 -250679 -254664 -189872 -209171 -143172
7712 -143172 -93073 -118657 -203871 -168396 -203277 -189983 -163853 -121328 -166900 -214744 -170787 -185863
7700 -185863 -69431 -146564 -169736 -222598 -145310 -232066 -227491 -99367 -211621 -108807 -240338
7689 -240338 -174437 -227401 -176647 -225155 -166927 -152361 -127547 -121242 -90687 -158345 -232247 -235464
7677 -235464 -120039 -157858 -172364 -234768 -117200 -141218 -42467 -212163 -120823 -144012 -95603
7666 -95603 -156826 -120899 -16501 -115789 -61077 -111023 -150486 -108353 -147808 -90409 -190177 -229735
7654 -229735 -166026 -118365 -123358 -91139 -186095 -195408 -142489 -77061 -95100 -64211 -33096 -118920
7642 -118920 -88542 -17230 -82216 -26650 -82098 -143484 -202383 -199852 -192792 -150738 -97293 -80213
7630 -80213 -117159 -134177 -163048 -82095 -40510 55581 -4300 11694 -36371 -46472 -81689 14290
7618 14290 -67354 -22084 -90403 -60270 -41826 -150718 -70529 -50412 -61039 -74137 -109461 -121306
7606 -121306 -141082 -103388 -206129 -147024 -243407 -206212 -217629 -97641 -31938 -173087 -240408
7595 -240408 -199597 -221140 -218058 -243411 -221655 -117389 -112430 -167951 -160619 -200334 -171048 -93789
7583 -93789 -93106 -158475 -167131 -218646 -127565 -112585 -181173 -198026 -177157 -118109 -35487 -45580
7571 -45580 -15403 61506 137115 138212 160779 146357 110248 80762 -46777 -18753 -95820 -50861
7559 -50861 -43241 -83318 -142241 -136466 -75010 -135955 -59755 -153196 -161459 -76432 -78290 -194310
7547 -194310 -189261 -179313 -183480 -175016 -136525 -96197 -190610 -94349 -164862 -163932 -186469 -156936 -199135
7534 -199135 -248773 -149621 -193752 -119270 -183434 -198979 -177251 -205393 -123658 -120782 -213571 -158795
7522 -158795 -115130 -166691 -119177 -170362 -100378 -103256 -108489 -278080 -195980 -158156 -112447 -110088
7510 -110088 -160749 -204956 -158179 -141987 -143436 -207913 -168431 -96384 -248937 -261357 -237698 -195359
7498 -195359 -133571 -111396 -190337 -98512 -202543 -184581 -214958 -155515 -177867 -185973 -150832 -266085
7486 -266085 -231039 -236981 -88914 -52400 -131381 -208157 -215422 -110983 -104201 -208316 -174037 -213988
7474 -213988 -201226 -245616 -182012 -117563 -133770 -89331 -230542 -184521 -198321 -208090 -149533 -223887
7462 -223887 -102882 -200330 -188216 -224700 -275627 -185680 -164010 -196770 -242303 -252816 -206319
7451 -206319 -164763 -155098 -211983 -205865 -117766 -191502 -181321 -210610 -214621 -115907 -203683 -221511
7439 -221511 -174511 -214837 -199644 -142474 -136478 -221562 -191966 -155036 -163233 -239888 -155788 -167627
7427 -167627 -195073 -288549 -273839 -195013 -216841 -145076 -168420 -172258 -242156 -150214 -162315 -187321
7415 -187321 -153731 -155278 -172843 -205173 -217106 -237576 -119690 -135101 -147158 -148454 -176387 -176662
7403 -176662 -185368 -203376 -176588 -77577 -188407 -105424 -137285 -94510 -97714 -174774 -171883 -155597
7391 -155597 -134350 -151027 -211518 -209075 -151638 -216324 -138980 -185823 -202089 -233562 -173714 -120675
7379 -120675 -153748 -209612 -194914 -144513 -80081 -172646 -201918 -230990 -109873 -186236 -164597
7368 -164597 -163535 -165225 -176104 -164839 -199452 -179760 -153555 -124954 -150857 -131049 -180282 -146191
7356 -146191 -104908 -166427 -201914 -182860 -94048 -174847 -104373 -146760 -191048 -207588 -177162 -128161
7344 -128161 -171437 -125184 -165387 -136964 -147256 -113094 -39511 -77720 -135427 -94852 -64563 -4016
7332 -4016 4881 -31367 -39892 -108792 -42720 -117605 -93733 -119132 -119999 -38629 -96500 -47127 -110430
7319 -110430 -42040 -107254 -98202 -105061 -29279 -102145 -153076 -72761 -26093 63771 31941 108765
7307 108765 86810 264132 360035 547204 760476 811120 921520 871763 813339 711168 523809
7296 523809 337702 272570 179727 119187 160042 169028 98839 69060 38378 -13694 -106101 -34628
7284 -34628 -19469 -2254 21661 -83501 -78463 -66847 -40533 2156 -44136 -27237 -56234 -87669
7272 -87669 -38294 -30956 15743 87302 106401 97819 107843 40934 51874 102288 12198 47668
7260 47668 9465 42199 63943 133127 40674 20795 16486 31444 56253 91734 97477 128564
7248 128564 141183 204761 186163 69610 53152 71448 146274 58969 49063 39278 -10317 7870
7236 7870 16518 -111113 -85644 57741 -69188 -20223 33592 -41283 41157 48975 159278 82579
7224 82579 83252 69824 51255 70685 55562 18467 -27872 645 -75868 -35547 -42874 -24821
7212 -24821 -90061 -35967 -120375 -43574 -118868 -34632 -31844 156374 -17666 335017 -385203
7201 -385203 -176544 -126444 -124213 -101826 -105841 -122049 -88077 -37678 -6810 31273 -24780 -20359
7189 -20359 -5429 22091 107908 157159 70551 154174 106370 136715 129349 81165 81041 43028
7177 43028 102325 38146 77655 38230 77553 122098 59367 113239 99892 127110 61633 195335
7165 195335 96866 183316 137544 178933 104674 71847 61425 103434 54643 -17193 98523
7154 98523 -49106 29286 -35848 37508 47846 95977 18966 7174 -5522 -10065 80368 54453
7142 54453 163663 95804 119360 99268 90138 141311 142472 173895 134164 118293 132552 169603
7130 169603 108952 90411 104671 188777 130177 202417 49199 217900 140844 227084 233098
7119 233098 213336 213174 204119 267055 216605 191966 244302 139584 153839 171689 256027 148618
7107 148618 261144 202700 255251 244061 276401 356000 389922 258794 295994 304592 408308
7096 408308 410386 358310 357349 276978 282991 288741 264245 223586 410658 292536 332849 358938
7084 358938 355213 365879 437069 358363 362042 408877 438458 512118 438668 496028 504806 554755
7072 554755 499056 483743 492763 477936 589421 500042 547676 489021 476788 501572 540895 503961
7060 503961 502523 503917 444132 487085 510844 559510 659051 634926 618283 561382 534480 655625
7048 655625 703189 766589 739113 801464 724833 717306 806315 835632 917159 973992 926684 982712
7036 982712 951818 934705 1055314 1079906 1075639 1108143 1068806 1110277 1077139 1216055 1255782
7025 1255782 1204736 1220393 1209803 1226230 1296160 1374592 1453215 1471336 1518486 1477426 1607731
7014 1607731 1619629 1715759 1748754 1798697 1788010 1782067 1935593 2004875 2162806 2126392 2228369
7003 2228369 2303368 2464235 2547219 2680883 2788046 2808770 2919021 2974169 3083550 3192871
6993 3192871 3403011 3529530 3725490 3957013 4130109 4501946 4819580 5383569 5911894 6790064
6983 6790064 7989817 9670762 11371375 12731283 13305404 13534048 13751433 14722179 16683285
6974 16683285 20641435 26629788 32838075 36005927 35349772 31816584 27255696 23582757
6966 23582757 21095454 20189235 20236768 20968208 21902941 22605298 23192842 23679502 24303822
6957 24303822 25106736 26519305 29215276 34054452 40522632 47122452 52193227 54212320
6949 54212320 53561694 50377070 45115545 38773906 32617034 27437425 23755966 21571503
6941 21571503 20804002 21058918 21644507 21855270 21445150 20673855 19968659 19917445 21057468
6932 21057468 24061959 29325812 35141135 37953165 36654912 32085579 26403405 21216136
6924 21216136 17338862 14159280 11999154 10300355 9027688 8099463 7451601 6848114 6482298
6915 6482298 6051839 5771470 5515835 5189492 5056057 4780063 4619808 4454433 4297668 4059771
6905 4059771 3980126 3857826 3837023 3677153 3668770 3639257 3515024 3557667 3547930 3525417 3427176
6894 3427176 3314576 3199756 3028254 2860916 2721450 2707948 2516956 2544033 2431120 2387411
6884 2387411 2327762 2289054 2326994 2266958 2303130 2215665 2277119 2244906 2479925 2478995 2602984
6873 2602984 2538331 2571230 2446276 2308860 2137961 1969456 1848938 1738907 1846808 1706427
6863 1706427 1754530 1705283 1669098 1657313 1607343 1552974 1482322 1470234 1389828 1595167 1522564
6852 1522564 1529251 1551720 1644033 1578831 1522996 1422277 1296687 1244658 1103494 1009671 957795
6841 957795 1040070 951864 937258 882691 869729 813827 809850 870981 879288 931230 858328 884509
6829 884509 806251 918493 826437 827279 735809 788866 712917 701408 777231 799477 985678 1028636
6817 1028636 1005094 787585 773748 756659 670228 632106 644463 600966 632234 580695 797537
6806 797537 610594 554971 499641 445728 407307 422168 468012 440102 471316 495340 404958
6795 404958 424454 346481 472168 402547 366196 334044 313591 333829 384448 385010 328550 334607
6783 334607 316355 238714 280782 262170 290509 239877 229874 278260 269478 313726 295114 235344
6771 235344 182119 251254 193388 229431 219367 172356 211282 176459 254492 203431 195750 153765
6759 153765 261062 165605 256280 240620 317417 268130 214891 205629 196206 228406 257523 151627
6747 151627 206226 151694 133303 197338 184047 254392 267185 265376 212822 196271 136132 153173
6735 153173 201896 220400 199641 175529 155321 111702 67365 121741 144363 196751 47816
6724 47816 54707 64161 99107 124890 128605 84505 21154 46438 58777 111849 85952 129867
6712 129867 204438 48283 85797 115749 201718 213206 259627 110333 121179 121060 146584 146082
6700 146082 137699 50623 63027 101661 93951 68072 48176 128075 26984 37885 132159 133052
6688 133052 104127 142513 88551 176611 173549 85491 199347 88384 239016 206467 194051
6677 194051 147973 135768 144769 169994 270222 360708 361260 282138 263536 290629 226547 195734
6665 195734 273683 181454 160753 126236 220871 276537 272678 254353 221764 240660 224174 328328
6653 328328 384459 490036 460799 479269 448155 541680 475342 442697 429639 296842 405923
6642 405923 296970 444131 340849 369013 212198 346266 266425 286735 321918 286851 208337
6631 208337 288329 310120 312488 314944 277663 250882 260162 207862 119930 202179 246475 252364
6619 252364 127123 183007 244973 288305 287802 306515 270943 326101 300729 312135 321075 326933
6607 326933 317742 312275 330405 443600 429203 481058 641950 755305 750534 779782 655878
6596 655878 624030 601851 526531 440937 384748 391707 293066 369686 283914 295698 318944 325115
6584 325115 269622 282976 231739 295723 300452 360947 325965 258928 317490 323342 412282 399090
6572 399090 469054 454731 467998 525468 592018 559571 609731 715461 773332 1000446 1266016
6561 1266016 1477316 1621892 1628387 1464202 1253842 1042488 935401 809773 746280 672258
6551 672258 608804 733842 638279 732060 766241 748600 881557 939961 1090746 1038072 1140089
6540 1140089 1154877 1042701 933804 971330 980056 963609 955679 1063210 1184796 1286701 1542150
6529 1542150 1816960 2198002 2316524 2421709 2298661 2076523 1927938 1839176 1874895 1776680
6519 1776680 1710886 1630747 1601695 1637689 1721211 1651137 1802169 1924245 1927700 1868138 1702596
6508 1702596 1481705 1313976 1180379 1067389 1033982 919611 1028059 946857 866767 787627
6498 787627 805477 844159 950216 935666 936661 1027293 1102891 1188624 1274001 1350452 1272699 1228126
6486 1228126 1124131 1067180 1015469 1049616 1007828 986231 928832 953627 932937 899689 986986
6475 986986 966536 1097656 1030275 934089 933034 995035 1045913 1009074 1001969 1081734 1110613 1092553
6463 1092553 1121064 1181273 1201859 1268043 1325214 1452962 1421981 1556109 1537883 1621038 1635574
6452 1635574 1633783 1702487 1749531 1705821 1702246 1788092 1815325 1835722 1823494 1808668 1886518 1952266
6440 1952266 2033797 1972514 2056263 1978502 2091505 2089717 2046806 2050580 2000020 2028744 2044146 1988688
6428 1988688 2085482 2085181 2052439 2073035 2149338 2192111 2262672 2291642 2409438 2431950 2454213 2529441
6416 2529441 2627435 2532093 2583395 2662505 2688173 3020730 2826574 3005331 3039338 3217310 3318246
6405 3318246 3503510 3645972 3800318 3957799 4141129 4364833 4535675 4927158 5184860 5685494
6395 5685494 6055574 6655201 7197083 8024016 8955412 10572404 12824120 16155756 20046971
6386 20046971 24305019 28017834 30223805 30674495 29408517 26948181 24147423 21697775
6378 21697775 19715437 18344806 17499235 16595737 15571155 14431075 13261775 12111845
6370 12111845 11190579 10323130 9786629 9301435 9125912 8983524 9006157 9065287 9311938 9655194
6360 9655194 10079244 10570117 11103465 11816996 12628092 13534879 14630918 15967930 17769374
6351 17769374 19838687 22082107 24487818 26868176 29247086 31145503 32456541 33424378
6343 33424378 34361284 35562634 38246350 43877648 55015042 73051418 95887126 117152876
6335 117152876 129235351 127474485 113264819 92676654 72213672 55403879 43180517
6328 43180517 34726073 28866697 24916506 21825720 19518061 17632781 16045528 14672325
6320 14672325 13588380 12669038 12011229 11278164 10554746 10024468 9547626 8945287 8486218
6311 8486218 8061076 7674313 7420950 7112794 6935283 6724420 6528063 6405966 6312527 6150156
6301 6150156 6019565 5984393 5866367 5728064 5721983 5638906 5505645 5362280 5216770 5227624
6291 5227624 5022820 4971719 4835695 4787210 4799395 4781649 4750899 4701531 4645073 4649278 4661462
6280 4661462 4594109 4661069 4525514 4613416 4654686 4753899 4844916 5109395 5401514 5795513 6129407
6269 6129407 6463150 6701671 6909245 6943244 6929007 7120423 7324042 7619520 8127622 8530107
6259 8530107 9123710 9628747 10112068 10566162 10817772 10959416 11220925 11241532 11272365 11187348
6249 11187348 11231649 11107984 10983819 10906561 10796865 10755111 10853392 10977564 11098716 11395912
6239 11395912 11713241 11859063 11978196 11981805 11939682 11894530 11683278 11503298 11354166 11305661
6229 11305661 11325565 11077614 10621737 10127723 9607388 9121918 8759878 8524187 8502012 8589205
6219 8589205 8840325 9029608 9293047 9422859 9490582 9275488 8892345 8438533 8041604 7652091
6209 7652091 7451973 7333629 7518256 7702374 8017400 8055025 8127230 7986810 7737252 7405080
6199 7405080 6916952 6428945 5926950 5489093 5078084 4623117 4417623 4152649 4036007 3794097
6189 3794097 3499494 3556930 3551047 3518396 3486881 3462087 3563292 3836305 4151957 4502195 4906354
6178 4906354 5208325 5412486 5300623 4876827 4511061 4071773 3680326 3405883 3023758 2899294
6168 2899294 2697358 2672235 2532991 2336958 2231252 2205091 2121473 2081363 1986583 1978787 2023557
6157 2023557 2019538 2033698 1938656 2029409 1947235 1905009 1766007 1626921 1647481 1597151 1568577
6146 1568577 1473857 1555344 1610103 1576597 1449289 1397102 1463546 1473308 1384693 1393096 1470961 1322166
6134 1322166 1359961 1361820 1306004 1221152 1310207 1202551 1163668 1040812 1170613 1254931 1170681
6123 1170681 1096389 1087138 1135086 1129531 1172032 1099624 1118181 1140639 1158989 1132226 1051940 1060165
6111 1060165 1083161 1135516 1055004 1038866 980195 1000851 1093861 1089357 1180063 1276330 1426392
6100 1426392 1538253 1593947 1473926 1488215 1394445 1331786 1214563 1090922 1009149 1035811 1038809
6089 1038809 951143 899473 966582 957181 998095 1133210 1089341 1081044 1152300 1183272 1270066 1391971
6077 1391971 1390491 1435924 1618435 1871245 2033340 2304287 2446143 2488663 2476409 2390319 2166026
6066 2166026 1957816 1685434 1578841 1388818 1330359 1257429 1295853 1234335 1293111 1346961 1363648
6055 1363648 1442664 1422233 1521634 1577457 1705144 1896266 2173119 2491846 3057573 3599752
6045 3599752 3926822 4186277 4003282 3629854 3110316 2670446 2288091 2093222 1948117 1719249
6035 1719249 1673342 1561212 1517149 1604662 1589547 1603693 1683444 1761339 1748140 1898723 1955412
6024 1955412 2265916 2442255 2953178 3493359 4272551 5120944 5722103 5901034 5619026 4977332
6014 4977332 4175273 3503495 2961321 2506462 2167911 1911517 1921856 1815404 1694816 1605588
6004 1605588 1503726 1512068 1559887 1616294 1641070 1701836 1825201 1960751 2186566 2538498 3038719
5993 3038719 3650187 4302167 4570949 4676152 4477001 3972106 3414730 2849237 2358202 2098064
5983 2098064 1714734 1662136 1504544 1555156 1392127 1336127 1302802 1308265 1338354 1411056 1391061
5972 1391061 1453257 1501613 1608927 1749382 1850369 2085400 2228970 2444337 2592265 2445665
5962 2445665 2312641 2152127 1884325 1576537 1457655 1340943 1248599 1235202 1207800 1121510
5952 1121510 1147072 1165214 1180473 1017104 954420 848951 919783 837770 852617 751244 808413
5941 808413 754687 792049 829562 918170 885302 941921 948799 934703 894085 838461 787447 766058
5929 766058 772662 767227 677762 621728 565970 626146 668766 576709 580070 570123 499147 554794
5917 554794 531501 520060 523950 604837 606018 571885 596005 575426 662452 599512 564553 501554
5905 501554 453096 534244 507823 620439 617535 693376 657101 635749 605376 643772 438146
5894 438146 628296 580067 500109 512988 543781 511486 556276 501079 538840 604639 612603 605924
5882 605924 624689 677228 732571 796795 787263 753915 804045 734838 655524 657166 637560 612698
5870 612698 673812 541363 574864 578086 639705 629832 592341 672584 757822 797827 838226 783538
5858 783538 851297 954346 937904 829257 851741 779194 879789 790308 733416 632830 688464
5847 688464 773589 788070 711938 780591 763053 786789 924562 893391 935235 1030718 1002048
5836 1002048 961514 848954 914018 835914 868205 814131 804347 787266 786808 845970 834748 774273
5824 774273 764248 838330 880105 874967 857969 976220 900400 932285 873727 917055 898592 924286
5812 924286 948535 971894 929584 877820 855242 954293 940643 963548 984611 892597 916897 892249
5800 892249 1001457 968578 1063648 921883 1019863 1082119 1088762 1014579 1017498 1129577 1189960
5789 1189960 1101406 1175577 1163364 1215860 1264689 1255334 1340541 1312143 1346130 1383028 1314685 1389223
5777 1389223 1350010 1458782 1398939 1431219 1426781 1530235 1436819 1497723 1574832 1575316 1661764 1706173
5765 1706173 1679174 1744469 1910426 1847305 1931052 1945013 2028092 1998722 2001638 2095740 2185341
5754 2185341 2212649 2219511 2264716 2254764 2289759 2400022 2493246 2471664 2558866 2613508 2585363 2683982
5742 2683982 2733137 2776486 2892179 3013210 3151343 3316658 3381481 3549371 3603694 3767488
5732 3767488 3866239 4040920 4193119 4305462 4458006 4526042 4764981 5120384 5387040 5819716
5722 5819716 6233521 6657092 7152076 7640276 8274642 9190460 10387796 12170880 14480399
5713 14480399 17604234 20832846 24353281 29372078 36465251 42393738 43860608 41087606
5705 41087606 35597057 29865241 25488257 22869197 21397884 20559168 19813221 19307382 19277668
5696 19277668 20127073 21648986 23930242 27240025 31873115 38294372 45814270 53474268
5688 53474268 60564596 66145862 68054334 66157421 59720197 51286988 42496788 35140906
5680 35140906 29594124 25833783 23262177 21625447 20945633 20939830 21615792 22592332 24074567
5671 24074567 25796471 27294491 29288899 32793128 38579749 44196628 46012718 43911616
5663 43911616 39511564 35286378 32438467 30569187 28956189 26816816 24297653 21644701
5655 21644701 19290869 17218433 15591836 14355767 13400450 12623539 12055917 11589614 11080360
5646 11080360 10716743 10495827 10365243 10268427 10273648 10436836 10760433 11321020 11954823 13279172
5636 13279172 15185413 17834583 20748266 23440713 25083262 25340620 24138023 22062536
5628 22062536 19662836 17217899 15341200 13689079 12586587 11708425 11042674 10517752 10038527
5619 10038527 9623986 9211502 8980144 9001058 9018439 9005064 9283606 9476092 9838188 10607192
5609 10607192 11787850 13523256 15754652 18021659 19764594 20502564 20115442 18727882
5601 18727882 16987850 15239511 13704514 12565288 11813279 11338595 11049961 10929280 11002316
5592 11002316 10909300 11030447 11058502 11197860 11250526 11332267 11260064 11308075 11427273 11607210
5582 11607210 11947577 12566556 13587417 14739923 15865911 16674777 16986638 16989067 16685511
5573 16685511 16386786 15960395 15480836 15062663 14610317 14118062 13631694 13118925 12696225
5564 12696225 12272074 11924592 11447168 11083677 10840549 10682596 10666677 10782771 10934032 11234333
5554 11234333 11524418 11863653 12130492 12237502 12163143 11856063 11390030 10798568 9900812 9161752
5544 9161752 8473329 7820094 7301563 6828575 6387351 6031310 5769177 5672124 5554694 5589429
5534 5589429 5721168 5850727 6161031 6322191 6201155 5944435 5407606 4927271 4460284 4063583
5524 4063583 3819520 3565870 3322551 3192402 3084358 2915466 2784793 2686138 2708439 2692197
5514 2692197 2568311 2538058 2560039 2555123 2412161 2377481 2335122 2404810 2282587 2254324 2239006
5503 2239006 2248985 2238359 2157447 2149834 2011288 2059576 2015979 2101072 1950664 1968724 2039451
5492 2039451 2034956 1969585 2003038 2046792 1924600 1985060 1947080 1890981 1910875 2077677 2035865
5481 2035865 2142782 2098867 2079594 2027172 2087660 2070336 1988652 2033851 1950355 1970111 1847114
5470 1847114 1796207 1738978 1712172 1660691 1681091 1697135 1713891 1740095 1761658 1802880 1924217
5459 1924217 1961927 2058305 2109588 2108168 2067529 2033012 2062283 2012918 1968140 1942185 1870305 1847734
5447 1847734 1859228 1810585 1866358 1992187 2054735 2064375 2093417 2123506 2179497 2171804 2124908 2137355
5435 2137355 2117356 2072885 2014660 1876081 1773914 1688917 1582013 1499560 1510497 1455667 1379192
5424 1379192 1421693 1408212 1408361 1541465 1492333 1488038 1652858 1608321 1634714 1617284 1585986 1560206
5412 1560206 1470104 1462721 1396952 1250703 1259619 1189012 1223518 1126716 1028926 1116365 1044184 1097737
5400 1097737 1175855 1215038 1167032 1175203 1125667 1013033 968520 929290 925558 860613 863396 777319
5388 777319 829279 866349 809550 776614 798937 809286 884414 814957 856684 896508 830650 906009
5376 906009 871515 893317 924214 854452 936819 912223 884408 889502 882054 736985 762532 755708
5364 755708 727174 715071 715901 651095 669379 673163 718912 669702 770726 699681 637143 654595
5352 654595 605019 598708 724908 611010 594116 598680 546602 583490 536414 517598 616710 603778
5340 603778 633824 558274 630168 517566 623796 568941 575379 482989 479956 580101 534105
5329 534105 577963 592392 633168 565524 585793 606850 589199 616072 646080 593855 539304 516163
5317 516163 555377 606031 628485 634007 670832 619039 563886 655166 671828 653188 677713 602961
5305 602961 665886 696127 613898 619955 619316 656478 658792 665896 592945 646430 635599 714127 675656
5292 675656 590719 566198 617360 614119 606939 596014 620443 657140 609061 620432 631361 550373
5280 550373 602625 577151 623180 489179 573690 500930 551452 534051 518193 543291 517036
5269 517036 596315 485075 580424 548647 538538 543016 482965 535240 527722 629140 467136
5258 467136 530743 439819 552129 586502 558003 533124 616914 600298 609696 530949 595283 628000
5246 628000 564621 568702 506448 513613 517583 606630 566865 603048 608375 664346 634037 483153
5234 483153 538982 604700 613210 622405 570192 551261 644072 625135 681866 667144 591674 619323
5222 619323 637227 710775 668243 690035 695906 703007 680609 704614 701457 739274 826195 812991
5210 812991 764958 755362 750485 836866 769449 881747 796458 942390 901528 970362 902677 932405
5198 932405 942086 987432 1101049 1138049 1138424 1105704 1197860 1158479 1146894 1193409 1219044 1173465
5186 1173465 1226693 1212660 1240534 1223071 1230325 1228288 1267505 1243033 1272174 1259764 1237956 1148565
5174 1148565 1135254 1190188 1167368 1182026 1214231 1262696 1249657 1240302 1273421 1360837 1200161
5163 1200161 1337203 1329921 1358007 1349645 1398639 1496089 1589638 1628232 1608766 1645167 1657676 1722593
5151 1722593 1642040 1640694 1661277 1698803 1730658 1748932 1773539 1738791 1746294 1775147 1760455 1774077
5139 1774077 1787656 1824663 1830595 1817680 1767686 1746627 1879667 1803236 1848742 1894778 1873892
5128 1873892 1887700 1887483 1876165 1920706 1990484 1999203 2004810 1938009 1964031 1987411 2086554 2174131
5116 2174131 2166102 2151793 2212247 2157891 2233855 2308835 2333497 2364190 2475005 2403577 2454946
5105 2454946 2502072 2591176 2684878 2797023 2784705 2712952 2803632 2838948 2821050 2853067 2947021
5094 2947021 2921395 2956171 3001705 3128108 3237651 3179733 3306350 3318657 3414708 3472598 3506427
5083 3506427 3588512 3746703 3766545 3784294 3871442 3975815 4038731 4188284 4201239 4319644 4322989
5072 4322989 4435446 4467328 4683574 4796332 4862365 4905421 4986305 5202693 5211259 5345720 5536075
5061 5536075 5631617 5765239 5889301 6048083 6198677 6307624 6320856 6538649 6702415 6787307
5051 6787307 7011749 7135304 7312486 7550298 7698642 7904778 8074364 8170612 8423338 8663046
5041 8663046 8883287 9036886 9196253 9456378 9767523 10030740 10298273 10553723 10841961 10984210
5031 10984210 11368579 11630755 11903198 12191494 12491120 12854885 13164858 13473726 13653233
5022 13653233 13974484 14227845 14565498 14857374 15146379 15450899 15764760 16044433 16296107
5013 16296107 16563017 16842339 17062748 17260615 17410466 17655689 17730259 17858527 17949347 17982487
5003 17982487 18095067 18118860 18148491 18201238 18105030 18106597 17979976 17893351 17793168 17621168 17479373
4992 17479373 17212794 17066883 16700487 16459366 16166151 15967906 15641045 15392948 15129972
4983 15129972 14830246 14551915 14249153 13960749 13770113 13348470 13090178 12844247 12525290
4974 12525290 12241704 12013064 11719091 11456786 11234813 11021625 10776250 10489193 10207453
4965 10207453 9914232 9769495 9567352 9290126 9053024 8778795 8615742 8458099 8195696
4956 8195696 8027133 7870518 7773720 7615821 7393717 7241217 7083106 6938451 6759932 6642125
4946 6642125 6503243 6372526 6219691 6106023 5947610 5884138 5825866 5670839 5533728 5392940
4936 5392940 5277240 5198666 5084412 4910661 4887534 4773281 4722441 4576359 4457759 4409575
4926 4409575 4308765 4272523 4133658 4102873 4085218 3962622 3978099 3874732 3708418 3701046 3600816
4915 3600816 3527878 3427487 3421564 3418041 3359109 3301796 3297518 3231247 3061782 3062136 2970396 2915641
4903 2915641 2828146 2924559 2852211 2744499 2675668 2701463 2729002 2562764 2590345 2473980 2570058
4892 2570058 2485260 2428076 2421500 2332557 2264797 2261065 2246501 2275841 2264314 2126410 2005220
4881 2005220 2094073 2000285 2016490 2060306 1951537 1851783 1891783 1828430 1897005 1833795 1779425
4870 1779425 1738988 1671688 1662461 1695114 1627745 1638678 1602357 1618649 1581544 1568277 1620101 1518489
4858 1518489 1524537 1418477 1469634 1461985 1444625 1419666 1364648 1410998 1361740 1371485 1323268 1271426
4846 1271426 1334823 1300820 1218874 1270235 1158231 1222210 1154106 1091813 1155756 1163239 1200691
4835 1200691 1145767 1198334 1091759 1147592 1163662 1100326 1124123 950730 968627 950105 1082963
4824 1082963 982369 1029517 998278 1015371 998661 1009690 928908 992229 1080871 999081 911186
4813 911186 895004 876223 894498 860109 779859 817481 879199 917320 852628 824677 857772 930833
4801 930833 784003 769854 816294 730127 687172 691965 707507 724219 760405 737622 670103 668473
4789 668473 778791 802154 796872 813557 768883 868759 888152 856258 804622 855174 866386 777601
4777 777601 813537 883511 837720 878400 898314 812855 829934 799527 795764 787750 807650 840685
4765 840685 853103 805006 706115 824703 682852 676750 597601 641820 608754 667946 603736
4754 603736 618778 584294 504386 495165 556313 569427 564009 530948 505544 566213 529552 504196
4742 504196 448379 479285 509466 552266 573237 504350 498833 498531 553076 485028 540645 493923
4730 493923 557535 547727 516908 590238 439238 470687 429845 485919 435066 498066 454487 497951
4718 497951 445851 418052 408695 438718 511880 439282 422667 427431 511031 472650 517683 454462
4706 454462 494988 452008 497619 441566 496643 488876 418280 523079 397006 536224 437725
4695 437725 446025 426051 444573 466481 504236 458364 429105 429285 426816 445550 398310 490884
4683 490884 440321 510478 603031 569687 504272 492139 467783 471690 546207 500898 492310 461932
4671 461932 429164 501307 517427 512174 490748 486697 474626 443148 441967 542955 527130 504775
4659 504775 450883 476486 533528 559267 552361 502077 658265 596965 535898 500325 497612 555795
4647 555795 615366 581641 558335 616094 600607 641092 627428 589631 578633 625631 658659 642725
4635 642725 650765 675118 698566 648013 792306 759094 673282 730288 841713 805571 921273
4624 921273 1063236 920640 984925 934736 947981 988588 1034615 970326 1040318 1011384 908973
4613 908973 974637 943056 946137 904996 852900 862955 821954 849757 793979 833699 810690 824867
4601 824867 826036 851821 842287 834064 836925 909398 895634 940217 1030893 1023765 1168440 1239821
4589 1239821 1273456 1275600 1228505 1365499 1603233 1851567 2056052 2146261 2101652 1914145 1863331
4578 1863331 1668261 1597395 1382447 1302785 1282474 1119299 1103019 1089955 1147768 1061361 1066430
4567 1066430 1041655 1030151 1111792 1181359 1139843 1078339 1126119 1156295 1256561 1505489 1691782
4556 1691782 1907375 2120512 2143402 2120106 1896507 1743564 1566664 1460004 1495712 1330164
4546 1330164 1244928 1188399 1239478 1271041 1213699 1199718 1172508 1151404 1201303 1198296 1117709 1182724
4534 1182724 1111172 1193674 1067801 1160060 1120467 1170534 1236623 1159279 1162990 1076640 1149242
4523 1149242 1099753 1186878 1088278 1111234 1144661 1248613 1264529 1293171 1287448 1282312 1304248 1328389
4511 1328389 1395200 1318724 1437126 1354665 1350292 1394148 1416468 1398252 1405692 1426961 1411514 1461776
4499 1461776 1444852 1399609 1420906 1486231 1572355 1484734 1460163 1518123 1539543 1567152 1555059
4488 1555059 1594385 1620692 1672013 1695266 1640440 1830644 1769966 1893617 1902290 1826045 1855301
4477 1855301 1786493 1844907 1823634 1921726 1910784 1939482 1991693 2017818 1996957 2073576 2093551
4466 2093551 2170449 2166051 2160452 2164357 2245806 2291754 2221314 2365967 2370052 2406304 2408839 2400390
4454 2400390 2487706 2635148 2597867 2650353 2714833 2752697 2761112 2741852 2770664 2856791 2857463 2959785
4442 2959785 2994986 3070677 3020785 3217150 3221562 3258660 3353570 3432766 3525461 3613527 3653394
4431 3653394 3769743 3710340 3825707 3866249 3887649 3998092 4095723 4195900 4220608 4272825 4393611
4420 4393611 4478874 4535491 4594227 4700197 4772814 4919397 4985492 5090818 5122465 5310777 5379823
4409 5379823 5608692 5740462 5932763 5986893 6099486 6275357 6435289 6636109 6715298 6899072
4399 6899072 6890195 7073043 7299455 7552943 7772898 8009802 8201184 8499642 8736257 8946094
4389 8946094 9266585 9498456 9851775 10159331 10533262 10952458 11563550 12286845 13051226 13969186
4379 13969186 15005719 16036744 17276732 18491068 19955076 21963539 24801582 29690550
4371 29690550 38554360 52350034 66258316 74104377 73976876 66700977 57438975 49064966
4363 49064966 42679216 37826845 33964843 31104930 29169032 28091421 27447255 27260678
4355 27260678 27416562 28015081 28850645 30151080 31585123 33501088 35705343 38570797 42398535
4346 42398535 47425563 54922081 66545308 83411818 101604900 115311578 123956670 130720702
4338 130720702 147134808 186484718 244816340 283053070 289111191 270624352 239741790
4331 239741790 206876992 174937365 144374680 117862808 97341923 82721442 73008164
4324 73008164 66600366 61985237 58944848 56903583 55529674 54788999 54758662 55509921 57100536
4315 57100536 59626241 63533513 69860246 79899323 98490688 134517925 192162921 244864424
4307 244864424 264336561 257110780 231303974 200620186 169497032 139611700 112404614
4300 112404614 90534896 74376210 63136832 55568658 49875142 45456418 41862700 38657076
4292 38657076 35652828 32896459 30320186 28303267 26457312 25015822 23557118 22470031
4284 22470031 21655810 20753524 19987567 19142828 18309929 17511002 16883550 16166153 15671906
4275 15671906 15136193 14733601 14304494 13842928 13442133 13083859 12786735 12437023 12032922
4266 12032922 11589594 11297493 11004137 10787003 10448765 10182890 9921791 9694224 9582627
4257 9582627 9282971 9166508 8865068 8693095 8483152 8257932 8007024 7677235 7442867 7322012
4247 7322012 7166874 6998455 6764729 6682373 6499689 6353394 6248480 6132645 6000318 5819205
4237 5819205 5663468 5493768 5398970 5317029 5222103 5126199 4968565 4902590 4800727 4715951 4636118
4226 4636118 4592441 4488421 4302336 4243275 4076707 4023019 3947892 3838194 3745228 3662034 3653513
4215 3653513 3449279 3483621 3395202 3430343 3338940 3244982 3145609 3058107 3013343 2984738 2917168
4204 2917168 2835739 2828467 2747672 2725823 2740611 2662553 2628647 2559546 2495917 2482824 2491772 2359388
4192 2359388 2448743 2261529 2246557 2091541 2140919 2071697 2052420 2051816 2018509 1956681 1959951 1835590
4180 1835590 1905666 1820851 1803479 1810352 1729252 1728015 1648564 1607869 1604126 1529745 1589118 1555392
4168 1555392 1533887 1516318 1483022 1429897 1460259 1403239 1395244 1266858 1214512 1265452 1208934
4157 1208934 1226831 1155106 1243204 1181014 1182597 1207916 1188078 1197170 1235786 1110686 998412
4146 998412 1011188 1072552 1105397 1023515 971586 1007925 1038267 954843 1033918 991316 1037452 961729
4134 961729 943413 914725 874195 960325 832724 925138 868022 873316 836959 920782 871915 871544
4122 871544 872797 927795 857968 940530 1019971 1052282 1114615 1011480 1052780 963766 961573 853452
4110 853452 876734 851914 813391 843025 810973 804301 809910 889073 720966 823961 666109
4099 666109 784614 746228 854351 841137 779419 868469 906355 953269 1059999 1224158 1233063
4088 1233063 1307088 1501428 1688136 1945822 2022665 1962406 1844104 1717212 1457581 1321203
4078 1321203 1227704 1068549 1005678 950277 809481 789026 783209 882860 786724 773258 795640
4067 795640 826294 827606 762312 885863 887334 941619 946909 1217123 1392703 1625164 1803031
4056 1803031 1824082 1762915 1611841 1527202 1308782 1190719 1010457 916248 928580 898939 800667
4045 800667 788152 719307 766234 727837 690792 634911 691163 781760 746738 825048 711610
4034 711610 839477 834295 796900 742356 677302 677575 701172 635790 655765 542140 552414 618292
4022 618292 545042 553755 501941 615907 600445 578304 573888 552623 564317 601567 573895 515208
4010 515208 545342 540648 507601 564868 540188 594307 585282 542189 546797 477673 543786 520305
3998 520305 467067 451105 421811 528600 452339 421717 428552 489157 453098 432535 363440 396999
3986 396999 394996 410014 331519 328470 299892 368790 402661 278688 310838 281395 350770 268587
3974 268587 234418 261874 219251 288401 280312 318388 184015 258692 256920 292286 259685 217508
3962 217508 235855 194483 203635 211342 214445 173807 230479 192659 242021 178567 280991 266503
3950 266503 167749 110354 198907 143765 140470 202093 101011 135693 146949 135465 128501 245431
3938 245431 181421 164510 144602 110077 149808 252117 193476 135759 114458 149696 226077
3927 226077 177732 217894 167825 155120 225078 187836 126648 146600 115106 117385 151648 73773
3915 73773 132930 119897 85979 125802 86464 87417 190754 154114 169967 53855 56247 204410
3903 204410 63679 140216 86059 119843 90477 122142 172652 151841 124389 92998 92806 66829
3891 66829 165854 86173 99519 51216 125355 8803 159881 129992 60978 141888 56907
3880 56907 145434 71106 48233 36919 100253 53746 64650 -1453 100223 101963 31135 70248
3868 70248 132943 144942 112700 46731 75814 157490 99086 108022 74565 65609 69779 64624 56564
3855 56564 38929 80887 113787 106478 -6857 -12299 101337 -1928 14631 55844 68400 16875
3843 16875 54590 72231 46440 58623 73504 125288 -5674 90864 127630 93295 16425 34001
3831 34001 28007 127169 46744 18384 42089 52398 69557 135407 18808 41946 32519 47488
3819 47488 121219 64131 20584 92504 31420 57214 23926 51862 157862 163621 132422 57645
3807 57645 94136 64769 67833 118013 97044 39199 67822 83340 125185 72567 60645 97845
3795 97845 30769 12763 62214 164082 95196 101639 1931 82984 87452 68286 96710 -16408
3783 -16408 52324 33768 5039 79621 66022 97539 -34139 14381 2584 68228 119160 148556
3771 148556 122894 -24762 60796 30090 19949 64505 111114 86517 18245 99065 97169 90764
3759 90764 159715 163006 43981 66437 58612 86256 19041 28228 51047 79489 102697 88754
3747 88754 21912 -6770 74457 3065 90458 51705 2873 45402 34027 146483 75051 22981
3735 22981 47616 34466 -6747 23878 132380 95299 61835 33936 79676 70126 33855 -14044
3723 -14044 65232 51633 38533 11352 -37584 78501 46835 88448 2077 -1256 -22417 129554
3711 129554 60656 61987 46599 4616 107980 61531 82130 52795 129386 29454 59389 -16889
3699 -16889 29865 -4164 68529 85295 -20518 -6451 -56218 7280 19075 89805 49968 75314
3687 75314 -7819 14173 -19921 65752 33865 57801 66513 11214 151129 26476 87316 2544
3675 2544 111158 26323 -2970 73886 27273 82575 39585 107963 -5759 79866 21951 68483
3663 68483 28535 100375 61748 18339 21885 -18267 14604 -16558 103131 69214 94479 105305
3651 105305 147538 142795 114031 164387 121808 68571 133522 133433 106674 152104 102655 103390 70352
3638 70352 59708 62473 86060 139572 75834 84010 73134 127039 141049 246261 200794 216002
3626 216002 72355 44389 60090 96409 26554 45446 49467 88269 55718 55833 32975 38147
3614 38147 96455 116105 69542 117781 52692 96427 98140 103138 72473 76942 42270 11273
3602 11273 84754 -1979 34315 128550 66373 127231 88696 107717 138010 112651 65580 55137
3590 55137 76884 96279 91228 69045 24196 55555 90175 98489 19594 77400 -19436 75937
3578 75937 4765 65734 44757 180829 66715 63922 -18279 17408 34306 109945 79628 -685
3566 -685 -10981 -65512 -5175 107617 30317 21908 19872 -57897 215 -41741 68954 89910
3554 89910 35316 67228 27809 46232 35375 63404 91956 110628 231001 122047 119125 199297
3542 199297 332713 412881 708653 1021136 1072730 1023913 777371 521411 455661 369693 272655
3531 272655 176249 189632 174858 179944 219068 175353 194941 187163 296868 467695 724531
3520 724531 899963 859824 721682 528123 434265 412603 338881 253547 159268 102079 100722
3509 100722 153008 103863 152980 118984 147569 113152 138920 54443 156794 126693 78213
3498 78213 123001 84029 136703 107522 66412 4312 20030 151041 117506 92352 139786 98958
3486 98958 142773 148667 115224 28298 219738 37626 167654 87572 39330 35139 117758 104233
3474 104233 46790 54224 103256 120086 11089 25822 67120 103592 134048 30024 136492
3463 136492 42623 151427 73665 90864 104067 126333 112518 173449 182817 240478 147891 172434
3451 172434 265668 302536 361736 461084 571445 755660 775296 788803 640852 723865 751080
3440 751080 975767 1396584 2413802 3412280 3664454 3281678 2506235 1804998 1252171 966528
3430 966528 693935 552711 369872 346391 291325 338553 477043 395352 384990 197877 279409
3419 279409 248091 213945 234389 219277 210320 168040 230737 191242 148912 239614 247117 206561
3407 206561 172886 201150 105712 147846 181542 173418 186581 150694 207780 186005 269442 299131
3395 299131 300764 234625 293570 333908 400556 425656 345725 297353 234007 194285 139079 53465
3383 53465 94247 96397 55773 88424 51773 98246 87864 78541 98234 16981 59438 24055
3371 24055 75602 38670 8555 25563 30528 1965 21288 30364 43739 -18803 -23994 60201
3359 60201 20909 20146 -23848 32150 -57003 34478 26101 -23075 -20413 -16985 50101 -65984 21949
3346 21949 3799 18993 71281 -69230 42971 47969 75381 -11687 -8917 6138 11189 34240
3334 34240 -14880 -39667 -26035 -55613 -50148 47436 1269 19270 52976 753 -11591 -56407
3322 -56407 -22532 -32982 -16095 -51286 32088 -27806 64583 -3028 -10182 -50127 -16725 50846
3310 50846 -5410 -35882 24329 54390 -32222 3943 15308 -17687 -2527 11185 72693 5519
3298 5519 55390 -30689 -57951 -72846 -36974 -91786 -38055 -82131 -67745 -10439 -44626 -699
3286 -699 60167 -48475 -46958 -34493 27085 -77394 30 5555 -13105 -81698 -80060 -81808 5843
3273 5843 434 55907 -55434 -127714 -39574 46841 -33472 -40390 -18434 -45951 -50367 33081
3261 33081 10808 -74610 -27718 -18112 -2714 18207 -46282 -48096 -73956 -56837 10079 16005
3249 16005 -79077 -47175 -67241 -51866 33457 25030 -31305 -23869 -106496 -48501 -89761 -10892
3237 -10892 -23272 -48248 -86234 -64871 -66843 -80019 -39947 -25337 9362 -1719 -96983 -69181
3225 -69181 -46101 -118551 -99473 -92805 -89420 -31399 -5880 -45738 -28393 -48362 -43699 -14576
3213 -14576 -53003 -36049 -118345 -807 -59290 -111602 -37561 -99747 -27974 -53611 -67391 -65294
3201 -65294 -49196 -27462 -26094 -51525 -55394 -36605 -26171 -63655 -15108 -51748 -69584 -56021
3189 -56021 -72153 -33285 -81723 -49202 -93915 -25348 -55 -107946 -8990 -83513 -1980 -32803
3177 -32803 -24987 -132414 -38415 -102228 4426 -52012 -69008 -102252 -68364 -34093 -77674 -75215
3165 -75215 -30090 -74079 -63525 -21560 -146976 -40990 -96549 -12435 -63854 -17858 -28919
3154 -28919 -31385 -62711 -27246 -16478 -83047 -70618 -47685 -58874 -81994 -47277 -11086 -24225
3142 -24225 -48913 -55793 -59825 -64059 -75611 -29003 -10729 -42157 -84580 -18340 -63881 -82320
3130 -82320 -94473 -86210 -82427 5707 -62250 -17062 -48128 -58340 -10732 77168 -33131 -111891
3118 -111891 9019 -65137 -21814 30488 -6728 -59899 43433 -12026 -72061 -87212 -30928
3107 -30928 -20934 -91130 -92134 -113659 -44081 -137233 -52170 -6870 -7714 -105194 -75520 -40853 -61847
3094 -61847 -59392 -52913 -53200 -84686 -43321 -128197 -80180 -29331 -7487 -34446 -16730 -67399 -100298
3081 -100298 -76914 -64444 44815 -47775 -57293 -110737 -101626 -89855 -158871 -118086 -78439 -97370
3069 -97370 -64748 -96330 -94899 -61129 -26994 -45984 -187094 -132176 -53264 -15978 -19693 -36300
3057 -36300 -14216 -67872 -18744 -74986 32212 -68006 -36689 -64063 -41530 -161813 -34950
3046 -34950 -119470 -96504 -42514 -72276 -43838 -48782 -59072 -67656 -37946 -64922 -16975 -5179
3034 -5179 -41609 -52199 -13355 -38115 24753 -58928 -80522 -46684 -80054 29712 -52770 44907
3022 44907 13824 35852 -36344 10462 -54771 -78514 -60872 -60084 -42548 -66180 -129743 -100752
3010 -100752 17503 -50996 14864 -23514 -66343 -84272 -70736 -28754 1407 79265 -42422
2999 -42422 17341 20496 14604 2801 -26422 21629 -29059 -35770 -50674 -16047 -88738 47624
2987 47624 -70117 -116412 -93748 -133261 -197922 -58925 -84098 -104770 -119364 -146779 -49510
2976 -49510 -101271 34563 -90683 -125147 -36840 -84559 -97651 -131151 -53057 -61519 38911
2965 38911 -41151 -27970 18429 -7135 -93207 -29807 -135743 -119469 -103358 -118489 -114147 -83844
2953 -83844 -45032 -97260 -5486 -33391 -86177 23772 -41812 -10315 4088 -82342 -46465 8554
2941 8554 -51239 20005 -54240 -11681 -32815 -90443 -44026 -159714 -139040 -146115 -75795 -99328
2929 -99328 -36278 -48429 -86093 -72686 -117993 -6482 -21557 33782 -55851 19422 -46844 -2153
2917 -2153 -35369 -75141 -93756 -88003 -80183 -81423 -93550 -49408 -82097 -23566 -131642 -75313
2905 -75313 -9117 -44882 -10933 -18187 -109781 -78036 -47536 -114029 -119054 -41166 -59891 -87767
2893 -87767 -84590 -99221 -126706 -52984 -102732 -63274 -25225 -91254 -79445 -77825 -78586 -32664 -93368
2880 -93368 -81893 -105238 -38803 -11729 -31006 -58459 -58972 -47764 -80422 -71408 -47939 -70450
2868 -70450 -57859 -113016 -100293 -98715 -147016 -158257 -32007 -94843 -55434 -126474 -87656 -93722
2856 -93722 -39841 -115378 -69786 -105079 -107871 -160467 -86803 -112655 32961 -55222 -67043 -68321
2844 -68321 -174916 -64014 11733 -6878 -85905 -34144 -22509 -61584 11090 -76159 -62413
2833 -62413 -37562 -76647 -134530 -121305 -136582 -6730 -24603 -72022 -122580 -123413 -78872 -37499
2821 -37499 -113699 -69015 -117602 -124180 -106325 -61832 -77871 -49473 -18649 -118739 -86046 -199041
2809 -199041 -75946 -62623 -72620 -93426 -2843 -25664 -115538 18096 -68556 -4345 -151824
2798 -151824 -87901 -141452 -114791 -122529 -60683 38181 -39095 -101609 -168615 -81894 -131146 -25756
2786 -25756 -80163 -77644 -69504 -59031 -28622 -60825 -41612 -98917 -85469 -137252 -117536 -112955
2774 -112955 -80412 -105482 -63733 -77876 -30523 -24157 -39562 -54194 -123245 -55007 -78713 -58354
2762 -58354 -89595 -76156 -73473 -107462 -38836 -76620 -57682 -107349 -69090 -28651 -92007 -148262
2750 -148262 -39673 -67951 -19916 -113463 -56528 -64727 2206 -105781 -94335 -116890 -138965
2739 -138965 -118177 -64522 -146217 -113709 -72090 -99713 -50195 -52391 -108930 -83988 -73205 -127260
2727 -127260 -154234 -58849 -74399 -31787 -68389 -44558 -101381 -75514 -142205 -36574 -127620
2716 -127620 -33114 -101908 -97074 -70341 -26145 -31609 -92183 -62269 -200339 -80652 -82751 -68289
2704 -68289 -114277 -54411 -73896 -97366 -124395 -125302 -108328 -105512 -33382 -98282 -138106 -90031
2692 -90031 23217 1527 -55415 -44470 -50125 -95508 -77176 -65714 -113023 -89459 -118964 -130306
2680 -130306 -93974 -116863 -36421 -14755 24653 -13235 -99040 -180066 -52474 -56729 -49699 -107823
2668 -107823 -111608 -121074 -128206 -13232 -25598 2971 -85409 -123326 -62211 -89051 -178939 -180232
2656 -180232 -141069 -19430 -41672 -71397 -192956 -80800 -76991 -81965 -1418 -88979 -45191
2645 -45191 -104250 -92032 -35399 -61457 -12512 -94066 -99451 -25005 -128627 -105541 -55923 15528
2633 15528 -95535 -43801 -14994 -58682 -28988 -129123 -99769 -142997 -146712 -149673 -51429 -128728
2621 -128728 -34837 -50376 -138059 -23576 -12401 -67955 -130582 -72644 -49865 -24568 -35812
2610 -35812 -83915 -73111 -103726 -45515 -83369 -18001 -90320 16606 -84387 -51683 -90656
2599 -90656 -101645 -81495 -114720 -96301 -77342 -13016 -72567 -110102 -124177 -142447 33020 -28502
2587 -28502 -28738 -140362 -75297 -75801 -20821 -68498 -137516 -171418 -68985 -49100 -71182 -91958
2575 -91958 -21096 2919 -28913 -117096 -100577 -67970 -73725 -73236 -102309 -149632 -169578 -134215
2563 -134215 -73922 -98278 -81520 -122586 -179585 -85798 -136837 -84757 -158550 -121706 -166390 -112272
2551 -112272 -82907 -38411 -63076 -68329 -66358 -3869 -134965 -47023 -105178 -90060 -42457 48134
2539 48134 -68743 -69494 -89017 -82548 -143597 -88558 -39281 -107672 -96572 -33688 -126172 17909
2527 17909 -39791 2080 -40610 -123026 -162961 -24594 -30422 -91892 -113464 -84933 -133295 -102544
2515 -102544 -106275 -20930 -90959 -27872 -5508 -77112 -117318 -91745 -100639 -108217 -113448 -139499
2503 -139499 -36239 -69459 -79345 -63852 -38890 -134655 -118957 -103314 -146861 -79042 -134381 -55576
2491 -55576 -178209 -68862 -86595 -107660 -109730 -64766 -78971 -3340 -37518 -46802 -88655 -92969
2479 -92969 -57985 -127293 -66410 -171797 -42365 -27701 -48651 -91772 -135210 -89979 -42559
2468 -42559 -29069 -140769 -58118 -67489 -113030 -132964 -23931 -11496 16248 -8585 -77947 -58861
2456 -58861 -46563 -60141 -90992 -31610 -62438 -72342 -89601 -120327 -15464 -74777 -24645 -8421
2444 -8421 -63801 -72881 -21878 -88371 -119006 -42947 -129910 -22351 -15512 -148451 -121828 -63133
2432 -63133 -27489 -94739 -149587 -121471 -165849 -61846 -91698 -73561 -72351 -129647 -116393 -42763
2420 -42763 -150762 -80561 -48807 -114300 -72605 -151047 -101832 -62065 -58584 -109483 -142672 -110124
2408 -110124 -119847 -95721 -106340 -90594 -92465 -183427 -128889 -146835 -100846 -88587 -117999 -75814
2396 -75814 -137149 -121886 -82776 -98573 -120220 -74211 -118768 -46605 -6372 -109158 -99063 -84402
2384 -84402 -58820 -79715 -51253 -123283 -86313 -64027 -58585 -88140 -117321 -46513 -72853 -138938
2372 -138938 -151334 -91520 -61243 -166787 -80160 -139301 -56601 -68714 24331 -145137 -75909
2361 -75909 -10094 47967 -52459 -10684 26076 8161 -14588 -88714 -36053 -39470 -137775 -20893
2349 -20893 -72513 -90020 -74421 -42869 -44944 -146589 -167808 -192421 -174009 -92034 -149754 -196240
2337 -196240 -199983 -181053 -184216 -207775 -95913 -172487 -139515 -102529 -54841 -52484 -19851 -122516
2325 -122516 -80283 -20877 -30585 -64385 -133922 -19295 -41992 -11739 -49987 -49503 455 -32747
2313 -32747 -90906 -84285 -146218 -278369 -278746 -325190 -350761 -331712 -164664 -124508 -104937 -111290
2301 -111290 -60084 -125897 -4250 22933 -13148 8243 -63114 -89382 -58458 -25014 -82445
2290 -82445 -37052 -67086 -54182 24592 2849 22358 -38619 -27009 -97070 -95592 -96621 -93856
2278 -93856 -94600 -34275 -48841 78750 -64357 -4993 -94506 -36276 -36231 -16676 26287 -21152
2266 -21152 -38019 -66973 -33391 -11964 4793 7457 -71807 -92960 -92747 -11193 10333 62278
2254 62278 16035 21673 24226 -65855 12562 -12592 4561 -50362 43614 -17428 -97867 -77791
2242 -77791 -47535 -59268 -41930 -115040 -148084 -117308 -110174 -136344 -115036 -161961 -116057 -107658
2230 -107658 -144437 -146764 -127427 -60637 -30735 -99037 -129292 -93762 -32463 -118540 -5553 -155114
2218 -155114 -106473 -147166 -19810 -87154 -155601 -165006 -141458 -194807 -156408 -127510 -70579 -94869
2206 -94869 -134043 -75265 -87801 -78482 -41602 -112025 -78081 -103846 -56938 -101409 -72041 -118172
2194 -118172 -29401 -40160 -94880 -46442 -73792 -86446 -123216 -27412 -37394 22387 4528 -75385
2182 -75385 -109326 -52892 -86505 -24503 -43283 -118473 -70613 -69845 63045 -87198 -6607 -62569
2170 -62569 -20576 -117285 1682 39 -24244 -58258 35274 -22435 -52184 -17769 -75290 -46584
2158 -46584 -40818 -15868 -131318 -69482 -142100 -112733 -83731 -128947 -124560 -95745 -133683 -181186
2146 -181186 -163685 -163737 -89277 -113809 -14866 -186095 -74305 -27841 -86922 -56585 -91436 -142956
2134 -142956 -117614 -107516 -104187 -62436 -89848 -150497 -97115 -119975 -39301 -162432 -115227 -147066
2122 -147066 -143748 -256851 -200460 -179584 -163983 -102683 -107105 -56864 -158999 -83564 -173000 -43619
2110 -43619 -197383 -135392 -134023 -86443 -70225 -101539 -36228 -88933 -73576 -77875 -142256 -170544
2098 -170544 -62381 -86670 -30363 -131935 -81717 -82851 -119827 -91399 -67378 -48259 -146319
2087 -146319 -121510 -125936 -58292 -137528 -95306 -109465 -89122 -143817 -42652 -116991 -100228 -32807
2075 -32807 -108413 -53783 -152183 -25519 -73536 8355 -93158 -67801 -77905 -55972 -30877
2064 -30877 -30605 -91732 -138554 -104600 -155550 -138728 -124090 -3263 -66454 -103024 -54544 -86476
2052 -86476 -91509 -117069 -113216 -141104 -8259 -89524 -109581 -105089 -123845 -122791 -92559 -82320
2040 -82320 -131911 -85669 -107667 -154890 -63284 -128499 -154292 -167218 -132502 -132268 -181825 -149940
2028 -149940 -125084 -113279 -123669 -106570 -114652 -87858 -146832 -138971 -81463 -83646 -132228 -67306
2016 -67306 -204263 -167340 -109699 -83374 -108270 -154852 -89267 -96999 -155422 -164661 -110891 -89304
2004 -89304 -79822 -116588 -141559 -167574 -127455 -107236 -87716 -132908 -101539 -97541 -112837 -134481
1992 -134481 -89663 -73115 -54707 -134369 -136732 -41660 -11731 -79201 -49538 -56808 -84959 -138297
1980 -138297 -128783 -138203 -124635 -105698 -174309 -20057 -132028 -142110 -65243 -59031 -21791 -109525
1968 -109525 -133616 -68264 -93975 -34093 -42254 -51467 -85645 -144716 -139203 -120683 -102295 -105862
1956 -105862 -98567 -142635 -157213 -102197 -127249 -87921 -87837 -78363 -70288 -148351 -137031 -110685 -156539
1943 -156539 -64300 -108212 -102199 -72725 -115280 -153536 -116014 -97051 -108125 -121685 -71672 -77926
1931 -77926 -154891 -131592 -110126 -56868 -123633 -151429 -89002 -75275 -38121 -38426 -97672 -169373
1919 -169373 -112018 -26382 -61427 -91347 -64603 -113064 -141218 -140629 -171847 -45912 -86917 -111192
1907 -111192 -128954 -169158 -71486 -139106 -112316 -59736 -147576 -141996 -181553 -104772 -89722 -68259
1895 -68259 -122360 -69647 -78814 -103447 -141800 -98011 -30019 -56782 -124950 -103981 -93571 -54630
1883 -54630 -62033 -44191 -71216 -69998 -133767 -162126 -111151 -135663 -93262 -124663 -79573 -79020 -55090
1870 -55090 -99304 -65729 -133651 -61947 -51726 -45012 -90183 -147019 -153726 -36481 -136306 -145076
1858 -145076 -76145 -98341 -128855 -112641 -165352 -120988 -80093 -100224 -149707 -78944 -93800 -24491
1846 -24491 -89793 -48854 -97660 -50114 -122829 -121896 -101962 -96870 -64132 -124416 -85571 -139756
1834 -139756 -92493 -97743 -90444 -143970 -109461 -94924 -87811 -103968 -102914 -135239 -12199 -9220
1822 -9220 -125865 -106580 -68168 -103028 -92938 -131292 -123035 -144125 -77708 -55400 -94895 -123259
1810 -123259 -119293 -114740 -77462 -131470 -103132 -122659 -97479 -154173 -138180 -104679 -172489 -96827
1798 -96827 -38038 -60853 -76548 -17669 -88879 -76869 -170914 -129634 -84791 -73277 -129466 -126246
1786 -126246 -150880 -148213 -57510 -131979 -115364 -82419 -108168 -128737 -102154 -129335 -113103 -86761
1774 -86761 -148887 -165587 -125233 -27778 -107345 -142816 -127879 18433 -98148 -4230 -138252
1763 -138252 -74299 -114001 -130523 -58259 -84063 -78760 -86295 23001 -93302 -13544 -100285 -93792
1751 -93792 -97098 -87279 -113396 -122731 -50558 -117391 -90806 -116267 21915 -60413 -68652 -66996 -98532
1738 -98532 -153044 -91847 -29388 -103495 -68061 -149582 -56397 -97899 -129201 -113329 -110670 -76976
1726 -76976 -220493 -186589 -172400 -176531 -182707 -171506 -175774 -140584 -141840 -224205 -44992 -145085
1714 -145085 -96553 -200712 -113644 -227030 -126473 -134684 -113978 -158183 -103058 -150816 -111541
1703 -111541 -85523 -112163 -74715 -36207 -133342 -142616 -96600 -154558 -91331 -110316 -155377 -162399
1691 -162399 -198358 -107956 -198993 -120402 -109181 -92662 -63026 -82411 -88389 -85075 -30579 -36125
1679 -36125 -86902 -70289 -102146 -16547 -68257 -70600 -142744 -23558 -132217 -97919 -113912 -91258
1667 -91258 -114893 -67279 -106786 -67523 17282 -8051 -72578 -92250 -29644 -24261 -8586 -53993
1655 -53993 -71912 -13642 -12289 15420 -22863 30039 18172 12323 -26393 -4965 -70248 -14000
1643 -14000 -12403 3540 -35603 -15180 -33529 24914 22490 -37989 -113244 -122019 -93908 -104207
1631 -104207 -103201 -123047 -115771 -111314 -106875 -124548 -138085 -126189 -153562 -168801 -188825 -200185
1619 -200185 -166708 -168802 -210216 -249441 -220715 -140652 -204979 -116555 -164443 -75300 -73895 -73352
1607 -73352 -80477 -89893 -117890 -98345 -164039 -153225 -127898 -119463 -132865 -190441 -130241 -81420
1595 -81420 -134471 -174490 -110853 -98105 -115552 -167240 -201911 -204883 -150424 -223440 -210858 -153925
1583 -153925 -101198 -6302 -6290 3078 6279 28866 -29799 14820 -15073 -54480 -58612 -52269 -38963
1570 -38963 36158 -9137 -9059 -49704 5589 -1776 -38456 -66600 -92645 -89826 -19985 -75653 -57216
1557 -57216 -47814 -138475 -67764 -62151 -88658 -116923 -77919 -10036 -42945 -83456 -84382 -88190 -131676
1544 -131676 -113292 -133365 -103025 -112236 -75722 -10025 -113647 -140111 -127269 -89236 -110920 -100935
1532 -100935 -215291 -196814 -165881 -228774 -132803 -137878 -97828 -111116 -94684 -102851 -160326 -139712
1520 -139712 -165691 -75036 -173233 -44340 -127371 -119012 -129947 -146552 -90977 -59334 -81308 -103534
1508 -103534 -84554 -111672 -98897 -107832 -96801 -121821 -159546 -156451 -198259 -84957 -120544 -82069
1496 -82069 -137387 -87330 -94298 -42390 -57311 -90209 -98872 -59018 -72194 -107658 -174798 -86277
1484 -86277 -92514 -107085 -64867 -111328 -105442 -147372 -43428 -121254 -156743 -34815 -82494 -196065
1472 -196065 -173820 -77902 -140590 -85962 -71394 -44490 -116317 -36218 -142319 -126871 -107847
1461 -107847 -65572 -58641 -80434 -127543 -106850 -43143 -42375 -97384 -120203 -134024 -56820 -79628
1449 -79628 -104530 -209564 -176714 -93335 -98014 -185479 -155474 -122887 -87750 -121321 -143409 -220028
1437 -220028 -158664 -176155 -120523 -172867 -203714 -229141 -84254 -172588 -85940 -103053 -96232 -116592
1425 -116592 -127081 -88428 -193227 -104229 -84800 -113126 -161823 -109421 -68524 -91169 -132216
1414 -132216 -159998 -61745 -157767 -121757 -145284 -101270 -100140 -163583 -184636 -103493 -63717 -100241
1402 -100241 -39245 -150449 -126417 -69610 -124877 -145808 -152338 -88295 -138457 -44817 -90114 -82537
1390 -82537 -101348 -40601 -122494 -89995 -131038 -73209 -64342 -79852 -169510 -114395 -99694 -22031
1378 -22031 -58602 -89985 -79112 -89013 -80033 -83067 -137850 -70735 -95849 -141752 -77342 -82428 -166757
1365 -166757 -135519 -112712 -67009 -39476 -70613 -104149 -160651 -166550 -87902 -76233 -91224 -96113
1353 -96113 -143195 -124262 -67127 -121606 -153753 -48872 -68685 -131746 -66120 -134676 -148871 -107046
1341 -107046 -96090 -139687 -162937 -80888 -79782 -72882 -168838 -102828 -130892 -55871 -102832 -111763
1329 -111763 -69146 -174430 -84057 -184337 -79370 -127241 -117833 -67920 -144045 -66859 -129965
1318 -129965 -137239 -107186 -119890 -74516 -90197 -123025 -143345 -150962 -148208 -107691 -122720 -123507 -58997
1305 -58997 -54309 -80806 -129060 -104022 -116767 -102293 -170310 -174211 -188116 -77355 -48790 -95667
1293 -95667 -94091 -121677 -101547 -99675 -73371 -93771 -134182 -94530 -122071 -164722 -139095 -125440
1281 -125440 -82396 -12768 -49086 -61570 -82381 -94832 -106794 -138892 -146220 -119932 -144086 -155148
1269 -155148 -115153 -115654 -107791 -92902 -106999 -101777 -48050 -60891 -121645 -121122 -116350 -86238 -135520
1256 -135520 -119790 -222587 -152733 -169154 -54958 -67429 -101907 -137034 -103794 -132915 -192705
1245 -192705 -90888 -142159 -77431 -116583 -46213 -101493 -77330 -109227 -124521 -76648 -86212 -73730
1233 -73730 -175104 -95291 -72630 -86386 -44205 -147481 -147695 -102947 -132939 -113327 -179578 -118349
1221 -118349 -98058 -124673 -122567 -59944 -129274 -154363 -89261 -87242 -164718 -124120 -149444 -55108
1209 -55108 -152368 -95863 -180176 -106130 -79135 -109025 -130560 -156884 -107474 -106242 -84791 -183907
1197 -183907 -132937 -124183 -157776 -111091 -100090 -184421 -91280 -41021 -95050 -38095 -67421 -65603
1185 -65603 -87426 -61035 -186825 -138990 -185904 -141987 -124227 -101051 -73229 -158213 -149756 -53483
1173 -53483 -99387 -102358 -114356 -153969 -134588 -102643 -97351 -125955 -133990 -115200 -92654 -111718
1161 -111718 -126778 -103851 -116240 -80121 -86460 -109667 -145128 -139498 -39805 -147824 -155758 -193455
1149 -193455 -141326 -82760 -147659 -58984 -51403 -126473 -61669 -96980 -107911 -116723 -84237 -95248
1137 -95248 -104257 -57827 -155298 -90332 -183138 -17952 -67186 -62696 -78833 -83758 -122844 -69614
1125 -69614 -128501 -114599 -108638 -169363 -58792 -73385 -95164 -75296 4098 -36142 -126323 -52311
1113 -52311 -87584 -107619 -75560 -149787 -121898 -163478 -187219 -149214 -109685 -52343 -107537 -134601
1101 -134601 -84695 -139400 -99840 -99900 -53550 -235663 -138925 -120473 -150467 -114168 -148807 -95267
1089 -95267 -65269 -7595 -106971 -4472 -168469 -24859 -57526 -150940 -98899 -97659 -138692
1078 -138692 -177853 -85738 -132578 -104789 -147673 -98781 -136706 -86787 -59864 -161105 -94080
1067 -94080 -124816 -157396 -224395 -123417 -110832 -114118 -71791 -59054 -111037 -52179 -137927 -96089
1055 -96089 -114918 -125442 -92809 -196267 -127940 -181337 -98760 -206957 -134828 -101924 -152236
1044 -152236 -157499 -113060 -157379 -157284 -191156 -139444 -124947 -176789 -127364 -100681 -108076 -114950 -186136
1031 -186136 -124615 -167645 -92607 -115741 -90655 -144972 -148205 -103556 -122501 -135657 -72474 -95763
1019 -95763 -138934 -210997 -128865 -113558 -84094 -73401 -161356 -162391 -130979 -112507 -103806 -132783
1007 -132783 -86691 -116808 -70344 -114069 -32129 -99505 -82870 -118810 -72740 -154447 -77967 -131824
995 -131824 -93827 -81463 -153447 -137707 -133303 -86627 -88796 -69301 -102244 -128735 -82478 -56922
983 -56922 -147982 -126369 -79232 -82035 -88390 -83372 -137383 -186170 -103188 -158975 -73578 -67315 -153339
970 -153339 -207970 -208535 -146760 -163505 -141936 -171679 -104614 -160580 -99824 -103659 -122328 -10101
958 -10101 -99767 -85555 -113617 -61903 -78514 -81371 -73282 -117376 -69473 -135068 -133345 -154128 -178616
945 -178616 -127445 -76139 -92388 -105476 -132216 -103596 -132275 -104617 -47580 -17643 -47450 -71705
933 -71705 -56219 -61366 -51475 -61895 -71349 -78584 -70611 -94102 -72763 -15352 -53917 -86639 -131977
920 -131977 -142348 -136751 -60320 -107836 -123432 -199323 -104006 -18609 -82626 -35262 -107147 -67833
908 -67833 -112281 -36418 -79836 -149383 -56105 -64798 -46617 -97448 -152091 -80272 -117119 -120638
896 -120638 -95923 -74631 -125840 -132848 -143673 -112581 -151985 -80703 -155219 -157876 -119752 -98593
884 -98593 -90934 -99319 -107890 -69043 -131594 -83766 -123133 -133198 -117137 -143936 -158547 -184647 -155074
871 -155074 -33963 -62592 -56266 -97694 -122146 -148723 -59294 -140436 -103393 -127009 -132942 -91715
859 -91715 -135712 -173972 -163661 -71668 -49757 -68425 -145684 -141056 -75490 -21098 -143417 -131142
847 -131142 -170772 -103501 -102720 -96269 -79324 -68299 -57568 -77567 -90063 -101605 -183178 -107547
835 -107547 -87215 -130931 -67331 -92573 -91514 -84713 -135044 -112536 -184702 -123832 -131109 -66213
823 -66213 -205444 -81005 -124878 -92255 -109749 -107506 -84250 -135859 -111337 -48240 -71512 -26914
811 -26914 -117500 -141329 -97950 -66134 -120239 -72832 -98117 -59391 -96841 -100551 -173139 -31555
799 -31555 -123630 -41716 -90761 -73732 -198443 -84405 -76539 -114338 -96587 -113677 -104877 -118662
787 -118662 -108329 -153283 -80140 -111846 -98660 -108094 -167618 -104923 -81220 -37521 -109510 -54005
775 -54005 -86169 -82534 -118384 -84455 -155132 -101635 -71369 -129524 -146064 -166964 -103330 -188399
763 -188399 -81400 -167899 -139850 -153872 -93383 -63534 -55130 -103535 -151421 -135264 -176827 -20577
751 -20577 -88796 -99016 -172378 -120809 -119339 -90859 -95199 -74691 -57554 -150719 -147922 -151108 -25570
738 -25570 -79999 -59807 -124846 -277460 -71750 -148344 -156415 -139443 -63012 -126743 -101160 -149519
726 -149519 -59197 -187287 -40147 -135871 -177038 -121458 -60279 -93284 -85465 -44918 -44386 -122110
714 -122110 -148582 -93920 -153062 -113071 -117017 -21498 -129585 -162574 -94938 -114106 -135842 -134230
702 -134230 -112605 -129836 -73227 -171181 -13917 -49198 -61912 -85134 -114493 -98100 -70865 -61865
690 -61865 -93265 -95611 -169391 -124477 -118558 -149982 -90746 -48959 -139333 -95825 -95490 -89766 -123737
677 -123737 -110614 -130971 -171554 -147141 -178026 -140569 -171339 -26365 -148223 -92538 -133891
666 -133891 -177708 -78706 -161492 -90810 -71242 -150081 -193632 -158879 -151398 -100058 -110555 -56615
654 -56615 -119424 -124711 -77834 -128045 -165948 -167161 -112928 -203926 -173324 -157459 -82273 -115808
642 -115808 -96676 -87269 -197447 -104905 -115224 -97496 -135861 -126294 -79605 -172859 -181515 -135227
630 -135227 -108918 -76457 -131820 -134741 -96153 -178350 -119397 -151674 -59148 -104464 -78241 -123105
618 -123105 -173182 -169416 -96184 -85041 -158400 -64568 -102308 -154646 -85572 -96652 -98401 -99321 -143755
605 -143755 -202026 -136098 -78275 -104272 -137473 -132735 -157005 -155598 -74064 -151645 -133576 -149998
593 -149998 -100121 -97915 -126459 -94920 -163622 -164328 -102825 -121945 -118696 -179683 -141493 -124996 -135162
580 -135162 -149528 -71111 -58726 -108625 -194190 -58267 -122664 -112463 -39536 -99287 -104260 -139209
568 -139209 -91339 -157785 -70259 -133531 -32740 -137467 -67427 -163419 -107018 -55765 -43460
557 -43460 -117192 -113038 -158298 -79979 -157920 -71522 -79407 -55752 -62640 -69605 -82121 -94824 -76084
544 -76084 -48101 -85024 -119134 -117675 -93794 -103984 -108264 -93048 -139773 -130214 -45553 -96410 -67917
531 -67917 -67443 -66052 -99646 -80069 -161443 -134418 -32256 -124773 -76792 -113687 -128698 -65000
519 -65000 -124532 -168706 -36271 -47904 -60443 -131945 -132239 -75583 -107644 -111078 -69751 -99959
507 -99959 -142422 -180334 -165542 -157038 -94547 -98848 -103318 -138930 -129162 -180174 -150933 -96897 -79706
494 -79706 -169125 -149605 -136149 -101089 -85876 16217 -103825 -108037 -183275 -139596 -129552 -97184
482 -97184 -97191 -69355 -55142 -120203 -75281 -156917 -76204 -14610 -66515 -141863 -189595 -111209 -135894
469 -135894 -39132 -69335 -101687 -108874 -154359 -146561 -149238 -74710 -196920 -100835 -139306 -148825
457 -148825 -170932 -108589 -70802 -52457 -110315 -62962 -109113 -85568 -93212 -1788 -96886 -119481
445 -119481 -60407 -154391 -122942 -154774 -57287 -113272 -13406 -112294 -147986 -159571 -69336 -80462
433 -80462 -203029 -95923 -203210 -119078 -181296 -65416 -107267 -127945 -126162 -140683 -85968
422 -85968 -136634 -86656 -118508 -139291 -198567 -176999 -127725 -86307 -160407 -78878 -168410 -143471
410 -143471 -188295 -152876 -122433 -155601 -160303 -174986 -161829 -122457 -148727 -188993 -139090 -111144
398 -111144 -187832 -148738 -166650 -125010 -149809 -93051 -148751 -150978 -147302 -113516 -139055 -117048
386 -117048 -152138 -142949 -154391 -212700 -178988 -188533 -176235 -76119 -149839 -211248 -144072 -132421
374 -132421 -67235 -108849 -136002 -160717 -146948 -92342 -82744 -43673 -74629 -34671 -144250 -23374
362 -23374 -82477 -72227 -109341 -98212 -100377 -126837 -15861 -72111 -120179 -75192 -114826 -106239
350 -106239 -172597 -115948 -94683 -185496 -128390 -79350 -15689 -51767 -76433 -48656 -97347 -49924
338 -49924 -101244 -77496 -79780 -52052 -57167 -42882 -68582 -2101 -86245 -75094 -87728 -92957 -89288
325 -89288 -137637 -88250 -113182 -135750 -191276 -106752 -106392 -132656 -76003 -3161 -99558 -156175
313 -156175 -109413 -134498 -138164 -162782 -67176 -48154 -155505 -129809 -110917 -202400 -122965 -109779
301 -109779 -196037 -153771 -213585 -151680 -169663 -155365 -69989 -136921 -209771 -229078 -290220 -138383
289 -138383 -179626 -161760 -202100 -179134 -170143 -156962 -134941 -151011 -151465 -170515 -178752 -191592 -217060
276 -217060 -76107 -141868 -54257 -163962 -121912 -121439 -89855 -204876 -177706 -157516 -118249 -191938
264 -191938 -97828 -124172 -132011 -58804 -86764 -91469 -98829 -73596 -138534 -100872 -77953 -118565
252 -118565 -100887 -154055 -40353 -112334 -90007 -113108 -49469 -179869 -83829 -191361 -89192
241 -89192 -91634 -132534 -125558 -108558 -73206 -82632 -111521 -70193 -44361 -142407 -110798 -105102 -61125
228 -61125 -24472 -44902 -80686 -110771 -81177 -100080 -109401 -124327 -24450 -90778 -105295 -127303
216 -127303 -104445 -124843 -70189 -99531 -183384 -167427 -61808 -50105 -85750 -128587 -145620 -84990
204 -84990 -150928 -143017 -142485 -128619 -78646 -150909 -29552 -76805 -119519 -126729 -120180 -175961 -90705
191 -90705 -114765 -151188 -138738 -181768 -170264 -200121 -122000 -135901 -163414 -151433 -78695 -114537
179 -114537 -152609 -131348 -218900 -107304 -131491 -201125 -164326 -131085 -115828 -84453 -130006 -91540
167 -91540 -62707 -68417 -139358 -172986 -165790 -149743 -188591 -150823 -121630 -108318 -217144 -141335
155 -141335 -87317 -128423 -98647 -211342 -113668 -66561 -121972 -172949 -160247 -138583 -162157 -120524
143 -120524 -136268 -111497 -133370 -91227 -97554 -124177 -97393 -116278 -139908 -83835 -116869 -191575
131 -191575 -173154 -153550 -201184 -136554 -198204 -115265 -174008 -127232 -169688 -93745 -172834 -107992
119 -107992 -172376 -166710 -218189 -208453 -193426 -164426 -147440 -160006 -142984 -196709 -103188 -143873
107 -143873 -151509 -163288 -151662 -109965 -201751 -142962 -180859 -100216 -146456 -136359 -152241 -137497
95 -137497 -197606 -117632 -110643 -146382 -155475 -146326 -129204 -270955 -195465 -228204 -175749 -261547
83 -261547 -167035 -130689 -178552 -203330 -236015 -133682 -169321 -242201 -209484 -109950 -114015 -213492
71 -213492 -167921 -126541 -191716 -219511 -147578 -142912 -189870 -159079 -145060 -206779 -186322 -223203
59 -223203 -140570 -161965 -132945 -211342 -211920 -248328 -184876 -197511 -149945 -160410 -187738 -122322
47 -122322 -156339 -173447 -143964 -117653 -111220 -179119 -206485 -193892 -171629 -181812 -122722 -179804
35 -179804 -160372 -215634 -211732 -148718 -192572 -216449 -196720 -192287 -197536 -187320 -189134 -169748 -223850
22 -223850 -197427 -173558 -108262 -155686 -111652 -164491 -178190 -176634 -165068 -164452 -205195 -149404 -228780
9 -228780 -147101 -210120 -178793 -200671 -168095 -177701 -191535 -184662 -149843
0 -149843
$$ Imaginary data points
##PAGE= N=2
##DATA TABLE= (X++(I..I)), XYDATA
16383 -321865 -383530 -384597 -327609 -381581 -333608 -327213 -271582 -296618 -270406 -271980 -276991 -270166
16371 -270166 -283459 -248700 -286416 -273966 -250437 -245551 -217966 -165254 -221993 -173569 -217429 -166203
16359 -166203 -182050 -139126 -150415 -161763 -195713 -133788 -96178 -122689 -102508 -133634 -74954
16348 -74954 -65333 -86571 -68182 -48836 -18308 -20676 -21308 10783 13914 -55886 -3401 -13355 -24149
16335 -24149 23812 -19792 12031 97027 51815 46538 81012 106295 36509 92591 11841 96460
16323 96460 63584 101166 112529 132266 99878 146648 134868 183026 130161 187814 145570 225548
16311 225548 190172 224676 220743 226380 217401 227222 246045 240609 247566 306014 216725 358034
16299 358034 269181 298578 236287 311517 326822 337016 310974 338753 343254 333784 350731 349834
16287 349834 331233 328891 345529 375377 399615 346437 356192 325809 382926 403537 411097 409063
16275 409063 385558 460170 413755 479084 463948 461287 489018 493140 493667 489301 393797 418829
16263 418829 442640 527119 552784 534276 481538 473224 466331 524678 487258 467186 492503 517259
16251 517259 471574 552185 548310 559601 561753 603817 500270 512685 557879 611983 665372 563056
16239 563056 595154 572380 535965 595121 611001 642379 621429 578645 571880 671067 642627 761427
16227 761427 708364 637699 612979 650151 613805 701435 625110 686276 678348 707718 677918 674766
16215 674766 740349 707608 698973 734970 701191 646860 716683 711115 719927 750295 725291 739404
16203 739404 715313 743666 769402 804639 763821 783480 709123 720640 804054 860791 775381
16192 775381 731178 742440 768201 769728 772958 806340 759790 695633 757345 794230 877815 833848
16180 833848 832119 817473 753255 698533 808918 843276 783709 803581 799380 831379 805135 821826
16168 821826 852821 789118 847420 813575 702664 728668 782096 870711 821334 834745 814383
16157 814383 764854 825844 807448 857950 833017 873431 810236 820366 784086 846338 830294
16146 830294 903730 854261 864329 876456 881567 850662 853570 831503 811533 795841 805773 835041
16134 835041 874967 911753 844212 884015 824479 868084 863208 933131 875174 807909 848427 832129
16122 832129 910411 873126 834502 847255 857055 874967 856694 881352 888284 881209 936627 826567
16110 826567 898682 870753 907736 803090 898411 858079 939541 905859 916678 839368 890898
16099 890898 978444 899764 908440 840100 895444 823775 858835 873195 922691 878858 935974 1017714
16087 1017714 900447 1000076 919624 999623 933130 934593 920837 974629 959744 975648 925017
16076 925017 968352 957671 928019 973604 906498 889770 881231 944769 936476 952118 883756 847337
16064 847337 966233 956340 897332 936012 926440 901897 935614 1015534 936839 939447 964025 906597
16052 906597 867368 978185 934515 1027606 863725 936167 902557 924334 988959 951663 946229
16041 946229 924261 901605 891702 945439 915785 931912 889191 928739 907423 874859 1018160
16030 1018160 895913 979546 841105 969743 836989 873999 859044 849384 955787 953885 938983
16019 938983 936926 944434 996101 921680 997293 888029 984052 996520 928879 931965 1038906 962902
16007 962902 968967 951578 906902 877844 879385 933331 990402 940765 895606 980304 981294 894400
15995 894400 950174 963617 908576 907861 908442 955052 993455 950666 970633 958130 916209 965140
15983 965140 933073 956959 919291 983257 916946 898749 939274 899622 998177 956514 955062 918120
15971 918120 996302 941216 931049 895835 938450 955274 935105 969973 968160 859776 911757
15960 911757 960137 1020089 903478 947409 924714 927826 912680 909217 982580 1000299 947330 985753
15948 985753 871046 904505 906642 921388 931822 923719 913900 944199 933366 976446 895233 998016
15936 998016 939536 993629 985806 907526 886215 1052922 939054 939259 906589 929612 908802 945845
15924 945845 960663 976729 967369 938132 857883 925295 973861 963523 996673 925378 888200 957912
15912 957912 992780 969579 902771 934167 1026597 941146 894319 997063 989967 970698 927236
15901 927236 920031 930580 934313 974589 988774 939062 957211 923678 914665 906082 905077 864937
15889 864937 937655 964384 911230 941296 904967 985830 974933 1039549 970690 969298 921490 870916
15877 870916 909808 958621 991179 965548 885800 942263 939626 990986 939089 997912 1018538 1023738
15865 1023738 946504 948428 943574 963017 971928 967796 934521 896361 951216 995389 951067 924213
15853 924213 971602 948898 947219 969239 894208 950022 969595 993557 965754 985311 932966 960599
15841 960599 1054670 1012487 946570 951763 984530 968137 997512 998254 988586 920473 909634 980349
15829 980349 913464 980380 1019831 1034497 1060588 997119 1011514 973791 977467 1013517 967173 959971
15817 959971 927855 959150 977960 956938 986317 989831 989440 965253 1017902 950664 994828 865219
15805 865219 872309 987933 961991 905057 944326 890360 899242 938230 884175 937449 929664 990099
15793 990099 873658 923185 884573 974636 948234 942529 968948 969066 1000831 925363 950319 947058
15781 947058 986226 1029764 1009696 945018 918246 971933 892838 1000244 899056 899811 886565
15770 886565 954355 875385 882988 1006117 921565 928877 914459 999789 1027679 1035919 955790 970744
15758 970744 950055 964681 936671 1021297 970407 924157 1007023 924921 988930 993331 985100 955622
15746 955622 1012227 899248 960358 984908 1002097 1002508 957012 1064173 981501 1013051 948748
15735 948748 956343 937652 990636 1003423 964176 906886 912444 895018 964876 962623 899054 952645
15723 952645 949849 963608 1019300 984140 986097 929910 887598 926964 1007524 969422 1030523 953270
15711 953270 931578 875507 953125 1018318 954370 1039159 892608 942613 948515 923092 1015895
15700 1015895 964816 902709 908440 909963 932021 970893 1087109 878771 1056110 962233 974398
15689 974398 957752 1009476 961161 942299 931308 947083 965510 947932 951125 998697 993289 977970
15677 977970 999440 990063 997144 962767 965703 1008396 902454 954370 899313 1006738 923732 919469
15665 919469 1038793 1066172 943936 963856 1002469 974175 960843 950439 971060 941193 986099
15654 986099 1004005 1006328 1010265 995594 967177 1023179 1023853 960402 983566 939091 919934 991379
15642 991379 891260 910729 989557 976887 968218 905139 841902 930205 1038476 934681 911826
15631 911826 967629 1017532 982448 1039978 883514 992930 971192 986094 957774 957446 960428 950946
15619 950946 942704 927515 969003 899202 983870 959221 950770 894143 987636 954915 947971 973912
15607 973912 983294 965209 973995 1023078 883623 1028237 979477 905648 940557 957106 956431 969820
15595 969820 1016531 934127 981285 940039 969636 941975 934714 1063189 990931 998310 932923 921852
15583 921852 989877 1003940 978005 928484 987994 974461 927979 974342 997460 1084819 1029153
15572 1029153 1005762 997513 927157 999937 913513 927543 952492 969212 993711 1041517 1050079 971263
15560 971263 1043343 952518 933584 1020782 961736 905737 912539 1032239 947153 1035601 992288
15549 992288 955932 995324 993558 964430 1082115 1060734 942639 881738 995279 970646 1002295
15538 1002295 1028371 937132 981493 984424 1021822 1023855 1085661 1057858 942015 958630 1012706
15527 1012706 1052590 982976 1057778 1006798 969091 906946 1040444 993399 996824 944409 994231
15516 994231 1035276 969661 1023696 944964 1075352 989860 933747 1013871 1028943 911617 1023747
15505 1023747 933307 1011595 1030787 951082 931425 974452 996875 1007589 997323 1009541 993365
15494 993365 1005025 1060824 1032757 1078718 1007665 951494 960583 1017456 1012803 1017694 1022435 946097
15482 946097 1041091 952723 1025160 1048075 1019364 1032724 907314 909305 998351 1018336 1005238
15471 1005238 1017081 1057168 973153 999459 967783 1041837 1079414 1069466 999565 985824 1037824
15460 1037824 1012273 1002648 1025305 977679 1035266 988836 1033186 952855 1005218 980330 972700 993266
15448 993266 980345 997544 1014712 1047743 978203 995851 1003032 977129 979818 946771 1011582 1055820
15436 1055820 1070476 923800 944866 930751 900778 1081464 983462 992123 1023446 986968 1033470
15425 1033470 1155442 1038190 1001400 986728 997447 965574 1020174 1012543 1059130 1000549 977038
15414 977038 977672 1040720 1021871 1017101 948308 1015355 1027658 975609 980777 984430 933076 945225
15402 945225 1001398 945285 1055603 1012242 1021426 958725 994129 976419 989376 991582 968176 997937
15390 997937 989119 1034865 1024329 1011181 1014959 1061103 1000001 1044112 1000158 974705 986487 932838
15378 932838 962484 984294 1031490 1014714 1010251 1005189 1060262 1016056 1060613 1028015 1058993 1000174
15366 1000174 973471 897935 973705 1019145 994290 1030157 1006146 1036220 1022756 969580 1025507
15355 1025507 1002030 981884 1001760 1015223 956503 998289 1057449 1030855 1044453 1008962 1029586
15344 1029586 1022493 1005286 994486 1053096 932750 929819 959903 930617 1014023 1010244 979357 1026597
15332 1026597 1040870 1027531 977378 1028189 1004374 1031725 1037940 1008060 982105 958975 1024617
15321 1024617 967630 1027623 1077862 1046555 1067524 1008746 1042690 1034976 1053341 981451 1053147
15310 1053147 1014881 1027152 977968 995247 1016424 1066108 1045077 994761 998586 1013800 1097563
15299 1097563 1014209 1012075 1013990 1024902 996936 1031401 999566 1064230 1143956 1040160 1041807 966495
15287 966495 1038408 1050775 1065723 1077390 1064519 984673 1070174 1020108 994532 1054121 1064176
15276 1064176 1069825 1042038 1034004 1059304 1079015 988041 1105599 1001975 1042180 967308 998232
15265 998232 1021805 1007796 1031132 1054895 1012464 1018840 1024865 1035400 1076621 992968 911985 1029651
15253 1029651 1022454 1085766 974293 1053810 1041968 1046801 1045785 1052606 1068322 1011812 1004405 985160
15241 985160 990573 934578 1055045 990148 1050077 1010181 1079184 1039305 1036542 1040291 1090053 1049537
15229 1049537 1014582 1036379 1050078 1003485 1028138 1044540 1042874 997031 1062224 1001806 1056105
15218 1056105 1113858 1045646 1023343 1035012 1006053 1040396 1007190 1047465 976961 999277 1071446
15207 1071446 1043189 1031444 1047009 1039229 1005875 979133 953339 983670 1028499 1021889 1056013 1078519
15195 1078519 1110982 1008114 1043185 1039784 1052063 1006947 1030506 1042357 1027862 921978 1003113
15184 1003113 1005103 995231 976517 1049067 1018079 1053276 959239 987813 979487 1032383 947802 971153
15172 971153 1013757 1071512 1044094 1102180 1155630 1099397 1069001 1055134 1020073 1010352 1041054 1002255
15160 1002255 1076125 1136188 1024400 1018860 1052241 1050250 1129091 1110978 1034139 1113888 1074292
15149 1074292 1003405 1047457 1064215 1042167 1035304 1090693 1025679 1107729 1111712 1056244 1171863
15138 1171863 1127373 1143957 1097572 1055686 1020694 1038008 1037363 1105080 1090249 1115324 1145431 1138651
15126 1138651 1058696 1116473 1118572 1130606 1102920 996199 943207 1023330 943514 1026742 1013162
15115 1013162 1057646 1041086 1091909 989834 1066770 975875 978016 985468 979573 962339 941955 982413
15103 982413 1023571 1085661 1018219 1019544 1116644 1050466 993573 1027604 1125343 1012743 1050679
15092 1050679 958595 950872 1051002 1024241 999695 956828 909341 891903 838664 808980 889279
15081 889279 893655 961650 960706 966442 967351 949181 1009998 977687 990888 1050056 1162000 1117301
15069 1117301 1231898 1092138 1211664 1101937 1089196 1035948 1066018 1133442 1178614 1151892
15059 1151892 1120512 1115113 1131273 1102855 1057960 1075632 1020805 1045875 1056777 1064605 1020126 952782
15047 952782 1004843 986917 1023871 1077561 1164637 1184833 1120407 1169578 1166243 1164292 1154531 1195767
$$ [...]
##END NTUPLES=NMR SPECTRUM
##END=
