##TITLE=abcd
##JCAMPDX= 6.0         $$ Bruker NMR JCAMP-DX V2.0
##DATA TYPE= NMR SPECTRUM
##DATA CLASS= NTUPLES
##ORIGIN= UXNMR, Bruker Analytische Messtechnik GmbH
##OWNER= root
$$ XWIN-NMR		Version 3.5
$$ Tue Apr  7 19:27:12 2026 Russian Standard Time (UT+4h)  servis@DPX200
##.OBSERVE FREQUENCY= 200.131235884673
##.OBSERVE NUCLEUS= ^1H
##.ACQUISITION MODE= SIMULTANEOUS
##.ACQUISITION SCHEME= undefined
##.AVERAGES= 32
##.DIGITISER RES= 18
##SPECTROMETER/DATA SYSTEM= spect
##.PULSE SEQUENCE= zg
##.SOLVENT NAME= CDCl3
##.SHIFT REFERENCE= (INTERNAL, CDCl3, 0, 16.4885)
##AUDIT TRAIL= $$ (NUMBER, WHEN, WHO, WHERE, WHAT)
$$ ##TITLE= Audit trail, XWIN-NMR		Version 3.5
$$ ##JCAMPDX= 5.01
$$ ##ORIGIN= Bruker BioSpin GmbH
$$ ##OWNER= servis
$$ F:\spectra/data/av/nmr/H1/1/pdata/1/auditp.txt
$$ ##AUDIT TRAIL=  $$ (NUMBER, WHEN, WHO, WHERE, WHAT)
(   1,<2026-04-07 19:24:44.70 +0400>,<servis>,<DPX200>,
      <created by zg, POWCHK disabled, PULCHK disabled
       configuration hash MD5:
       00 E9 B6 7A A2 85 ED C7 34 08 36 98 17 FE 4E 26
       data hash MD5: 32K
       05 D5 CC 76 71 14 E8 42 83 1B 85 96 BD BB 7F AD>)
(   2,<2026-04-07 19:26:36.81 +0400>,<servis>,<DPX200>,
      <Start of raw data processing
       efp BC_mod = 2 LB = 0.05 FT_mod = 6 PKNL = 1 PHC0 = -182.5018 PHC1 = -0.898437 SI = 16K 
       data hash MD5: 16K
       3E 6A 70 BB 0C F1 BA 83 1D E7 24 E9 5A F0 B6 24>)
(   3,<2026-04-07 19:26:49.15 +0400>,<servis>,<DPX200>,
      <pk PHC0 = 5.2 PHC1 = 0 
       data hash MD5: 16K
       F6 2E 92 E9 1D 5A 4C 91 D6 26 D2 42 6A 52 70 A9>)
$$ ##END=
$$ 
$$ hash MD5
$$ DB 9A 21 5E 55 F8 E4 41 40 D6 B2 12 57 70 D7 87
##$RELAX= 
##$RELAX= 
##$RELAX= 
##$RELAX= 
##$RELAX= 
##$RELAX= 
##$RELAX= 
##$RELAX= 
$$ Bruker specific parameters
$$ --------------------------
##$DU= <F:\spectra>
##$EXPNO= 1
##$NAME= <H1>
##$PROCNO= 1
##$TYPE= <nmr>
##$USER= <av>
##$AMP= (0..31)
100 100 100 100 100 100 100 100 100 100 100 100 100 100 100 100 100 100 
100 100 100 100 100 100 100 100 100 100 100 100 100 100 
##$AQSEQ= 0
##$AQ_mod= 1
##$AUNM= <au_zg>
##$AUTOPOS= <>
##$BF1= 200.13
##$BF2= 200.13
##$BF3= 200.13
##$BF4= 200.13
##$BF5= 500.13
##$BF6= 500.13
##$BF7= 500.13
##$BF8= 500.13
##$BYTORDA= 1
##$CFDGTYP= 0
##$CFRGTYP= 5
##$CHEMSTR= <none>
##$CNST= (0..31)
1 1 145 1 1 1 1 1 1 1 1 1 1 1 1 1 1 1 1 1 1 1 1 1 1 1 1 1 1 1 1 1 
##$CPDPRG= <>
##$CPDPRG1= <>
##$CPDPRG2= <>
##$CPDPRG3= <>
##$CPDPRG4= <mlev>
##$CPDPRG5= <mlev>
##$CPDPRG6= <mlev>
##$CPDPRG7= <mlev>
##$CPDPRG8= <mlev>
##$CPDPRGB= <>
##$CPDPRGT= <>
##$D= (0..31)
0 2 0 0 0 0 0 0 0 0.06 0 0 0 0 0 0 0.0002 0 0 0 0 0 0 0 0 0 0 0 0 0 0 
0 
##$DATE= 1775575484
##$DBL= (0..7)
120 120 120 120 120 120 120 120 
##$DBP= (0..7)
150 150 150 150 150 150 150 150 
##$DBP07= 0
##$DBPNAM0= <>
##$DBPNAM1= <>
##$DBPNAM2= <>
##$DBPNAM3= <>
##$DBPNAM4= <>
##$DBPNAM5= <>
##$DBPNAM6= <>
##$DBPNAM7= <>
##$DBPOAL= (0..7)
0.5 0.5 0.5 0.5 0.5 0.5 0.5 0.5 
##$DBPOFFS= (0..7)
0 0 0 0 0 0 0 0 
##$DE= 6
##$DECBNUC= <off>
##$DECIM= 32
$$ [...]
##$SUBNAM4= <"">
##$SUBNAM5= <"">
##$SUBNAM6= <"">
##$SUBNAM7= <"">
##$SUBNAM8= <"">
##$SUBNAM9= <"">
##$SW= 20.6817932712277
##$SWIBOX= (0..15)
0 0 3 0 0 0 0 0 0 0 0 0 0 0 0 0 
##$SW_h= 4139.07284768212
##$TD= 32768
##$TD0= 1
##$TE= 0
##$TE2= 300
##$TE3= 300
##$TEG= 300
##$TL= (0..7)
0 120 120 120 120 120 120 120 
##$TP= (0..7)
150 150 150 150 150 150 150 150 
##$TP07= 0
##$TPNAME0= <>
##$TPNAME1= <>
##$TPNAME2= <>
##$TPNAME3= <>
##$TPNAME4= <>
##$TPNAME5= <>
##$TPNAME6= <>
##$TPNAME7= <>
##$TPOAL= (0..7)
0.5 0.5 0.5 0.5 0.5 0.5 0.5 0.5 
##$TPOFFS= (0..7)
0 0 0 0 0 0 0 0 
##$TUNHIN= 0
##$TUNHOUT= 0
##$TUNXOUT= 0
##$USERA1= <user>
##$USERA2= <user>
##$USERA3= <user>
##$USERA4= <user>
##$USERA5= <user>
##$V9= 5
##$VALIST= <valist>
##$VCLIST= <CCCCCCCCCCCCCCC>
##$VD= 0
##$VDLIST= <DDDDDDDDDDDDDDD>
##$VPLIST= <PPPPPPPPPPPPPPP>
##$VTLIST= <TTTTTTTTTTTTTTT>
##$WBST= 1024
##$WBSW= 30
##$XGAIN= (0..3)
0 0 0 0 
##$XL= 0
##$YL= 0
##$YMAX_a= 80643
##$YMIN_a= -91807
##$ZGOPTNS= <>
##$ZL1= 120
##$ZL2= 120
##$ZL3= 120
##$ZL4= 120
##$ABSF1= 0
##$ABSF2= 0
##$ABSG= 0
##$ABSL= 0
##$ALPHA= 0
##$AQORDER= 0
##$ASSFAC= 0
##$ASSFACI= 0
##$ASSFACX= 0
##$ASSWID= 0
##$AUNMP= <proc_1d>
##$AZFE= 0.1
##$AZFW= 0.1
##$BCFW= 0
##$BC_mod= 2
##$BYTORDP= 0
##$COROFFS= 0
##$CY= 18.4799938201904
##$DATMOD= 1
##$DC= 0
##$DFILT= <>
##$DTYPP= 0
##$F1P= 9.9274215381318
##$F2P= -0.165520771350173
##$FCOR= 1
##$FTSIZE= 16384
##$FT_mod= 6
##$GAMMA= 0
##$GB= 0
##$INTBC= 1
##$INTSCL= 4.127829e-11
##$ISEN= 128
##$LB= 0.05
##$LEV0= 0
##$LPBIN= 0
##$MAXI= 10000
##$MC2= 0
##$MEAN= 0
##$ME_mod= 0
##$MI= 50
##$NCOEF= 0
##$NC_proc= -7
##$NLEV= 6
##$NOISF1= 3.799351
##$NOISF2= 2.8
##$NSP= 0
##$NTH_PI= 0
##$NZP= 0
##$OFFSET= 16.48848
##$PC= 4
##$PHC0= -177.3018
##$PHC1= -0.898437
##$PH_mod= 1
##$PKNL= yes
##$PPARMOD= 0
##$PSCAL= 4
##$PSIGN= 0
##$REVERSE= no
##$SF= 200.130005582386
##$SI= 16384
##$SIGF1= 3
##$SIGF2= 2
##$SINO= 400
##$SIOLD= 16384
##$SREGLST= <1H.CDCl3>
##$SSB= 0
##$STSI= 16384
##$STSR= 0
##$SW_p= 4139.07284768211
##$SYMM= 0
##$S_DEV= 0
##$TDeff= 32768
##$TDoff= 0
##$TI= <>
##$TILT= no
##$TM1= 0
##$TM2= 0
##$TOPLEV= 0
##$USERP1= <user>
##$USERP2= <user>
##$USERP3= <user>
##$USERP4= <user>
##$USERP5= <user>
##$WDW= 1
##$XDIM= 16384
##$YMAX_p= 272512612
##$YMIN_p= -2019156
$$ End of Bruker specific parameters
$$ ---------------------------------
##NTUPLES= NMR SPECTRUM
##VAR_NAME=  FREQUENCY,     SPECTRUM/REAL,   SPECTRUM/IMAG
##SYMBOL=    X,             R,               I
##VAR_TYPE=  INDEPENDENT,   DEPENDENT,       DEPENDENT
##VAR_FORM=  AFFN,          ASDF,            ASDF
##VAR_DIM=   16384,         16384,           16384
##UNITS=     HZ,            ARBITRARY UNITS, ARBITRARY UNITS
##FACTOR=    0.252644378177508, 1,           1
##FIRST=     3299.83951724647, 0,            0
##LAST=      -839.233330435636, 0,           0
##MIN=       -839.233330435636, -2019156,    0
##MAX=       3299.83951724647, 272512612,    0
$$ Real data points
##PAGE= N=1
##DATA TABLE= (X++(R..R)), XYDATA
$$ [...]
9369 910443 832242 899762 954086 979366 1004282 1064781 1166696 1174718 1268152 1261056 1395197 1569441
9357 1569441 1487397 1626786 1676510 1652412 1645301 1673866 1796339 1936686 2103880 2179815 2210883
9346 2210883 2095347 1976530 1885758 1832349 1871095 1876317 1909755 1948765 1882722 1837169 1895130
9335 1895130 1867079 1882997 1843601 1847413 1942960 1935209 1835927 1865849 1898210 1754959 1803853 1893759
9323 1893759 1898238 1890722 1935585 1952458 1965379 2028190 2189831 2327175 2461438 2507745 2482388
9312 2482388 2436600 2437714 2441376 2513427 2575307 2582435 2475453 2488017 2461999 2384262 2393784 2331116
9300 2331116 2378906 2362274 2297261 2256078 2255563 2299421 2351737 2328161 2427631 2486669 2516516 2709559
9288 2709559 2867685 3071786 3343976 3686308 4413088 5111442 5878839 6233923 6318512 6607552
9278 6607552 7035069 7308917 7302931 6914645 6719432 6533164 6500046 6492719 6218835 5855117
9268 5855117 5333362 4871913 4276809 3883645 3463865 3229791 3115191 3019417 2831941 2844634
9258 2844634 2888254 2892504 2970505 3077836 3320430 3434776 3739207 4132961 4480937 4882877
9248 4882877 5265536 5502255 5656138 5831323 6212262 6619865 7182042 7800586 8276157 8277407
9238 8277407 7823871 7124192 6336119 5772161 5253798 4840734 4506380 4219633 3929865 3740572
9228 3740572 3544246 3296120 3326001 3257356 3149719 3159585 3202198 3296221 3329945 3411776 3572265
9217 3572265 3622327 3730709 3736489 3736460 3914152 4032192 4261521 4647321 5251165 5924566 6642823
9206 6642823 6830943 6740105 6195035 5535563 4919681 4401616 4078793 3672926 3311962 3293062
9196 3293062 3099524 3087674 3159457 3215260 3110137 3074704 3087560 3120690 3061083 3014139 2998017
9185 2998017 3094552 3176991 3205534 3404423 2866787 3010492 3010051 3096227 3208926 3435454 3654595
9174 3654595 3808097 3922481 3827534 3584111 3428453 3205854 3166341 3022892 3054873 3032308
9164 3032308 3105755 3069678 3231114 3267379 3421165 3521081 3564050 3581832 3522172 3501513 3548507
9153 3548507 3509126 3419611 3481382 3521389 3580218 3557422 3625316 3621151 3561925 3638816 3662698 3592466
9141 3592466 3621033 3570598 3743881 3723230 3842713 3997450 4053974 4195904 4269159 4393603
9131 4393603 4635304 4803814 4899050 5046218 5171443 5428311 5529470 5540628 5608515 5854631
9121 5854631 5907690 6174590 6395681 6534523 6802282 6954028 7186993 7248697 7454368 7626850
9111 7626850 7691434 7688252 7676994 7581649 7564087 7577527 7607316 7715407 7939720 8147825 8433979
9100 8433979 8707192 9023180 9484641 9929124 10508135 11250831 11942981 12748179 13782088
9091 13782088 14790252 16274844 18522168 23710647 31178096 36467271 35700489 29543946
9083 29543946 25808922 23918892 23277105 23320915 23915911 25068158 26542256 27695490 28166241
9074 28166241 27891568 27531863 26924741 26177622 25608781 25467196 25565615 25674680 25684530 25704077
9064 25704077 26143558 27205249 29047813 31776911 35460166 39420453 43307534 46367700
9056 46367700 48212741 49237468 50049712 51224146 53172448 56340978 60197400 63874122
9048 63874122 66571368 68812954 71723743 76521377 82732259 87838851 88790219 85132720
9040 85132720 78688032 72294924 67394973 64015099 61859503 60586617 60372017 60519977
9032 60519977 61316261 63505480 67276804 72553039 78552018 84688007 91784784 100554863
9024 100554863 110258121 116498886 115491887 106626851 93748840 80902705 70175728 62265561
9016 62265561 56517614 52635107 49816459 47202745 44461665 41151816 38147251 35556488
9008 35556488 33640457 32430632 31990823 32246325 32938535 33397188 33332859 32936033 32962661
8999 32962661 33425275 33997384 34475733 34588246 34576977 34706474 34902066 35364822 35862916 36228823
8989 36228823 35995643 34405868 31702898 28686099 26299182 24481783 23347736 22462017
8981 22462017 21988923 21791324 21487996 21167345 20387782 19273521 18212769 17246530 16568798
8972 16568798 15988722 15514713 15083062 14550400 14285671 13988947 13730573 13653852 13456054 13324412
8962 13324412 13053240 12764020 12545157 12160796 11899454 11628692 11364496 11061204 10771953
8953 10771953 10297971 10045307 9709505 9489759 9267600 8958621 8715500 8464871 8326217
8944 8326217 8050708 7968984 7795325 7577873 7300454 7045752 6838293 6685505 6605631 6596104
8934 6596104 6631457 6640566 6699218 6920128 7012153 7192582 7502159 7703075 8324881 9028439
8924 9028439 9878976 10429597 10731250 10364722 9828470 9114600 8440342 8021210 7750873 7519681
8914 7519681 7322274 7079737 6706639 6270296 5893388 5525447 5210320 4860679 4674454 4562503
8904 4562503 4410293 4352035 4246293 4213727 4263577 4359370 4453527 4502937 4613469 4758459 4880846
8893 4880846 5250072 5564833 5657429 5873170 5692466 5372176 4990332 4521904 4085576 3884975
8883 3884975 3686044 3629615 3422387 3275878 3111572 2871051 2718702 2581411 2543178 2298588
8873 2298588 2302819 2204865 2108879 2017449 1934784 1873992 1824440 1764483 1701999 1657464 1629975 1555872
8861 1555872 1500151 1517204 1421560 1369846 1387537 1319294 1293411 1289420 1244657 1252192 1162884 1107120
8849 1107120 1121991 1020035 1097354 1022981 992954 970799 936171 952405 952780 899431 833758 800480
8837 800480 804297 731363 774194 733061 796576 815203 721986 583846 638878 650332 676874 658029
8825 658029 608809 619667 608360 616651 505044 571043 596852 522409 551806 550928 535082 534710
8813 534710 572759 495537 406857 485326 466086 454758 526876 473820 520349 480586 451203 459908
8801 459908 367709 386668 406867 395436 386838 417995 476889 412913 417973 441263 391519 466765
8789 466765 463139 514654 607279 1741483 -202840 96801 117454 170490 226797 215953 223680
8778 223680 276769 225772 304236 276034 357486 420090 347109 369355 318940 379677 366947 308467
8766 308467 366632 421228 392830 437958 431835 471074 399997 441361 367709 401274 394203 416498
8754 416498 433421 453412 384770 364125 384810 411247 377905 395796 411078 318319 351073 378566
8742 378566 389848 420761 420023 396734 447749 392869 423151 501500 423006 451518 512141 478156
8730 478156 502558 483445 445274 493556 519855 486695 480530 531839 512465 605435 497527 516996
8718 516996 429331 410258 379768 404914 403717 426655 411969 313096 388048 328033 342261 297590
8706 297590 325216 299595 300836 239598 363956 253585 316817 293706 264659 290755 200558
8695 200558 297482 286960 369492 341737 275028 304816 317277 317538 347946 310988 257480 229847
8683 229847 307733 221872 251018 247040 263300 201984 127516 255529 202102 118870 158589 217010
8671 217010 248851 260821 269964 198410 194951 172593 77503 110885 121564 165052 28609 39021
8659 39021 65622 81051 22472 13326 18314 23476 18507 28744 117462 34559 16812 41155 53498
8646 53498 19654 26918 39099 -6200 15802 -39910 62560 19104 70452 43659 51864 63300
8634 63300 -24080 -7386 45056 -24242 60552 69655 38595 36909 -6146 -18416 -35992 50523
8622 50523 -9160 49292 1484 8365 -8331 34540 -7822 53615 -32167 71419 78750 79012
8610 79012 21367 -49401 -21694 -18148 37130 -128266 -47926 -31562 -5145 -33806 -17758 -59658
8598 -59658 17402 -48412 9557 -17725 -69896 -41574 -46478 -114723 -25035 -19165 -44849 -82880
8586 -82880 -137368 3419 -119865 -47030 -82733 -81829 -31102 -62133 -43026 -145896 -17779
8575 -17779 -82679 -89988 39439 -36442 -522 -24203 -80449 34405 -120638 -22205 -125232
8564 -125232 -65607 -42032 -109662 -49322 -74550 -75987 -40807 -32486 -101748 -72456 -92729 -155989
8552 -155989 -103466 -70885 -123133 -133566 44286 -46559 -45919 -61490 -39088 -18302 -7976 -32313
8540 -32313 48095 -75153 -72479 1049319 -2019156 -490931 -271859 -234383 -165998 -80238
8530 -80238 -122258 -117669 -159775 -97326 -50502 -117582 -64328 -109800 -216023 -122765 -153214 -121657
8518 -121657 -92772 -84950 -163352 -67505 -65488 -72705 -163857 -112440 -56942 -161461 -187807 -92957
8506 -92957 -143761 -163832 -69561 -116170 -82349 -163070 -33319 -123245 -102913 -61635 -111675 -172541
8494 -172541 -73674 -98430 -154903 -138518 -66568 -119669 -58422 -102255 -147635 -117453 -105988 -148589
8482 -148589 -102223 -38297 -123881 -45523 -87595 -202300 -141212 -94150 -149027 -91672 -108026
8471 -108026 -66403 -69461 -175502 -93874 -148469 -67013 -121374 -106739 -59127 -77481 -121624 -117045
8459 -117045 -23608 -105387 -92367 -153184 -156538 -39932 -77041 -135017 -126742 -65129 -97455 -151000
8447 -151000 -60699 -114479 -95469 -88468 -146884 -80081 -105215 -82877 -141375 -151146 -152946 -187489
8435 -187489 -110621 -148306 -112598 -102090 -123538 -85491 -81500 -117282 -136329 -127183 -134097 -133526 -134669
8422 -134669 -105411 -44977 -91675 -104445 -68537 -36250 -60813 -124352 -119746 -164348 -70774 -90337
8410 -90337 -74095 -33070 -189650 -154340 -124232 -130870 -157997 -50979 -102507 -145489 -151661 -112757
8398 -112757 -130824 -70451 -135608 -125328 -70960 -143718 -90636 -112132 -206330 -57920 -76803
8387 -76803 -153366 -102880 -100999 -114222 -113597 -132233 -172554 -102311 -176711 -89533 -167571 -68699
8375 -68699 -155167 -94351 -261321 -103078 -46913 -217913 -136735 -129821 -148529 -116498 -134631
8364 -134631 -73587 -114312 -125802 -93779 -125039 -42217 -92983 -66773 -150339 -152384 -132081 -115221
8352 -115221 -100546 -77405 -89533 -115351 -91933 -59115 -152012 -91575 -189424 -40963 -41219 -74475
8340 -74475 -206713 -137432 -160069 -80466 -93124 -163951 -139005 -162346 -173715 -134203 -132840 -106729
8328 -106729 -8816 -104762 -87255 -153020 -125900 -107021 -161190 -54949 -204789 -87225 -82529
8317 -82529 -170892 -116294 -43148 -102983 -168130 -128250 -123753 -185713 -151941 -63779 -147189 -108180
8305 -108180 -198330 -130137 -92884 -151104 -91467 -216189 -136155 -138538 -111573 -182434 -270616 -128804
8293 -128804 -36670 -97648 -18894 -160732 -64719 -103428 -46054 -130261 -126294 -150869 -221919 -119361
8281 -119361 -4652 -242921 -238560 -241151 -47657 -201616 -147246 -66177 -124502 -133580 -164101
8270 -164101 -84231 -139619 -60147 -96964 -167143 -211399 -124966 -149612 -136674 -123320 -119892 -100593
8258 -100593 -42117 -13364 -82882 -127929 -62065 -80346 63625 -25528 -106352 -28386 -124410
8247 -124410 -178565 -67696 -97809 -90927 -239680 -140468 -69529 -132120 -101030 -5878 -146571
8236 -146571 -142370 -188109 -97896 -98679 -112414 -269010 -105868 -107629 -134072 -86149 -165312 -147879
8224 -147879 -186465 -135079 -222680 -164465 -27256 -398138 -117949 -11428 -13247 416 -151106
8213 -151106 -81547 -30129 -135613 -153592 -74246 -145644 -68190 -30754 -106700 -19451 -72104
8202 -72104 -192296 -159544 -129775 58965 227461 -154828 258328 -400800 -469652 389075
8192 389075 1627513 -682158 -333759 -36920 -259239 -128606 -233813 -81294 -371003
8183 -371003 -356581 193970 -78324 -412379 -127727 -247445 -121718 64025 -229171 -129413
8173 -129413 5159 -330561 -114013 1137 -127998 -8220 -126449 -94947 -171501 -318096
8163 -318096 -138902 9922 -101348 113833 -390138 -244483 -88298 43389 -179509 -224952
8153 -224952 -152680 -107949 -76921 -90129 -95657 -110383 -173939 -148714 -126701 -125696 -45311 -138452
8141 -138452 -78513 -29520 -27744 -92757 -111030 -205912 130296 -161306 -101717 -106239 -120647 -197779
8129 -197779 -100550 27832 -80766 -224748 -129632 -129845 -102504 -147166 -101576 -124212 -93962
8118 -93962 -50329 -113692 -114090 -149900 -74422 -95060 -189895 -158814 -97151 -194566 -135791 -38400
8106 -38400 -141411 -184189 -70451 -143604 -168140 -146035 -21957 -56160 -225547 -73454 -89216
8095 -89216 -179901 -212021 -140317 -107989 -60046 -152424 -83047 -123514 46815 -41362 -179141
8084 -179141 -386 -71721 -35326 -16328 -14914 -89607 -83106 -111614 -108464 -115322 -42706 -52362
8072 -52362 -66545 -60068 -17456 -99414 -45304 10207 -13100 -51790 -90219 -51895 40896 -23872
8060 -23872 13930 -92019 -186737 -116698 -96839 -120130 -78543 -57048 -159926 -120767 -98336
8049 -98336 -1489 -100221 -18540 -120372 -164569 -123259 -78641 -114713 -81491 -106764 -114077 -102333
8037 -102333 -120226 -71768 -209349 -131314 -99399 -71060 -109879 -40612 -136019 -67879 -54588
8026 -54588 -116020 -95176 -39324 -80368 -175168 -120842 -170741 2634 -35328 -146499 -129192
8015 -129192 -34514 -33028 -27936 -53170 -77054 36307 65923 -30325 -4679 42336 -86529 -87694
8003 -87694 -105002 -102280 -77556 -67864 21282 -5039 7898 -44938 -117824 2177 -27803 -569
7991 -569 -669 23860 -102976 -20394 -62330 -18785 -61414 -72054 -10193 -112254 -59412 -30173
7979 -30173 -40182 -45345 -24567 -11306 7251 -79426 -32432 -1061 -38212 -45113 -127016 -36930
7967 -36930 -54469 -90429 -56788 -20248 -50855 -54658 6076 -77263 -45511 -141774 10748 -88204
7955 -88204 -56405 -73080 -69755 -53730 -112473 -115726 -78181 -76222 -39340 -157011 -11269 -146121
7943 -146121 -152101 -68509 -84851 -119745 -96464 -2903 -94775 -157831 -117029 -92594 -103091 -61702
7931 -61702 -54643 -78882 -105781 -58252 -131664 -31076 -131108 -86519 -21363 -65951 -190887
7920 -190887 -107634 -175623 -24608 -91359 -179786 -59422 -78099 -81796 -45506 -115870 -59957
7909 -59957 -116811 -82991 -78470 -87928 -86255 -87678 -123696 -51331 -51492 -57529 -119819 -56532 -23146
7896 -23146 -115444 -103942 -26686 -28007 1707 -860 2490 -44561 -11544 -85710 13917 -62370
7884 -62370 -13099 -16035 -61609 -49450 -32833 -98863 72909 -9092 -39526 -26123 12120 -51274
7872 -51274 -65413 -68878 -79764 -48352 -85755 -73043 -72971 -52854 -38599 -64110 -19835 -4272 -140276
7859 -140276 -124783 -54382 -72308 -50526 -1280 -46844 -90023 -125688 -156328 -105293 -263186
7848 -263186 -1947745 1172422 -282387 -128281 -110779 -122027 -9044 -52020 -52823 -54003 -48753
7837 -48753 -42198 -69724 31009 -19100 -60943 8415 -61072 -31996 -35111 -56621 -54656 -2395
7825 -2395 24339 -55186 -67871 -87553 -71614 -18740 -173459 -53665 -110658 -37565 -108731 -127324
7813 -127324 -53724 -41487 -70957 5788 8367 -24131 -58444 -34822 4694 -115176 -91985 -17532
7801 -17532 -31712 -34878 16051 7394 -48008 6186 15917 -17167 20876 63751 -37798 6734
7789 6734 11156 20170 2133 -59513 -32854 -75554 91133 -68208 -36391 3651 45394 9545
7777 9545 -68811 35756 -14292 -25812 -31527 18401 -17622 10280 -91830 13984 20222 -29988
7765 -29988 14250 -39813 956 65973 44193 48841 -20615 64294 71691 -9540 -26027 -91058
7753 -91058 37837 -17465 45423 33776 -5650 -16298 20309 57337 14192 31241 -16242 26451
7741 26451 -17459 42030 -44273 -57920 23465 94950 9868 56420 15531 13087 35680 3971
7729 3971 13296 8738 -13735 26268 42658 -8363 -52273 38079 109141 111973 -8781 86017
7717 86017 102043 99793 62785 39512 75571 139057 18736 65285 35703 27011 69079 118445
7705 118445 91452 9686 19953 84543 86739 63185 74476 122083 25842 103468 150756 53153
7693 53153 53063 40138 131816 86449 72731 122633 137765 110521 101326 125830 112256 34985 115574
7680 115574 67721 45022 113872 43143 45583 153612 112096 59201 134981 113584 205851 118846
7668 118846 104060 120179 96874 123338 38611 103156 157752 41221 85104 105182 141269
7657 141269 137682 91604 144376 78053 80756 75151 124299 136437 152463 138327 138580 189469 137495
7644 137495 97880 130469 121636 96211 41464 73518 216078 127098 102585 120416 48363 144241
7632 144241 134233 81939 99310 171900 114450 178356 159611 209012 187824 215833 172208 139899
7620 139899 205894 131407 152012 105914 90537 199079 214023 242176 222140 195450 193640 179338
7608 179338 199278 166785 222793 234044 200958 190396 144240 187435 111921 86050 292497
7597 292497 303330 259538 257039 287519 238751 257585 304953 256779 227703 204368 250600 212095
7585 212095 294809 351217 337938 286861 343331 316624 419173 342285 402179 404529 470748 421863
7573 421863 490023 491611 587555 697015 846864 1003397 1109273 1215166 1294698 1213016 1189992
7562 1189992 994859 921781 787991 610784 557779 556084 389419 393212 417558 369843 389888
7551 389888 356103 337417 292790 297385 337710 317611 336689 266091 289524 232164 229424 254013
7539 254013 229673 302459 233633 251581 274409 233210 300543 235571 317649 280157 282347 250498
7527 250498 252551 212389 268596 306449 321586 261523 323478 280215 322203 330694 323096 282212
7515 282212 339900 284158 337520 274871 324679 344234 267198 293856 345743 324837 261078 335184
7503 335184 389203 300288 328661 258318 266633 280334 297666 272562 265821 308032 331237 425282
7491 425282 279901 419926 304653 324252 357256 366538 414141 360847 314183 267747 327033
7480 327033 422626 355401 366811 421056 407602 390705 380827 446358 424237 389178 450444 495255
7468 495255 454795 490577 467973 379342 334258 361944 383246 451293 477473 444798 456370 489596
7456 489596 456268 418172 387889 474934 428915 355505 405728 389520 384830 457004 452747 454875
7444 454875 550725 514385 492203 524121 527428 516156 538949 549256 578179 555285 641400 671752
7432 671752 711305 608698 710998 696226 709901 655854 590582 673369 633243 589449 596557
7421 596557 561514 600969 553401 557863 584505 562379 567319 591481 623115 590232 659780 555066
7409 555066 640787 662813 622827 670989 643489 615271 620350 734272 628111 724781 711385
7398 711385 661623 730001 687864 712143 723961 706258 774528 707651 796774 734311 808498 829853
7386 829853 832173 829825 866072 967989 978640 1174350 1107152 1235616 1381539 1350605 1392773
7375 1392773 1303136 1363432 1208166 1202963 1135961 1027211 1009498 922205 973905 976457 956747
7364 956747 907813 994651 931202 944101 922208 892500 913963 905649 927400 935218 925012 1002710
7352 1002710 1030315 1111768 1106167 1160195 1138521 1127582 1053797 980059 1031247 1074267 1045453 1013534
7340 1013534 1058441 1050663 1052799 1076886 1064988 1036560 1084900 1129987 1071036 1110917 1121190 1172220
7328 1172220 1172215 1150270 1214240 1257371 1363655 1344804 1420440 1539499 1631315 1800150 2007056
7317 2007056 2242369 2619356 2955253 3357063 3555978 3672140 3684023 3397432 3187373 3028334
7307 3028334 2867516 2833141 3001512 3240076 3555184 3987286 4402967 4717743 4901450 4895257
7297 4895257 4606585 4236249 3758995 3303712 2919803 2703110 2500413 2312923 2064581 1955473
7287 1955473 1841958 1732436 1712160 1638883 1567806 1492357 1548010 1534786 1526942 1501206 1482670
7276 1482670 1454026 1445083 1426967 1431863 1359749 1354299 1326329 1455359 1466968 1509142 1495983 1425913
7264 1425913 1439172 1480338 1493561 1448541 1474350 1404852 1424312 1453407 1449556 1403053 1398813 1419484
7252 1419484 1381431 1426884 1342997 1403983 1470962 1457566 1530889 1494032 1484826 1536379 1452076 1399145
7240 1399145 1456687 1472920 1415345 1411547 1465389 1361764 1471003 1445340 1437087 1459538 1504145
7229 1504145 1583136 1503581 1584527 1508594 1544252 1543589 1569379 1589642 1556911 1542198 1498921 1597500
7217 1597500 1576412 1571568 1539954 1590554 1600974 1627283 1618569 1595735 1639629 1529808 1642544
7206 1642544 1619574 1604358 1727440 1756527 1094296 1557325 1572060 1677675 1651417 1653697 1672178
7195 1672178 1699625 1762399 1669672 1731498 1790081 1776389 1860202 1797224 1897502 1841315 1810801
7184 1810801 1819470 1854881 1827916 1893650 1896867 1913620 1903750 1882217 1890112 1880885 1842407 1912031
7172 1912031 1933927 1944599 1901080 1933937 1954086 1961453 2003072 1953146 2017628 1977350 1999650 2057271
7160 2057271 2018979 2028850 2032880 1987342 2016268 2054099 2116162 2017339 2062998 2039016 2129767 2120972
7148 2120972 2109568 2146947 2205371 2208617 2214643 2328611 2370764 2441153 2448027 2518477 2633535 2617781
7136 2617781 2687129 2618623 2611216 2568613 2614407 2688327 2767328 2899652 3127346 3215164 3237740
7125 3237740 3241021 3241737 3307751 3279453 3342159 3436322 3452156 3427419 3483969 3393935 3514797 3634690
7113 3634690 3760828 3822173 3883821 3982009 4027292 4106548 4041166 3983930 3970323 3789856 3825152
7102 3825152 3702169 3710388 3727044 3877825 3946906 4119518 4106221 3943148 3798456 3716995 3643155
7091 3643155 3702618 3728039 3876177 3881939 3863808 3760082 3528118 3515449 3449915 3323916 3372512
7080 3372512 3467193 3474143 3490753 3417684 3275293 3124856 3004846 3008423 2898835 2867219 2726977
7069 2726977 2708012 2672450 2734152 2796476 2774599 2754848 2888177 3025177 3203162 3430157 3691191
7058 3691191 3769641 3727267 3634830 3417429 3189723 3069867 2999939 2898665 2744693 2777403
7048 2777403 2696007 2714816 2658649 2695465 2682727 2719971 2679011 2778723 2929734 3079634 3175534
7037 3175534 3122948 3034935 2901786 2771243 2628542 2646447 2526237 2462292 2503421 2433050 2390350
7026 2390350 2356351 2383544 2442755 2363985 2421477 2354941 2337659 2389276 2360775 2328039 2354103
7015 2354103 2452063 2440621 2409541 2406891 2436676 2455145 2442675 2500412 2491457 2474314 2454632 2601288
7003 2601288 2668635 2719838 2715624 2688175 2702129 2722334 2807233 2679342 2688125 2704969 2725382 2832328
6991 2832328 2858183 2884690 2941331 3016859 3033947 3086910 3239078 3376201 3663339 4035961 4385868
6980 4385868 4832952 4893551 4967325 4970181 5111498 5601099 6555152 7706161 8488537 8563362
6970 8563362 7817325 6945780 6205454 5784978 5565348 5476135 5548041 5823152 6062855 6292844
6960 6292844 6542993 6684660 6766548 6959582 7322281 8042372 8964920 10027879 10951360 11355864
6950 11355864 11266260 10652923 9870309 8865594 7702600 6748363 6064510 5595321 5384919
6941 5384919 5312818 5541168 5874676 6034100 5955767 5722215 5590119 5750970 6141424 6876554
6931 6876554 7820821 8627310 8565834 7586411 6605981 5616630 4978124 4391189 4063497 3703946
6921 3703946 3331669 3251608 2991142 2872665 2787333 2734918 2775935 2653200 2622205 2660481 2538860
6910 2538860 2589969 2543568 2541285 2569139 2505409 2538471 2675950 2559059 2596128 2722817 2743199
6899 2743199 2771770 2771454 2868267 2918455 2826781 2766681 2738593 2635309 2456798 2462155 2394448 2321261
6887 2321261 2249758 2212848 2233308 2273634 2274669 2235666 2268343 2339841 2393207 2338619 2476048
6876 2476048 2623625 2750860 2977743 3181811 3363041 3445607 3353790 3461131 3577780 3582054
6866 3582054 3661364 3683917 3547589 3289824 3021235 2783261 2595430 2485127 2404084 2304817
6856 2304817 2225112 2230588 2182309 2262001 2340866 2374591 2447764 2470568 2471195 2377309 2302056 2168849
6844 2168849 2136627 2077345 2081488 2044917 2105842 2046674 2066607 2040278 1971830 1971461 2007747 2072949
6832 2072949 2158024 2208058 2208106 2079224 2181891 2051691 2214201 2149586 2210048 2301655 2486588
6821 2486588 2743060 3236018 3886324 4455507 4514840 4114795 3558490 2983663 2625254 2395747
6811 2395747 2217884 2108209 2041779 1930954 1822221 1869416 1922903 1810534 1850165 1882996
6801 1882996 1975460 1993631 2040439 1911258 1856132 1860503 1919852 1823200 1787832 1731213 1744404
6790 1744404 1741250 1735010 1727669 1852291 1801776 1755884 1807152 1609457 1628733 1651742 1667467 1620830
6778 1620830 1628443 1512420 1554755 1560861 1551996 1704790 1700412 1865546 1993706 1992331 1871091
6767 1871091 1751298 1579027 1543596 1440652 1354400 1313972 1385951 1332774 1449827 1566735
6757 1566735 1737852 1907818 1841697 1802314 1731319 1668146 1550832 1496008 1485151 1460807 1398159
6746 1398159 1315414 1405668 1412345 1534442 1479747 1546299 1696245 1593425 1610112 1447131 1462653
6735 1462653 1323452 1320921 1376075 1352033 1278279 1166024 1148538 1121798 957906 977370 987945
6724 987945 915337 840615 918789 901812 900293 901252 903952 905133 896449 958862 921136 908376 1004169
6711 1004169 1011865 1063891 1199333 1335851 1403593 1358475 1423514 1206767 1165467 1081237 1121615
6700 1121615 1112844 1003938 1076016 1064281 1111585 1139397 1127170 1077452 1095881 1014779 982774
6689 982774 1003068 988244 949072 982013 989995 929368 970622 997250 1009840 1090752 1037939 1161324
6677 1161324 1198811 1255130 1240818 1220299 1261884 1239697 1207511 1086238 1115730 1059513 999727
6666 999727 977277 952400 1013000 934879 1003290 1052984 1006611 1017115 1059275 1057765 1157058 1275332
6654 1275332 1262634 1234207 1254595 1289137 1327544 1334423 1198886 1154348 1176417 1202177 1115806
6643 1115806 1214095 1251227 1216975 1201799 1234717 1267955 1366988 1341345 1294094 1338802 1432489
6632 1432489 1429841 1421174 1460835 1506302 1489066 1508915 1380145 1476951 1438394 1544583 1623052
6621 1623052 1703265 1769618 1697431 1729305 1615214 1555983 1445860 1372315 1447898 1383783 1384576
6610 1384576 1374323 1329696 1303264 1329302 1385190 1563859 1562212 1728452 1799259 1893824 1991615
6599 1991615 1933973 1898626 1746517 1560885 1480708 1366512 1320873 1208484 1230217 1306499 1209546
6588 1209546 1161137 1275333 1289401 1248603 1331173 1440387 1458887 1562786 1507075 1487562 1481598
6577 1481598 1383083 1405509 1392800 1266033 1273862 1359735 1328307 1342947 1360450 1378516 1472355
6566 1472355 1448117 1664477 1709217 1808137 2222888 2632955 2997705 2977113 2772382 2387570
6556 2387570 2105836 1907143 1768436 1625430 1606911 1596893 1599233 1621791 1614162 1710042 1748381
6545 1748381 1702012 1810953 1931496 1997020 2172547 2215911 2158747 2195493 2097444 2219830 2250332
6534 2250332 2275696 2299325 2352093 2283105 2393204 2419616 2474234 2377804 2438784 2315406 2283496
6523 2283496 2316247 2363161 2477621 2698770 2819037 2758907 2781965 2866587 2894720 3020636 3079494
6512 3079494 3194397 3273211 3207273 2988310 2726956 2459388 2366800 2211076 2236069 2180553
6502 2180553 2227858 2232341 2357146 2406380 2519288 2612295 2778586 2923755 3041692 3227557
6492 3227557 3274537 3371046 3541394 3498706 3469306 3282743 3069911 2821882 2606734 2471171
6482 2471171 2257051 2161655 2024495 1960635 1876648 1806628 1766562 1690881 1715550 1639705 1663642
6471 1663642 1594284 1627451 1526395 1602268 1571901 1514944 1555869 1501547 1508919 1411755 1379074
6460 1379074 1433464 1445484 1528259 1485795 1555852 1610637 1621609 1605139 1672608 1777270 1806117
6449 1806117 1872250 1963139 1915710 1983131 2011398 2098860 2116508 2140062 2238759 2378706 2392176
6438 2392176 2499098 2528609 2608386 2712979 2672908 2656987 2659418 2744525 2824618 2792327 2717474
6427 2717474 2741715 2712636 2627761 2598082 2536038 2587088 2447668 2555143 2488632 2441785 2386630
6416 2386630 2429251 2500532 2438744 2537200 2603517 2790786 2781585 2809538 3021849 3158114 3301343
6405 3301343 3498921 3591628 3748392 3858239 3891267 3961960 3811068 3778861 3745899 3822645 3909501
6394 3909501 4099966 4331393 4509007 4932541 5450600 6037358 6876213 7894905 8933705
6385 8933705 9785609 10131578 9985132 9416249 8642469 7571296 6635685 5979680 5425047
6376 5425047 5199269 5055200 4906623 4796578 4702026 4593614 4553397 4487570 4471567 4486446
6366 4486446 4649285 4798970 5036129 5395899 5735196 6268039 6789676 7315484 7634327 7779721
6356 7779721 7680721 7516962 7211326 6997752 6809283 6769779 6715692 6869425 7189394 7435682
6346 7435682 7839676 8344171 9018071 9861598 11195002 13349250 16632920 21185283 26061196
6337 26061196 29734552 30824311 29241636 25766734 22069852 18860583 16443979 14487953
6329 14487953 12884756 11615245 10582099 9809779 9065143 8705815 8345201 8045180 7752638
6320 7752638 7596795 7341761 7099835 6864134 6580620 6478881 6146803 6036395 5819711 5629100
6310 5629100 5443491 5362259 5404327 5211442 5132870 5082329 5065092 4929220 4900894 4888665 4774270
6299 4774270 4693027 4730650 4669850 4699321 4777666 4724346 4749364 4814874 4975163 5130519 5312792
6288 5312792 5491534 5765045 5899462 6034842 6140619 6120315 6137008 6077419 6033246 6002693
6278 6002693 5956969 5988475 6083331 5998789 5925842 5837907 5700649 5694415 5640971 5587776 5619746
6267 5619746 5626471 5629814 5730560 5712490 5799653 5955801 6035756 6175696 6332445 6464936 6598480
6256 6598480 6644970 6917123 7097257 7291762 7584449 7714180 7739023 7721390 7572160 7523205
6246 7523205 7424810 7396077 7496368 7710861 7825526 8116607 8332870 8644716 8987231 9300243
6236 9300243 9443577 9692849 10054963 10447309 10845308 11166217 11288280 11223710 10862312 10407159
6226 10407159 10068173 9770838 9633534 9699210 9916625 10157411 10465985 10866532 11245906 11679450
6216 11679450 12230644 12912947 13520939 14170986 14774741 15361410 16085805 17079699 18256586
6207 18256586 19569510 20772586 21481685 21524823 20938450 19925421 18688225 17435530 16178840
6198 16178840 15031325 13953543 12998064 12148530 11348967 10746051 10190031 9775190 9477447
6189 9477447 9140877 8977605 8900374 8801034 8886107 8903157 9080694 9474518 10054491 10645843
6179 10645843 11086150 11148561 10804306 10272366 9679080 9097959 8640974 8405737 8180078 8151519
6169 8151519 8227974 8178474 8216749 8079422 7934722 7829515 7623989 7490467 7375926 7352144
6159 7352144 7430441 7441985 7543127 7597652 7589443 7568563 7512135 7417897 7382540 7372603 7487280
6148 7487280 7693499 7854701 8095392 8357254 8644754 8924656 9157946 9499428 9733959 10142213
6138 10142213 10642070 11034934 11662146 12418031 13332019 14346118 15557166 17031801 18601913
6129 18601913 20573654 22860490 25697560 29641067 35029637 42671780 52670262 64080646
6121 64080646 74521070 80991740 81631557 76364504 67440683 57404536 48402901 41483408
6113 41483408 36488688 33016558 30555401 28501458 26533581 24372263 22060885 19683628
6105 19683628 17539771 15791176 14259762 13066892 12201514 11496813 10903036 10414817 10057640
6096 10057640 9844091 9589258 9385013 9319007 9269511 9253327 9127872 8972146 8785002 8591321
6086 8591321 8442301 8242594 8093345 8040161 8052566 7981541 8149989 8226908 8174843 7991835
6076 7991835 7750153 7588480 7424218 7311870 7261263 7140372 7221614 7225701 7223132 7261834 7382437
6065 7382437 7545132 7752611 7948047 8255703 8482895 8776327 9098794 9329218 9531665 9790760
6055 9790760 10000670 10080406 10016752 9685933 9127130 8645398 8136094 7715976 7528290 7335139
6045 7335139 7096376 6915845 6822592 6586639 6376149 6215168 6034705 6019164 6098809 6135018
6035 6135018 6310018 6491508 6723352 6900982 6980393 6901772 6696956 6508638 6236744 5938812
6025 5938812 5730055 5518646 5402423 5351980 5442632 5380112 5624222 5724152 5855960 5881755
6015 5881755 5841049 5644195 5223534 4962797 4844876 4836355 4912163 4911582 5027842 5163844 5203969
6004 5203969 5200333 5041487 4877085 4608806 4450625 4262505 4025765 3918549 3819834 3798900
5994 3798900 3807522 3865117 3866492 3971594 3964116 3914200 3901346 3744670 3597531 3510463 3508497 3416325
5982 3416325 3440001 3499066 3555322 3639306 3758793 3703683 3603738 3459741 3277418 3228555 3084237
5971 3084237 3021119 2892891 3018677 3054086 3066392 3066032 3010085 2969282 2807267 2734408 2597974
5960 2597974 2521668 2508841 2421655 2360797 2391364 2340972 2316743 2345120 2346742 2279861 2234415 2231294
5948 2231294 2095305 2018382 1983232 1815876 1844706 1717055 1716973 1689250 1623017 1599454 1547713
5937 1547713 1535142 1535631 1465298 1492284 1426488 1528094 1416476 1415275 1293734 1364233 1348248
5926 1348248 1313170 1310207 1344728 1302398 1288251 1277160 1193251 1206699 1210571 1194488 1193149 1174868
5914 1174868 1173019 1216269 1092160 1116057 1141754 1077536 1094681 1097019 1165522 1075425 1104572 1051654
5902 1051654 1162315 1173259 1162032 1208872 1185820 1214245 1220549 1256126 1182623 1205153 1088151
5891 1088151 1080554 1133168 1086536 1066188 1031426 1050022 1045164 1064796 1045940 1104632 1036498 1215071
5879 1215071 1235810 1304489 1471707 1305754 1344776 1399179 1306804 1326953 1370410 1297452 1360145
5868 1360145 1332529 1381082 1406942 1375169 1430578 1450253 1550533 1615546 1667928 1740153 1839927
5857 1839927 1922010 1894239 1914651 1867125 1784072 1803120 1708509 1630433 1556072 1588808 1623615
5846 1623615 1641659 1487219 1609371 1518546 1579082 1551480 1734177 1753719 1731364 1754817 1648147
5835 1648147 1504358 1581816 1519210 1411502 1435103 1427236 1360995 1306682 1268040 1334845 1243505
5824 1243505 1214699 1231563 1256946 1323898 1318145 1349838 1370273 1348308 1323954 1374062 1260746
5813 1260746 1355781 1316772 1255255 1249690 1174847 1188924 1174046 1137168 1064007 1136674 1114840 1058553
5801 1058553 1105882 1098686 1111388 1066250 1151815 1039327 1156930 1133859 1105486 1124094 1152491
5790 1152491 1224324 1176674 1211688 1191113 1199951 1189675 1275567 1315262 1268338 1283718 1275171 1282012
5778 1282012 1253864 1248193 1246952 1308342 1385243 1321537 1303427 1321872 1425364 1479638 1533739 1471594
5766 1471594 1468378 1491482 1519640 1564485 1661821 1651131 1715655 1720784 1774911 1827363 1831162 1793760
5754 1793760 1893845 1846968 1823827 1906746 1885664 1887371 1946898 1863112 1926818 1972016 2006085
5743 2006085 2027266 1998796 2065888 2110891 2186112 2278214 2325695 2408225 2523960 2547914 2513294
5732 2513294 2606910 2711686 2679842 2763372 2825345 2828854 2903126 2943489 3034405 3042717 3141313 3309062
5720 3309062 3403520 3445176 3575284 3796498 4110699 4466643 5095225 5962637 7204265 8569405
5710 8569405 9934452 10899042 10777351 9676666 8566619 7896745 7406607 7249062 7219667
5701 7219667 7129318 6944073 6799488 6778065 6915660 7170543 7780327 8464446 9498062 10919769
5691 10919769 12596003 14248461 15332714 16209324 16362606 15659852 14473591 12901044 11473312
5682 11473312 10639060 10177378 9971689 10179886 10483446 11014164 11546674 12206052 12587829
5673 12587829 12771662 12974111 13357312 13774808 14487131 15308179 15988267 15799837 14578369
5664 14578369 13299376 12417606 12001046 11849340 11862970 12109263 12266672 12183508 12152385 12081321
5654 12081321 12214421 12585267 13308001 14248379 15509149 16826304 17957625 18601164 18759168
5645 18759168 18294845 17493922 16526501 15721326 15041297 14600940 14200157 14083736 14119023 14118619
5635 14118619 14410362 14858427 15226283 15700877 16235185 16370423 16404172 16243055 16114778 16304733
5625 16304733 17039009 18082274 19635339 21441319 23048415 24226704 24808256 24339108 23173258
5616 23173258 21812519 20504698 19246273 18360763 17696870 17079874 16692155 16441672 16341142
5607 16341142 16354277 16633099 17035596 17498788 17813220 17759809 17507997 17272320 17205409 17477355
5597 17477355 18289610 19151218 20485251 21846197 22844354 23278249 23076914 22161974 21094462
5588 21094462 19878782 18783044 17966611 17293848 16784845 16346002 16048628 15784082 15764582
5579 15764582 15765609 15969240 16211173 16371370 16359953 16032966 15663746 15342913 15162983 15132550
5569 15132550 15302438 15692895 15972683 16273038 16402837 16237004 15833054 15271667 14646195
5560 14646195 14018043 13531816 13174484 13046938 12903701 12863427 12903103 12836982 12623796 12327185
5550 12327185 11993817 11755764 11478860 11153184 10708873 10417454 10058009 9813584 9661221
5541 9661221 9576788 9562816 9514481 9462485 9433343 9285882 9245172 9198907 9197427 9210710 9413936
5530 9413936 9652020 9822641 9978943 9892098 9732371 9685902 9678512 9696839 9695599 9661352 9693135
5519 9693135 9624731 9562375 9527434 9414756 9397803 9346938 9362606 9315448 9332970 9291342 9305089
5508 9305089 9269470 9287350 9393550 9437179 9515547 9606038 9716012 9682293 9675670 9661777 9567977
5497 9567977 9500533 9474798 9338200 9333241 9266899 9217152 9124400 9056831 9067409 9081892 9042129
5486 9042129 9094867 9074426 9061313 9236540 9378532 9494804 9611706 9639538 9699248 9709350 9670690
5475 9670690 9800305 9808050 9809660 9764112 9900791 9797827 9886777 10004742 10145377 10372261 10612785
5464 10612785 10868234 11188506 11408945 11710115 11919890 12096431 12247466 12311839 12311342 12258234
5454 12258234 12251778 12231431 12339733 12457814 12682102 12950152 13152074 13340298 13656870 14049434
5444 14049434 14351671 14690967 15019655 15211349 15266246 15334287 15321754 15228805 15199430 15068808
5434 15068808 14931897 14750966 14770646 14759300 15057037 15489888 16058613 16686037 17269136 17618867
5424 17618867 17632826 17402814 16831224 16239223 15665624 15176640 14869772 14609333 14372142 14177519
5414 14177519 13946597 13820899 13672524 13632988 13604335 13595027 13685115 13693490 13746576 13897409 13964957
5403 13964957 14099931 14192838 14362946 14509972 14533603 14624018 14745687 14816469 14984168 15090695
5393 15090695 15330353 15610090 15849991 16300599 16710983 17210926 17700512 18224186 18642143
5384 18642143 18851988 19059838 19003236 18811912 18563615 18155030 17752401 17376891 16997603 16691162
5374 16691162 16421193 16338711 16252595 16165101 16243842 16282341 16498890 16591593 16744409 16996858
5364 16996858 17223631 17423826 17736009 17873761 18204389 18472611 18760831 19080088 19415007
5355 19415007 19760596 20063454 20544077 20941302 21374176 21881546 22321165 22833867 23299693
5346 23299693 23771468 24227789 24749880 25256603 25701228 26190097 26605635 27003266 27372350
5337 27372350 27742701 28047756 28240562 28485378 28538636 28685404 28754213 28824656 28746112 28554607
5327 28554607 28442991 28212858 28001816 27798591 27440276 27157780 26849593 26526493 26059894
5318 26059894 25774474 25464902 25048096 24648213 24304562 23880981 23507141 23121184 22698920
5309 22698920 22277580 21887780 21437062 21008658 20537619 20119166 19661865 19205374 18719741
5300 18719741 18180193 17765894 17286043 16801872 16333996 15843262 15417455 14983963 14578181
5291 14578181 14151252 13753195 13382251 12952465 12618131 12181429 11829013 11470469 11132067
5282 11132067 10705694 10451879 10187684 9844144 9562776 9359095 9130166 8903405 8650406
5273 8650406 8433246 8267685 7954440 7861096 7607944 7362210 7230690 7045881 6875204 6680149
5263 6680149 6563821 6475390 6353720 6122840 5987304 5752847 5748785 5611765 5446523 5306444
5253 5306444 5200727 5061590 4931460 4836748 4817856 4685592 4550405 4558773 4407190 4301593
5243 4301593 4203903 4111680 4001205 3976056 3887786 3768292 3634456 3582236 3541865 3508937 3451566
5232 3451566 3344474 3296579 3317523 3212488 3158788 3135478 3080610 2993728 2996509 2830615 2877603
5221 2877603 2865070 2833292 2729976 2668076 2720657 2622091 2591768 2589175 2529218 2507255 2442105
5210 2442105 2442856 2350519 2340769 2287661 2264214 2289814 2375898 2287942 2308986 2312866 2242464 2267244
5198 2267244 2336260 2276608 2296180 2288250 2296663 2221091 2221935 2270983 2169772 2132173 2112302 2142679
5186 2142679 2146219 2169077 2135394 2135534 2130597 2057863 2065603 1954304 1948960 1872038 1866167 1723457
5174 1723457 1687722 1657319 1632950 1592506 1602710 1555929 1599143 1498093 1512830 1564961 1530409
5163 1530409 1505020 1500539 1376898 1463476 1485026 1591753 1579841 1560651 1614948 1702017 1546357
5152 1546357 1666055 1595795 1631065 1552316 1621476 1564980 1566252 1538457 1513306 1532846 1519405
5141 1519405 1471015 1469652 1444852 1446716 1466629 1415184 1303718 1218949 1309200 1222935 1208515 1185030
5129 1185030 1130856 1139906 1160187 1086443 1056254 1093145 1042783 1014913 1017000 1067257 1086815 1082667
5117 1082667 984282 968507 977912 958081 954563 919492 947154 938274 919089 907021 847806 928388
5105 928388 882279 843838 871616 848727 860732 871603 867139 828241 873705 836929 828536 840423
5093 840423 821231 835083 904550 851038 848115 848801 835335 849891 883493 823556 902770 833683
5081 833683 935584 949436 1010997 1013086 976107 1045879 1143019 1145954 1206309 1211855 1339872 1365246
5069 1365246 1420508 1655775 1967377 2595233 3435184 4670888 5844412 6479742 6419686 5657340
5059 5657340 5150437 5099364 5207367 4921300 3715527 2688324 2202434 1733674 1524673
5050 1524673 1366865 1248242 1192217 1070733 985711 1017716 887165 837722 784684 770727 728961
5039 728961 726581 759043 719277 728166 649817 681806 641415 679634 640682 678887 668721 640277
5027 640277 661454 671712 666598 617631 641968 557819 607440 596595 593531 532361 491239 597759
5015 597759 479208 511383 564481 504997 510879 592598 545338 548378 578428 494537 532892 407078
5003 407078 462288 511086 466660 447870 430889 468000 408502 482293 475299 454745 428916 476843
4991 476843 484152 491070 441924 526636 411420 465017 495418 480335 431392 406972 482415 416603
4979 416603 418091 386492 391005 418425 405233 425472 475479 435598 443186 488590 470239 476932
4967 476932 511070 503969 475688 448173 425784 416337 455546 430370 487962 538984 537313 561985
4955 561985 485413 496062 503903 464162 504200 426367 483392 480786 473573 476829 376936 489601
4943 489601 492903 447390 510366 482480 477595 417419 474673 428125 449297 443034 472810 462765
4931 462765 485658 470336 492594 401100 484247 451104 420917 511311 463436 417646 442364 460686
4919 460686 413681 496211 436966 474126 414743 496835 468704 481324 431132 418492 467895 367781
4907 367781 443257 401064 435062 394619 461947 358136 408694 463850 375935 399730 424671
4896 424671 453763 384639 417469 423269 449652 350179 391759 466924 350573 389185 317257 370145
4884 370145 384880 369283 355134 388712 296571 327405 359009 296068 320481 291327 272574 278003
4872 278003 277908 247583 287984 269965 309946 286073 272744 323969 246224 263676 323217 272077
4860 272077 221304 254816 272107 214749 180622 276846 286448 242785 187304 262040 295301 263714
4848 263714 243040 265443 228526 165809 228904 220004 280631 222412 281718 232940 293304 204330
4836 204330 251691 206927 261249 158377 307307 267228 263162 338594 337951 199884 295024 327533
4824 327533 309171 321538 322232 327138 249821 296095 343847 245265 225208 281123 265821 232560
4812 232560 255655 299857 326604 349599 378292 306158 288225 258791 301657 285389 297894 231515
4800 231515 272749 242794 309872 271783 276942 227523 282212 283271 247669 336948 276918 358272
4788 358272 271444 281781 380182 321551 339487 335033 374050 427553 420002 396615 350363 426976
4776 426976 387121 393186 402580 472995 449457 497985 462426 376574 397523 355763 414355 440633
4764 440633 485681 447502 462303 410640 411095 342447 343191 350417 325985 370660 367097 357704 292820
4751 292820 371343 326958 347865 376957 352187 325826 295141 336659 364497 357209 412589 365193
4739 365193 353036 328360 373540 372873 330754 387130 394286 364926 396856 360651 402465 420294
4727 420294 300753 361776 400053 439826 330821 408610 432323 311712 382634 427374 408221
4716 408221 345821 431725 450517 479585 454608 478811 461148 465011 457431 453498 482600 443801
4704 443801 463786 408459 550382 466862 556655 499988 475615 423089 549099 427229 429575
4693 429575 468439 455327 497218 458978 490486 478932 445465 525500 543618 478115 532558 466216
4681 466216 551212 500288 524812 560046 513431 517833 517827 612231 529644 518656 600470 613470 585599
4668 585599 575754 586077 663549 564187 646384 599732 663811 647037 606886 584648 571978 619979
4656 619979 654006 670946 616965 688321 726250 618996 625551 709017 694832 642007 728259 694250
4644 694250 677628 700144 739619 755024 647177 719366 765038 767553 802432 819490 777938 752741
4632 752741 780054 851222 802475 879250 985086 924904 971310 1074103 1043318 1014584 1104670
4621 1104670 1107278 1097176 951217 993898 1091389 1007045 1046381 1013055 1065262 1107169 1140940
4610 1140940 1214666 1308183 1187478 1224671 1229222 1234685 1174860 1171850 1180723 1162041 1188120 1232490
4598 1232490 1210932 1157772 1149852 1150178 1205592 1272001 1278613 1185326 1299001 1277345 1361991 1285930
4586 1285930 1369514 1471731 1516347 1593616 1681763 1758281 1855566 1853868 1905417 2039803 2165859
4575 2165859 2264176 2281983 2194468 2121775 1891925 1774333 1654585 1620047 1626294 1561227 1633797
4564 1633797 1609186 1685603 1717190 1597193 1671908 1647444 1663844 1742091 1799477 1882461 1986311
4553 1986311 2027517 2007223 2096381 2138222 2255790 2265666 2281748 2312438 2257500 2042271 1777226
4542 1777226 1763438 1715570 1591266 1699156 1675904 1720944 1687521 1609807 1627184 1579211 1551886
4531 1551886 1609771 1584493 1537505 1522774 1578922 1575581 1629859 1591552 1647178 1623843 1591668 1633215
4519 1633215 1528225 1537281 1417514 1478711 1474236 1469578 1482605 1470675 1417896 1475804 1458364 1422305
4507 1422305 1472722 1506064 1499584 1504319 1496569 1513704 1515242 1553487 1592071 1661528 1686463 1625870
4495 1625870 1667101 1693394 1666919 1709989 1694108 1747683 1760777 1716831 1773148 1741612 1817001
4484 1817001 1843568 1801122 1864713 1884228 1866832 1942363 1915745 1990741 2038084 2058297 2124497
4473 2124497 2141725 2235868 2205436 2199647 2272147 2337830 2372944 2391498 2567692 2446022 2530636
4462 2530636 2492225 2471081 2491626 2636210 2641451 2613436 2660383 2668461 2731798 2745589 2742771 2814361
4450 2814361 2858213 2923821 2930434 2988908 2990792 3091892 3149713 3232645 3274348 3297577 3331592 3406137
4438 3406137 3441381 3611641 3601086 3698569 3769358 3833634 3900380 3964519 4011034 4123524 4177194
4427 4177194 4217868 4255875 4382992 4454663 4498691 4596508 4647487 4752612 4885790 4980205 5095039
4416 5095039 5184156 5184411 5331665 5472329 5587966 5697351 5850996 6070579 6160358 6268237
4406 6268237 6434066 6516976 6704325 6902134 7049503 7149280 7426555 7591954 7686870 7905973
4396 7905973 8139352 8280368 8625239 8912526 9045515 9347255 9666580 9929965 10272680 10615984
4386 10615984 10984633 11475728 11942462 12530040 13095387 13636596 14214632 15018527 15928028
4377 15928028 17118814 18432720 20278707 22847076 26321437 29668464 31685275 32954399
4369 32954399 34954928 37879028 40096670 40398815 38845062 38039239 39169653 42001457
4361 42001457 44821836 45729743 44064073 42125551 41156936 40943390 40798588 40670189 40764032
4352 40764032 41390534 42125936 43353915 45004564 47457569 50750298 54990832 59167492
4344 59167492 62697035 66058644 70757252 77068214 83625344 89414416 95646555 105546884
4336 105546884 121411990 143454161 166561870 183682813 193034084 202301553 215998790
4329 215998790 232553984 253033487 271599252 272512612 243987847 203170162 169280503
4322 169280503 145161769 129585037 120667005 116302658 115824514 117429783 118549084 116959358
4314 116959358 113311099 110850997 110936587 113824634 120691073 132692048 149879205 168437615
4306 168437615 181597215 187330493 190496671 199411691 213785084 232974252 252850143
4299 252850143 261425182 243801361 204690807 167953011 140890197 122863507 111812985
4292 111812985 105634734 102822197 102453134 102018276 99349394 93541753 86895003 81523604
4284 81523604 77562289 75422815 75384202 77096472 79113687 79558672 78787293 78487887 79117488
4275 79117488 79014647 76127077 69420726 61217593 53715190 47679924 43153607 39898178
4267 39898178 37671397 35978047 34568571 33042764 31482486 30010247 28865405 28128971
4259 28128971 27229310 26172029 24911296 23577099 22333139 21284267 20359134 19321610
4251 19321610 18400885 17627846 16818256 16201766 15638448 15118271 14715822 14407204 14093560
4242 14093560 13625517 13299927 12841316 12391500 11937835 11582695 11237233 10849789 10620176
4233 10620176 10409020 10289469 10334220 10186688 9951629 9583076 9232349 8912538 8487016 8417404
4223 8417404 8080119 8003823 7790395 7655834 7519524 7406007 7265293 7096316 6890147 6812625
4213 6812625 6705904 6556767 6527467 6308012 6176890 6003217 5977764 5753888 5610549 5605876
4203 5605876 5393822 5335683 5208690 5127141 4935853 4772221 4693025 4563010 4529253 4350601
4193 4350601 4316025 4233236 4122761 3997955 3906752 3880528 3823296 3781575 3683139 3651443 3480593
4182 3480593 3463132 3350663 3275520 3224951 3183434 3050805 3043629 2991337 2935719 2862873 2824234
4171 2824234 2792381 2726896 2660341 2658686 2576114 2654497 2577181 2564470 2496785 2423043 2393093 2320283
4159 2320283 2226801 2194247 2226772 2143070 2189932 2153851 2056111 2097567 2136664 2037268 1990409
4148 1990409 1924295 1986000 1973386 1968863 1868244 1922676 1960155 1777080 1797731 1736486 1756515
4137 1756515 1707966 1729063 1709873 1627180 1685594 1653657 1735436 1632014 1590686 1648697 1619406
4126 1619406 1629673 1622919 1636059 1587970 1644660 1523511 1538387 1620436 1574560 1623581 1693843
4115 1693843 1646636 1616593 1576099 1595675 1580040 1505840 1538948 1538342 1478835 1577141 1479059 1476681
4103 1476681 1434831 1491929 1447993 1613362 1586567 1642374 1588827 1610737 1652440 1650868 1585922
4092 1585922 1654758 1623524 1722303 1697319 1810065 1833773 1855693 1922147 1998470 2123928 2104597
4081 2104597 2283047 2343589 2356499 2535071 2593506 2657256 2690405 2567694 2522684 2436222 2349879
4070 2349879 2415847 2417355 2526257 2566716 2590242 2638057 2748102 2713611 2845134 2961402 2996870
4059 2996870 3123457 3329647 3405332 3496423 3526196 3528839 3642974 3680280 3854720 4008507 4088767
4048 4088767 4196440 4003593 3887806 3906176 3862081 3859297 3878288 3971974 4005016 4141166 4178337
4037 4178337 4247254 4501850 4645548 4837808 4981953 4931464 4697551 4458056 4155944 3814355
4027 3814355 3589841 3419395 3440749 3318282 3355592 3257352 3284917 3252274 3403478 3382126 3463567
4016 3463567 3519766 3575924 3539769 3528182 3646808 3620402 3683277 3602791 3662885 3625936 3474160
4005 3474160 3437919 3238980 3095827 2872446 2782281 2640478 2555636 2504187 2458939 2466523 2472328
3994 2472328 2444881 2507546 2596592 2543432 2559402 2473865 2408826 2255760 2153273 2085526 1950195
3983 1950195 1838354 1707848 1702441 1541364 1537178 1417940 1408677 1364042 1313943 1263652 1239196
3972 1239196 1155278 1205091 1282957 1209895 1206337 1201385 1185535 1157764 1224055 1157522 1180022 1122538
3960 1122538 1168212 1107064 1107056 1021932 971767 912007 890963 899944 882345 859403 880269 865380
3948 865380 825622 861962 880920 814634 834026 852735 829302 851660 800213 821257 825665 888971
3936 888971 866948 805650 878672 893846 968280 1033012 1035183 1051126 1096734 1006358 920974 860227
3924 860227 769106 787099 746827 658761 638510 597523 554920 633236 576017 500996 566636 619665
3912 619665 617470 615228 590221 576448 535812 532495 607701 626720 661055 686032 801688 805908
3900 805908 918829 914887 862843 815375 668084 675788 497219 427683 477191 454794 413838
3889 413838 366616 295512 288538 245486 245196 293428 262550 244957 252890 295620 261312 302672
3877 302672 262207 331491 312788 303686 354031 330995 333350 373212 317434 377637 279101 191400
3865 191400 244033 220124 196084 143074 115277 188866 146326 74498 85614 73666 29700 23375
3853 23375 -6569 117620 58306 100740 48474 55766 2167 103305 114375 48520 44790 77320
3841 77320 -442 19145 40997 58837 91441 64435 30991 35198 24475 57802 45384 61942
3829 61942 -274 1804 -13009 2147 28816 40969 38850 -9059 67976 33819 -14733 35556
3817 35556 -20601 28637 15688 33118 25412 -60700 -55325 -41461 -4599 37670 65563 23380
3805 23380 -3843 26588 30087 -46790 -29022 -5024 -56161 1685 22032 2539 -31532 -49498
3793 -49498 43165 -22016 21916 29252 2329 5660 22262 37584 38937 1955 -27530 -54799
3781 -54799 67909 44685 -42623 -43158 29862 18616 -28160 34311 15653 62538 -28740 -1020
3769 -1020 -9579 -122587 28708 -631 16210 -54617 10737 -23641 -3947 32211 18517 56378
3757 56378 49683 67807 -11640 52172 -57618 -13040 26971 -11139 -25812 10448 -233 -63162
3745 -63162 -35270 -96168 40905 59644 30689 -55507 -48309 -82483 -79258 11369 -4238 -118309
3733 -118309 16507 12441 -36802 42815 -159833 67446 -49670 48200 -41007 -58759 15145
3722 15145 -10146 -37706 -66744 -20094 -27005 -36009 -52366 -36074 -80993 -49389 -103312 -93374
3710 -93374 -97333 -43011 -17104 -6429 -23680 1789 -41091 -58182 -92756 -39710 -92102 -93711
3698 -93711 -68018 4363 -83160 -37564 -50590 -33579 -7662 673 -33424 -54727 -44170 -56927
3686 -56927 -20322 -48609 -34334 -47268 -83881 -57290 -80997 -26718 -28590 -36430 -99851 -78500
3674 -78500 -106285 -16331 8443 -61897 -57099 -83109 -51710 -90486 -24061 -71808 -61710 -87603
3662 -87603 -87128 35192 -109151 -64419 -6795 -31071 -44303 -29324 -49576 -614 -40387 -50781
3650 -50781 -14711 -31792 -16431 26188 17500 -46391 63282 63851 13720 -32379 -38731 28905
3638 28905 -67706 19369 8990 4521 6594 -5974 -21359 66265 124294 198720 292663 324371
3626 324371 198180 198194 66691 109865 125182 86907 -70755 -76336 -60033 -14693 -29583 -38731
3614 -38731 -49018 -29756 -20250 -47026 -64224 -10704 -79684 3797 -20872 -21830 -18422 2288 -54878
3601 -54878 -22121 -54693 -38194 -33747 -60451 -4103 -7616 -22367 -49374 17897 -4378 -10609
3589 -10609 -17493 33325 -76528 3595 50400 -60437 -87367 -42983 5580 -14037 11345 -11123
3577 -11123 1819 -46939 -6633 -35425 -68394 -46399 -24931 -47189 -110265 -60616 -17080 41061
3565 41061 -58363 -17347 -14013 968 -9246 -46075 -32766 8017 24475 -2733 -25085 13506
3553 13506 -25830 22636 88279 63836 95551 151582 63670 125526 95834 170047 145542 208584
3541 208584 298973 404700 667322 906142 996201 823939 668475 489130 383381 377760
3531 377760 415795 350496 510739 526653 479078 284204 272619 239083 308298 226144 308657
3520 308657 480702 553710 519844 396811 370371 235966 214619 161017 79560 195088 114207
3509 114207 61256 135613 99747 111947 133545 121075 131654 161752 99722 100905 129970 192504
3497 192504 77040 110847 114509 173669 149863 133325 151076 165125 121869 165113 189153 179059
3485 179059 224261 209998 183982 217081 162837 204876 171498 218515 217979 347315 266471 328413
3473 328413 303616 302989 298851 223013 279068 280811 198385 290385 373628 320757 309288 367344
3461 367344 456596 387651 458089 430068 487966 559878 496940 500268 629007 696839 858774
3450 858774 1053883 1162900 1084694 1030818 955503 839501 943935 1018769 984695 1029105 1190123
3439 1190123 1412988 1874159 2901813 3921427 4301437 3560877 2636145 2121162 1844427
3430 1844427 1637486 1610413 1507830 1492899 1411259 1480336 1581499 1626238 1836342 1856682 1924130
3419 1924130 2087994 2313852 2782501 3423582 4830436 6649489 7921279 7594521 6342769
3410 6342769 5845812 5506318 5223627 5103625 5036479 5182013 5900536 7391555 9312498
3401 9312498 11284495 12391392 13645904 16636886 23845124 34387423 41627541 39750943
3393 39750943 29399017 20709787 15080448 11415402 8880123 6936724 5445642 4509697
3385 4509697 3697743 3222576 2983794 2936073 2998198 2913588 2719490 2307465 2093961 1952501
3375 1952501 1743547 1653563 1485205 1307519 1237198 1073713 1027201 1052458 982152 954900 907145
3364 907145 967158 952529 945860 815703 765821 788570 733988 743712 672982 688152 678198 658134
3352 658134 564347 542783 570228 567630 608344 585382 525081 530027 454260 472567 455129 397707
3340 397707 432604 469946 430154 367622 366193 385803 380525 365614 344059 253076 297161 269834
3328 269834 310105 230837 228735 252932 226382 194396 239387 79390 161186 158999 154434 160591
3316 160591 178721 138429 87529 136668 117596 93834 57109 155312 114850 121486 89833 131922
3304 131922 81656 81689 2841 33676 44313 93048 132207 22282 52427 11691 -16732 78379
3292 78379 11267 64610 26242 15458 -22417 -34658 -27705 -30550 -13324 17210 -22133 -14534
3280 -14534 -4883 -10450 6851 -24663 -11427 -83300 -38627 -53658 -45586 -66885 6283 -47134
3268 -47134 -30177 7562 -4970 -30449 29520 21730 -43312 -20473 -8596 -78696 -25173 -36757
3256 -36757 -15842 -11136 -33884 -71851 -39504 -38955 -101600 -75798 -46180 -12257 -56907 -41808
3244 -41808 -50822 -97469 -37332 -13635 -74486 -70093 -67970 -79134 -65288 -52200 -64298 -5438
3232 -5438 -52580 -28354 -95148 -72172 -95429 -134153 -147167 -101119 -97004 -167568 -86951 -101149
3220 -101149 -100629 -68904 -150026 -60260 -69545 -58110 -110758 -116575 -112886 -103793 -137273 -146851 -59258
3207 -59258 -150788 -164197 -92804 -125557 -89761 -134091 -93140 -142091 -96818 -109728 -83201 -21880
3195 -21880 -92046 -102093 -128340 -143820 -158064 -91076 -113371 -71768 -136350 -132602 -55581 -119438
3183 -119438 24128 -56417 -66345 -16027 -108147 -91410 -48488 -135593 -103008 -112885 -62363 -64112
3171 -64112 -61370 -101217 -68213 -17476 -35456 -40131 -22684 -9828 -6480 49862 4291 -12392
3159 -12392 44393 -39694 -71640 -93574 -65719 -125883 -86565 -104250 -19158 -141322 -79763 -108634
3147 -108634 -112757 -145070 -103858 -119187 -121714 -95371 -190878 -119159 -162489 -116643 -57756 -62151
3135 -62151 -142343 -77442 -111350 -97298 -80904 -102618 -127663 -76537 -130798 -182461 -85962 -188436
3123 -188436 -66436 -95974 -117646 -123033 -119863 -99873 -160555 -105334 -108368 -88790 -106697 -74300
3111 -74300 -120285 -116014 -128145 -153611 -142971 -191380 -151889 -174520 -204750 -85308 -122846 -198174
3099 -198174 -179306 -71287 -111091 -95707 -158122 -125722 -106681 -185709 -103858 -148727 -83212
3088 -83212 -79952 -73729 -101018 -129247 -90542 -140174 -139764 -94311 -190577 -107725 -114292 -140499 -97740
3075 -97740 -112430 -93106 -137233 -109825 -145600 -104382 -111573 -110501 -120002 -120235 -107497 -150303 -101682
3062 -101682 -180678 -135555 -118699 -155352 -86219 -139243 -162344 -194888 -153581 -70878 -173346
3051 -173346 -100222 -94178 -149689 -93264 -193332 -133944 -94844 -189608 -122722 -194962 -162922 -151651
3039 -151651 -93359 -132872 -174131 -120338 -119148 -148459 -93978 -94351 -116929 -110054 -152287 -64020
3027 -64020 -83300 -151129 -116732 -174660 -164386 -170777 -114190 -85035 -143135 -160414 -194256 -80721
3015 -80721 -170578 -171636 -218323 -172654 -177852 -168993 -127862 -128744 -112049 -131410 -132790 -109716 -152994
3002 -152994 -133854 -167573 -131636 -93747 -69442 -165096 -45026 -116557 -134469 -105086 -107435 -176994
2990 -176994 -142087 -140172 -117305 -133954 -183650 -146542 -127077 -152688 -72261 -162562 -158376 -161213
2978 -161213 -170425 -130481 -167605 -148491 -139527 -172916 -140329 -190634 -235094 -161284 -185417 -177672
2966 -177672 -195069 -125227 -106464 -209386 -191446 -239769 -186548 -106975 -215985 -182399 -148748
2955 -148748 -175759 -116531 -134088 -133563 -159401 -118257 -108466 -139072 -170651 -141044 -203146 -180905
2943 -180905 -229773 -127207 -123605 -134460 -186297 -224492 -126822 -179452 -145705 -107870 -111404 -82126
2931 -82126 -155495 -189566 -173936 -161642 -140396 -108958 -178558 -142755 -223955 -101141 -183243 -168390
2919 -168390 -103687 -157299 -112441 -153697 -172443 -225816 -103615 -169601 -170592 -218059 -104034 -108419
2907 -108419 -155919 -175559 -183294 -120195 -106330 -90908 -107596 -153932 -175650 -176814 -184492 -134235
2895 -134235 -212768 -112549 -105285 -166158 -130801 -157769 -161882 -58453 -136098 -142716 -179433 -129682
2883 -129682 -114939 -147059 -157004 -112169 -123297 -113761 -138974 -127338 -206349 -134578 -115508 -175897
2871 -175897 -143183 -146526 -185223 -160809 -161037 -160907 -193528 -120073 -128926 -149526 -148422 -193589 -161995
2858 -161995 -195307 -173001 -81346 -190508 -141022 -142110 -136031 -103659 -136754 -221171 -172748 -164370
2846 -164370 -178377 -169836 -168492 -188675 -144220 -167692 -142219 -79156 -158213 -183588 -243410 -132094
2834 -132094 -167007 -175988 -88548 -189704 -169349 -126732 -150484 -171754 -170000 -175860 -189430 -156968
2822 -156968 -162855 -81745 -151500 -166682 -124969 -200446 -122916 -141169 -149717 -158731 -208176 -148109
2810 -148109 -127475 -188065 -175988 -147076 -114314 -177413 -148476 -131031 -222429 -188744 -219585 -131172
2798 -131172 -174414 -94705 -158538 -174514 -156311 -95831 -152088 -137376 -95648 -185741 -181399 -127808
2786 -127808 -124790 -201085 -121039 -150003 -134618 -173614 -183149 -163052 -153378 -159169 -175876 -156343
2774 -156343 -104408 -154673 -102796 -150843 -204630 -166396 -184603 -155667 -99019 -173204 -148717 -185022
2762 -185022 -194844 -90713 -149724 -126717 -136646 -153801 -161921 -174534 -159009 -120566 -193690 -134044
2750 -134044 -165421 -158377 -188227 -130293 -166299 -158360 -156875 -111231 -242080 -114007 -207669 -213374
2738 -213374 -143009 -112213 -217264 -154617 -112029 -166254 -171937 -100064 -225262 -150216 -146133 -177798
2726 -177798 -145460 -152032 -160309 -151361 -146797 -110194 -136500 -153677 -207237 -180358 -104108 -166722
2714 -166722 -179984 -175349 -220662 -146596 -178359 -180066 -144966 -122679 -138993 -137215 -152920 -162450
2702 -162450 -119012 -93508 -194797 -146774 -150011 -134275 -152466 -150910 -152591 -171575 -120724 -174348
2690 -174348 -158272 -136414 -156173 -122201 -158576 -137635 -168822 -103270 -206469 -148730 -172784
2679 -172784 -151535 -108315 -173707 -185147 -151661 -145811 -113196 -186456 -159453 -161653 -147856 -176505
2667 -176505 -160508 -159824 -181834 -208027 -148971 -102533 -205601 -179102 -158206 -112020 -119599 -118759
2655 -118759 -122525 -172072 -129875 -164476 -156179 -188275 -155248 -200073 -149341 -153360 -181402 -122691
2643 -122691 -175103 -161465 -142947 -213729 -175358 -249186 -150603 -187295 -134659 -186793 -206115 -189361
2631 -189361 -173868 -123265 -219975 -174103 -176770 -156747 -145538 -136474 -132172 -171921 -103097 -140892
2619 -140892 -224916 -153207 -150953 -172886 -132134 -129823 -184725 -205504 -119955 -141876 -206681 -200808
2607 -200808 -205727 -175904 -169336 -140684 -190606 -153995 -181955 -211034 -210791 -115766 -183416 -181755 -158753
2594 -158753 -164714 -154651 -187113 -139804 -137463 -170088 -173440 -148576 -99433 -187716 -137335 -145115
2582 -145115 -192589 -108784 -122334 -112755 -155634 -93853 -198315 -152350 -63885 -112624 -111523 -91632
2570 -91632 -97242 -130793 -157913 -67211 -53270 -96965 -109243 -73267 -1408 -124054 -125454 -121233
2558 -121233 -144870 -121976 -111951 -130231 -134017 -159064 -149994 -159295 -175181 -103582 -147244 -131596
2546 -131596 -131058 -163971 -101028 -159005 -164331 -172086 -166616 -180551 -200939 -221999 -141828 -103215 -122916
2533 -122916 -145486 -246462 -130904 -94114 -169927 -179866 -120586 -147977 -224177 -134641 -173003
2522 -173003 -139121 -171728 -178990 -131912 -196581 -316034 -238970 -245502 -241155 -323492 -263488 -247728
2510 -247728 -331245 -283324 -301496 -209333 -323376 -219346 -121097 -127602 -96666 -143841 -166678
2499 -166678 -158180 -179985 -152464 -139555 -133299 -58000 -97193 -119039 -139207 -158154 -112814 -208400
2487 -208400 -159229 -182890 -128662 -137214 -137602 -116080 -197423 -110055 -79642 -72089 -58792 -66675 -109146
2474 -109146 -91341 -140789 -80224 -128396 -116486 -157447 -126334 -141502 -176136 -115050 -124797 -97353
2462 -97353 -172859 -140103 -132569 -63545 -103968 -154014 -50799 -12174 -101905 -58949 -84389 -88762
2450 -88762 -114689 -185780 -109438 -119520 -110565 -116387 -149531 -142600 -101445 -104017 -173929 -116165 -107463
2437 -107463 -125958 -130643 -146154 -206601 -154844 -160308 -175006 -210786 -199448 -244248 -148513 -131657
2425 -131657 -160387 -179715 -157417 -119667 -168864 -205217 -113876 -173146 -245126 -208267 -169952 -188322
2413 -188322 -164718 -232540 -194967 -163910 -164111 -148349 -150335 -209315 -183484 -222614 -190824 -197660
2401 -197660 -242857 -169807 -208362 -208480 -203932 -191002 -214946 -215230 -200002 -192842 -124294 -152757 -96714
2388 -96714 -105035 -180049 -160711 -157952 -184403 -123057 -215793 -111336 -130721 -132541 -101735 -162098
2376 -162098 -116213 -210254 -184346 -175892 -190880 -190762 -168160 -203182 -195620 -181646 -67488 -152324
2364 -152324 -142809 -126078 -189161 -148228 -173496 -120652 -191797 -107041 -137033 -13858 -158036
2353 -158036 -51332 -149078 -164599 -146287 -98964 -141228 -209879 -130225 -119156 -147650 -125562
2342 -125562 -131969 -160596 -172059 -121997 -135675 -148791 -125759 -101277 -157712 -81600 -102319 -170895
2330 -170895 -136360 -147835 -192877 -211465 -131155 -169344 -210305 -192046 -235843 -166174 -199895 -146545
2318 -146545 -207612 -108118 -193475 -113425 -158343 -103704 -112206 -125710 -144998 -143159 -161407 -174317
2306 -174317 -136173 -194628 -190193 -66696 -190553 -160843 -135948 -192911 -162435 -273790 -218353
2295 -218353 -221692 -250822 -191936 -171992 -172634 -134638 -160227 -177672 -142907 -152487 -170027 -124728
2283 -124728 -81404 -226129 -170109 -192178 -213938 -183671 -211577 -187751 -113813 -111319 -160124 -75799
2271 -75799 -97947 -149038 -140309 -94798 -146514 -153586 -158446 -203735 -111394 -124368 -139376 -162038
2259 -162038 -170043 -124477 -184587 -178199 -143733 -189357 -122768 -118554 -167919 -149127 -144605 -133371
2247 -133371 -156387 -176808 -165204 -232325 -162094 -151958 -192544 -189509 -163226 -182930 -146432 -132947
2235 -132947 -197019 -175371 -171565 -124146 -195363 -82448 -179723 -176294 -183904 -195752 -137136 -152067
2223 -152067 -78804 -139163 -178602 -145636 -157351 -149785 -196520 -144019 -192345 -154065 -169982 -138822
2211 -138822 -189164 -218000 -201809 -107874 -188877 -87448 -205528 -172896 -161038 -208056 -196405
2200 -196405 -143788 -153149 -188336 -203154 -146831 -127957 -176960 -185454 -194040 -98663 -132579 -127604
2188 -127604 -131727 -129081 -210496 -184779 -87339 -148995 -103817 -158957 -134105 -173149 -165748 -121957
2176 -121957 -162508 -137701 -159982 -164923 -236191 -117367 -123540 -175971 -81593 -139158 -81000 -114252
2164 -114252 -180007 -134900 -218262 -133686 -150134 -93835 -213388 -216165 -132795 -214628 -209641 -190248
2152 -190248 -152656 -185174 -115996 -160528 -174556 -105874 -191162 -154185 -143258 -215171 -195470 -174275
2140 -174275 -179142 -207841 -146444 -167580 -158790 -225304 -204749 -161444 -171115 -204938 -183148 -189979
2128 -189979 -150134 -240821 -137792 -150857 -183241 -234836 -190794 -185333 -190910 -182514 -202880 -139371
2116 -139371 -180423 -175351 -196449 -152445 -119599 -148090 -129286 -168434 -214069 -176561 -212388 -236218
2104 -236218 -185348 -89426 -185743 -198271 -132147 -154015 -222372 -232367 -149924 -143632 -154942 -182205
2092 -182205 -152375 -156161 -165918 -142441 -149663 -100411 -181123 -181646 -119781 -144809 -164867 -200717 -172699
2079 -172699 -209393 -133985 -156852 -143982 -164328 -123092 -232526 -152905 -181404 -159098 -153558 -195855
2067 -195855 -146686 -179288 -183951 -150241 -150993 -179578 -148917 -209951 -230082 -182021 -160413 -124216
2055 -124216 -159347 -139459 -206635 -188533 -215467 -175240 -179892 -199449 -128709 -121817 -167942 -178193
2043 -178193 -206287 -218895 -171183 -132050 -144196 -155453 -216881 -175034 -206518 -186032 -153351 -125750
2031 -125750 -160613 -203778 -225445 -214358 -134275 -89994 -199358 -164321 -94617 -160629 -126690
2020 -126690 -181871 -99818 -159280 -231088 -166400 -202985 -222601 -176740 -147254 -157744 -167026 -142036
2008 -142036 -165031 -162052 -183413 -176789 -219357 -230950 -219005 -169233 -149874 -180419 -187777 -197419
1996 -197419 -139878 -200505 -139584 -170893 -155985 -123306 -143439 -160821 -225793 -150966 -211433 -164417
1984 -164417 -175434 -148993 -194503 -103481 -191263 -155826 -71465 -233507 -168937 -279061 -201879
1973 -201879 -126622 -114697 -167289 -143769 -186312 -189151 -187018 -209211 -153680 -169651 -215764 -167024
1961 -167024 -176873 -183131 -185773 -176341 -213921 -158479 -182153 -185907 -132916 -157881 -154780 -211851 -123680
1948 -123680 -128506 -161534 -147820 -173522 -229655 -174061 -85208 -174485 -221203 -160552 -107992 -225991
1936 -225991 -150706 -215502 -171151 -165935 -183106 -160554 -71284 -149482 -139883 -204146 -188335 -195516
1924 -195516 -145907 -130473 -108559 -131842 -183463 -155002 -117046 -128513 -207881 -175824 -126039 -199327
1912 -199327 -226002 -179294 -208339 -191168 -223709 -231435 -134297 -115110 -208263 -187476 -203863 -129706
1900 -129706 -203257 -241630 -197209 -200169 -218722 -203426 -177393 -171528 -220762 -147420 -176681 -188362
1888 -188362 -121370 -167553 -138671 -100991 -125037 -170196 -167989 -156562 -137363 -193597 -195823 -208790
1876 -208790 -192565 -175321 -173501 -182196 -144057 -158749 -84525 -149807 -151218 -179178 -174941 -183439 -195310
1863 -195310 -139270 -211030 -237648 -175316 -171306 -270722 -173694 -174570 -133282 -201453 -133589 -158882
1851 -158882 -194010 -143152 -191883 -196622 -249859 -155108 -159676 -197870 -207024 -234809 -196234 -224363
1839 -224363 -205649 -212431 -140214 -229118 -243188 -211879 -184684 -141175 -54751 -162321 -157937 -159504
1827 -159504 -172216 -167262 -173841 -128870 -139278 -210832 -237217 -212834 -199820 -184544 -202711 -190377
1815 -190377 -167572 -126434 -139522 -205323 -134722 -109546 -195252 -194821 -237498 -155898 -207596 -213956
1803 -213956 -157474 -173473 -135772 -183843 -134158 -186188 -223933 -188303 -193985 -222742 -189883 -225781
1791 -225781 -174689 -192630 -186948 -155581 -247796 -229269 -185642 -151792 -198994 -126577 -194779 -121537
1779 -121537 -181685 -178579 -197771 -184132 -136284 -217380 -237903 -150416 -226137 -176060 -86621 -184123
1767 -184123 -199413 -146913 -143004 -175328 -188497 -180882 -175492 -139988 -123655 -211500 -170582 -212633
1755 -212633 -208268 -170058 -122215 -131367 -207053 -207436 -132052 -143163 -124458 -184803 -137646 -182766
1743 -182766 -256494 -161710 -256195 -156810 -141320 -210195 -174973 -185154 -220230 -179013 -156580 -147391
1731 -147391 -136211 -186220 -157743 -188694 -217967 -147531 -183284 -220170 -136382 -233083 -162284 -111315
1719 -111315 -174750 -232580 -202236 -208470 -253587 -186109 -184617 -203286 -203060 -252273 -198208 -253922
1707 -253922 -166015 -146603 -150105 -198948 -219066 -127450 -270559 -249531 -225000 -260010 -161417 -195092
1695 -195092 -94777 -207013 -184927 -203259 -204457 -170494 -205383 -174968 -127614 -212692 -214723 -233633
1683 -233633 -214683 -217394 -234692 -214184 -241920 -214952 -147335 -184372 -78052 -130397 -111328 -186499
1671 -186499 -159323 -161166 -110691 -245089 -189797 -240623 -225492 -122787 -197356 -160356 -228588
1660 -228588 -187486 -95773 -153502 -144910 -124480 -131707 -124600 -187171 -133157 -160867 -56226 -144884
1648 -144884 -128536 -143148 -196468 -204065 -156768 -152291 -135182 -173868 -121007 -141966 -162142 -198289
1636 -198289 -127610 -153472 -178862 -164256 -136315 -164713 -160984 -199751 -224163 -169934 -221120 -212632
1624 -212632 -178352 -190975 -215612 -164159 -178344 -172219 -166866 -201443 -79879 -176884 -225663 -263900
1612 -263900 -166983 -179929 -145389 -207848 -224352 -222212 -201582 -181332 -199228 -181224 -220820 -127772
1600 -127772 -209705 -153186 -186830 -201493 -170993 -258239 -183797 -199786 -236680 -191967 -240128 -219938
1588 -219938 -201585 -183394 -182049 -186160 -161148 -227862 -207167 -189998 -222148 -261530 -216761 -217124
1576 -217124 -165596 -193850 -172018 -126390 -169107 -121751 -131468 -139980 -180889 -169452 -198868 -216544
1564 -216544 -144600 -161633 -159975 -153365 -186341 -216323 -144641 -165354 -215421 -216165 -137520 -177997
1552 -177997 -141064 -152157 -121169 -201084 -166914 -186356 -202425 -201487 -205638 -189220 -98354 -185465
1540 -185465 -228153 -177745 -139390 -156773 -148487 -202934 -167797 -241660 -142783 -233110 -160802 -156622
1528 -156622 -197383 -247973 -259864 -134648 -190570 -154736 -171139 -164453 -167176 -205396 -180479 -232453
1516 -232453 -133470 -201172 -170555 -234235 -203966 -147814 -244652 -163993 -161562 -187423 -195425 -198481
1504 -198481 -279316 -141184 -138929 -240502 -187432 -182932 -188296 -155789 -248108 -242577 -186746 -235864
1492 -235864 -159116 -172921 -219302 -199146 -201257 -180964 -243034 -197324 -219678 -230663 -204048 -190714
1480 -190714 -196490 -219444 -148748 -193263 -208598 -229563 -178586 -163562 -204111 -213856 -224638 -141870
1468 -141870 -185233 -175131 -230399 -215300 -171489 -191648 -168553 -217720 -134203 -141479 -83419 -124541
1456 -124541 -127734 -144286 -119016 -147539 -134636 -133744 -169915 -85091 -156697 -159142 -219582 -161939
1444 -161939 -179316 -155496 -166238 -157699 -125557 -121844 -141695 -146464 -141084 -183472 -130491 -163764
1432 -163764 -143447 -140979 -130525 -222591 -172493 -168375 -180929 -230160 -170835 -219265 -163419 -144542
1420 -144542 -132375 -186641 -233226 -261845 -215474 -234031 -203983 -224144 -145733 -251980 -168199
1409 -168199 -166929 -204226 -263751 -250316 -119920 -230627 -168596 -196787 -187897 -191627 -152599 -212839
1397 -212839 -197741 -207976 -186436 -150000 -137476 -132500 -156293 -182865 -86089 -127906 -153540 -171889
1385 -171889 -221555 -73292 -139314 -162335 -194621 -147791 -93677 -131990 -173367 -149977 -191642
1374 -191642 -227470 -169674 -112362 -96680 -118890 -109187 -209527 -178929 -180236 -164047 -161851 -211917
1362 -211917 -128075 -207537 -130918 -162627 -195323 -117142 -150896 -160330 -106867 -214210 -170158 -138862
1350 -138862 -112083 -160821 -182402 -162322 -142536 -163057 -112938 -184738 -175570 -163924 -176047 -181196
1338 -181196 -183525 -210364 -210157 -238914 -154972 -198727 -177760 -226441 -178586 -216228 -193762 -162547
1326 -162547 -191255 -213072 -227151 -159759 -164789 -175189 -178569 -207051 -268442 -205475 -199800 -198168
1314 -198168 -208799 -179462 -230872 -195172 -148911 -147544 -194271 -179962 -186052 -199352 -249615 -265390
1302 -265390 -260098 -265539 -218977 -192040 -238083 -263705 -219280 -191221 -196379 -223127 -194421 -180799
1290 -180799 -108185 -203892 -272245 -184677 -208511 -146939 -199578 -231727 -193517 -186766 -221014 -165997
1278 -165997 -217695 -140308 -159383 -177509 -223258 -144185 -202260 -187712 -177626 -169513 -261462 -146368
1266 -146368 -228114 -217592 -130056 -204049 -137185 -221595 -266836 -162366 -183441 -178450 -149101 -127154
1254 -127154 -167068 -103650 -150312 -136522 -164203 -88473 -150224 -168464 -208575 -155313 -183399 -179823
1242 -179823 -178064 -204286 -208955 -181309 -196666 -143246 -206618 -161497 -160898 -147222 -147779 -202331 -149376
1229 -149376 -165347 -139757 -157649 -159033 -260575 -170144 -96931 -141383 -213445 -134648 -168310 -166888
1217 -166888 -189919 -152116 -196320 -159792 -167812 -210931 -207580 -257402 -219804 -278911 -188151 -189306
1205 -189306 -199219 -134115 -175336 -191869 -235871 -179094 -210765 -246372 -131627 -183657 -150971 -180253
1193 -180253 -269484 -178933 -227936 -242466 -199508 -149268 -214896 -184434 -189235 -159906 -206694 -223284
1181 -223284 -267398 -227338 -198917 -213042 -197783 -200973 -206179 -193782 -168554 -149218 -247812 -174248
1169 -174248 -248394 -201122 -236637 -177682 -167743 -170994 -180574 -236357 -178199 -218567 -193599 -130647
1157 -130647 -166726 -116209 -188159 -178213 -155068 -192838 -194638 -106456 -199134 -130042 -196871 -171767
1145 -171767 -190173 -145624 -236036 -207281 -137961 -201406 -204648 -232635 -198573 -227561 -289918 -212455
1133 -212455 -147721 -171863 -209987 -161238 -138555 -175975 -203097 -153073 -184577 -125244 -232919
1122 -232919 -167692 -192777 -176488 -150330 -195567 -192091 -133619 -157989 -99852 -132727 -177929 -158756
1110 -158756 -196724 -197678 -215070 -183762 -167706 -210776 -162250 -183356 -202025 -173698 -168992 -250048
1098 -250048 -147903 -145463 -118381 -136417 -183344 -123327 -158382 -208904 -140932 -185358 -219021 -256039
1086 -256039 -204576 -154650 -202294 -234031 -185104 -184402 -156064 -185648 -191708 -180669 -155736 -251454
1074 -251454 -248365 -200832 -212058 -252472 -202593 -132049 -112550 -146433 -263090 -220287 -185957 -180977
1062 -180977 -206270 -241113 -142430 -204957 -187883 -162366 -172529 -221614 -197524 -204747 -205600 -144135
1050 -144135 -166062 -207240 -141660 -208598 -271908 -209754 -126142 -210453 -200218 -201073 -187265 -209929
1038 -209929 -182024 -229997 -195097 -172842 -212680 -245029 -237900 -218427 -158001 -233237 -216416 -206746
1026 -206746 -234731 -215589 -218459 -179297 -212968 -180904 -202228 -184562 -213256 -188423 -205212 -203364
1014 -203364 -201241 -155165 -179335 -149267 -169584 -257669 -228396 -172044 -181186 -160538 -127253 -199835
1002 -199835 -137123 -234270 -205007 -211023 -161106 -196093 -232101 -131461 -166619 -165465 -223142 -241648
990 -241648 -223765 -155629 -181490 -224118 -207629 -207549 -231772 -219345 -224445 -200383 -217245 -207056 -176399
977 -176399 -165622 -190210 -115377 -207484 -119691 -197351 -184534 -216687 -229917 -162846 -198720 -170847
965 -170847 -134603 -194395 -225200 -206568 -182160 -210513 -156593 -175064 -109338 -219799 -191330 -154078
953 -154078 -164633 -201096 -95995 -169751 -223044 -173779 -232702 -215868 -180725 -191675 -211161 -225864
941 -225864 -114864 -193102 -113680 -150498 -263378 -161851 -150062 -139340 -161683 -202054 -195677
930 -195677 -183303 -192938 -162417 -169749 -203097 -154722 -110354 -182240 -150242 -154671 -129237 -120118 -184732
917 -184732 -196388 -165775 -243606 -227721 -215083 -195732 -194542 -211141 -179564 -159630 -126952 -158649
905 -158649 -157805 -228466 -223770 -156880 -93887 -207066 -201048 -168211 -234762 -185194 -199808 -186758
893 -186758 -175266 -200429 -238611 -181331 -213684 -196339 -163490 -197311 -186190 -206280 -234844 -179189
881 -179189 -161837 -228828 -158984 -154762 -174612 -197610 -132670 -279319 -252351 -175038 -246388 -256528
869 -256528 -210066 -145428 -239293 -134570 -177517 -204659 -199146 -180579 -226726 -224877 -213319 -205384
857 -205384 -212328 -258761 -169997 -175176 -247429 -168617 -241822 -155028 -125918 -175945 -138184 -159057
845 -159057 -200626 -171410 -200779 -210671 -229980 -183588 -153127 -186157 -223254 -167687 -212788 -207110
833 -207110 -173575 -221128 -161845 -244763 -213918 -148705 -192390 -235061 -262498 -240587 -245070 -194379
821 -194379 -220923 -164610 -192320 -152121 -244698 -201087 -196797 -163167 -142641 -202934 -154017 -178363
809 -178363 -209706 -193732 -234053 -139930 -191423 -197464 -205019 -198558 -191527 -248096 -222598 -139769 -202600
796 -202600 -224362 -211801 -224589 -252099 -173335 -180326 -295218 -231024 -187363 -231770 -177437 -249118
784 -249118 -232903 -208254 -214211 -201742 -225977 -190146 -126797 -174342 -143403 -211705 -147506 -256988
772 -256988 -194310 -189803 -196503 -210932 -225266 -227161 -175398 -195651 -143179 -159961 -162421 -153525 -245709
759 -245709 -225219 -159246 -179976 -199290 -201625 -179042 -220056 -181802 -191824 -227604 -185392 -162709
747 -162709 -192416 -143525 -158350 -152413 -116261 -133335 -214754 -202766 -137993 -151709 -229544 -168301
735 -168301 -196659 -272690 -211672 -129933 -110287 -178384 -100746 -194204 -138705 -174903 -177768 -133858
723 -133858 -151566 -199774 -163162 -126908 -222018 -200590 -171634 -148664 -160831 -176611 -240472 -162849
711 -162849 -177133 -176323 -180094 -168522 -236138 -230407 -184326 -224671 -173305 -189330 -177238 -206357 -159707
698 -159707 -197935 -153484 -146930 -174286 -179463 -181106 -182308 -106609 -234061 -230302 -208505 -201058 -136437
685 -136437 -229059 -198623 -202606 -147919 -171477 -186934 -197056 -228991 -186529 -202179 -196857 -192094
673 -192094 -251766 -121829 -246077 -210055 -200008 -133645 -172058 -213503 -118431 -156896 -166324 -147893
661 -147893 -147821 -209743 -164027 -220989 -192476 -158569 -204709 -204795 -196675 -186491 -158408 -95874 -140923
648 -140923 -162400 -166393 -145137 -195272 -71713 -118415 -148736 -138476 -98739 -141227 -163751 -159528
636 -159528 -132982 -172251 -168344 -176281 -125955 -234983 -168412 -185426 -218606 -189241 -32004 -198193
624 -198193 -130946 -115265 -95976 -169240 -195327 -184380 -135421 -153800 -228662 -152671 -139414 -73783
612 -73783 -140505 -112789 -109865 -146413 -170490 -226470 -178854 -183849 -183335 -162612 -157601 -166700 -163572
599 -163572 -245344 -245765 -264953 -190145 -192341 -177652 -158860 -171838 -174719 -181152 -197541 -136212 -219914
586 -219914 -177312 -207000 -161032 -210802 -262026 -194336 -174151 -223518 -193682 -106507 -176846 -194412
574 -194412 -160513 -236045 -260364 -142347 -230498 -158875 -187711 -238283 -168042 -180853 -148702 -202173
562 -202173 -168939 -199517 -270905 -177988 -205370 -222314 -167053 -195778 -174418 -206095 -178593 -236313
550 -236313 -264843 -164222 -174204 -219451 -174527 -255056 -122324 -175563 -256523 -224519 -179247 -169261
538 -169261 -161473 -193390 -160109 -184904 -160371 -156754 -174400 -206638 -171234 -200294 -160223 -189763
526 -189763 -230168 -231451 -173036 -175105 -210410 -189648 -118409 -124942 -92723 -187732 -197547 -181149 -189883
513 -189883 -203238 -216374 -165002 -228200 -163675 -195691 -198662 -154244 -181096 -202672 -147487 -228533
501 -228533 -197498 -160565 -186693 -163532 -131812 -234481 -246496 -245186 -182831 -154190 -234950 -226676
489 -226676 -209392 -158377 -207269 -199938 -185251 -192759 -200624 -213604 -159073 -149992 -183615 -241030 -238012
476 -238012 -268491 -211137 -241589 -155489 -217588 -184168 -179123 -193104 -189196 -162296 -231383 -180011
464 -180011 -154942 -173322 -200653 -198288 -264651 -197800 -244830 -182375 -217256 -170187 -107555 -167042
452 -167042 -225771 -196302 -217581 -139779 -196731 -163473 -220806 -212025 -229665 -279921 -267128 -188172
440 -188172 -235761 -193916 -223474 -197127 -191410 -197003 -171297 -155217 -223681 -273492 -214956 -169206
428 -169206 -145058 -178729 -169982 -174871 -248352 -211922 -221244 -214453 -216218 -153213 -217088 -239182 -157539
415 -157539 -202493 -180783 -188157 -222255 -236421 -193527 -102245 -250825 -197269 -153101 -196860 -241431
403 -241431 -174103 -202633 -177960 -222536 -149132 -206149 -227626 -209592 -161380 -156022 -181407 -210524
391 -210524 -160164 -224638 -246334 -152766 -226581 -167922 -207168 -205047 -234864 -259287 -218312 -222755
379 -222755 -231310 -222845 -240190 -232515 -209432 -246814 -241427 -154962 -189276 -225610 -168160 -243298 -216434
366 -216434 -200630 -205088 -142922 -233604 -133761 -202113 -184020 -224378 -218335 -198412 -221613 -223897
354 -223897 -219490 -234950 -226227 -238750 -152057 -114143 -212796 -148145 -183984 -244035 -278893 -193640
342 -193640 -197234 -215125 -239678 -215658 -228953 -198060 -190400 -240165 -231710 -182432 -206275 -234311
330 -234311 -213723 -189464 -224750 -184807 -221687 -126746 -217136 -195077 -243096 -241051 -199647 -191588
318 -191588 -182873 -184979 -186071 -173877 -207961 -201544 -186239 -207478 -175276 -199290 -202414 -206898 -170645
305 -170645 -223660 -212726 -216235 -169246 -147397 -210785 -116812 -210560 -156062 -156268 -188209 -207177
293 -207177 -187079 -168017 -217642 -238767 -179180 -224860 -181626 -222676 -190360 -246326 -218697 -197035
281 -197035 -176931 -175680 -114910 -244115 -192450 -190186 -153664 -150280 -181365 -226512 -216203 -167139
269 -167139 -190939 -211857 -225259 -202700 -190720 -208137 -272840 -174131 -211623 -138343 -176886 -209227
257 -209227 -162280 -179967 -184477 -278685 -185814 -238725 -250219 -268447 -214108 -155135 -200173 -255268
245 -255268 -193552 -255383 -250464 -172678 -204165 -272918 -179239 -212967 -220432 -244796 -268822 -210777
233 -210777 -216592 -207185 -149750 -205121 -155468 -218994 -182765 -261533 -200853 -248573 -224533 -219860
221 -219860 -210342 -197362 -199681 -176181 -247176 -156494 -187548 -208878 -187761 -254965 -207687 -203051
209 -203051 -171385 -190380 -148710 -206913 -261858 -203417 -193700 -143597 -219103 -234648 -209321 -287972
197 -287972 -259842 -220670 -197028 -150170 -242250 -197665 -239533 -169727 -198794 -204288 -191190 -137344
185 -137344 -253718 -223990 -206184 -210285 -188111 -222805 -227486 -185958 -180214 -164337 -183300 -202857
173 -202857 -158187 -217300 -223395 -168530 -250976 -230023 -212186 -198744 -246725 -199136 -212748 -168631
161 -168631 -276208 -185194 -216162 -167534 -176742 -221820 -222435 -173806 -167658 -167219 -229538 -208649 -215080
148 -215080 -198714 -242613 -192478 -177993 -260389 -250434 -204715 -241550 -255380 -202416 -158738 -190946
136 -190946 -235792 -200666 -221003 -284420 -172199 -167323 -178975 -212540 -257973 -243991 -253567 -236167
124 -236167 -260031 -245285 -235691 -225384 -211448 -203443 -212013 -242432 -250619 -219806 -246900 -277136 -225219
111 -225219 -218677 -231241 -227662 -204823 -225476 -236753 -261852 -205818 -251356 -245423 -246541 -246635 -228879
98 -228879 -230541 -201060 -243822 -191410 -237224 -209235 -265796 -229699 -231243 -275951 -241417 -201729
86 -201729 -317692 -257544 -277375 -236615 -210619 -255606 -269568 -232060 -224530 -233743 -275482 -203325
74 -203325 -229017 -297269 -220068 -246274 -242624 -279609 -268018 -241693 -264090 -226295 -272374 -267479
62 -267479 -291081 -279764 -268387 -262009 -231195 -246247 -181734 -268785 -253252 -292867 -257322 -266955
50 -266955 -284890 -273051 -285361 -240002 -201710 -222980 -208103 -206546 -291330 -273493 -287924 -275418
38 -275418 -258022 -261989 -264336 -309466 -292033 -281430 -245677 -262568 -218503 -273683 -209910 -265435
26 -265435 -292018 -278799 -240925 -243344 -236455 -303327 -284654 -254627 -266679 -265317 -296784 -312324 -326164
13 -326164 -283655 -258338 -309130 -283703 -272598 -289275 -283764 -274506 -327342 -274137 -278511 -344688 -289615
0 -289615
$$ Imaginary data points
##PAGE= N=2
##DATA TABLE= (X++(I..I)), XYDATA
16383 -477862 -488651 -505121 -463935 -420158 -402018 -463399 -385084 -416695 -417609 -399329 -349124 -386415
16371 -386415 -399374 -338494 -344640 -315283 -305704 -277353 -315447 -284134 -293550 -237488 -256723 -251969
16359 -251969 -243701 -254550 -266330 -209134 -261502 -142242 -164404 -155453 -135804 -191662 -152546 -107292
16347 -107292 -68688 -95215 -134157 -96497 -102669 -69999 -35646 -55453 -17052 13031 29876 -17005
16335 -17005 28543 6032 -4826 35875 41686 36728 58653 47898 108299 128491 177940 107705
16323 107705 151595 153412 141414 115942 172759 151249 217934 142517 167148 221829 265244 180197
16311 180197 247002 257658 297281 330214 254845 331664 310592 264521 373226 316654 380199
16300 380199 339669 362291 332775 350696 384121 349934 386534 413819 389334 474275 466108 449335
16288 449335 508826 462521 460286 439944 429466 460369 486581 468263 539943 549269 495791 553317
16276 553317 550412 575899 582157 640240 625267 598594 622558 608392 616802 612458 619034 598068
16264 598068 673608 682055 552821 627241 707062 752011 699552 693185 693598 751297 702396 649255
16252 649255 738307 690075 752236 698799 710862 779585 709075 766615 769048 805298 779144 764145
16240 764145 742684 795186 825450 782261 801635 754943 807013 753472 755553 813119 789782 794566
16228 794566 852788 911181 833543 878533 841336 883272 863587 911193 891372 859056 875355
16217 875355 848120 833446 924096 890086 864046 875896 989076 907985 931856 906630 934522
16206 934522 874601 958191 979554 900506 985165 1009668 989486 995676 920546 998229 961627 984621
16194 984621 1073006 964917 1000930 980550 1097248 1071383 1039929 1058693 1107053 1069519 1020256
16183 1020256 1020132 1041953 1030096 1054663 1110825 1041414 1078734 1046064 1034440 1040311 1009708 1045091
16171 1045091 1084420 1057889 1057539 1094850 1057671 1001942 1034963 1028376 1111017 1118248 1100062 1048358
16159 1048358 1097277 1117068 1142672 1120756 1074393 1131975 1160614 1118103 1173272 1088128 1133608
16148 1133608 1102467 1090791 1137307 1131084 1223265 1138878 1164566 1176459 1204341 1130145 1094669
16137 1094669 1154675 1209038 1154562 1152073 1109264 1158095 1156014 1154206 1144564 1189995 1169812 1145121
16125 1145121 1133910 1156558 1188578 1117117 1148626 1080494 1178577 1147358 1160001 1118641 1131264
16114 1131264 1142566 1183319 1206001 1216341 1174444 1239337 1242960 1203399 1205684 1193078 1159620 1168514
16102 1168514 1210335 1149218 1120387 1237718 1199568 1211403 1189876 1222644 1168897 1228469 1245788
16091 1245788 1222139 1239774 1208718 1208346 1201617 1155837 1172361 1230684 1237318 1223148 1201719 1174752
16079 1174752 1237983 1136550 1251956 1223836 1212617 1161112 1206906 1218858 1211600 1158606 1157483
16068 1157483 1171920 1219620 1147886 1175198 1240861 1271664 1238686 1157827 1172133 1247400 1252412
16057 1252412 1181778 1193139 1211494 1252650 1273171 1291726 1277155 1196016 1207290 1228096 1161975
16046 1161975 1192307 1290252 1250935 1222604 1219729 1237601 1224158 1221428 1249870 1224781 1179686 1200956
16034 1200956 1149810 1171142 1240727 1197822 1155953 1214252 1214674 1249062 1289086 1220408 1219001 1255098
16022 1255098 1279587 1197766 1213746 1223424 1196859 1160342 1255071 1224756 1262590 1225879 1250254
16011 1250254 1293093 1178591 1218882 1237645 1220522 1232817 1247103 1221209 1282341 1227015 1266108
16000 1266108 1283982 1252106 1214668 1209739 1213450 1206921 1258064 1189976 1277737 1199855 1212537 1239817
15988 1239817 1189011 1248427 1301930 1201178 1230700 1252555 1258984 1243068 1191338 1215229 1205055
15977 1205055 1234881 1191575 1224156 1239974 1172073 1259350 1283001 1230723 1190705 1277757 1278569 1203829
15965 1203829 1152712 1228365 1214658 1227348 1346280 1296418 1212820 1249507 1269669 1202497 1239664
15954 1239664 1200215 1222961 1182799 1208288 1213035 1128828 1196546 1143763 1178401 1278663 1232310
15943 1232310 1219999 1237262 1188385 1266186 1195975 1217801 1189530 1215366 1200442 1226897 1213111
15932 1213111 1255747 1209159 1213584 1230997 1264262 1222759 1236487 1240403 1264590 1199925 1143945 1168256
15920 1168256 1278344 1184384 1259199 1230979 1215061 1237031 1276798 1313161 1254302 1193174 1263131
15909 1263131 1224198 1255331 1254111 1186941 1269439 1234740 1254634 1262413 1220872 1262553 1230495 1291896
15897 1291896 1265479 1258017 1255315 1231193 1274425 1251685 1246978 1227502 1285757 1221586 1239229 1211514
15885 1211514 1253333 1275057 1260298 1278384 1277109 1230565 1228412 1296543 1269634 1275367 1280055 1237383
15873 1237383 1302624 1283226 1220687 1225909 1240721 1198281 1235127 1250702 1222842 1268586 1311083
15862 1311083 1299828 1296145 1288051 1287463 1259915 1256911 1267359 1237458 1238885 1201714 1263265 1237090
15850 1237090 1268948 1189099 1289577 1241598 1245404 1246868 1195264 1225510 1269321 1254634 1239292
15839 1239292 1244167 1235647 1292728 1234772 1260740 1214329 1194186 1219131 1239581 1236309 1287674 1254986
15827 1254986 1259252 1272340 1191436 1242986 1273002 1273443 1275546 1276397 1172439 1242622 1219161 1254944
15815 1254944 1269308 1286400 1276791 1230227 1276464 1240555 1207506 1212635 1307146 1291162 1254293 1284873
15803 1284873 1271579 1291405 1262758 1296545 1278676 1241759 1316241 1292978 1217155 1306494 1293252
15792 1293252 1344907 1304362 1261156 1224689 1346191 1219246 1211986 1215517 1208490 1319625 1288147
15781 1288147 1213858 1252067 1284869 1244701 1244395 1268059 1287691 1347617 1306930 1248734 1341473 1276358
15769 1276358 1230552 1237344 1255630 1272938 1270600 1247565 1257116 1287509 1239816 1286424 1303395 1217298
15757 1217298 1294485 1218060 1241741 1296940 1279955 1242595 1244021 1225962 1237300 1215224 1245906
15746 1245906 1282652 1244874 1271119 1230279 1256968 1263905 1272612 1264347 1243761 1254075 1221994 1258876
15734 1258876 1275969 1200600 1266028 1220679 1218167 1263734 1342099 1263603 1237936 1195400 1325659
15723 1325659 1264076 1273478 1220989 1295947 1283366 1285393 1279864 1263821 1270543 1213885 1302208 1286458
15711 1286458 1292346 1263403 1264190 1285879 1177947 1237208 1328890 1304035 1267844 1267149 1293883 1201728
15699 1201728 1268907 1341056 1330368 1280580 1253163 1293700 1267236 1304222 1251837 1303473 1259062
15688 1259062 1321899 1240739 1248270 1339141 1220792 1316011 1240461 1268706 1291588 1266786 1303228
15677 1303228 1265417 1294914 1201356 1252624 1306356 1281980 1258579 1273644 1358905 1267435 1312656
15666 1312656 1311084 1332087 1256894 1332120 1249151 1290362 1270021 1245963 1244768 1244836 1268290 1360461
15654 1360461 1245192 1274036 1324837 1323590 1369733 1319420 1316521 1323903 1264830 1313577 1268431 1269281
15642 1269281 1281120 1338211 1216477 1258981 1283948 1180493 1237861 1275082 1250414 1290461 1236882
15631 1236882 1262728 1223731 1348853 1328710 1245290 1294568 1260020 1345847 1263845 1311458 1240241
15620 1240241 1338326 1349187 1280775 1313980 1319715 1241954 1269791 1288194 1275823 1217516 1272454
15609 1272454 1276235 1205675 1299848 1234445 1325847 1305967 1242459 1245105 1285422 1379939 1222597
15598 1222597 1226758 1309678 1197724 1317834 1278173 1283955 1326307 1293743 1303694 1298793 1340030 1291651
15586 1291651 1260097 1319452 1255187 1334155 1284821 1318956 1322655 1289510 1334558 1290016 1310526
15575 1310526 1332737 1234380 1292575 1250520 1275948 1347210 1241867 1223838 1307073 1298112 1270451
15564 1270451 1282616 1321595 1354141 1333774 1299790 1318677 1291681 1291788 1285494 1301772 1215775 1249215
15552 1249215 1227365 1270526 1266021 1292554 1327826 1303788 1275144 1248708 1292561 1358555 1274047
15541 1274047 1303584 1335982 1330803 1314438 1362519 1294116 1280128 1261996 1305693 1297403 1302730 1251873
15529 1251873 1269390 1295400 1224844 1266291 1305081 1342420 1359724 1272979 1367597 1379803 1329310
15518 1329310 1351591 1301438 1264699 1312453 1329584 1295160 1296853 1332256 1248196 1391230 1327045
15507 1327045 1304283 1325796 1279186 1285952 1354040 1319388 1323814 1260414 1362841 1313172 1256889
15496 1256889 1372245 1364359 1292941 1258657 1334543 1311869 1290476 1328775 1360404 1325364 1301763
15485 1301763 1300921 1336350 1300492 1325326 1318442 1338446 1256799 1310918 1290315 1293575 1294816 1412627
15473 1412627 1373568 1321942 1287991 1383720 1334696 1362574 1278080 1291473 1296464 1306790 1327919
15462 1327919 1226063 1261966 1303574 1341644 1288052 1302239 1318444 1289590 1323470 1385060 1385952
15451 1385952 1362014 1375254 1324061 1394576 1334281 1293140 1360657 1397269 1338993 1320846 1326733
15440 1326733 1314516 1355129 1328342 1379046 1316946 1357350 1308371 1327026 1360411 1379745 1366427
15429 1366427 1275479 1264741 1332655 1316203 1328353 1324327 1297570 1295064 1273425 1387951 1345500
15418 1345500 1321565 1358035 1327816 1263202 1379857 1293243 1345804 1365582 1393652 1378626 1314344
15407 1314344 1277826 1345712 1331847 1278447 1340451 1292065 1330575 1272887 1312934 1319863 1352151
15396 1352151 1282979 1332104 1283555 1356266 1279654 1281536 1315439 1336728 1345727 1315586 1284472 1284972
15384 1284972 1349591 1360675 1285186 1273670 1339825 1320632 1362137 1385895 1360598 1326182 1322945
15373 1322945 1343915 1343067 1334535 1295651 1361785 1305620 1323689 1269356 1337746 1351892 1369587 1353763
15361 1353763 1323712 1320370 1307654 1368192 1317196 1306639 1385656 1313023 1338795 1352232 1353333 1373803
15349 1373803 1378279 1356518 1321979 1301171 1354904 1302021 1322958 1337633 1408282 1393155 1391484 1350404
15337 1350404 1305408 1287996 1285077 1287572 1364911 1357935 1344820 1346361 1335770 1376532 1347806 1372134
15325 1372134 1368111 1322418 1375693 1390550 1392370 1375173 1323360 1319123 1310637 1309748 1389200 1303802
15313 1303802 1309196 1330277 1292583 1377207 1388040 1318981 1379411 1409941 1396592 1349430 1368909
15302 1368909 1377490 1369540 1400362 1371871 1310613 1292921 1307228 1341480 1336609 1339901 1402916 1352704
15290 1352704 1304650 1346195 1363247 1336081 1432542 1321109 1346041 1348035 1354973 1323144 1374657
15279 1374657 1362008 1346487 1363810 1388482 1375704 1297778 1334358 1357407 1368070 1379735 1310803
15268 1310803 1366436 1343826 1346608 1278251 1361086 1295514 1302329 1348465 1288170 1336820 1358526 1366313
15256 1366313 1327356 1424308 1301357 1327345 1317488 1359425 1354683 1287403 1360928 1337465 1308799
15245 1308799 1277823 1318186 1288277 1318715 1331862 1398674 1362557 1253094 1331921 1319522 1346925
$$ [...]
##END NTUPLES=NMR SPECTRUM
##END=
