##TITLE=abcd
##JCAMPDX= 6.0         $$ Bruker NMR JCAMP-DX V2.0
##DATA TYPE= NMR SPECTRUM
##DATA CLASS= NTUPLES
##ORIGIN= UXNMR, Bruker Analytische Messtechnik GmbH
##OWNER= root
$$ XWIN-NMR		Version 3.5
$$ Thu Apr  2 18:24:18 2026 Russian Standard Time (UT+4h)  servis@DPX200
##.OBSERVE FREQUENCY= 200.131235884673
##.OBSERVE NUCLEUS= ^1H
##.ACQUISITION MODE= SIMULTANEOUS
##.ACQUISITION SCHEME= undefined
##.AVERAGES= 32
##.DIGITISER RES= 18
##SPECTROMETER/DATA SYSTEM= spect
##.PULSE SEQUENCE= zg
##.SOLVENT NAME= CDCl3
##.SHIFT REFERENCE= (INTERNAL, CDCl3, 0, 16.4885)
##AUDIT TRAIL= $$ (NUMBER, WHEN, WHO, WHERE, WHAT)
$$ ##TITLE= Audit trail, XWIN-NMR		Version 3.5
$$ ##JCAMPDX= 5.01
$$ ##ORIGIN= Bruker BioSpin GmbH
$$ ##OWNER= servis
$$ F:\spectra/data/av/nmr/H1/1/pdata/1/auditp.txt
$$ ##AUDIT TRAIL=  $$ (NUMBER, WHEN, WHO, WHERE, WHAT)
(   1,<2026-04-02 18:23:18.75 +0400>,<servis>,<DPX200>,
      <created by zg, POWCHK disabled, PULCHK disabled
       configuration hash MD5:
       00 E9 B6 7A A2 85 ED C7 34 08 36 98 17 FE 4E 26
       data hash MD5: 32K
       AF 41 EA B7 40 B4 50 9C FE B5 1B 95 F1 61 63 4E>)
(   2,<2026-04-02 18:23:48.42 +0400>,<servis>,<DPX200>,
      <Start of raw data processing
       efp BC_mod = 2 LB = 0.05 FT_mod = 6 PKNL = 1 PHC0 = -266.7951 PHC1 = -0.898437 SI = 16K 
       data hash MD5: 16K
       A2 E7 FB 64 0B 01 56 83 99 44 2B 1F 8B 42 5B 05>)
(   3,<2026-04-02 18:23:58.71 +0400>,<servis>,<DPX200>,
      <pk PHC0 = 2.8 PHC1 = 0 
       data hash MD5: 16K
       33 D3 E5 DF 8A 00 4F 92 B2 EB 76 C9 C9 1D FD 62>)
$$ ##END=
$$ 
$$ hash MD5
$$ 68 FD A1 14 E9 86 C2 BC 05 87 5D C8 67 C8 72 C0
##$RELAX= 
##$RELAX= 
##$RELAX= 
##$RELAX= 
##$RELAX= 
##$RELAX= 
##$RELAX= 
##$RELAX= 
$$ Bruker specific parameters
$$ --------------------------
##$DU= <F:\spectra>
##$EXPNO= 1
##$NAME= <H1>
##$PROCNO= 1
##$TYPE= <nmr>
##$USER= <av>
##$AMP= (0..31)
100 100 100 100 100 100 100 100 100 100 100 100 100 100 100 100 100 100 
100 100 100 100 100 100 100 100 100 100 100 100 100 100 
##$AQSEQ= 0
##$AQ_mod= 1
##$AUNM= <au_zg>
##$AUTOPOS= <>
##$BF1= 200.13
##$BF2= 200.13
##$BF3= 200.13
##$BF4= 200.13
##$BF5= 500.13
##$BF6= 500.13
##$BF7= 500.13
##$BF8= 500.13
##$BYTORDA= 1
##$CFDGTYP= 0
##$CFRGTYP= 5
##$CHEMSTR= <none>
##$CNST= (0..31)
1 1 145 1 1 1 1 1 1 1 1 1 1 1 1 1 1 1 1 1 1 1 1 1 1 1 1 1 1 1 1 1 
##$CPDPRG= <>
##$CPDPRG1= <>
##$CPDPRG2= <>
##$CPDPRG3= <>
##$CPDPRG4= <mlev>
##$CPDPRG5= <mlev>
##$CPDPRG6= <mlev>
##$CPDPRG7= <mlev>
##$CPDPRG8= <mlev>
##$CPDPRGB= <>
##$CPDPRGT= <>
##$D= (0..31)
0 2 0 0 0 0 0 0 0 0.06 0 0 0 0 0 0 0.0002 0 0 0 0 0 0 0 0 0 0 0 0 0 0 
0 
##$DATE= 1775139798
##$DBL= (0..7)
120 120 120 120 120 120 120 120 
##$DBP= (0..7)
150 150 150 150 150 150 150 150 
##$DBP07= 0
##$DBPNAM0= <>
##$DBPNAM1= <>
##$DBPNAM2= <>
##$DBPNAM3= <>
##$DBPNAM4= <>
##$DBPNAM5= <>
##$DBPNAM6= <>
##$DBPNAM7= <>
##$DBPOAL= (0..7)
0.5 0.5 0.5 0.5 0.5 0.5 0.5 0.5 
##$DBPOFFS= (0..7)
0 0 0 0 0 0 0 0 
##$DE= 6
##$DECBNUC= <off>
##$DECIM= 32
$$ [...]
##$SUBNAM4= <"">
##$SUBNAM5= <"">
##$SUBNAM6= <"">
##$SUBNAM7= <"">
##$SUBNAM8= <"">
##$SUBNAM9= <"">
##$SW= 20.6817932712277
##$SWIBOX= (0..15)
0 0 3 0 0 0 0 0 0 0 0 0 0 0 0 0 
##$SW_h= 4139.07284768212
##$TD= 32768
##$TD0= 1
##$TE= 0
##$TE2= 300
##$TE3= 300
##$TEG= 300
##$TL= (0..7)
0 120 120 120 120 120 120 120 
##$TP= (0..7)
150 150 150 150 150 150 150 150 
##$TP07= 0
##$TPNAME0= <>
##$TPNAME1= <>
##$TPNAME2= <>
##$TPNAME3= <>
##$TPNAME4= <>
##$TPNAME5= <>
##$TPNAME6= <>
##$TPNAME7= <>
##$TPOAL= (0..7)
0.5 0.5 0.5 0.5 0.5 0.5 0.5 0.5 
##$TPOFFS= (0..7)
0 0 0 0 0 0 0 0 
##$TUNHIN= 0
##$TUNHOUT= 0
##$TUNXOUT= 0
##$USERA1= <user>
##$USERA2= <user>
##$USERA3= <user>
##$USERA4= <user>
##$USERA5= <user>
##$V9= 5
##$VALIST= <valist>
##$VCLIST= <CCCCCCCCCCCCCCC>
##$VD= 0
##$VDLIST= <DDDDDDDDDDDDDDD>
##$VPLIST= <PPPPPPPPPPPPPPP>
##$VTLIST= <TTTTTTTTTTTTTTT>
##$WBST= 1024
##$WBSW= 30
##$XGAIN= (0..3)
0 0 0 0 
##$XL= 0
##$YL= 0
##$YMAX_a= 541826
##$YMIN_a= -519740
##$ZGOPTNS= <>
##$ZL1= 120
##$ZL2= 120
##$ZL3= 120
##$ZL4= 120
##$ABSF1= 0
##$ABSF2= 0
##$ABSG= 0
##$ABSL= 0
##$ALPHA= 0
##$AQORDER= 0
##$ASSFAC= 0
##$ASSFACI= 0
##$ASSFACX= 0
##$ASSWID= 0
##$AUNMP= <proc_1d>
##$AZFE= 0.1
##$AZFW= 0.1
##$BCFW= 0
##$BC_mod= 2
##$BYTORDP= 0
##$COROFFS= 0
##$CY= 18.4799938201904
##$DATMOD= 1
##$DC= 0
##$DFILT= <>
##$DTYPP= 0
##$F1P= 9.9274215381318
##$F2P= -0.165520771350173
##$FCOR= 1
##$FTSIZE= 16384
##$FT_mod= 6
##$GAMMA= 0
##$GB= 0
##$INTBC= 1
##$INTSCL= 4.127829e-11
##$ISEN= 128
##$LB= 0.05
##$LEV0= 0
##$LPBIN= 0
##$MAXI= 10000
##$MC2= 0
##$MEAN= 0
##$ME_mod= 0
##$MI= 50
##$NCOEF= 0
##$NC_proc= -5
##$NLEV= 6
##$NOISF1= 3.799351
##$NOISF2= 2.8
##$NSP= 0
##$NTH_PI= 0
##$NZP= 0
##$OFFSET= 16.48848
##$PC= 4
##$PHC0= -263.9951
##$PHC1= -0.898437
##$PH_mod= 1
##$PKNL= yes
##$PPARMOD= 0
##$PSCAL= 4
##$PSIGN= 0
##$REVERSE= no
##$SF= 200.130005582386
##$SI= 16384
##$SIGF1= 3
##$SIGF2= 2
##$SINO= 400
##$SIOLD= 16384
##$SREGLST= <1H.CDCl3>
##$SSB= 0
##$STSI= 16384
##$STSR= 0
##$SW_p= 4139.07284768211
##$SYMM= 0
##$S_DEV= 0
##$TDeff= 32768
##$TDoff= 0
##$TI= <>
##$TILT= no
##$TM1= 0
##$TM2= 0
##$TOPLEV= 0
##$USERP1= <user>
##$USERP2= <user>
##$USERP3= <user>
##$USERP4= <user>
##$USERP5= <user>
##$WDW= 1
##$XDIM= 16384
##$YMAX_p= 486561257
##$YMIN_p= -1064631
$$ End of Bruker specific parameters
$$ ---------------------------------
##NTUPLES= NMR SPECTRUM
##VAR_NAME=  FREQUENCY,     SPECTRUM/REAL,   SPECTRUM/IMAG
##SYMBOL=    X,             R,               I
##VAR_TYPE=  INDEPENDENT,   DEPENDENT,       DEPENDENT
##VAR_FORM=  AFFN,          ASDF,            ASDF
##VAR_DIM=   16384,         16384,           16384
##UNITS=     HZ,            ARBITRARY UNITS, ARBITRARY UNITS
##FACTOR=    0.252644378177508, 1,           1
##FIRST=     3299.83951724647, 0,            0
##LAST=      -839.233330435636, 0,           0
##MIN=       -839.233330435636, -1064631,    0
##MAX=       3299.83951724647, 486561257,    0
$$ Real data points
##PAGE= N=1
##DATA TABLE= (X++(R..R)), XYDATA
$$ [...]
7185A015420l53618K11569k42215j34165M25660L6208m51223J2500K53180k46118
7175E27198L1681k37473J68541l9292k93763M42005Q0566L31952O0924K6954M04951
7164A504244K37052n88749q7187o8139j68786k97452J61820p8120k13753K94093
7154F95023l19374J57178J66270l15297n1696K81172j18796J01879j54929K73472
7144G14902j21568k7885j265K7579K99186N5810j27031r0492J18540K3721M6653
7133I18150J18166n9523j88620J29658j62940k43102K92855J2950j72124K38321
7123H83791m6709N2525k12979M03393l11079k92837P3715M4875R3261L92052l8334
7112A041674K7214J99088j24553K22609m4709l2525J41364j11298k31638j09159
$$ y = [1015420, 661802, 873371, 631156, 496991, 922651, 958859, 507636, 520136, 773316, 527198, 558879, 321406, 489947, 450655, 156892, 598897, 679463, 1011415, 1072339, 1099293, 1504244, 1741296, 1152547, 1065360, 997221, 828435, 530983, 692803, 614683, 400930, 695023, 375649, 532827, 699097, 383800, 332104, 613276, 494480, 596359, 441430, 714902, 593334, 565449, 564184, 591763, 890949, 946759, 819728, 729236, 847776, 871497, 918150, 1036316, 976793, 788173, 917831, 754891, 511789, 804644, 817594, 645470, 883791, 837082, 889607, 676628, 1080021, 768942, 476105, 549820, 594695, 687956, 1080008, 1041674, 1068888, 1267976, 1143423, 1366032, 1321323, 1288798, 1430162, 1318864, 1087226, 978067]
7102I78067k7434K02360m1545J20981n55085N11454k77269J01276K23768j43103
7092A093470m11356K41458p8836p4714l19889L80610j53651L25786Q7940j97609
7082H93209o1016N9048J93822k56905M06657k14160r976K66879k19906j85477
7072H72175K16655Q03J21417j96823K8839J66274M6457l2554j41240O9762n0478
7061A101287J96940P5607k73694L71158l29256J13494K37942L44344l43993J41159
7051A634988j02017L0241p4767M26887k19696j29230N4240j32913K95265J75663
7041A958661m23010O4969J44467p5900J44570Q7626j3590k54566O09281l23539
7031A918969k30415M55319j23342L0284K99805q6635j59303L04158m79709L49031
$$ y = [978067, 950633, 1152993, 1111448, 1232429, 677344, 1188798, 911529, 1012805, 1236573, 1093470, 682114, 923572, 844736, 770022, 450133, 830743, 677092, 1002878, 1090818, 893209, 832193, 891241, 1085063, 828158, 1234815, 1020655, 1010679, 1277558, 1057652, 872175, 1088830, 1089633, 1211050, 1014227, 1043066, 1209340, 1255797, 1223243, 1082003, 1151765, 1101287, 1298227, 1373834, 1100140, 1471298, 1142042, 1255536, 1493478, 1837822, 1493829, 1634988, 1532971, 1563212, 1488445, 1915332, 1695636, 1566406, 1620646, 1487733, 1782998, 1958661, 1535651, 1600620, 1745087, 1669187, 1813757, 1901383, 1887793, 1633227, 2242508, 1918969, 1688554, 2143873, 2020531, 2050815, 2350620, 2263985, 2104682, 2408840, 1929131, 2278162]
7021B278162J93876j92721J29045R2756J06644l65581K58110L26097l75945K38608
7011B689051L00854l85772K75315K11241l39797O02981J24666q5351K53141K81488
7001C927817J85998N8833L17408k94324J22581K18199j27246J89184J30057J65121
6991D893628j36976N85457K08868R3432Q53632J22749L30927P00877J142975Q95905
6981I691474J939333R50759O05835J058672O37815J947895L101831N181814Q488343
6972C3603771J0640483Q709613R02118o726079q348409o969235l898187k342694
6964B5571381p59638l83748L1649o39788j35367L88989N29830R75402K740666
6955B8319376L436565P733446J0861866J2504853J0498097N390204l10853m734610
$$ y = [2278162, 2472038, 2279317, 2408362, 2501118, 2607762, 2242181, 2500291, 2826388, 2450443, 2689051, 2989905, 2604133, 2879448, 3090689, 2750892, 3353873, 3478539, 3393188, 3646329, 3927817, 4113815, 4172648, 4490056, 4195732, 4318313, 4536512, 4409266, 4598450, 4728507, 4893628, 4756652, 5342109, 5550977, 5644409, 6498041, 6620790, 6951717, 7652594, 8795569, 9691474, 11630807, 12581566, 13187401, 14246073, 14883888, 16831783, 19933614, 25115428, 33603771, 44244254, 52953867, 53855985, 47129906, 38781497, 31812262, 27914075, 25571381, 24811743, 24427995, 24459644, 23819856, 23684489, 24073478, 24603308, 25578710, 28319376, 31755941, 39489387, 50351253, 62856106, 73354203, 78744407, 78433554, 73698944]
6947G3698944p355484r704105j0879825r053566o178475m274199k803179q52021
6939B2598090k80178n8032N10076n59664n3373J80338J741443L927439Q040481
6930C6046620J0064831Q341454J513177p196123j0055695r126179n994128m399767
6922A9194190l607022k433454k123504j511319q58362j027418q81036O0283r04954
6913E907404l19266k33922k81673l16110R9931j36827o89001J98953j850k3660
6903D203979k67630l56025K66232r0803k64770M64317l65971J03533J06653l61247
6893C438268P4690k24949l31811j48313j6081N8945j41302K43946r37722M50718
6883B466389l8415j32395R0887r6659J21038L6055k70447j6726M64306k35856
$$ y = [73698944, 66343460, 56639355, 45759530, 36705964, 30527489, 26253290, 23450111, 22598090, 22317912, 22259880, 22769956, 22210292, 22156919, 22337257, 24078700, 28006139, 36046620, 46111451, 54452905, 55966082, 48769959, 38714264, 29588085, 23593957, 19194190, 15587168, 13153714, 11030210, 9518891, 8660529, 7633111, 6752075, 6812358, 5907404, 5588138, 5354216, 5072543, 4756433, 4856364, 4719537, 4030536, 4229489, 4227639, 4203979, 3936349, 3580324, 3846556, 3755753, 3490983, 3955300, 3589329, 3692862, 3799515, 3438268, 3512958, 3288009, 2956198, 2807885, 2791804, 2850749, 2709447, 2953393, 2015671, 2466389, 2427974, 2295579, 2386466, 2289807, 2410845, 2446900, 2176453, 2159727, 2624033, 2388177]
6873B388177L67590j7128M20196l28768k47792M2655q2467J2940l41926L57343
6863B570820N7076k48592N15557l82142k07354L7609m6392k88660K71427N884
6853B285233j53228J21027J47977r5642J00976l52631n60337K79612o5516N851
6843A713322j77426K5258k41314O3428p8311q1190J28598o3506J64140Q7339L18303
6832A858641l43808K98436K24449j25384K0396k78096J68015o21979L15555J50321
6822A666546q231J36426N23044O41653N04951k98244m5729o28936k40974l55193
6812A895313m9768l61534L67803k06586l9184j31929k32277j07929j76637k91566
6802F65706L61827J00521j13482K22243K08513k11246q1371m5955J33856J09558
$$ y = [2388177, 2755767, 2738639, 3158835, 2830067, 2582275, 2624930, 2542463, 2555403, 2213477, 2570820, 2627896, 2379304, 2894861, 2512719, 2305365, 2342974, 2296582, 2007922, 2279349, 2285233, 2132005, 2253032, 2401009, 2305367, 2406343, 2053712, 1493375, 1772987, 1707471, 1713322, 1535896, 1561154, 1319840, 1383268, 1304957, 1223767, 1352365, 1288859, 1452999, 1540338, 1858641, 1514833, 1813269, 2037718, 1912334, 1932730, 1654634, 1822649, 1200670, 1516225, 1666546, 1658315, 1794741, 2317785, 2959438, 3464389, 3166145, 3120416, 2491480, 2250506, 1895313, 1845545, 1484011, 1851814, 1645228, 1606044, 1474115, 1241838, 1133909, 957272, 665706, 1027533, 1128054, 1014572, 1236815, 1445328, 1234082, 1152711, 1106756, 1240612, 1350170]
6792A350170m14045k6832J56152j02063l33213M2241J10639j22185j50418L46063
6782H56509m1931j01302O0233M513m3700R7534j77101M15625L2088p1373L08764
6771A339859j00319m4151n35470M27403J8422l81789P0731K10920j96244j66773
6761F42589O6804k8481N1773K87745q0386K69403j00706l66289K14727q7912l81671
6750D87596L76924l78430L53513j03065Q410K12290j25964L38039m218P8963j07646
6739A136412l0072l5978R1702j63714r1401n9541K59233m28931j00721J00900
6729F77889j35746K4291J96077k02370J6195L37865l50583m0495K43957J88536
6719I55616j93233q2063N8183j20536K21538j29912q4358M9888l0402J55012L52596
$$ y = [1350170, 936125, 909293, 1065445, 963382, 630169, 672410, 783049, 660864, 510446, 856509, 814578, 713276, 773509, 778022, 734322, 831856, 654755, 1070380, 1102468, 1031095, 1339859, 1239540, 1195389, 659919, 1087322, 1105744, 723955, 794686, 1005606, 809362, 642589, 709393, 680912, 732685, 1020430, 940044, 1209447, 1108741, 742452, 957179, 869267, 487596, 864520, 486090, 839603, 736538, 744948, 957238, 831274, 1169313, 1165095, 1244058, 1136412, 1106340, 1070362, 1162064, 998350, 906949, 847408, 1106641, 677710, 576989, 677889, 542143, 566434, 762511, 560141, 576336, 914201, 563618, 523123, 767080, 955616, 762383, 680320, 738503, 617967, 839505, 709593, 625235, 675123, 644721, 799733, 1152329]
6708A152329J15811k39438J24506j62595j51149n1757m5856J08946l10656M97661
6698A037802j96454o08593M85029k5876Q1198m10971K26217k00474J69049K59363
6688H16290j72974J76341J67238l92894J42090J76639j66345P5294L50318k62042
6678I09955j31186K59492m12433q9340K14541K87384l31052J38677j57596k7788
6668F60654Q6800K0147j53185O0504J89950k65483K40370J3467p4027r7867L89922
6657A071252m69426M7000L65991J9763J76064J85123k87964p1623L41484j48059
6647A229605L84273k84013k91662q9293R0812J00583J5659l59214J17624N859
6637I20233o0499J70611j95205k38886l5392N45553o4683k16579O2073p2684O47117
$$ y = [1152329, 1268140, 1028702, 1153208, 990613, 839464, 787707, 741851, 850797, 540141, 1037802, 841348, 232755, 717784, 691908, 773106, 362135, 588352, 387878, 556927, 816290, 643316, 819657, 986895, 594001, 736091, 912730, 746385, 821679, 1171997, 909955, 778769, 1038261, 625828, 536488, 751029, 1038413, 707361, 846038, 688442, 660654, 747454, 767601, 614416, 674920, 864870, 599387, 839757, 853224, 779197, 681330, 1071252, 601826, 648826, 1014817, 1034580, 1210644, 1395767, 1107803, 1036180, 1377664, 1229605, 1613878, 1329865, 1038203, 948910, 1039722, 1140305, 1155964, 796750, 914374, 920233, 859734, 1030345, 835140, 596254, 560862, 1106415, 1041732, 825153, 887226, 814542, 1461659]
6626A461659m22844k13989j70115o7713M06476j39809J2263m2773k08020l1929
6616E83206O8453L62002j05567J19137l86217M6914K46942J3213M8569L2129K38274
6605A267055m53140L20506j9588J50433L34970K13829N2015k36994j57758J67778
6595A639106k35161k43273O838j3852q0986q852j3606J30954m29488J41229J40791
6584A033700j02231R1545J70228m09160J77545J35126m6930K3292j04867N16005
6574A484253l45633q3448K08019J40166r9068K56856p4901l37925M52613J30412
6564A731344m0745M63835J45480M26933P72049O3733K17086j08743q06758l88285
6554B475929R0750l46631k5321k93837J22567L82546o05717L2502J76635k504
$$ y = [1461659, 1038815, 824826, 654711, 586998, 993474, 853665, 865928, 823155, 615135, 583206, 651659, 1013661, 908094, 1027231, 641014, 687928, 934870, 948083, 996652, 1028781, 1267055, 813915, 1134421, 1114833, 1265266, 1600236, 1814065, 1866080, 1629086, 1471328, 1639106, 1403945, 1160672, 1167510, 1153658, 1072672, 1063820, 1050214, 1181168, 751680, 892909, 1033700, 931469, 1023014, 1193242, 784082, 961627, 1096753, 1049823, 1073115, 968248, 1484253, 1138620, 1055172, 1263191, 1403357, 1304289, 1561145, 1486244, 1148319, 1600932, 1731344, 1690599, 2154434, 2299914, 2726847, 3498896, 3562629, 3779715, 3670972, 2864214, 2475929, 2566679, 2220048, 2194727, 1900890, 2023457, 2406003, 1800286, 1832788, 2009423, 2006919]
6544B006919L64828q8079N25389J87855k80378k09307K43130m35499l22274J32829
6534B125413j42051o0714n9060N28449k28815L33693P79682k61944l81088L50619
6524B984184k8681n8503J05844L15850J65046M44370k93002k51614K20986j13447
6514C491033l78166J83205N1606N06769j97925j88788o11096k16792k8062l13450
6504B298334J473O8752l36444R6930K58249l35298K11833j61382R4722m4830J3677
6493B166016p0412J80489M24785M07675L57226l57745J34459o12078J28327l00791
6483B457951j24225o1028l72823K99678L10390m54478K73674J238k58239M61822
6473B533960l00924J50719J80967j13508J80621k30159m745J63546J32469k50534
$$ y = [2006919, 2371747, 2283668, 2809057, 2996912, 2716534, 2507227, 2750357, 2314858, 1992584, 2125413, 1983362, 1922648, 1863588, 2392037, 2163222, 2496915, 3276597, 3014653, 2633565, 2984184, 2955503, 2897000, 3002844, 3318694, 3483740, 3928110, 3635108, 3383494, 3604480, 3491033, 3112867, 3296072, 3347678, 3854447, 3656522, 3467734, 2856638, 2639846, 2611784, 2298334, 2299807, 2368559, 2032115, 2129045, 2387294, 2051996, 2263829, 2102447, 2197169, 2152339, 2166016, 2095604, 2276093, 2700878, 3108553, 3465779, 3108034, 3242493, 2630415, 2758742, 2457951, 2333726, 2272698, 1899875, 2199553, 2509943, 2055465, 2329139, 2330377, 2072138, 2533960, 2233036, 2383755, 2564722, 2451214, 2631835, 2401676, 2396931, 2560477, 2692946, 2442412]
6463B442412L98761j41039Q8548J09627j23278N16191j43596k5949q2559J23324
6453C162442J5342J50491J86275K41717J0700k8110k18475M30459j15896J84014
6443D018959K54840J8566J02217K7261L87552M73413J45486j16675j92501k5209
6433E093909K6911Q6193Q1286M0609J73347J41006K05140R7358J33326L71370
6423F450455Q6214j7183N4474k97476R7129J06111q1550K97645k79027K34163
6413F650955J56541j2825L77739J32389M03986O08997J98213L27875N51382P49
6403I396001Q48616O02474K58356P25187O21289J57544N28959O30012P92628J185488
6393A5746554J094350J275089J874736K244495K658598L772472M655989M742535
$$ y = [2442412, 2841173, 2700134, 2788682, 2898309, 2775031, 3291222, 3147626, 3121677, 3039118, 3162442, 3177784, 3328275, 3514550, 3756267, 3766967, 3738857, 3520382, 3950841, 3834945, 4018959, 4273799, 4292365, 4394582, 4421843, 4809395, 5282808, 5428294, 5311619, 5119118, 5093909, 5120820, 5207013, 5288299, 5328908, 5502255, 5643261, 5848401, 5945759, 6079085, 6450455, 6536669, 6519486, 6573960, 6276484, 6373613, 6479724, 6398174, 6695819, 6416792, 6650955, 6807496, 6794671, 7172410, 7304799, 7708785, 8317782, 8515995, 8843870, 9395252, 9396001, 10244617, 10847091, 11105447, 11830634, 12451923, 12609467, 13138426, 13768438, 14561066, 15746554, 16840904, 18115993, 19990729, 22235224, 24893822, 28666294, 33322283, 38064818]
6385C8064818M774290M558863L976521L926041L228849L484915K616895J422742
6377F6053934j08130k090870l375986m670932n115048n356297m737910m655505
6369C5943256l529181l269736k539253k225647j814410j718276j118193o75847
6361A9052713n81472p02150o36580m3983k31572k21695R9054r2992M51125J00589
6351A7193037O47734P50952J117935J097491J876092K079740K372247K749275
6343B9884503K932723L720108N802442J0025968J8618576L0081343L9619044L6413721
6335A77098428J9687475m878857k6387535l6228018l2561059k4169123j5999703
6328E6561608j1258622p697844n304487m095586l174288k417370j943932j302669
$$ y = [38064818, 42839108, 47397971, 51374492, 55300533, 58529382, 62014297, 64631192, 66053934, 65945804, 63854934, 60478948, 55808016, 50692968, 45336671, 40598761, 35943256, 32414075, 29144339, 26605086, 24379439, 22565029, 20846753, 19728560, 19052713, 18471241, 17769091, 17132511, 17088528, 16856956, 16635261, 16734315, 16641323, 17092448, 17193037, 17840771, 18591723, 19709658, 20807149, 22683241, 24762981, 27135228, 29884503, 32817226, 36537334, 42339776, 52365744, 70984320, 101065663, 140684707, 177098428, 196785903, 191907046, 165519511, 129291493, 96730434, 72561311, 56561608, 45302986, 37605142, 32300655, 28205069, 25030781, 22613411, 20669479, 19366810]
6320A9366810j073168n42317m97543k38162n5707o90971m15796r20892j266569
6311A3665685r29876q80121n83069q77276k68906k57900P131m18223R1486n3622
6301I495309j60370k8217p3790M1842J18657J71038R2136J53807r3702k92149
6291I424561O26273L4243l31203K95095M24664j35247Q48439L76774J056994O68475
6281A3289068J398952R95506R91704J062066j40736N77036o7896l93688K74364
6272A7986376P35547O61583O95970O43010O17961O14415J81282K29746j64326
6263B2201564L77950J9513l60512Q284M12698K94123M85205R02655R28572J389816
6253B6659868Q23452J303289J334726Q09136J4444P29941k3215m28208o10588
$$ y = [19366810, 18293642, 17751325, 17253782, 17015620, 16959913, 16268942, 15853146, 14932254, 13665685, 12735809, 11855688, 11272619, 10395343, 10126437, 9868537, 9875668, 9457445, 9548931, 9495309, 9334939, 9306722, 9232932, 9274774, 9393431, 9564469, 9656605, 9810412, 9716710, 9424561, 10050834, 10085077, 9753874, 10048969, 10473633, 10338386, 11186825, 11563599, 12620593, 13289068, 14688020, 15683526, 16675230, 17737296, 17596560, 18173596, 18105700, 17712012, 17986376, 18721923, 19383506, 20079476, 20722486, 21340447, 21954862, 22136144, 22365890, 22201564, 22579514, 22599027, 22238515, 22246799, 22659497, 22953620, 23438825, 24341480, 25270052, 26659868, 27483320, 28786609, 30121335, 30930471, 30944915, 31674856, 31651641, 31223433, 30612845]
6244C0612845o39311l93227q38994n56185j133438q94548n35293q43552n58777
6235B4219520o18454J37381K99081R43465N72465Q57193Q26699R9323k82891p50383
6225B6303399q77420j545105j863389q62481j557231j317450r05408r45169o99964
6216A5729782p45484j210771O926l62358n65369M4666l25369O35821L99332K37468
6206A3844644J179509Q40288J187542J021861J118759P66430J146804K23805n86118
6197B0743524j392565j920114j581822j844340j287880j568549n00242n73390
6189A0074622m11401m48473O7892o2338K25875J69580K84642O55603J398162R52031
6179A2906195J511263J056745l93974J44408j550919j503553j052103j380155
$$ y = [30612845, 29973534, 29580307, 28741313, 28185128, 27051690, 26157142, 25621849, 24778297, 24219520, 23601066, 23738447, 24037528, 24980993, 25553458, 26410651, 27237350, 27336673, 27053782, 26303399, 25425979, 23880874, 22017485, 21155004, 19597773, 18280323, 17374915, 16429746, 15729782, 14984298, 13773527, 13780453, 13418095, 12852726, 12897392, 12572023, 13207844, 13607176, 13844644, 15024153, 15864441, 17051983, 18073844, 19192603, 19959033, 21105837, 21329642, 20743524, 19350959, 17430845, 15849023, 14004683, 12716803, 11148254, 10648012, 10074622, 9663221, 9214748, 9282640, 9220302, 9446177, 9615757, 9900399, 10556002, 11954164, 12906195, 14417458, 15474203, 15080229, 15224637, 13673718, 12170165, 11118062, 9737907]
6171I737907o72669q63052m45845n67962l4207n54673n76677n05120o52300P4224
6161D939626k48503m46236n6813K39148k17325N45275j61094q0427J63423j82008
6151D495066k52413l61116j26571j88507M72442m65393J1637j18692j58397l32091
6141B975965K80127l59214J80727n4207l18185R5573k38802L9369L70680n46496
6131B425537L9959j26576J96479Q686l4485m8711J35109j48999K56661k98854
6121B404806k35294K82598L61388l24500J69297m41433L70129q2284K11009j24172
6111B591544P8463J01149l6679k5128P76683L91656M8802O8877Q8703j62333N6351
6100C978088j63332l11837m97860o5198M5706k97094O1234j05922k30933j98984
$$ y = [9737907, 9065238, 8202186, 7756341, 7188379, 7154172, 6599499, 6022822, 5517702, 4865402, 4939626, 4691123, 4244887, 4188074, 4427222, 4209897, 4755172, 4594078, 4513651, 4677074, 4495066, 4242653, 3881537, 3754966, 3566459, 4038901, 3573508, 3585145, 3466453, 3308056, 2975965, 3256092, 2896878, 3077605, 3023398, 2705213, 2800786, 2561984, 2601353, 2972033, 2425537, 2465496, 2338920, 2535399, 2544085, 2509600, 2460889, 2595998, 2446999, 2703660, 2404806, 2169512, 2452110, 2813498, 2488998, 2658295, 2216862, 2586991, 2504707, 2715716, 2591544, 2670007, 2771156, 2734477, 2709349, 3486032, 3877688, 3926490, 3995367, 4084070, 3921737, 3978088, 3814756, 3502919, 3005059, 2939861, 2985567, 2688473, 2749707, 2643785, 2412852, 2213868]
6090B213868r7864O9120k11994p1502L4511J00902K71453j76808k6815M16615
6080B521486J8392m0557J11433r0109j51795j23317M70564N33684j54831j81105
6070B913845P0461q9226M01349k92784p7010l93083j47310k22548K67595k33531
6060B197758j12735l7474J1179M12481K93724j56394m0340M14946J04047j30985
6050B956207J17152K58718L57292L27127P32256J03618k41773o7093m64075O5313
6040D144742k02732m40831j51315o59211M7658p9562m34462J12847j38717K2280
6030B220697J67565J78846J98926L2856l87922L68844K15515M08537L73371M55676
6020D232911N57410J082081K07914J34264k7822j195460k86506m32706o08940
$$ y = [2213868, 2116004, 2185124, 1973130, 1901628, 1936139, 2037041, 2308494, 2131686, 2104871, 2521486, 2539878, 2499321, 2610754, 2520645, 2368850, 2245533, 2716097, 3249781, 3094950, 2913845, 2984306, 2895080, 3296429, 3003645, 2926635, 2533552, 2386242, 2163694, 2431289, 2197758, 2085023, 2047549, 2058728, 2471209, 2764933, 2608539, 2568199, 2983145, 3087192, 2956207, 3073359, 3332077, 3689369, 4016496, 4748752, 4852370, 4610597, 4543504, 4079429, 4144742, 3942010, 3501179, 3349864, 2690653, 2738311, 2658749, 2224287, 2337134, 2198417, 2220697, 2388262, 2567108, 2766034, 2798890, 2410968, 2779812, 2995327, 3403864, 3777235, 4232911, 4790321, 5872402, 6080316, 6214580, 6186758, 4991298, 4704792, 4272086, 3663146]
6011C663146m84694j07690k26468j82506j07939N6282j88848p6451k18855L57344
6001B483321k12912K37825M820K22396k23941M55015P07131O45190L26657O92721
5991E338223N81583M02396m96357n87262n89391p11859m43996l09948j98903l61752
5981B622734m52734J9637K60991o73273K84571K04180m0879l4234J24850K44817
5971B560660J91953j32202L96877p373K58222O18694l04637k94097k93683K02625
5961C197039p28318J78433j93911j20898l15710J4192N0086k1759m14883L92570
5951B036841K55083j90598l62498j79401J27926k05275J62910O2504q9313J72236
5941A790415K1777k36120J89727J83593j76965r9325j74978N2440J76889K19909
$$ y = [3663146, 3178452, 3070762, 2844294, 2661788, 2553849, 2610131, 2421283, 2344832, 2125977, 2483321, 2270409, 2508234, 2513054, 2735450, 2511509, 2966524, 3673655, 4318845, 4645502, 5338223, 5919806, 6322202, 5825845, 5238583, 4649192, 3937333, 3493337, 3183389, 2984486, 2622734, 2170000, 2189637, 2450628, 1777355, 2061926, 2266106, 2225227, 2190993, 2315843, 2560660, 2752613, 2620411, 3017288, 3009915, 3268137, 3886831, 3582194, 3288097, 2994414, 3197039, 2468721, 2647154, 2453243, 2332345, 2016635, 2030827, 2080913, 2059154, 1644271, 2036841, 2291924, 2101326, 1738828, 1559427, 1687353, 1482078, 1644988, 1707492, 1618179, 1790415, 1812192, 1576072, 1765799, 1949392, 1772427, 1673102, 1498124, 1550564, 1727453, 1947362]
5931A947362k5872j34259j63925l1320l31270L42903j75575M4697O6044j38715
5921A400070j78613M19159k63683j5115Q9222n7325j58259K64964J1852O00353
5911B112625m04514N8229j29226R2817k31913J69520M5915P3308j96663m8103
5901A541995K93739l2319q633m3486J30668l60567J42523k20888M8406K63194
5891A754632Q8107p5402l60905J65206J03410q8931J61713j47925M50186k21905
5881A828186j459P75662o09432L3132M96486L9164j50276j53692J82638k02534
5871B237875J14527m21255p3404K19245j61372q4567O4396M33261m45298L28797
5861B212205J03480k547O1891M0569M04305j20815r3019j06615j02597L03673
$$ y = [1947362, 1921490, 1787231, 1623306, 1591986, 1260716, 1603619, 1428044, 1472741, 1538785, 1400070, 1221457, 1640616, 1376933, 1361818, 1451040, 1393715, 1235456, 1500420, 1512272, 2112625, 1708111, 1766340, 1637114, 1729931, 1498018, 1667538, 1713453, 1786761, 1590098, 1541995, 1835734, 1803415, 1794782, 1751296, 1881964, 1521397, 1663920, 1443032, 1491438, 1754632, 1842739, 1767337, 1406432, 1571638, 1675048, 1586117, 1747830, 1599905, 2050091, 1828186, 1826727, 2602389, 1992957, 2026089, 2522575, 2561739, 2411463, 2257771, 2440409, 2237875, 2352402, 1931147, 1857743, 2076988, 1915616, 1831049, 1895445, 2328706, 1883408, 2212205, 2315685, 2313138, 2375029, 2415598, 2819903, 2699088, 2606069, 2499454, 2396857, 2700530]
5851B700530j61115m11371J97986n6006j0583M6043R0402j68179J09356O5733
5841B402796J04457q4457J68006M33203p5218O3711l26008K96752m81636O8254
5831B569860J58675J57418q5502j51687j63070J91401J62227j63937M8287k49828
5821B473844J74785j950O1908L4249j43775K61396J25023N1593k85071K39912
5811B991914k78157n062K12434j29684j19941L92638K78280k15171j34834o9526
5801B922891M0k05464K40786L2096J37194J4726m30231N08535j04538J57232k97117
5790B976150M16554J34137k9839j10203q7930L45898q1536L84237k90920L538
5780C660086J34569j60134K1074j8169J82098j39241K21972j38833K90977J11164
$$ y = [2700530, 2539415, 2128044, 2326030, 2270024, 2259441, 2305484, 2395886, 2227707, 2337063, 2402796, 2507253, 2422796, 2590802, 3024005, 2948787, 3012498, 2686490, 2983242, 2501606, 2569860, 2728535, 2885953, 2800451, 2648764, 2485694, 2677095, 2839322, 2675385, 2723672, 2473844, 2648629, 2646679, 2708587, 2742836, 2599061, 2860457, 2985480, 3037073, 2752002, 2991914, 2713757, 2708695, 2921129, 2791445, 2671504, 3064142, 3342422, 3127251, 2992417, 2922891, 2922931, 2717467, 2958253, 2990349, 3127543, 3142269, 2712038, 3220573, 3116035, 3273267, 2976150, 3392704, 3526841, 3497002, 3386799, 3298869, 3644767, 3563231, 3947468, 3656548, 3660086, 3794655, 3634521, 3655595, 3637426, 3819524, 3680283, 3902255, 3763422, 4054399, 4165563]
5770D165563l29K3474q9489N81729k35107k50836J48184L03748J82505l27822
5760D501620L3016J86465K33046j40285N6404K05521Q5852k51248M23612j74989
5750E159014K52273k82880K04143L76733Q2160j43271M88168j78248N36271l94612
5740F099751J07073O85454P5393J26053J27479K12349j5786K05305L20472J42197
5730H085740M28254J52010K17470K9681L69501O22932M42038K41949N49397P29050
5720A1868022L83879J023356M13574J159671J179469J987693K654495K831653
5712B3501812L940981N462885R421543J2840349J1130714K471927q062742j1236133
5704D9471336q443767n534814l048573q74772q64273j236771q07394q16402N35340
$$ y = [4165563, 4165234, 4188708, 4099219, 4680948, 4445841, 4195005, 4343189, 4646937, 4829442, 4501620, 4534636, 4721101, 4954147, 4813862, 4870266, 5075787, 5161639, 4910391, 5334003, 5159014, 5411287, 5128407, 5332550, 5709283, 5791443, 5648172, 6136340, 5958092, 6494363, 6099751, 6206824, 6892278, 6967671, 7093724, 7221203, 7433552, 7417766, 7623071, 7943543, 8085740, 8513994, 8666004, 8883474, 8913155, 9282656, 9905588, 10347626, 10589575, 11138972, 11868022, 12251901, 13275257, 13688831, 14848502, 16027971, 18015664, 20670159, 23501812, 27442793, 32905678, 42327221, 55167570, 66298284, 68770211, 60707469, 49471336, 41027569, 35492755, 32444182, 31569410, 30705137, 29468366, 28660972, 27844570, 28379910]
5695B8379910J161460K364322L490720N731129R157670J2321754J2563909J1820733
5687H6991607R971998M939324l357145j0248880j3777729j3593042r548183o792125
5679D4585825m462597l339664k273945j261884k92705Q81595N94626L98103J020414
5670C5849768J913723L173739P148254J1293464J1135424M049951o544798j0148453
5662E7871072o422872k850420q62464q97170r29020k403600k709713k021547j838892
5653C6935374j742689j790749j775195j473027j635030j370405q98850o59756
5645B5589673o17933J61607j80459j87116K72394O2256Q95675R72831J426467
5636B8395395K577344L855462M279768N076425L715261J806321M9553j128263
$$ y = [28379910, 29541370, 31905692, 35396412, 41127541, 50285211, 62606965, 75170874, 86991607, 96963605, 101902929, 98545784, 88296904, 74519175, 60926133, 51377950, 44585825, 40123228, 36783564, 34509619, 33247735, 32955030, 33836625, 34431251, 34829354, 35849768, 37763491, 40937230, 48085484, 59378948, 70514372, 74564323, 68019525, 57871072, 51448200, 48597780, 47735316, 46838146, 45909126, 43505526, 40795813, 38774266, 36935374, 35192685, 33401936, 31626741, 30153714, 28518684, 27148279, 26249429, 25589673, 24971740, 25133347, 24952888, 24765772, 25038166, 25100422, 25996097, 26968928, 28395395, 30972739, 34828201, 39107969, 44184394, 47899655, 49705976, 49755529, 48627266]
5628D8627266j429508j295042j728565k148877j683390k192421j571182j363731
5620C5214550j290648n69045l65434k4356m7583J95034P64232P75441O62457J202105
5610C6516753J969863K379514L085076M264715M423688M224906K505154J250871
5602F0620540p43736j354554j151643j138843r82684j511821j810250j183477
5594E0743532l68328r74384j76699l34308L69097K06765j43295O30300j67808
5585D9784872j2830K7926L21796J93681M28653R66241J382442Q97662R54609L491
5575E4948543o44203p89311j178126j038958j156385j096765q70757r06566m90865
5566D6776607j039713p60540j576952p40164p57822n84043j500192j018747p89853
$$ y = [48627266, 47197758, 45902716, 44174151, 42025274, 40341884, 38149463, 36578281, 35214550, 33923902, 33354857, 32989423, 32965067, 32917484, 33112518, 33876750, 34652191, 35314648, 36516753, 38486616, 40866130, 43951206, 48215921, 52639609, 56864515, 59369669, 60620540, 59876804, 58522250, 57370607, 56231764, 55249080, 53737259, 51927009, 50743532, 50375204, 49400820, 49224121, 48889813, 49258910, 49465675, 49322380, 49952680, 49784872, 49772042, 49799968, 50121764, 50315445, 50744098, 51710339, 53092781, 53990443, 54945052, 54948543, 54304340, 53515029, 52336903, 51297945, 50141560, 49044795, 48174038, 47267472, 46776607, 45736894, 44976354, 43399402, 42659238, 41901416, 41317373, 39817181, 38798434, 38008581]
5557C8008581n08008n23636p77957o5846p07757m28769n58575n68281j109005
5548C2760747m96441n52257o23921p10142o59284p55524m15530m61567o54137
5539B7431944r5068j69044m21963J66395J99756o91355P7981o33008k24304j04912
5529B5536422l31827m61560o65253r82228l70621n38327m82362o87715l49105
5520B0667424l49642l97869L4459o18558j04596k61307k01840K58199k67154q1589
5510A8677527j13461k51884l04549m13494n20542l09921m48077k69770l91576
5501A5654253n12395o78740j36699J66334m94463L12363l95237j91049j79980
5492A3544387K4732Q6072l09387K49491M70843P768l56496k19314k5901l397J92413
$$ y = [38008581, 37500573, 36976937, 36198980, 36133134, 35425377, 34996608, 34438033, 33869752, 32760747, 32264306, 31712049, 31088128, 30377986, 29718702, 28963178, 28547648, 28086081, 27431944, 27336876, 27167832, 26745869, 26912264, 27112020, 26420665, 26498646, 25865638, 25641334, 25536422, 25204595, 24743035, 24077782, 23095554, 22724933, 22186606, 21704244, 21016529, 20667424, 20317782, 19919913, 19954372, 19335814, 19231218, 18969911, 18768071, 19026270, 18759116, 18677527, 18564066, 18312182, 18007633, 17594139, 17073597, 16763676, 16315599, 16045829, 15654253, 15141858, 14463118, 14326419, 14492753, 13998290, 14310653, 13915416, 13724367, 13544387, 13569119, 13655191, 13345804, 13595295, 14066138, 14073906, 13717410, 13498096, 13472195, 13468798, 13661211]
5481A3661211n06640k43580l48150k06200l90854J11199l30250m5390J61586j15257
5471A1747675j96072l4996j33446k05691p6449J26569o14981M1204l9511J83834
5461A0798136j44230J63035j01682K81665L85027L10772k95687L49561m96649
5452A1249948m663k40311m02650m46704n6506M6068n08524M25658J99663j69113
5442A0092866M1367J4270M74766J69910j84380M75217M65579l09757l40362l85803
5432A0513673l89710l84635l44925n27763J9681k50126K00130J24356K05635j31841
5422I034475j77169J84858o87876L599j48483O5058m54231O8767j52158k09531
5412G527309k81324p84553j65938j87345l49850m92936j60940l74851J58397k78030
$$ y = [13661211, 13154571, 12910991, 12562841, 12356641, 11965787, 12076986, 11746736, 11701346, 11862932, 11747675, 11551603, 11516607, 11383161, 11177470, 11101021, 11227590, 10612609, 10653813, 10614302, 10798136, 10653906, 10816941, 10715259, 10996924, 11381951, 11692723, 11397036, 11746597, 11249948, 11245285, 11004974, 10602324, 10155620, 10099114, 10145182, 9636658, 10062316, 10261979, 10092866, 10134233, 10148503, 10623269, 10793179, 10608799, 11084016, 11549595, 11239838, 10899476, 10513673, 10123963, 9739328, 9394403, 8866640, 8886321, 8636195, 8836325, 8960681, 9166316, 9034475, 8857306, 9042164, 8354288, 8357887, 8209404, 8274462, 7820231, 7888998, 7736840, 7527309, 7245985, 6461432, 6295494, 6108149, 5758299, 5265363, 5104423, 4729572, 4887969, 4609939]
5402D609939k93280p9390K47035J93Q9691K28750j73103n25884R7904k83102P5175
5391C993928O8194o8378j38166j50143J70182j51285n23411M75099k50516M9784
5381C475288j03617L00500J6443M9344j48637J64472l02993O7305J90674j43980
5371C564799J22159m13070K55335m02369L2892l13155j00850M2708J61465j36195
5361B813719p0553l7463R3671m2974L36642m99409p75m77367J77748L9060J6285
5350B348584k03017L7486J32704K19187p11712L64858j44187o0825J90674o045
5340B167707j3127j66136j9312o0908N38936m28243l44664K70431K28198r8392
5330B074490J8181l461k17045M30577m05773J22090K18529j79437N2839n1646
$$ y = [4609939, 4316659, 4237269, 4484304, 4484497, 4574188, 4802938, 4629835, 4103951, 4201855, 3918753, 3993928, 4062122, 3993744, 3855578, 3705435, 3875617, 3724332, 3200921, 3676020, 3425504, 3475288, 3371671, 3672171, 3688614, 3737958, 3589321, 3753793, 3450800, 3518105, 3708779, 3564799, 3686958, 3273888, 3529223, 3126854, 3159746, 2846591, 2745741, 2788449, 2949914, 2813719, 2743166, 2705703, 2799374, 2756400, 3093042, 2593633, 2592858, 2115491, 2293239, 2332299, 2348584, 2145567, 2183053, 2315757, 2534944, 1823232, 2188090, 2043903, 1983078, 2173752, 2167707, 2154580, 1988444, 1969132, 1908224, 2447160, 2018917, 1674253, 1944684, 2172882, 2074490, 2092671, 2089210, 1872165, 2302742, 1896969, 2019059, 2237588, 2058151, 2110990, 2059344]
5320B059344L5153j68973N202K672k05676Q2606L51940j54209q7322k116K67598
5309B186219k47473J64288K42914m71824l2281m5922l769k56956L04273j10144
5299A729325J62394K2295l60181L65580j53294j49867R8763N8987j59915M5243
5289A659330P2364r4723m00469j80470J66317Q7122J54962j17629M4552k78422
5279A112934K01488j59193J80379l11719J58828M3209J24501j38715j00968m6589
5269A064155r1312R8636p7309J43626j18579j18069K82438k22066P4748k79008
5259G57260O5997q4389J67681j71525L40739j1007k39548N8804r9981P5197m1521
5248H17707j58847J09992M93519m74599K59254j67675K16096k48263j23067K78613
$$ y = [2059344, 2094497, 1925524, 1930726, 1933398, 1727722, 1810328, 2162268, 2008059, 1920737, 1918621, 2186219, 1938746, 2103034, 2345948, 1874124, 1841843, 1795921, 1792152, 1535196, 1839469, 1729325, 1891719, 1914014, 1553833, 1919413, 1766119, 1616252, 1715015, 1774002, 1614087, 1659330, 1731694, 1636971, 1236502, 1056032, 1222349, 1309471, 1464433, 1346804, 1391356, 1112934, 1314422, 1155229, 1335608, 1023889, 1182717, 1225926, 1350427, 1211712, 1110744, 1064155, 972843, 1071479, 994170, 1137796, 1019217, 901148, 1183586, 961520, 1036268, 757260, 823257, 738868, 906549, 735024, 1075763, 1064756, 825208, 884012, 784031, 859228, 817707, 658860, 768852, 1262371, 787772, 1047026, 879351, 1095447, 847184, 724117, 1002730]
5238A002730l99197M01685k3475p4681n0614j77212J47001L4951L07307m85530
5228F82965J35035K06333j69654j66290L57624k17103K66766m05520j65826K29841
5218G54171j13867j698o9806L04114l7841J5353l65487K10910K52878l12622R1508
5207G27613L898m9067n1758K8947P6795K41537j91694L63248n38301K09657K45477
5196A066352k91709L54255j61599M16881l59290Q8189K83823k43601K85913k99880
5186A139334l808k30460L53430j39783L47459m62476K59300k17268j10152K73742
5176A209318j30399j14270j17358j90474p3030N92856o32699L62644l8675j08906
5166G59007k38809K21968J51488j31633p5617n096J15637L5362K91397l46774
$$ y = [1002730, 603533, 1005218, 981743, 907062, 856448, 679236, 826237, 861188, 1168495, 682965, 818000, 1024333, 854679, 688389, 1046013, 828910, 1095676, 690156, 524330, 754171, 640304, 638606, 568800, 872914, 835073, 850426, 484939, 695849, 948727, 636105, 727613, 731511, 682444, 630686, 659633, 736428, 977965, 786271, 1149519, 611218, 820875, 1066352, 774643, 1128898, 967299, 1384180, 1024890, 1113079, 1396902, 1153301, 1439214, 1139334, 1135526, 905066, 1258496, 1118713, 1466172, 1003696, 1262996, 1045728, 935576, 1209318, 1078919, 964649, 847291, 656817, 583787, 1176643, 543944, 906588, 867913, 759007, 520198, 742166, 893654, 762021, 686404, 681308, 796945, 832307, 1123704, 776930]
5156G76930m34L83042k53559K19057k30192K58631p3045M4051q1047n5795J72327
5145A159966l67760K91173r2393l893k82481K05444J22241j4619k24353P5586
5135H68911r6653k76899M29751k48868K53109k65527p1951Q1969k7205n1963J30144
5124G24818l34724N4625K44971k01922j05243L12094P6266l120k00945J69764
5114G36584j29319Q641k74306K66974K33662k17309k11653N2883J62259l9640
5104E88776N01318m36380L2091K85037l99907j6495j35426j71081J59658Q2517
5094D90108o1385j44956J48803K52025j39440j89618m1470J36915P0895J88172
5084G10049p8057l08237L32886l30353J60167J21703k03170K72816k41776L60192
$$ y = [776930, 776496, 1159538, 905979, 1125036, 894844, 1153475, 1080430, 1124481, 1043434, 987639, 1159966, 792206, 1083379, 990986, 987093, 704612, 910056, 1032297, 1017678, 793325, 868911, 772258, 495359, 925110, 676242, 929351, 663824, 591873, 673842, 646637, 594674, 724818, 390094, 444719, 689690, 487768, 382525, 694619, 770885, 767765, 566820, 736584, 607265, 615906, 341600, 608574, 842236, 624927, 413274, 466157, 628416, 588776, 1090094, 653714, 685805, 970842, 570935, 554440, 419014, 247933, 407591, 490108, 428723, 283767, 432570, 684595, 545155, 355537, 314067, 450982, 521877, 710049, 631992, 323755, 656641, 326288, 486455, 608158, 404988, 677804, 436028, 796220]
5074G96220p5437k21026l06859L96481K63867k26459L69503J55482N2227K44861
5064A448860P99612N22645Q73306J70300o11734k53423p21472o07922l60244j59919
5054A100009k23120N4662k01002p5200j84713K14118P4813o24570R7375O20351
5044H52723j62146j97655L8236k29268M29470m22538K89700l5794j69079k18978
5034A74671M28144k73783k4712L10260j82040k56133M97746j67199M42129m76727
5024D72356r2556k71685O08915k69444K55465j18108k46449j48393K33800p5303
5014C48598J64488k21662j75106M18444j5184j69810k03631K29350j05010J48636
5004D19113J89491m61301J96490K05665l4719n8074l5338n3069N21426l89876
$$ y = [796220, 720783, 499757, 192898, 589379, 853246, 626787, 996290, 1151772, 1203999, 1448860, 2248472, 2771117, 3644423, 3814723, 3202989, 2949566, 2228094, 1620172, 1259928, 1100009, 876889, 931551, 730549, 655349, 470636, 684754, 759567, 134997, 232372, 852723, 690577, 492922, 531158, 301890, 731360, 308822, 598522, 562728, 393649, 174671, 602815, 329032, 304320, 614580, 432540, 176407, 674153, 506954, 949083, 472356, 379800, 108115, 717030, 447586, 703051, 584943, 338494, 190101, 423901, 348598, 513086, 291424, 116318, 534762, 519578, 349768, 146137, 375487, 270477, 419113, 608604, 147303, 343793, 549458, 514739, 456665, 421327, 368258, 889684, 499808]
4994D99808J97038J83878n96734R7358L31373k46168p1027L30029o42976O97504
4984G80083l45925j17421j33256P16K08953j8578J81202r8609j54885R6115R8856
4973D97251j59245j38984L03016J52119l81499M72347r1625k58631q5773J58984
4963D67960J43084m8223k64642J59900j33226M09957k74322n4986L6174K98097
4953G39773k10291j11970M7300J21162j91554K02843l9039k06740J41195k12750
4943B79929l1872L81538l45816L44983o4072J57157j72087N4073m54936J80366
4933C29263J8032L54766k3067M0464k72322K55030r3415j34789l03439P0937R4510
4922C35970K07240j49593J63127j45145k35060L6119J18113l9927M08247n58365
$$ y = [499808, 696846, 880724, 283990, 381348, 712721, 466553, 395526, 725555, 82579, 780083, 434158, 316737, 183481, 184197, 393150, 374572, 555774, 457165, 302280, 398395, 497251, 338006, 199022, 502038, 654157, 272658, 745005, 653380, 394749, 308976, 467960, 611044, 562821, 298179, 458079, 324853, 734810, 460488, 405502, 441676, 739773, 529482, 417512, 464812, 585974, 394420, 597263, 558224, 351484, 492679, 279929, 248057, 629595, 283779, 628762, 564690, 721847, 549760, 603833, 148897, 329263, 347295, 702061, 678994, 719458, 447136, 702166, 608751, 473962, 170523, 241460, 335970, 543210, 393617, 556744, 411599, 176539, 212658, 330771, 290844, 699091, 140726]
4912A40726N17424K1865l2676l17172L90605O7202l59299K61988n23024L76204
4902E43843j75686j4931N6498J37931J49161k26633K82311k74568J63005n41455
4892I9476O08649r4594q9479M5439M7907p8290j62374Q6535J02135l80293K78978
4881D64089k4191j72344M40919j00655k26594P8727k6410l8491L65416j293m40592
4870C18581p3189K38532J73835j59849J25058P0317l91917K07550Q944m44453
4860G3409N28728r2106k42765J77923J40120j10818n6940p3751l9997J68669K83480
4849G55952O4831o89589N62172k17091R8855n9702j50536K76349j12981q2951
4839D45309m3851P2328N9264K15732k13379j36100K04843J18195k87530K43970
$$ y = [140726, 658150, 680015, 647339, 330167, 720772, 787974, 428675, 690663, 167639, 543843, 368157, 353226, 409724, 547655, 696816, 470183, 752494, 477926, 640931, 99476, 708125, 613531, 524052, 569491, 617398, 539108, 376734, 463269, 565404, 185111, 464089, 439898, 267554, 708473, 607818, 381224, 459951, 433541, 395050, 760466, 759173, 318581, 245392, 483924, 657759, 497910, 622968, 693285, 301368, 508918, 517862, 73409, 602137, 510031, 267266, 445189, 585309, 474491, 417551, 343800, 303803, 472472, 755952, 820783, 131194, 693366, 476275, 575130, 515428, 364892, 641241, 528260, 445309, 401458, 473786, 533050, 748782, 535403, 399303, 604146, 722341, 434811, 678781]
4829F78781k70759J48351k04710P5566N26490p12442R2199L03720J79380k89745
4819E26831L10947l28018J71551l3588K04048j4245J25321n8353j31868l00123
4809D72503J71566R3712J57341k96487J70870r1627k4853M9932l39744K40855
4799F04068J40905p5625q1923J97268j39610m3114r5632K97492m5146K9933L6265
4788H24881n3976p8144J33972K75238K69283K52930k37854p3853J01817j2457
4778A401837L4014k16517R0810K1116l1135Q4579J44724l63208j13319L77351
4768A430252k04820p3904M80151j37853J98080o2670p09264M31280N8095o50362
4758G58985K64734q2029j88456j71381R2193N3403J97765l04959L11934l19592
$$ y = [678781, 408022, 556373, 351663, 427229, 953719, 241277, 333476, 637196, 816576, 526831, 837778, 509760, 681311, 647723, 851771, 837526, 962847, 904494, 772626, 472503, 644069, 737781, 895122, 598635, 769505, 677878, 653025, 702957, 363213, 604068, 744973, 669348, 587425, 784693, 645083, 601969, 506337, 803829, 758683, 788616, 824881, 770905, 692761, 826733, 1101971, 1371254, 1624184, 1386330, 1312477, 1414294, 1401837, 1435851, 1219334, 1310144, 1331260, 1300125, 1384704, 1529428, 1166220, 1052901, 1430252, 1225432, 1151528, 1631679, 1493826, 1691906, 1629236, 919972, 1351252, 1409347, 758985, 1023719, 941690, 753234, 581853, 674046, 727449, 925214, 620255, 932189, 612597]
4748F12597K70232J29353k13778n1795r273O4237o6587P8160K0686k43868J22257
4737G12221n7245J51597l77n7225j03746J93245Q7504j44327j18923L71207k7074
4726A006857k61535K27804K6830k99976P5390J53064J70930j92861j04201J06837
4716I09139L7901J23042k12814n7702K95633p3054l5610J0825j34615q8409J62000
4705I36336O3214P3437J31399l03780j2310K05626l9957p0798N4033j55358r9278
4694G82564o5513J77664J7870k51677K92799K8469J59640k15737K49771k21721
4684I54129n0526J15145J66087j41057K68254j56324p7957j74470K41673J15094
4674A260048k84775P3145k1175P720K95135p0733j7345j07685K1057j27064K9166
$$ y = [612597, 882829, 1012182, 798404, 746609, 737336, 801573, 734986, 813146, 833832, 589964, 712221, 654976, 806573, 806196, 748971, 645225, 838470, 925974, 781647, 662724, 1033931, 1006857, 745322, 973126, 999956, 699980, 775370, 928434, 1099364, 906503, 802302, 909139, 947040, 1070082, 857268, 799566, 1095199, 1022145, 986535, 997360, 862745, 774336, 936336, 999550, 1072987, 1204386, 900606, 888296, 1093922, 1053965, 983167, 1037200, 881842, 782564, 717051, 894715, 912585, 660908, 953707, 982176, 1141816, 926079, 1175850, 954129, 903603, 1018748, 1184835, 1043778, 1312032, 1155708, 1077751, 903281, 1144954, 1260048, 975273, 1048418, 1027243, 1034963, 1330098, 1259365, 1242020, 1134335, 1155392, 1028328, 1057494]
4663A057494J38380J6224k31680J58917J14287j90755K47807J45859l13718P9405
4653A222220j267k63609J74780J07230L07442l22573j71953Q2804q7049M41484
4643A489509l03518K8057J75496o9186p3701K10085J69516k05562K6968K98094
4633A745758l30336J98472O0465j749L76114k04288j73531L74492k21509J15069
4623A938957j41571j35357L52706k60514j02465l8785K99870j26445J76706m77983
4613A485119N27579N6009l82184L31537k84130l1142J13124j84592J66323O4106
4603A861749r0206j01402L8087J29096k27826J19818J25459K08990J20285j36117
4593B047933Q2858L9339J9191j83088N73289k23654N1847L44158J32372N27535
$$ y = [1057494, 1195874, 1212098, 980418, 1139335, 1253622, 1062867, 1310674, 1456533, 1142815, 1222220, 1220953, 957344, 1132124, 1239354, 1546796, 1224223, 1052270, 1135074, 1048025, 1489509, 1185991, 1214048, 1389544, 1320358, 1246657, 1456742, 1626258, 1420696, 1447664, 1745758, 1415422, 1613894, 1674359, 1672610, 2048724, 1844436, 1670905, 2045397, 1823888, 1938957, 1797386, 1662029, 2014735, 1754221, 1651756, 1612971, 1912841, 1786396, 1963102, 1485119, 2012698, 2068707, 1686523, 2018060, 1733930, 1702788, 1815912, 1631320, 1797643, 1861749, 1771543, 1670141, 1708228, 1837324, 1609498, 1729316, 1854775, 2063765, 2184050, 2047933, 2130791, 2170130, 2189321, 2006233, 2579522, 2355868, 2407715, 2751873, 2884245, 3411780]
4583C411780R0127J29768J32853k84599m6646j23058j89645J80378o7359l85701
4573B847898L24743n58882J90705Q4001R9209p82726J93395K43432K646l0107
4563B614314j29987r4182J76051R2955J08257J2861L39890L07419N51720j99391
4553C779907L78357m21909l59168j36245p8212Q0216L4163l79967K40009k52826
4543B884325n05978M90126m19915L2632j6195J07729J08828j98632j3795n4992
4533B414133M4090j26940R0751k74304M05685r1996k71427L53271l05556k52531
4523A985176M22518M9406k10067K54807l19593K00613j7776j53220K91956m51688
4513B052132N12250K7873l40746L12220K0946l95406J82327J12082j30134K96822
$$ y = [3411780, 3501907, 3631675, 3764528, 3479929, 3433283, 3310225, 3120580, 3300958, 3233599, 2847898, 3172641, 2613759, 2804464, 2888465, 2987674, 2204948, 2398343, 2641775, 2644421, 2614314, 2484327, 2390145, 2566196, 2659151, 2767408, 2780269, 3120159, 3427578, 3979298, 3779907, 4158264, 3736355, 3377187, 3240942, 3162730, 3242946, 3277109, 2897142, 3137151, 2884325, 2378347, 2868473, 2448558, 2481190, 2464995, 2572724, 2681552, 2482920, 2469125, 2414133, 2458223, 2331283, 2422034, 2147730, 2553415, 2461419, 2189992, 2543263, 2237707, 1985176, 2407694, 2457100, 2247033, 2501840, 2182247, 2382860, 2365084, 2211864, 2503820, 2052132, 2564382, 2592255, 2251509, 2563729, 2584675, 2189269, 2371596, 2483678, 2353544, 2650366]
4503B650366N7064k09386J60269k48855K65038L02194l33908J17718L57021j72660
4493B944861o2733M2535J5922J17160r4032R5585K2639j3342J20018k12414L43146
4482C319345k69834k51320P73510q7513n24997K15017L6601L68653j15033K66784
4472C731213J01825j60989J0499j94689M69619J353J15995o6266P8754J11428
4462D198742K25564o5786K19994m25772R222J11280J79757J54594j17199K15558
4452D705954J31871p5901R5467J41962m9329L16675J59456J97939m8214l61043
4442E214837L14572J49658J65345K35026m03721M23607R5587N8568j88495L28802
4432F393786j85109P95167j52098L3898n5310L28176j5520n6975n7561O35961
$$ y = [2650366, 2707430, 2498044, 2658313, 2409458, 2674496, 2976690, 2642782, 2760500, 3117521, 2944861, 2882128, 2924663, 2940585, 3057745, 2963713, 3059298, 3081937, 3068595, 3188613, 2976199, 3319345, 3049511, 2798191, 3571701, 3484188, 2959191, 3174208, 3210809, 3579462, 3464429, 3731213, 3833038, 3672049, 3682548, 3487859, 3957478, 3958831, 4074826, 4008560, 4087314, 4198742, 4424306, 4358520, 4578514, 4152742, 4161964, 4273244, 4453001, 4607595, 4490396, 4705954, 4837825, 4761924, 4857391, 4999353, 4950024, 5266699, 5426155, 5624094, 5575880, 5214837, 5529409, 5679067, 5844412, 6079438, 5675717, 6099324, 6194911, 6253479, 6064984, 6393786, 6208677, 7003844, 6851746, 6885644, 6830334, 7158510, 7142990, 7086015, 7028454, 7664415]
4422G664415j76474K21454L85661k01688J00065L86472j2489j63263M05998L39982
4412H950133O5029J36144N5403K39831L60087R1933L9571M39186M59842K45888
4402A1083047m0557L73783j7596L08902N65696l9228M68953P9315K78012N35971
4392A3596298J44388L06688O33237N00801L37528K97207P14843L30894R91286
4383A7853170J145787R80074M04641Q56061Q23295R45628P71647R21282J465976
4374B6167561Q54068J987061K399313M832346P263034R558087Q581286M195973
4366F5838729n18979l413189n242348m840223l155624k089899k163970n30106
4358D3884391r50212l83128K60866R60062Q87329J661247K000988K521443K737944
$$ y = [7664415, 7487941, 7709395, 8095056, 7893368, 7993433, 8379905, 8367416, 8204153, 8610151, 8950133, 9015162, 9151306, 9206709, 9446540, 9806627, 9898560, 9938131, 10377317, 10837159, 11083047, 11042490, 11416273, 11398677, 11707579, 12273275, 12234047, 12703000, 12782315, 13060327, 13596298, 13740686, 14047374, 14680611, 15181412, 15518940, 15816147, 16530990, 16861884, 17853170, 18998957, 19979031, 20383672, 21239733, 22063028, 23008656, 23780303, 24701585, 26167561, 27021629, 29008690, 31408003, 36240349, 43503383, 53061470, 61642756, 65838729, 65319750, 61906561, 56664213, 51823990, 48668366, 46578467, 44414497, 43884391, 42934179, 42551051, 42811917, 43771979, 44659308, 46320555, 48321543, 50842986, 53580930]
4349E3580930L528315L583751M471192N551192O929347J0242857J3815224J6878350
4341A18581158J7849772J7411941J8812235L0172324N7646573Q8873536R4803253
4334D44150792M2410465m3375624p0114615m1952953j0733068J1193407J7028986
4327C48607390j513904l7712976n5256340m5554632l1335258j9470871j0933793
4320A46829616o926937o311283o532388j844049J980063N165590N175638M948908
4312A42485158Q752360J9892896M2503852P4433573R3060592O4045915j4978746
4305D30195600p2691093n9008559k7106131O88160J7237138J1553604k0078211
4298B80790508m8234266m7503688l4753456k3123862j4726993r749562p815361
$$ y = [53580930, 57109245, 60692996, 65164188, 70715380, 77644727, 87887584, 101702808, 118581158, 136430930, 153842871, 172655106, 202827430, 260474003, 349347539, 444150792, 486561257, 443185633, 373071018, 331118065, 320384997, 331578404, 348607390, 347093486, 309380510, 254124170, 208569538, 177234280, 157763409, 146829616, 139902679, 133591396, 127059008, 125214959, 127195022, 132360612, 137536250, 142485158, 151237518, 171130414, 213634266, 288067839, 381128431, 445174346, 430195600, 357504507, 298495948, 271389817, 272077977, 289315115, 300868719, 280790508, 232556242, 185052554, 150299098, 127175236, 112448243, 102698681, 94883320]
4291I4883320r752030q444534m809251k126293k527279n257233o900841o586865
4283D8478994n179596l256349k541840k753317k394435j951992j556870j865510
4275B6979085j652857j516262j379721k56797j295395p39221m10441j025273j295269
4266A7407849P8210j097605l63137j12171j226358P2887n62660m34834o40715
4257A3121466l74600n2651m89114o73010l10061n06115l33228l18670l43632m9125
4247I671260k34669l63653n24974M2512j9578m29467k69058j5425j35585q2084
4237G639279n60707j46805K88089n25479j77544K11455o99715L76473k31378j37689
4227F035979m30899l48659J04163l29897J72669j32964l3231l62766j43619j27982
$$ y = [94883320, 85131290, 76686756, 71877505, 69751212, 67223933, 61966700, 55065859, 48478994, 43299398, 40043049, 37501209, 34747892, 32353457, 30401465, 28844595, 26979085, 25326228, 23809966, 22430245, 22173448, 20878053, 20138832, 19728391, 18703118, 17407849, 17486059, 16388454, 16025317, 15913146, 14686788, 14759675, 14197015, 13762181, 13121466, 12746866, 12694215, 12205101, 11532091, 11222030, 10715915, 10382687, 10064017, 9720385, 9671260, 9436591, 9072938, 8547964, 8590476, 8570898, 8141431, 7872373, 7856948, 7721363, 7639279, 7078572, 6931767, 7219856, 6694377, 6516833, 6728288, 6028573, 6405046, 6173668, 6035979, 5605080, 5256421, 5360584, 5030687, 5203356, 5070392, 5037161, 4674395, 4530776, 4402794]
4217D402794j23434O1352j39146K77906l49664j87648J29006j0083k16220m1124
4207C803739J55625Q6082l60380j12877k68031j01302j11794k25038j8740J83143
4197C030427m72941Q8808R3507k52942r3060J38261k48749J26858j14712p9015
4187B216442o7177P3299J03759j71681n1061k50653k16857j24209k9475N17338
4177A999725m08564j39331p9947P575j33728n2299N8279L09343k97878j22035
4167A141140j48061K37930k03584m9866J55766l50289K52609j01981l76645L82665
4157I39684j10139N2065k9632l9941K3918m3052j83773o5967M47353m18781J21127
4146F92862l34233m2383K98981J43107j53096J5341l39155r7382L01372j22415
$$ y = [4402794, 4279360, 4340712, 4201566, 4479472, 4129808, 3942160, 4071166, 4061083, 3844863, 3803739, 3959364, 4045446, 3685066, 3572189, 3304158, 3202856, 3091062, 2866024, 2847284, 3030427, 2557486, 2646294, 2739801, 2486859, 2393799, 2532060, 2283311, 2410169, 2295457, 2216442, 2149265, 2222564, 2326323, 2154642, 2103581, 1852928, 1636071, 1511862, 1482387, 1999725, 1591161, 1451830, 1371883, 1379458, 1245730, 1193431, 1251710, 1561053, 1263175, 1141140, 993079, 1231009, 1027425, 977559, 1133325, 783036, 1035645, 933664, 557019, 939684, 829545, 881610, 851978, 812037, 835955, 792903, 609130, 543163, 990516, 571735, 692862, 358629, 316246, 615227, 758334, 605238, 620579, 281424, 184042, 485414, 362999]
4136C62999j63646K55532j62750J95224K54354p65366M36075j51060J03943Q7225
4126D52530p8932j98481J9783J8386j25421L61736P9922j82640J18571K11983
4116F77437O962k13492j22110j34206L42606j7655k31950k64059J06008K12302
4106C61843k7554l8168K63295j42773o9580J31116J09895k54477L35547J81917
4096H51061o8248l05554j96290K5259K51491K38857j67554m0852N97273K01526
4086A386969N54879L21019J03305q4280o4765k29989Q347l3709k91213L33903
4076B004466q8506L49868n10970j66855k58164K30235r1245J22582k96518M52418
4066A747311l4450k61671K80080Q4448m49196P81809K4520J93837J031753J35877
$$ y = [362999, 199353, 454885, 292135, 487359, 741713, -23653, 412422, 261362, 365305, 452530, 373598, 175117, 194900, 213286, 87865, 449601, 529523, 346883, 465454, 677437, 684399, 470907, 348797, 214591, 557197, 539542, 307592, 43533, 149541, 361843, 334289, 296121, 559416, 416643, 347063, 478179, 588074, 333597, 669144, 851061, 782813, 477259, 280969, 306228, 557719, 796576, 629022, 588170, 1185443, 1386969, 1941848, 2262867, 2366172, 2281892, 2217127, 1987138, 1995485, 1961776, 1670563, 2004466, 1915960, 2265828, 1754858, 1588003, 1329839, 1560074, 1468829, 1591411, 1294893, 1747311, 1712861, 1451190, 1731270, 1815718, 1366522, 2148331, 2172851, 2366688, 3398441, 3534318]
4056C534318j18808J01711n92257K78401l67924M5510K10795K85149l6984m35239
4046B904672k4347l28413K29694k92032J66477J08821N3084j26244K09623k70471
4036B630864J16432M71234j41274M14010L9757q34459J80686j68361m74463l63798
4026A870628l93430K22401K02844r3237L65955n06935p9724K01282N2186M695
4016A846665o3542J17414O9676M69572p6330j97429N7489R2619l52438K08655
4006B172351p9666M8442l53874J65216l76161m3640k25958l03506M4425L28218
3996A375847l50098L55650m6291j36765Q7820J51383M04155n16094l61534K23540
3986A187613q0748k55227J4187j2753P2359k38368J71385k82847m05204J45481
$$ y = [3534318, 3415510, 3517221, 2924964, 3203365, 2835441, 2880951, 3091746, 3376895, 3339911, 2904672, 2880325, 2551912, 2781606, 2489574, 2656051, 2764872, 2817956, 2691712, 2901335, 2630864, 2747296, 3218530, 3077256, 3491266, 3531023, 2696564, 2877250, 2708889, 2234426, 1870628, 1477198, 1699599, 1902443, 1809206, 2175161, 1668226, 1588502, 1789784, 1841970, 1846665, 1783123, 1900537, 1970213, 2439785, 2363455, 2166026, 2223515, 2316134, 1963696, 2172351, 2092685, 2141127, 1787253, 1952469, 1576308, 1532668, 1306710, 1003204, 1047629, 1375847, 1025749, 1381399, 1335108, 1198343, 1286163, 1437546, 1841701, 1325607, 964073, 1187613, 1106865, 851638, 865825, 853072, 925431, 687063, 858448, 575601, 170397, 315878]
3976C15878J89514k02099m2822j08261K55481j64750j20841J66139l10818K00192
3966A77613J8264j18246K25914j29819n7704K30927j00249j05071Q3192q0629
3956A44192j03639j36306K40910o466l03620n4672K68438j48203j27127J93723
3946c2770j28130J34164K33604n03000M32003m99230K34350J32286R7434k51740
3936a51029k6721K52764q1127p324l351p5394R3796R0885R3209l71151J51623
3925c3820L74508k45723k96766J68510m1694J04065l46135K20248O8306j29170
3915a57671k44549K10682R5987J2283j56313j51045o8239L90037j78946N3203
3905a94571K14055J2596J27414j72349j27201j887O0469M3391j07516J12540P8388
$$ y = [315878, 505392, 303293, 260471, 152210, 407691, 242941, 122100, 288239, -22579, 177613, 195877, 77631, 303545, 173726, 116022, 346949, 246700, 141629, 224821, 144192, 40553, -95753, 145157, 138691, -164929, -219601, 48837, -99366, -226493, -32770, -160900, -26736, 206868, -296132, 135871, -363359, -129009, 3277, 100711, -151029, -177750, 75014, -6113, -13437, -16788, -92182, 1614, 92499, 185708, -185443, -33820, 340688, 94965, -201801, -33291, -74985, 29080, -317055, -96807, -28501, -157671, -402220, -191538, -95551, -83268, -239581, -390626, -458865, -68828, -247774, -194571, 19484, 32080, 159494, -12855, -140056, -141943, -81474, -38083, -145599, -33059, 45329]
3894D5329k05240k89665m8508j11536j02770J86282k7233K71883L57134p10988
3884f35312K15329l6383L8011P952k56681L44358J55684j10143k65188O7787J49434
3873c25152J61949k18159j42925J83736Q0435k2505M9680l3945j58117K40486
3863a84517l49207m0542K10634l8543k39765J34805q3793M37502k60607L0349
3853c83684J72076q2976n7628l10930J39K84310j04331K4910j00241K4419M7439
3842d86497k9222m1340j61991J30612J25588k79790K41384m2847K5461O5112k22329
3831f75859J55278K46560j63916j25202L00239m59597Q4655K56226j12305J67140
3821c26781J69256m15636J47534j49216K13056k94537k35532N02433k25692k15605
$$ y = [45329, -159911, -449576, -498084, -609620, -712390, -526108, -553341, -281458, 75676, -635312, -419983, -456366, -418355, -410403, -667084, -322726, -167042, -277185, -542373, -474586, -325152, -163203, -381362, -524287, -340551, -260116, -282621, -232941, -266886, -425003, -184517, -533724, -574266, -363632, -402175, -641940, -507135, -590928, -153426, -414033, -383684, -211608, -294584, -352212, -663142, -663003, -378693, -483024, -458114, -558355, -533936, -486497, -515719, -557059, -719050, -588438, -462850, -742640, -501256, -544103, -518642, -453530, -675859, -520581, -274021, -437937, -563139, -262900, -722497, -637842, -381616, -493921, -326781, -157525, -573161, -425627, -574843, -361787, -656324, -891856, -389423, -615115, -830720]
3811h30720M21079l32647L50379j63803J61586j14130j09014j11188J39939J50056
3801d38463P9093K8050M9376R8996m15012J95714M1809l88017K09383J75666J51911
3790b11494m34643K5376N2561L90845l26218k54268J73885K06086l17898M36678
3780b59090k35485k69363K19595L30759l36264k699k2727N7827k24303L13366
3770d28384K17950m80638K2129L52479j46275q0285O0215j6183J11300j02705
3760d90397l9084R200L34320j83900j36267J9535J36361r506m2778m776l5708
3749d43000r0185j83357J50465O6568J54460J52223n9889O9389m00594l0643M3017
3738e71546R3446L09126K02695n18614l39297K52430k60757L05877j11171P906
$$ y = [-830720, -409641, -742288, -391909, -555712, -394126, -508256, -617270, -728458, -588519, -438463, -359370, -331320, -281944, -182948, -597960, -402246, -360437, -748454, -539071, -363405, -211494, -646137, -620761, -568200, -177355, -503573, -757841, -583956, -377870, -695768, -259090, -494575, -763938, -544343, -213584, -549848, -552547, -575274, -517447, -741750, -428384, -210434, -691072, -668943, -316464, -462739, -543024, -482809, -498992, -387692, -490397, -529481, -520281, -185961, -369861, -506128, -486593, -350232, -359738, -402516, -407292, -443000, -533185, -716542, -566077, -499509, -345049, -192826, -252715, -183326, -583920, -614563, -571546, -478100, -168974, 33721, -484893, -824190, -571760, -832517, -526640, -637811, -629905]
3728f29905K8784P4292o1405p0511K36210J26632l69645J27740J81832q6655J77804
3717b64827l54800j03573N37473j37228j61432l20212L01893N895J2404j59520
3707f43927k43002K59206K11420k20944M74616j82705m94801M73104m643J38411
3697b33265l87099l631j03189L2787M02721J56179k61152p2883j81581N5017J56488
3686d39608l2199R1463j33365l5877K06790j48874P0683k45908K99522j54975
3676e22348o9135K90751k79954J77244K43210j07845l01098K18004j83802m6147
3666e81120L88265l44962L2020K77749m30262L7341j0179j54955K41181l4239
3656e79161K93034n35678K29328L02523j88406J1702K31102j64773J90715r2852
$$ y = [-629905, -601121, -526829, -588234, -658745, -422535, -295903, -665548, -537808, -355976, -442631, -264827, -619627, -723200, -185727, -322955, -484387, -804599, -502706, -496811, -484407, -643927, -886929, -627723, -416303, -637247, -162631, -345336, -840137, -367033, -371676, -233265, -620364, -623995, -727184, -694397, -291676, -135497, -396649, -469532, -651113, -596096, -439608, -471807, -380344, -513709, -549586, -342796, -491670, -420987, -666895, -367373, -522348, -591483, -300732, -580686, -403442, -160232, -268077, -569175, -351171, -534973, -581120, -192855, -537817, -505797, -228048, -658310, -620969, -631148, -786103, -544922, -579161, -286127, -821805, -592477, -289954, -478360, -466658, -235556, -400329, -209614, -302466]
3646c02466j51436L04093k64709J77126k82304j66153J30636j27110K55905R6024
3636c30394o6370N1568j07564j74591M22731K02213m36458J67293N0233J03897
3626a17442k03131k06369L56603l30222M4366R6669k00462r664J02449M507j80923
3615f43619J48768o1411o3848N23157k53291j02657K49324m19711L2233P6939
3605e14116j2532J14820j12395j26582M4569L93061k86216n9760J21410j67387
3595f05128L36608k6343p887N0947j43175j7929K17005l40854j31583J20265K41839
3584c06235l7492j86678q3150P2426n2819L33266R874m11809R4864L02088L7048
3573b28617m0512k88610J27137J40422k37399R4180k065j75233r5528L76991J07236
$$ y = [-302466, -453902, -149809, -414518, -237392, -519696, -685849, -555213, -682323, -426418, -330394, -396764, -345196, -452760, -627351, -204620, -2407, -438865, -271572, -221339, -117442, -320573, -526942, -170339, -500561, -456195, -359526, -559988, -569652, -467203, -462696, -643619, -494851, -556262, -620110, -96953, -350244, -452901, -203577, -623288, -591055, -514116, -526648, -411828, -524223, -650805, -606236, -213175, -499391, -559151, -437741, -605128, -268520, -294863, -302750, -251803, -394978, -412907, -195902, -536756, -668339, -548074, -306235, -343727, -530405, -613555, -541129, -593948, -260682, -250808, -662617, -567753, -265665, -228617, -269129, -557739, -430602, -290180, -527579, -433399, -435464, -610697, -706225, -329234, -221998]
3562b21998l00271O9098j22897J0251L53848j56519O3224m69935O85394k79296
3552c69101j5888R0770k21353M47940k95375J17129m38274L09153J21679J6195
3542b37125M83290Q4059l38692L71968O03101J01461p78813R8501k61797q0945
3532D5008l67525J35283k12050K03021J62104L94893o1088o9023l54210n545M31844
3521C02712M17741j27026l28308O9515l29091K06457k48974m49423N04460o9212
3511e1149r8936P4238M676l92924J91812l92892K80199K84290l50314J59725K37
3500b91038J18322j88618J25516p3624J46648N2383l74734M28282j81467j80437
3490d18767M50610m23093J31129P6644R8564N4960K7662r8736k10563j21641J14814
$$ y = [-221998, -522269, -453171, -576068, -565817, -211969, -368488, -305264, -775199, -89805, -369101, -384989, -294219, -515572, -67632, -363007, -245878, -684152, -374999, -253320, -237125, 246165, 330224, -8468, 363500, 966601, 1068062, 289249, 387750, 125953, 45008, -322517, -187234, -399284, -196263, -34159, 360734, 299646, 230623, -123587, -129132, 302712, 720453, 593427, 265119, 334634, 5543, 212000, -36974, -486397, 18063, -51149, -150085, -75847, -71171, -464095, -272283, -665175, -384976, -100686, -451000, -291275, -291038, -172716, -361334, -235818, -309442, -162794, -110411, -485145, -56863, -238330, -418767, 31843, -391250, -260121, -183477, -84913, -29953, -2291, -101027, -311590, -433231, -318417]
3479c18417L46603j24589k04790j41522J93999K9138k61080K92593J99957l75220
3469c63328L44915j24941J45596n0341M6064j03454Q4584N6735p6024K47074j41571
3458F5309K55778m48420K35343J24080J49016J66649N8550k29265L04225K92182
3448I73447K24276n6068k86939J81741m20955M1503Q2799n5057N20274P52972
3438A957993R82887J588705R57007k73740j228067j125506r40315m82690j62645
3429A273629l21738K6033n9388j01676M21270m01054L03231J47435k61540j76312
3419H49890L79529J57039m01066N66576K94851J018473P78548K57262j78251o70317
3409C052534l17072J38576l25100M28507L37349L99845J670018K096171L340807
$$ y = [-318417, 28186, -96403, -301193, -442715, -248716, -219578, -480658, -188065, 11892, -363328, -18413, -143354, 2242, -48099, -2035, -105489, -20905, 35830, -40194, 206880, 65309, 321087, -127333, 108010, 232090, 381106, 547755, 606305, 377040, 681265, 973447, 1197723, 1141655, 854716, 1036457, 615502, 657005, 739804, 684747, 1205021, 1957993, 2940880, 4529585, 5486592, 5212852, 3984785, 2859279, 1918964, 1436274, 1273629, 951891, 977924, 918536, 816860, 1238130, 837076, 1140307, 1287742, 1026202, 849890, 1229419, 1386458, 985392, 1551968, 1846819, 2865292, 3643840, 3901102, 3722851, 3052534, 2735462, 2874038, 2548938, 2977445, 3314794, 3714639, 5384657, 7480828, 10821635]
3400A0821635L198025J222053q42690k435666j337752L95240J154904M48741k100339
3391A0524151l527928j387406j096052j146299q87450l01525n21018k99378n2747
3382A304348k98605R4430l71937M838O855l87977J41640J81013k91444M1218k26395
3371A97984k6295n6727k8428n8964j87361L28041K8984o6437k47947P9923Q2902
3360D5675M3510k63010J01634K76154l36568K9069m93394O70381k21597j9113
3350a67259M64074k03678q8813p1855J44152k11828J78064k19693K67006p6649
3340A3521O9818K76503N59965Q47731q167K08653o50583o39814k12508k59245
3330B05874j08001q5946l4110q7316m6146j7615K11306l88370L08323q6339k39428
$$ y = [10821635, 14019660, 15241713, 14399023, 11963357, 10625605, 11020845, 12175749, 12624490, 10524151, 6996223, 5608817, 4512765, 3366466, 2479016, 2177491, 1656473, 1357095, 1304348, 1005743, 1100173, 728236, 733074, 739929, 351952, 493592, 674605, 383161, 424379, 197984, 171689, 114962, 86534, 27570, -159791, 168250, 197234, 130797, -117150, -37227, 45675, 89185, -173825, -72191, 203963, -132605, -103536, -596930, 73451, -148146, -167259, 296815, 93137, 4324, -67531, 76621, -135207, 42857, -176836, 90170, 13521, 83339, 359842, 919807, 1767538, 1759371, 1968024, 1317441, 677627, 465119, 205874, 97873, 11927, -22183, -109499, -155645, -173260, 38046, -350324, -42001, -128340, -367768]
3319c67768j39119K95582J26988n2117k50483K45044j17101j84561M60992k84919
3309b67462P1248L13513n71525k1452J06666q1158l45055L38103J37146P8410
3299b41566q2072m45044J70144J61758J89526k0657j085l54013L45657k26719
3289e04071K02174J17591l69316J92264k09189L80084P8058l93037q6766J44584
3279d47624j48365K09929r6059K43273K50295j38368j75848l45842J00247O0170
3269d88192M84006n64323N1682J01781o2417j87259K45041n9777k12291K19678
3259d72071J11513k06015J35637O0945j25152J72705j84905l4601Q2345J11523
3249c48076l02592L00529L6103J4240k90553M33214l88418J48073j17903j6500
$$ y = [-367768, -506887, -211305, -84317, -136434, -386917, -141873, -258974, -443535, 17457, -267462, -196214, 117299, -454226, -475678, -369012, -450170, -795225, -457122, -319976, -241566, -323638, -768682, -598538, -436780, -247254, -267911, -268996, -623009, -277352, -504071, -301897, -184306, -553622, -361358, -570547, -190463, -112405, -505442, -592208, -447624, -595989, -386060, -482119, -238846, 11449, -126919, -302767, -648609, -548362, -488192, -4186, -568509, -516827, -415046, -477463, -664722, -419681, -479458, -691749, -472071, -360558, -566573, -430936, -369991, -495143, -322438, -507343, -541944, -459599, -348076, -650668, -350139, -314036, -299796, -590349, -157135, -545553, -397480, -515383, -531883]
3239e31883j81880L99288Q8616n35187L83990O3534j39203M3018J59477l06431
3229e56661Q344O4596j0603j36374L40154j69044n2639K61536j15963n6531K63504
3218a59681k94490K7946r6389J06616o4669R016K48896q8249j21182k24582K03665
3207d53103q3564m6487L85599n76607M32971J90599l97460K20118M9793j02436
3197c80577L0470R949j54966L29144j77478n7824Q4067j98279L60443o09635j9223
3186g83909P82338n53112o0171o8913J78409p4955M20282k99487J5438o6426J75329
3175c35177j99584J62525j16198l02957K06032J61081L24942L413l14772j29247
3165e39942j65361P51086l05712q7372K11196j49168j03824J82613m94333L06672
$$ y = [-531883, -713763, -314475, -225859, -761046, -377056, -313522, -452725, -409707, -250230, -556661, -548317, -483721, -494324, -630698, -290544, -459588, -512227, -250691, -366654, -423185, -159681, -454171, -426225, -522614, -415998, -480667, -471651, -222755, -311004, -432186, -656768, -453103, -536667, -583154, -197555, -774162, -341191, -150592, -548052, -327934, -278141, -380577, -350107, -340158, -495124, -165980, -343458, -401282, -317215, -515494, -155051, -764686, -783909, -1571, -554683, -614854, -683767, -505358, -580313, -160031, -459518, -444080, -510506, -335177, -534761, -372236, -488434, -791391, -585359, -424278, -99336, -95923, -410695, -539942, -705303, 45783, -259929, -347301, -136105, -285273, -389097, -206484, -700817, -394145]
3155c94145J33624j22240M9432l2837k86240J89452M6051K11222l8509j52774
3145c96964l26807J84231K44822j67710j54499O4100J21202J09254k64152J93554
3135c92969J35035k66580l0374M8452Q1743k47907M67677m13212P3976L67530
3125a76629m17070O9383K43745l1734M6924j20692J95643j26364k49497k871M14148
3114a55014r3813j03523k35082K51887o0179k55397o3154L44374K59394m15230
3104e25737K40949L4241l17031O079L86399j91900K14375k91385K02604j14066
3094c55472J79032o37167K15914J95345q0185m7268J44365l40018N31944l54164
3084e47674r217Q1667j84702L14197K49494k2080k29571n730j58941L18396m78238
$$ y = [-394145, -260521, -382761, -333329, -366166, -652406, -462954, -416903, -205681, -244190, -396964, -723771, -539540, -294718, -462428, -616927, -552827, -431625, -322371, -586523, -392969, -257934, -524514, -554888, -506436, -424693, -672600, -204923, -618135, -544159, -176629, -593699, -524316, -280571, -312305, -265381, -386073, -190430, -316794, -566291, -569162, -155014, -248827, -352350, -587432, -335545, -395724, -651121, -714275, -369901, -110507, -525737, -284788, -250547, -567578, -561499, -175100, -367000, -152625, -444010, -241406, -355472, -176440, -813607, -597693, -402348, -482533, -529801, -385436, -725454, -193510, -547674, -556891, -475224, -659926, -345729, -96235, -118315, -347886, -353616, -512557, -194161, -672399]
3073f72399L87681k07497J03826M05527l62653k29692K28629J66306k20368r3216
3063d93856J59538q5046J91144l17170j29463R8953J50125j80719M54430m58887
3053f10951K12087l17134J24233L83943K56187n32982K64846j40323o2287P8303
3043c44078L01740k08454k06282L27454k78959j21371P943O5658j80838K0686
3033f16501J62772J5166l7191k5389K64715l64726m153J39722j26999P1558J606
3022e19420K38270j52809o135j57033K67174k67524L27796J07001k07674J54833
3012b15521l41788m6581K10716k2814r2916M5828l7959R2481m24506L98538j58856
3001e93378j02035L88793L617k90767L51984l7675k17181Q8717o960j7050K20411
$$ y = [-672399, -284718, -492215, -388389, 17138, -345515, -575207, -346578, -180272, -400640, -493856, -334318, -419364, -228220, -545390, -674853, -575900, -425775, -606494, -152064, -610951, -398864, -715998, -591765, -207822, 48365, -484617, -219771, -360094, -422381, -344078, -42338, -250792, -457074, -129620, -408579, -529950, -522007, -456349, -637187, -616501, -453729, -438563, -475754, -501143, -236428, -601154, -605307, -465585, -592584, -521026, -519420, -281150, -433959, -440094, -597127, -329953, -597477, -269681, -162680, -370354, -215521, -557309, -603890, -393174, -415988, -508904, -463076, -501035, -408554, -833060, -434522, -593378, -695413, -306620, -303003, -593770, -241786, -279461, -496642, -407925, -414885, -431935, -211524]
2990b11524o7469k27974j4914J91485L8563k4183p2302K68516l20619n436J47058
2979b98799m67754J03682K10842j27705J83272m02108N46937n4446J48356j92222
2969c49945q6773k70039K60746L63729l21410J62653k265k10271J08058k07222
2959e52739L17164l04902J36718J69105l77456p7023k49636O39838P8280n32804
2949g53455J38549J66152k59685J77254j05142J01125K46906l59550L92739O0622
2939a94485p9264p8338j45037o6809J36194j41542M09888j22432n2076J49052
2929a84849j04670k31846m6530J9241j87341L66863L72638m34623L3128j47602
2919e45591K45031j25335k58166L10998j33657K83510m0596l76335K27459P3205
$$ y = [-211524, -278993, -506967, -521881, -330396, -291833, -316016, -388318, -119802, -440421, -445857, -298799, -766553, -662871, -452029, -579734, -396462, -798570, -251633, -306079, -157723, -349945, -436718, -706757, -446011, -82282, -403692, -241039, -243304, -453575, -345517, -552739, -235575, -540477, -403759, -234654, -612110, -689133, -938769, -298931, -220651, -753455, -614906, -448754, -708439, -531185, -636327, -535202, -288296, -647846, -255107, -194485, -273749, -352087, -497124, -563933, -427739, -569281, -159393, -281825, -333901, -184849, -289519, -521365, -567895, -548654, -735995, -369132, 3506, -431117, -397989, -545591, -300560, -425895, -684061, -373063, -506720, -223210, -263806, -640141, -412682, -339477]
2909c39477j74254K31792l59920m1978M49400k68684P6734L07301l41592N8935
2899d01743k05093K28148J27572l74070K89415l74007K97325J0462r4438m1054
2889e37483N56499o46229K91261j29981o8293J46561K42017l58654j94084K95284
2879d03102j13615J21372k66824K41539n6326J89006j7760J98242k62467j81529
2869e51464J14170J18599K53461m05375j21545R4183j31242L26857l34499J56650
2859d80205j52079K36298L25125l09002l15134L65728J4948K3901j57984j36305
2849e84709k37229L31389P0865J56589o1085j98357R0870k9258N16764n18883
2839d63044l92028N57478l6851q9801K7938q3904q4891J87059j56459j58755K56599
$$ y = [-339477, -513731, -281939, -641859, -683837, -234437, -503121, -426387, -119086, -460678, -401743, -606836, -378688, -251116, -625186, -335771, -709778, -412453, -401991, -496429, -537483, 19016, -627213, -335952, -465933, -534226, -387665, -145648, -504302, -698386, -403102, -516717, -395345, -662169, -420630, -476956, -287950, -305710, -107468, -369935, -551464, -437294, -318695, -65234, -470609, -592154, -497971, -629213, -302356, -636855, -480205, -632284, -395986, -70861, -379863, -694997, -329269, -314321, -290420, -448404, -584709, -821938, -490549, -419684, -263095, -324180, -522537, -431667, -460925, 55839, -463044, -855072, -297594, -334445, -424246, -396308, -480212, -565103, -378044, -534503, -693258, -436659]
2828d36659m52998K52040L91846M5551k2978n30889J87511R3708k67988M7259
2818f93597K17412K4777j44071K94099m1519o6433k92580J60396n8415L0532M80154
2807h9245k67524m13391L34711M79818l18391m10496o6031M22297J97175l34162
2797d65239K35839k62094J36327J30477m33881M3543K17420k93221J41799q5868
2787f34898J0540K09337k2103j28077L06781l05870K83406k04843J05553k06874
2777e87048J84293j40146L01882J28695l47483J05740k00346O3997k52688P8252
2767f64852L91622j22315l8778q1319j62539L23531j1153j234l7911J14334K60556
2756c0058m44530N0295J12049r9679J25127j22313P945j30578o368N2977J70806
$$ y = [-436659, -889657, -637617, -245771, -200220, -223198, -754087, -566576, -472868, -740856, -693597, -476185, -451408, -595479, -301380, -342899, -409332, -701912, -541516, -599931, -569399, -89245, -356769, -770160, -435449, 44369, -274022, -684518, -750549, -328252, -131077, -465239, -229400, -491494, -355167, -224690, -658571, -615028, -397608, -690829, -549030, -634898, -624358, -415021, -437124, -565201, -258420, -564290, -280884, -485727, -380174, -587048, -402755, -542901, -241019, -112324, -459807, -354067, -554413, -490416, -743104, -664852, -273230, -395545, -434323, -515642, -678181, -354650, -365803, -367037, -404948, -290614, -30058, -474588, -424293, -312244, -411923, -286796, -409109, -401164, -531742, -538110, -485133, -314327]
2745c14327j37883J54647j27207j18349Q5462P7689k98072N6441L8496J64664
2735d18439J66476l2146N7074k86197R40J84306p7822L4688P921j40206K55533
2724b47872L7700k28780l9621k98389M94023j2214j56594J27876l13299J18046
2714e19124K23210l39817J37230P6865j1873m8036R9862o0880k0953Q587J75736
2703b79193J39613j78480j06281O4698J68107j33754j57779M2111o0445K50528
2693b50875k05422N9339l50658N03981l57882J22340K09990l2228k32356J05196
2683d28575K3067J07567n57971K68140M9363K17660L9100k19948R775K80775l525
2672b14572m62768K70842J15850k87310J44963J33930j59298j40108J63423k85843
$$ y = [-314327, -452210, -297563, -424770, -543119, -457657, -379968, -678040, -621599, -583103, -418439, -251963, -284109, -227035, -513232, -512292, -327986, -405808, -371120, -363199, -503405, -247872, -210172, -438952, -478573, -776962, -282939, -295153, -451747, -323871, -637170, -519124, -295914, -635731, -498501, -421636, -433509, -481545, -381683, -442563, -463516, -454929, -279193, -139580, -318060, -424341, -359643, -191536, -325290, -483069, -440958, -501403, -250875, -456297, -396958, -747616, -243635, -601517, -479177, -269187, -301415, -533771, -428575, -405508, -297941, -855912, -587772, -538409, -320749, -281649, -501597, -491822, -211047, -214572, -677340, -406498, -290648, -577958, -432995, -299065, -458363, -598471, -435048, -720891]
2662g20891M84365j82604J39429j22641J19105m2748l77218Q9482M55400k64237
2652d22558r0551J42233m5535l72573L96126Q9035l38191K57454o8386p3212J84732
2641c41426k11774n11431P43966J94188k70410k33223O0379J24625p1129L4545
2631d81690J59065q8850m26414M49868J86322k37792k24612n8440M7887M30706
2621b43950k11975J8415j56098K20029O9520k61805J33203K6036p4068K70073
2611b10620l51413R26J06022J6168j5763j60038K93193K56229m58853p8712L21665
2600b81196l03975J05534K1017l27941K44804M30506m27697J17137L57711m28928
2590d93028L80549l89411R6859J07909j86181j70400K25212Q9489k07923j1182
$$ y = [-720891, -236526, -419130, -279701, -402342, -283237, -325985, -703203, -613721, -158321, -422558, -513109, -370876, -416411, -788984, -392858, -303823, -642014, -384560, -452946, -526158, -341426, -553200, -1064631, -320665, -126477, -396887, -630110, -569731, -445106, -516235, -481690, -322625, -411475, -837889, -388021, -201699, -439491, -664103, -722543, -674656, -243950, -455925, -437510, -593608, -373579, -304059, -565864, -432661, -406625, -480693, -210620, -562033, -561107, -455085, -438917, -454680, -614718, -321525, -65296, -524149, -602861, -281196, -585171, -479637, -458620, -786561, -541757, -111251, -538948, -421811, -64100, -493028, -112479, -501890, -405031, -297122, -483303, -653703, -428491, -339002, -546925, -558107]
2580e58107K76266J96430m23089K57953k71146j12597N87147J64835o60838J95828
2570c47318J40393n44346M04762j22654J22306M1421j97629k5550J9864P1167
2560d37584K3785R2713o9521L6146k1547j2688O1283L94191k92943N4887m58882
2549f30160K90135P3230n3575L11090k77458k66488Q2131j42519K88003k46998
2539e72609J74420j57705K83989l15269K43451P8257j50670L9047q7561j29591
2529e94241M6033J79439P973n6904j2385O9189k72599L72610j53098j47585L88175
2518a73393R3108l59786M9717j390j4914p6346L85794n26831L40819P0531j44275
2507c56966J21507j99902Q8968r2363P3597J919q7838N8172R9222o8596L4445
$$ y = [-558107, -281841, -85411, -508500, -250547, -521693, -634290, -47143, 117692, -543146, -347318, -206925, -751271, -346509, -469163, -346857, -305436, -503065, -528615, -508751, -437584, -413799, -321086, -390607, -354461, -376008, -388696, -327413, 66778, -226165, -171278, -630160, -340025, -266795, -320370, -9280, -286738, -553226, -471095, -613614, -325611, -572609, -398189, -555894, -271905, -587174, -343723, -265466, -416136, -377089, -464650, -594241, -548208, -368769, -360796, -417700, -430085, -360896, -633495, -260885, -413983, -561568, -173393, -80285, -440071, -390354, -391744, -406658, -483004, -97210, -624041, -283222, -212691, -356966, -235459, -435361, -346393, -438756, -365159, -363240, -451078, -392906, -293684, -362280, -327835]
2496c27835k15113j95226J85355K74281l82637N20516L131m07087J70716l36382
2486g10281N68850k23185r6909M28498l61225Q3738k28769K74909k10986M00054
2476g5306n41237M9731l062K450L13249l13150P3179K34652m54947L80649k22888
2465e56680K75439j91629j52039K45323L26894k25546k79154j4170R8944L4531
2455d38087K79955O8489n99329J51001J23404n4322L49981o26001L83734q2432
2445d43607r7927J45841L9629n1207j88310R8502J77189j87484q0924K99920o5355
2434c53733N3576l1598p8849k02058L82003j75817J66358j64699L29513k67174
2424c42478R769K60720k60553k20256J53546J97011p6335J03185l05772M8154
$$ y = [-327835, -542948, -738174, -552819, -278538, -661175, -140659, -137528, -544615, -373899, -710281, -141431, -364616, -461525, -33027, -394252, -310514, -539283, -264374, -475360, -75306, -616543, -566812, -569874, -567424, -254175, -567325, -494146, -259494, -714441, -333792, -556680, -281241, -472870, -624909, -379586, -52692, -278238, -557392, -571562, -472618, -438087, -158132, -89643, -688972, -537971, -414567, -468889, -118908, -744909, -361175, -443607, -541534, -395693, -356064, -407271, -595581, -497079, -319890, -507374, -588298, -288378, -353733, -300157, -331755, -410604, -612662, -230659, -406476, -240118, -404817, -75304, -342478, -332709, -71989, -332542, -552798, -399252, -202241, -278576, -175391, -481163, -433009]
2414d33009J60026r3581l61591O42552o42908M3861N03954k61913K17624k05472
2404d30457Q0107k49543K54915j0977m4051J16827k1145q1526K95516J7534m65259
2393e38059L87896L1130n598m42536L60803k95117j43061M07806j04013j99165
2383e39914J82974L0153k20808N31338l26155q9328j16585Q4911N02532j4916
2373B4202j95919j81188j20120L84906l76932j64574L65413r942K54134l03876
2363c23896j70617q8881j2921M77055o43183O47906j52737M6338j41845L70872
2353H091k39936M4758q096k33105K30102l95058K89972o0943K36023k28655k85239
2342f42086N11370j57975j82177L85964j87809k99307L54221m01465K44851j37761
$$ y = [-433009, -272983, -366564, -728155, -85603, -728511, -684650, -180696, -442609, -224985, -430457, -350350, -599893, -344978, -355955, -400006, -283179, -304324, -385850, -90334, -72800, -538059, -150163, -119033, -124631, -567167, -206364, -501481, -644542, -236736, -340749, -539914, -356940, -326787, -547595, -16257, -342412, -431740, -548325, -463414, 39118, 24202, -171717, -352905, -473025, -88119, -465051, -629625, -264212, -274154, -20020, -323896, -494513, -583394, -596315, -119260, -762443, -114537, -267274, -220936, -362781, 8091, -231845, -187087, -195183, -428288, -198186, -593244, -303272, -364215, -128192, -356847, -642086, -130716, -288691, -470868, -84904, -272713, -572020, -217799, -619264, -374413, -512174]
2332e12174J99102j24772J18791O5265K85963l18583k12375J51967j96853N07739
2322c5930m13542Q1938p1285j22095P500p4898K25959j54749L58727L28792n62496
2311d32079k0102k41060L64303m55444K75010K81231J1473m61535O32949j61304
2301b06558K5902j38575j33623L17030l65141L40491j56055j993r4086K38110
2291a74498m34151J41424m80421K42291O16776k86970k43620L60243N4471m18252
2281f22707L71561k54744j7113L05582j79726J75234K10277j73847O1076l72162
2271d96569J15859k0841p1013J31935q1450j44009K69639m6940n6752L70764n65895
2260e95272Q1829M26375m71488K3719K03269J55634k83536l67474N23477l78637
$$ y = [-512174, -313072, -437844, -319053, -253788, 32175, -286408, -498783, -346816, -543669, -35930, -449472, -367534, -438819, -560914, -553414, -628312, -402353, -557102, -198375, 130417, -432079, -452181, -693241, -328938, -784382, -509372, -228141, -216668, -678203, -45254, -206558, -180656, -319231, -452854, -135824, -500965, -160474, -316529, -318522, -412608, -174498, -608649, -467225, -947646, -705355, -88579, -375549, -619169, -258926, -204455, -622707, -251146, -505890, -523003, -217421, -397147, -221913, -11636, -185483, -124407, -496569, -380710, -401551, -472564, -340629, -422079, -566088, -296449, -343389, -400141, -29377, -595272, -513443, -87068, -558556, -534837, -331568, -175934, -459470, -826944, -303467, -682104]
2250f82104K02268L70098k07353r9356J80461j11238J2764j08549K2356k2661
2240d43314J74256j80211J33810o3646j8051k3062p3600j07393q2938M55733J5179
2229b13237o9229K26148J661r0705k41967r435J70361o0583N1704J467k50694
2218d84509N69706m43472j15388Q6279l51805M78175k27540R1402K07386N2296
2208a37470j31498j78539M6918J80179j41234K076J32492m5554J49880m02931
2198e25681K42553J75879m56247p4731J50769K71909j95870r3359K52886m5952
2188b97844o3977j47049P5844J39215j13740L06107Q0772m22424J81417j30079
2178c91758j7038j27674N4571K58792k82431Q3129J26334j07064j11214L53354
$$ y = [-682104, -479836, -109738, -317091, -416447, -235986, -347224, -334460, -443009, -420653, -443314, -269058, -449269, -315459, -379105, -397156, -420218, -493818, -601211, -684149, -228416, -213237, -282466, -56318, -54657, -145362, -387329, -396764, -226403, -286986, -235282, -233815, -484509, 85197, -358275, -473663, -387384, -739189, -261014, -488554, -397152, -189766, -137470, -268968, -447507, -400589, -220410, -361644, -359568, -227076, -272630, -122750, -525681, -283128, -107249, -563496, -638227, -487458, -215549, -411419, -504778, -251892, -297844, -361821, -508870, -433026, -293811, -407551, -101444, -20672, -443096, -261679, -391758, -408796, -536470, -481899, -223107, -505538, -422409, -296075, -403139, -514353, -160999]
2168a60999j99465j34173M45390n92568L98159N6625P2480k97858r3603N4234
2158d51778K67945r6990k71789M38327j87434j32127J64407j28737j89829J85408
2148d02597O0645j26309J53249K7617q3047L19090j58033j72609r323m0758O4683
2137c67392M0254J4527K1249l5031L33811m26309p8170L12213j29103r9892N0532
2126c63311N02573m69306o3451O6364l23916L18023K30503l95538l595J75008
2116c26646j33039M27269J81979l89040J15552j16867L4317p0591P785K7378L3414
2105b08489k73229Q1999K45826k40281L5140q1017O1550K61206l86967l2875J16023
2094d21114K78451m4509j61196J7784N68j28578K66603q5970r7358K86045r340
$$ y = [-160999, -360464, -494637, -49247, -641815, -243656, -187031, -114551, -412409, -506012, -451778, -183833, -280823, -552612, -114285, -301719, -433846, -269439, -398176, -588005, -402597, -341952, -468261, -315012, -287395, -370442, -51352, -209385, -381994, -391317, -432075, -367392, -327138, -312611, -291362, -326393, 7418, -418891, -497061, -184848, -313951, -413843, -363311, 139262, -330044, -393495, -327131, -651047, -333024, -102521, -498059, -501654, -326646, -459685, -32416, 149563, -239477, -123925, -240792, -206475, -277066, -269281, -241903, -208489, -481718, -399719, -153893, -394174, -359034, -440051, -378501, -117295, -504262, -537137, -421114, -142663, -187172, -348368, -330584, -330016, -458594, -191991, -277961, -375319, -89274, -98614]
2083i8614k96361R4172P5838k39756J74674l58938M86704q3983l72760N11735
2073a07289l90954K73496k65586k62398L51329N4136K7653L62441k83963k93481
2063e34616L66781j90903K320J86081k05294J63938j5006k16616K11027P593k9942
2052b54637r5915j23057P5043l6458L69642l44554j4859q076n943p0108K5878
2041d83044K33965q8536j70685p1272K56829O7187j48018J3382N4760M56918l52480
2030b30994j98581J11613N0707j72969K36929j474k82062N23054l69200P967J11715
2019b13295k68316l2776O03J31965q2341L38247k77656J53105l453J03526m51995
2008f02386K26983J34245Q1007r1176M2795j698j16557Q1911l0364R4710j69945
$$ y = [-98614, -394975, -300803, -224965, -464721, -290047, -648985, -162281, -246264, -619024, -107289, -498243, -224747, -490333, -752731, -401402, -347266, -319613, 42828, -241135, -534616, -167835, -358738, -356418, -170337, -375631, -211693, -226699, -443315, -232288, -224695, -254637, -350552, -473609, -398566, -435024, -65382, -409936, -424795, -432871, -438814, -508922, -483044, -249079, -337615, -508300, -579572, -322743, -255556, -403574, -390192, -335432, 121486, -230994, -429575, -317962, -267255, -440224, -203295, -204769, -486831, 36223, -332977, -325010, -213295, -481611, -514387, -513784, -381819, -464160, -125913, -403569, -250464, -253917, -150391, -602386, -375403, -241158, -160151, -251327, -208532, -210230, -326787, -244876, -275240, -180530, -350475]
1997c50475M2700O4019J12690j91800J72686l75342M30784j53326l3470j33040
1987d14574J22028M9432m32621L29260M36733m22861J05617m5218r6284j06521
1977d75009J99279k09826M27393k37916Q7078O9460j90592J49208j60273P8192
1967b63006L51871o33097K88302l7734k48979J78857P4400j85397L71140l95646
1957d99289p751J07669K9419j89863K16681K58539m08898M7994L89103j73781
1947b30177Q4916p0520l09560K76568L5806K79352P4606p38135J60102L07924
1937a29118j47376L2227j94064J86605l45255P8453r2815L18973k44797J12298
1927d24869k44478N19130k86828N3308j4082j51131J27257j16332J65802K90392
$$ y = [-350475, -307775, -243756, -131066, -322866, -150180, -525522, -94738, -248064, -281534, -414574, -292546, -243114, -675735, -346475, 90258, -332603, -226986, -272204, -368488, -475009, -275730, -485556, -58163, -296079, -209001, -139541, -330133, -180925, -341198, -263006, 88865, -544232, -255930, -293664, -542643, -363786, -289386, -474783, -103643, -499289, -507040, -399371, -369952, -559815, -343134, -84595, -493493, -445499, -56396, -230177, -145261, -215781, -525341, -248773, -212967, 66385, 140991, -597144, -437042, -129118, -276494, -244267, -438331, -251726, -596981, -518528, -611343, -292370, -537167, -424869, -669347, -150217, -437045, -383737, -397819, -548950, -421693, -538025, -372223, -81831]
1917h1831k87627r1452K55697m32537L34836j31111J38159J35197l12845K2161
1907d51353J1265J87984m4808K39699j88635p7151k4906P3891k55294K00286J86014
1896a43008l45745J10018J10027J27317j87404k52439J41022M7277K19885q9452
1886b62502J12868j26757j85702M0110R048k9586J25828J55847k30441N8598j07908
1875d40597J04046J14459j44422P1048J98487l94343j11847M95378l46947K08509
1865b46229J6586k63163q3509L20949O0933j30147J0449J37659k93003J63634
1855c05841m0208K6307J50619J80446m20707J44176n2991q3208K1561P1643J26660
1844a81543l13628J3930J86513k19757J38205q971q6955M5257O4450J32825J20399
$$ y = [-81831, -369458, -460910, -205213, -637750, -302914, -434025, -295866, -160669, -473514, -451353, -440088, -252104, -296912, -57213, -245848, -322999, -347905, -274014, -529308, -329022, -143008, -488753, -378735, -268708, -141391, -328795, -581234, -440212, -392935, -173050, -262502, -149634, -276391, -462093, -421983, -412935, -442521, -316693, -160846, -391287, -332689, -440597, -336551, -222092, -366514, -295466, -96979, -491322, -603169, -107791, -454738, -246229, -229643, -492806, -576315, -255366, -194433, -324580, -314131, -176472, -469475, -305841, -346049, -319742, -169123, 11323, -409384, -265208, -318199, -401407, -379846, -308203, -181543, -495171, -481241, -294728, -514485, -376280, -385251, -472206, -426949, -362499, -229674, -109275]
1833a09275l27832k3350K91995J90729m50417J23811l6766q7072J83094O4159
1823a80924j89251N8311J06827m30318L49498L4398J02483n42103N97846l87930
1813d81163j17364K88373L0090O7943J0082k79033N8794K09483j08580l8368P6991
1802b82752o5266Q8817N6392j15165O08j98988K60191Q3673k44245K56706k29591
1791c89620p4259L23574l51609J51002j42605M52664m19345J22203k27098L48925
1781b06168N3825k69602J83622j73221Q7659K0252N5282J33626l25905j36893
1771e77523L83558k62044M6855K36385l26914M66684k30268l26618K34629k22198
1761e77454L21291k07705M21367j15328j84767k11311N25359l14367K23029K06905
$$ y = [-109275, -437107, -460457, -168462, 22267, -428150, -304339, -341105, -428177, -245083, -180924, -370175, -311864, -205037, -635355, -285857, -251459, -148976, -691079, -93233, -481163, -598527, -310154, -280064, -212121, -202039, -481072, -422278, -212795, -321375, -359743, -282752, -348018, -259201, -202809, -317974, -317366, -516354, -256163, -172490, -416735, -160029, -389620, -463879, -140305, -491914, -340912, -483517, -30853, -450198, -327995, -555093, -206168, -152343, -421945, -238323, -411544, -323885, -303633, -248351, -114725, -440630, -577523, -193965, -456009, -409154, -172769, -499683, -32999, -263267, -589885, -355256, -577454, -256163, -463868, -42501, -157829, -342596, -553907, -28548, -342915, -119886, 87019]
1751H7019l66504j16754L33015k92116j57492L57309p4981k67987N4827J22191
1741c21473L472j74561j9062o2175M08558m70337J56161K52223j12716k54020
1731e93930J98370O0102J54411j02384K25415Q7236k82649K64947k78754J59886
1721a07350k19736p9325K78791m24394L81732k70639J44321J47261m7685l33025
1711e30049L29098l23590m0361J29577R4981o3096M10787k18509k29821J30157
1701c10826N8964q1387J25248j19877J31452j11024l9173J31249J25124n65114
1691f55364K71266J56229n0887N7820j37402O068L1891M6178j65127L78507m58960
1680e19781M7432M2312M4661M64778k91762k26489L13041j27111N869l8986l43747
$$ y = [87019, -279485, -396239, -63224, -355340, -512832, -155523, -230504, -498491, -443664, -321473, -318001, -492562, -511624, -573799, -165241, -635578, -479417, -227194, -339910, -593930, -395560, -335458, -181047, -283431, -58016, 29220, -253429, 11518, -267236, -107350, -327086, -406411, -127620, -552014, -170282, -440921, -296600, -149339, -197024, -530049, -200951, -524541, -564902, -435325, -340344, -403440, 7347, -211162, -440983, -310826, -251862, -333249, -208001, -327878, -196426, -307450, -346623, -215374, -90250, -655364, -384098, -227869, -278756, -220936, -358338, -352270, -320379, -274201, -439328, -60821, -519781, -472349, -430037, -385376, 79402, -212360, -438849, -125808, -252919, -247050, -286036, -629783]
1669f29783M68755L7139j17976J042j08275n3753k09807K36092L77061j98680
1659a98185m6833q5089o5329K20525r8019j81741k40954M20941j21699J30778
1649b65605j63697M804J01500N7055j74978m4700J20182j42313K44668O9703j54361
1638c47742j03929K5195J08923K1776j78258P3918j29013o6206L94888O121m16091
1627f10418L42127N9538k31736L01403l44736P042K1131N45456k18445k69497
1617c98135M9952m4002r6647J85153j21000N9384k30082K24627J25140m13182
1607f58792K52912j19544L526N02349k26112l11444K86200k78740K28316K12401
1597a08928K28704q08178L145L88068K45945l71412J68910J85712l95661J09796
$$ y = [-629783, -161028, -123889, -241865, -240823, -349098, -402851, -612658, -376566, 495, -198185, -245018, -330107, -395436, -174911, -272930, -454671, -695625, -274684, -396383, -265605, -429302, -424498, -322998, -265943, -440921, -485621, -365439, -507752, -263084, -193381, -347742, -451671, -426476, -317553, -295777, -474035, -400117, -529130, -595336, -200448, -194327, -610418, -268291, -208753, -440489, -139086, -483822, -476780, -455649, 89807, -128638, -398135, -348183, -392185, -488832, -303679, -424679, -365295, -595377, -370750, -245610, -658792, -405880, -525424, -521898, -19549, -245661, -557105, -270905, -549645, -321329, -108928, 119776, -688402, -685257, -297189, -51244, -422656, -253746, -68034, -463695, -353899]
1587c53899J22733j27427M5052P1329k03902J81123m3731J16422q8241o5315J07279
1576b38577o7133j46206N12604m28712J0663J32464l83312K41389K77463l90094
1566d79451j26988M45987k22978n2279L53118k92531o9414r5206N98759k83410
1556b24393k27630q3111L65783l02036M73566l82252q0869M0257o2806K31042
1546b52449M8900o9094k68583J32678o5850L96427k1352k48109j39148L58553
1536a28027m9372l58974j23180J27974L2636L20091o4350K61820n19121K1431
1526d79072L46604l03970J25531r1932j0619L23503j50499J96482m3690l31351
1516d19013J5808M3286J73137m26359q534K03440J14436K5963k3618p496k09020
$$ y = [-353899, -231166, -358593, -313541, -242212, -446114, -264991, -308722, -192300, -280541, -345856, -238577, -305710, -451916, 60688, -368024, -357361, -224897, -608209, -366820, -89357, -479451, -606439, -160452, -383430, -435709, -82591, -375122, -444536, -539742, 59017, -224393, -452023, -535134, -169351, -471387, 2179, -380073, -460942, -420685, -483491, -252449, -203549, -272643, -541226, -408548, -474398, -77971, -99323, -347432, -486580, -128027, -177399, -536373, -659553, -531579, -498943, -178852, -243202, 18618, -500503, -479072, -132468, -436438, -310907, -402839, -413458, -89955, -240454, -43972, -87662, -419013, -403205, -359919, -186782, -613141, -621675, -418235, -303799, -277836, -301454, -308950, -517970]
1505e17970O0434m9782J93330j76657J08202o0483N31478p83915L02336j29209
1495e22236P0585j94912n792M9471L38741q2734j76421M97861j59719k3998j87561
1484c96715J02800l2400j69437J2370K79861k09823M9034O6294k1810O2007M3711
1473b14108j74597P1049l9658j1596J1224J46368j12210J14541m87598L71562
1463c25023l19949J20246M23489o00180K58849K91515k55206K8582P5153j21662
1453d24186n6741K40152K6466O0155j21445j78769K86823J3263j1177m83877J84512
1442d64824J91223m55750J66928M65227m90442N75200q2385k96928l02432L45525
1432c48658o0532p0626K25095q4790k59897J87443N9038o5416j35315L19397j50139
$$ y = [-517970, -457536, -507318, -313988, -490645, -382443, -442926, 88552, -695363, -393027, -522236, -451651, -646563, -652355, -602884, -264143, -346877, -523298, -25437, -185156, -209154, -396715, -293915, -326315, -495752, -483382, -203521, -413344, -364310, -298016, -319826, -257819, -214108, -388705, -317656, -357314, -368910, -357686, -211318, -323528, -208987, -696585, -325023, -644972, -524726, -101237, -701417, -442568, -151053, -406259, -377677, -302524, -424186, -480927, -240775, -214309, -154154, -275599, -454368, -167545, -154282, -165459, -649336, -464824, -273601, -729351, -562423, -97196, -587638, -12438, -94823, -391751, -694183, -348658, -409190, -479816, -254721, -339511, -599408, -411965, -352927, -418343, -553658, -234261, -384400]
1421c84400j9846k8936Q7518K13081r8633J9373k80257L11303j67601q3087m32593
1410h64078N11677L21699m77050M29393l06863K05596P6220l72164K21850k73218
1400e26938J73226Q3499k9529j29261K40205k93880L95469j90092K8015l81550
1390f30836K70445m4311O82J70504l12111N31362k61337j80023J21166J9558p9268
1379c94169M54312l71743K8546j05796J91187j70885q5711k433J70297N2195j11093
1368c45293k4641P9902j32326K38651n0279K3049k33791K04442P1327l31792K60601
$$ y = [-384400, -404246, -433182, -345664, -132583, -231216, -211843, -492100, -180797, -348398, -431485, -864078, -352401, -30702, -507752, -78359, -385222, -179626, -103406, -475570, -253720, -526938, -353712, -270213, -299742, -429003, -188798, -482678, -87209, -277301, -249286, -630836, -360391, -404702, -404020, -233516, -545627, -14265, -275602, -455625, -334459, -314901, -394169, 60143, -311600, -283054, -388850, -197663, -368548, -454259, -456692, -286395, -234200, -345293, -369934, -290032, -422358, -183707, -233986, -210937, -444728, -240286, -168959, -500751, -240150]
$$ [...]
##END NTUPLES=NMR SPECTRUM
##END=
