##TITLE=abcd
##JCAMPDX= 6.0         $$ Bruker NMR JCAMP-DX V2.0
##DATA TYPE= NMR SPECTRUM
##DATA CLASS= NTUPLES
##ORIGIN= UXNMR, Bruker Analytische Messtechnik GmbH
##OWNER= root
$$ XWIN-NMR		Version 3.5
$$ Wed Apr  1 17:55:00 2026 Russian Standard Time (UT+4h)  servis@DPX200
##.OBSERVE FREQUENCY= 200.131235884673
##.OBSERVE NUCLEUS= ^1H
##.ACQUISITION MODE= SIMULTANEOUS
##.ACQUISITION SCHEME= undefined
##.AVERAGES= 32
##.DIGITISER RES= 18
##SPECTROMETER/DATA SYSTEM= spect
##.PULSE SEQUENCE= zg
##.SOLVENT NAME= CDCl3
##.SHIFT REFERENCE= (INTERNAL, CDCl3, 0, 16.4885)
##AUDIT TRAIL= $$ (NUMBER, WHEN, WHO, WHERE, WHAT)
$$ ##TITLE= Audit trail, XWIN-NMR		Version 3.5
$$ ##JCAMPDX= 5.01
$$ ##ORIGIN= Bruker BioSpin GmbH
$$ ##OWNER= servis
$$ F:\spectra/data/av/nmr/H1/1/pdata/1/auditp.txt
$$ ##AUDIT TRAIL=  $$ (NUMBER, WHEN, WHO, WHERE, WHAT)
(   1,<2026-04-01 17:54:21.65 +0400>,<servis>,<DPX200>,
      <created by zg, POWCHK disabled, PULCHK disabled
       configuration hash MD5:
       00 E9 B6 7A A2 85 ED C7 34 08 36 98 17 FE 4E 26
       data hash MD5: 32K
       48 1F 22 88 93 44 7D FC F9 DD 1A 61 1D 0B CB 96>)
(   2,<2026-04-01 17:54:23.28 +0400>,<servis>,<DPX200>,
      <Start of raw data processing
       efp BC_mod = 2 LB = 0.05 FT_mod = 6 PKNL = 1 PHC0 = -262.9951 PHC1 = -0.898437 SI = 16K 
       data hash MD5: 16K
       AE C4 20 DB A1 1B AB ED 7A 2A A0 B3 C7 1A D3 A8>)
(   3,<2026-04-01 17:54:39.20 +0400>,<servis>,<DPX200>,
      <pk PHC0 = -1.2 PHC1 = 0 
       data hash MD5: 16K
       B7 2C 20 AB E9 BA 03 10 F4 ED 44 13 93 97 25 79>)
$$ ##END=
$$ 
$$ hash MD5
$$ 75 B6 95 B5 6E 8A C2 41 40 EB D1 58 0C 06 C0 14
##$RELAX= 
##$RELAX= 
##$RELAX= 
##$RELAX= 
##$RELAX= 
##$RELAX= 
##$RELAX= 
##$RELAX= 
$$ Bruker specific parameters
$$ --------------------------
##$DU= <F:\spectra>
##$EXPNO= 1
##$NAME= <H1>
##$PROCNO= 1
##$TYPE= <nmr>
##$USER= <av>
##$AMP= (0..31)
100 100 100 100 100 100 100 100 100 100 100 100 100 100 100 100 100 100 
100 100 100 100 100 100 100 100 100 100 100 100 100 100 
##$AQSEQ= 0
##$AQ_mod= 1
##$AUNM= <au_zg>
##$AUTOPOS= <>
##$BF1= 200.13
##$BF2= 200.13
##$BF3= 200.13
##$BF4= 200.13
##$BF5= 500.13
##$BF6= 500.13
##$BF7= 500.13
##$BF8= 500.13
##$BYTORDA= 1
##$CFDGTYP= 0
##$CFRGTYP= 5
##$CHEMSTR= <none>
##$CNST= (0..31)
1 1 145 1 1 1 1 1 1 1 1 1 1 1 1 1 1 1 1 1 1 1 1 1 1 1 1 1 1 1 1 1 
##$CPDPRG= <>
##$CPDPRG1= <>
##$CPDPRG2= <>
##$CPDPRG3= <>
##$CPDPRG4= <mlev>
##$CPDPRG5= <mlev>
##$CPDPRG6= <mlev>
##$CPDPRG7= <mlev>
##$CPDPRG8= <mlev>
##$CPDPRGB= <>
##$CPDPRGT= <>
##$D= (0..31)
0 2 0 0 0 0 0 0 0 0.06 0 0 0 0 0 0 0.0002 0 0 0 0 0 0 0 0 0 0 0 0 0 0 
0 
##$DATE= 1775051661
##$DBL= (0..7)
120 120 120 120 120 120 120 120 
##$DBP= (0..7)
150 150 150 150 150 150 150 150 
##$DBP07= 0
##$DBPNAM0= <>
##$DBPNAM1= <>
##$DBPNAM2= <>
##$DBPNAM3= <>
##$DBPNAM4= <>
##$DBPNAM5= <>
##$DBPNAM6= <>
##$DBPNAM7= <>
##$DBPOAL= (0..7)
0.5 0.5 0.5 0.5 0.5 0.5 0.5 0.5 
##$DBPOFFS= (0..7)
0 0 0 0 0 0 0 0 
##$DE= 6
##$DECBNUC= <off>
##$DECIM= 32
$$ [...]
##$SUBNAM4= <"">
##$SUBNAM5= <"">
##$SUBNAM6= <"">
##$SUBNAM7= <"">
##$SUBNAM8= <"">
##$SUBNAM9= <"">
##$SW= 20.6817932712277
##$SWIBOX= (0..15)
0 0 3 0 0 0 0 0 0 0 0 0 0 0 0 0 
##$SW_h= 4139.07284768212
##$TD= 32768
##$TD0= 1
##$TE= 0
##$TE2= 300
##$TE3= 300
##$TEG= 300
##$TL= (0..7)
0 120 120 120 120 120 120 120 
##$TP= (0..7)
150 150 150 150 150 150 150 150 
##$TP07= 0
##$TPNAME0= <>
##$TPNAME1= <>
##$TPNAME2= <>
##$TPNAME3= <>
##$TPNAME4= <>
##$TPNAME5= <>
##$TPNAME6= <>
##$TPNAME7= <>
##$TPOAL= (0..7)
0.5 0.5 0.5 0.5 0.5 0.5 0.5 0.5 
##$TPOFFS= (0..7)
0 0 0 0 0 0 0 0 
##$TUNHIN= 0
##$TUNHOUT= 0
##$TUNXOUT= 0
##$USERA1= <user>
##$USERA2= <user>
##$USERA3= <user>
##$USERA4= <user>
##$USERA5= <user>
##$V9= 5
##$VALIST= <valist>
##$VCLIST= <CCCCCCCCCCCCCCC>
##$VD= 0
##$VDLIST= <DDDDDDDDDDDDDDD>
##$VPLIST= <PPPPPPPPPPPPPPP>
##$VTLIST= <TTTTTTTTTTTTTTT>
##$WBST= 1024
##$WBSW= 30
##$XGAIN= (0..3)
0 0 0 0 
##$XL= 0
##$YL= 0
##$YMAX_a= 495351
##$YMIN_a= -426925
##$ZGOPTNS= <>
##$ZL1= 120
##$ZL2= 120
##$ZL3= 120
##$ZL4= 120
##$ABSF1= 0
##$ABSF2= 0
##$ABSG= 0
##$ABSL= 0
##$ALPHA= 0
##$AQORDER= 0
##$ASSFAC= 0
##$ASSFACI= 0
##$ASSFACX= 0
##$ASSWID= 0
##$AUNMP= <proc_1d>
##$AZFE= 0.1
##$AZFW= 0.1
##$BCFW= 0
##$BC_mod= 2
##$BYTORDP= 0
##$COROFFS= 0
##$CY= 18.4799938201904
##$DATMOD= 1
##$DC= 0
##$DFILT= <>
##$DTYPP= 0
##$F1P= 9.9274215381318
##$F2P= -0.165520771350173
##$FCOR= 1
##$FTSIZE= 16384
##$FT_mod= 6
##$GAMMA= 0
##$GB= 0
##$INTBC= 1
##$INTSCL= 4.127829e-11
##$ISEN= 128
##$LB= 0.05
##$LEV0= 0
##$LPBIN= 0
##$MAXI= 10000
##$MC2= 0
##$MEAN= 0
##$ME_mod= 0
##$MI= 50
##$NCOEF= 0
##$NC_proc= -4
##$NLEV= 6
##$NOISF1= 3.799351
##$NOISF2= 2.8
##$NSP= 0
##$NTH_PI= 0
##$NZP= 0
##$OFFSET= 16.48848
##$PC= 4
##$PHC0= -264.1951
##$PHC1= -0.898437
##$PH_mod= 1
##$PKNL= yes
##$PPARMOD= 0
##$PSCAL= 4
##$PSIGN= 0
##$REVERSE= no
##$SF= 200.130005582386
##$SI= 16384
##$SIGF1= 3
##$SIGF2= 2
##$SINO= 400
##$SIOLD= 16384
##$SREGLST= <1H.CDCl3>
##$SSB= 0
##$STSI= 16384
##$STSR= 0
##$SW_p= 4139.07284768211
##$SYMM= 0
##$S_DEV= 0
##$TDeff= 32768
##$TDoff= 0
##$TI= <>
##$TILT= no
##$TM1= 0
##$TM2= 0
##$TOPLEV= 0
##$USERP1= <user>
##$USERP2= <user>
##$USERP3= <user>
##$USERP4= <user>
##$USERP5= <user>
##$WDW= 1
##$XDIM= 16384
##$YMAX_p= 319364234
##$YMIN_p= -595356
$$ End of Bruker specific parameters
$$ ---------------------------------
##NTUPLES= NMR SPECTRUM
##VAR_NAME=  FREQUENCY,     SPECTRUM/REAL,   SPECTRUM/IMAG
##SYMBOL=    X,             R,               I
##VAR_TYPE=  INDEPENDENT,   DEPENDENT,       DEPENDENT
##VAR_FORM=  AFFN,          ASDF,            ASDF
##VAR_DIM=   16384,         16384,           16384
##UNITS=     HZ,            ARBITRARY UNITS, ARBITRARY UNITS
##FACTOR=    0.252644378177508, 1,           1
##FIRST=     3299.83951724647, 0,            0
##LAST=      -839.233330435636, 0,           0
##MIN=       -839.233330435636, -595356,     0
##MAX=       3299.83951724647, 319364234,    0
$$ Real data points
##PAGE= N=1
##DATA TABLE= (X++(R..R)), XYDATA
$$ [...]
7347A01841k32801k7134Q2138p0291K15245k15629J25361O9570k83973L25515
7337H9842j30718m1287L54748j60315j46049j12763k5634J36380K9065P7149j02773
7326c2355q7515M6801J6018J38371M2211l42241J99836m5836K23179k29460j40497
7315b11488K45136j31979K33505m2221N6389J158O5254j5789N097L3320L6271
7304B74653K11072L07984R2902Q3273j61162l0777j37190j59428l43450J71628
7294C09505k40345m9597N1631j05125K16904j34339r6204O6875k42727L07279
7284H3857j81393P3553Q4713j41965l474j82937J94742O9066j65953J24432n6760
7273a02119J59967j51811J79884M7366j08014r8836n7539K47292j30511J38584
$$ y = [101841, -130960, -158094, -75956, -146247, 68998, -146631, -21270, 48300, -235673, 89842, -40876, -82163, 272585, 112270, -33779, -146542, -172176, -35796, -6731, 70418, -32355, -119870, -73069, -57051, 81320, 123531, -218710, -18874, -64710, 158469, -70991, -211488, 33648, -98331, 135174, 92953, 149342, 150500, 215754, 199965, 205062, 238382, 274653, 485725, 793709, 886611, 969884, 808722, 777945, 640755, 481327, 137877, 309505, 69160, 19563, 71194, -33931, 182973, 48634, -47570, 19305, -223422, 83857, -97536, -23983, 60730, -81235, -84709, -267646, -72904, -3838, -169791, -45359, -102119, 57848, -93963, 85921, 133287, 25273, -73563, -131102, 116190, -14321, 124263]
7263A24263m4342j57423Q0104k522l6606J40218k14794n3299J92899K65326j11226
7252A82598r7975n2532R8586n1475j16071j0517j79005R3535J31399J49280j57810
7241i987l01048L10705j44243L4888R4405j59875K47570j45701L5443M751r0127
7230a23219M1171R4522O519k89436K88459j13919n4671K60542l0456J20990k9712
7219A70790k83937n9794l0582L13820j39841M4341j34389K16898q194N3194m1366
7208A00940R9530k38016j46737j41498L98958p9335m1566N368J45887j55727p4290
7197a26486j2274n7022n563K35437q1684J12429q8888J21220R5434k85973k4257
7186a17627J97023l9824o4974J53987L062j70397j13246J86712N4299j00223m5066
$$ y = [124263, 79921, -77502, 2602, 80, -36526, 103692, -111102, -164401, 28498, 293824, 182598, 84623, 32091, 130677, 79202, -36869, -47386, -226391, -132856, -1457, 147823, -9987, -311035, -330, -144573, -109685, -15280, -175155, 72415, -73286, -37843, -33092, -123219, -82048, 12474, 18993, -270443, 18016, -95903, -150574, 109968, 79512, 200502, 170790, -113147, -172941, -203523, 110297, -29544, 14797, -119592, 97306, 89112, 142306, 100940, 200470, -37546, -184283, -325781, 73177, -6158, -47724, -42356, 103531, -52196, -126486, -138760, -195782, -201345, 34092, -47592, 64837, -24051, 97169, 192603, -93370, -117627, 79396, 39572, -25402, 128585, 131647, -38750, -151996, 34716, 89015, -11208, -56274]
7175e6274N1777L9218j35791L68984k61019j65748J21464k0272J11302n4195k66942
7164b67496K4456J42463n0304N4159N2236K8085J36753j52633j60044L16397R7451
7153B21523M6219k36031p2291J27204j30954J40900p9593n605j35545k7524K3738
7142a27959K58476q9541L2734j86958K65659N1547M1927r8426K9593o3754j43170
7131b9872K28384J93113j1124o6059j471P617J5105m00651K64676M4495p404l71683
7119a34874K47587n9881J09530J3122j1828o210k20619j43846K73236K0847j11625
7108b4561p2856K67122j34012K13079l16032K9936J25392j93634R7499J5027k36892
7097b29932K75597J63216j92050J30003j20331O3203p2130j23144j8740J08440
$$ y = [-56274, -4497, 34721, -101070, 267914, 6895, -158853, -37389, -57661, 53641, -554, -267496, -243040, -100577, -150881, -96722, -44486, -16401, 120352, -32281, -192325, 124072, 221523, 267742, 31711, -40580, 86624, -44330, 96570, 16977, 11372, -124173, -151697, -127959, 130517, 40976, 73710, -113248, 152411, 203958, 245885, 147459, 177052, 113298, -29872, 198512, 391625, 380501, 314442, 312971, 320588, 335693, -64958, 199718, 244213, 236809, -134874, 112713, 52832, 162362, 175484, 163656, 157446, -63173, -207019, 66217, 87064, -24561, -97417, 169705, 35693, 248772, -67260, -37324, 88068, -105566, -8067, 6960, -229932, 45665, 208881, 16831, 146834, 26503, 89706, 17576, -105568, -124308, -15868]
7087a5868j69687O6060J49761L9630M7211J65940l83496J10501r8529N0125K78670
7076B40318j71029J45211o4503q3478q2330Q091O6575J4509p9478m6521j08611
7065a61246K06924l8672j41663j02505J7587O9431K45820J27338J53581l32524
7055D4071J8569l5686j40592K37981O4472k12137j68766K02398K56111k13241
7045E3180r548j58013J37039j76186M66360j33991Q8514n70391Q3402L54761m7078
7034H8049K8963r1815j22526j159R2569L68191k43434o77j4208l3153q1905J42916
7022A31811J18055j32131N1628k8501J24084J24082j06065O6969j45030J4817
7012B19719j50660m1920K64598j3607k43203K68790n9500j01598k93970J8285
$$ y = [-15868, -185555, -119495, 30266, 69896, 117107, 283047, -100449, 10052, -88477, -38352, 240318, 69289, 214500, 149997, 66519, -15811, -7720, 58855, 73364, -6114, -52635, -161246, 45678, 7006, -134657, -237162, -219575, -150144, 95676, 223014, 376595, 44071, 62640, 26954, -113638, 124343, 188815, -23322, -192088, 10310, 266421, 53180, 43632, -114381, 22658, -153528, 312832, 178841, 267355, -303036, -219634, 135127, 88049, 117012, 25197, -97329, -98488, -5919, 362272, 118838, 118161, 103953, 70800, -11105, 131811, 249866, 117735, 169363, 140862, 264946, 389028, 282963, 349932, 204902, 219719, 69059, 27139, 291737, 278130, 34927, 303717, 244217, 142619, -151351, -133066]
7002a33066K13486j30886K36189j10603O5893K9092p2667R165R8943k92317K85979
6991A99208k14952P4295p9647k33171J58760N3265J9962K31563k01821q957M0349
6980C8854l6855J48666r9463n1990j22528K90739j48073M6769j59031J22974R0282
6969A20344J55080p8210j2575k91394J56695L331k4660J06728J22868j45220J13314
6958B26301l32712J31372j12436j8553J62669n5537K57651j21171O4482J52434
6948C54500l37930J47315k1965r6775J82382O3313L7793p3527j90911j18565o3042
6937a17412Q0962J10271J671J6003k00402J48191K952P3305o8164J5266q3924
6926b1281K0266l8014o5638J69337J52315k09067m0210q3208j17175J08079J46633
$$ y = [-133066, 80420, -50466, 185723, 75120, 141013, 170105, 97438, 106603, 205546, -86771, 199208, -15744, 58551, -21096, -254267, -95507, -42242, -22280, 209283, 7462, -1495, 38854, 1999, 150665, 51202, -788, -123316, 167423, 19350, 66119, -92912, 30062, 120344, 275424, 197214, 184639, -106755, 49940, 53271, 28611, 135339, 258207, 112987, 226301, -106411, 24961, -87475, -106028, 56641, 1104, 258755, 137584, 202066, 354500, 16570, 163885, 141920, 45145, 227527, 290840, 328633, 255106, 64195, -54370, -117412, -36450, 73821, 75492, 91495, -108907, 39284, 42236, 115541, 47377, 62643, -21281, -1015, -39029, -104667, 64670, 216985, 7918, -32292, -115500, -232675, -124596, 22037]
6915B2037J82506k40166o0732L52144k1473l25060J83022L7346o5947O1368J34453
6904B59498Q6255l4299o4072j48672j65072J90651K75201j07992j02586l769J71100
6893C56243j39043j6089j92479L11926m4740j74269J19292N220j47311n8147q8725
6882f8122l3805J71639k735R7698j38240J6845K6993o2686P2217l2051L4096O7518
6870A49367L7121k8180j65024K70145j69467l684L27981L5999j56391o1304k29972
6859F591K41562K01794j884j19141Q9283J3073l5939O7390Q0656k00043k17594
6848A25748m858R7122k12959J92317K94835l07055k33122J09410N0544P6325j58574
6837B9733L451K27835r1137j02439J41572p1747J11914L0894j20874j05765P3022
$$ y = [22037, 204543, -35623, -96355, 255789, 234316, -90744, 92278, 129624, 63677, 125045, 259498, 345753, 311454, 247382, 98710, -66362, 124289, 399490, 291498, 188912, 185143, 356243, 217200, 201111, 8632, 320558, 275818, 101549, 220841, 226061, 78750, 20603, -68122, -101927, 69712, 66977, 164675, 26435, 43280, 70273, 7587, 79804, 47753, 81849, 149367, 186488, 158308, -6716, 263429, 93962, 90278, 418259, 454258, 297867, 236563, 6591, 248153, 449947, 448063, 328922, 418205, 431278, 395339, 462729, 543385, 343342, 125748, 120890, 218012, 5053, 197370, 492205, 185150, -47972, 61438, 111982, 188307, 29733, 33184, 261019, 169882, 67443, 209015, 137268, 249182, 280076, 159202, 53437, 126459]
6826A26459p8568J08414P0357j47000J28557L7306L86131J0716M18109k28848
6816H31633l1349k75978R3858j60298k01600K18746M4279j44449J73135m34683
6806A13294J22877m6750r7474J33333L4941k9304R548L2939n2389L13161l29997
6795B04179k45677P9158O5044K40412k80758j44376M41394k11012k3584J48874
6785B73654l70369K51763k9079m4922K64718j60073k57308J19772L5520o4700
6775A8976k4925N2622K64150j69012k73888L83180J32582k47671J81219q2565
6765B34668K16363j89195j95861Q1451p1473l8390K38916k2243O1744j95378j98
6754A20404J82145j02103j24923j19027J50331J23812n5167j03669N1632N9143
$$ y = [126459, 47891, 156305, 226662, 79662, 208219, 245525, 631656, 642372, 1060481, 831633, 800284, 524306, 618164, 457866, 256266, 475012, 519291, 374842, 547977, 113294, 236171, 189421, 91947, 225280, 260221, 230917, 240465, 273404, 221015, 534176, 204179, -41498, 37660, 102704, 343116, 62358, -82018, 359376, 148364, 124780, 273654, -96715, 155048, 125969, 81047, 345765, 185692, -71616, 48156, 83676, 18976, -5949, 46673, 310823, 141811, -132077, 251103, 383685, 136014, 317233, 234668, 451031, 261836, 65975, 147426, 75953, 37563, 276479, 254236, 315980, 120602, 120404, 302549, 200446, 75523, -43504, 106827, 230639, 175472, 71803, 123435, 182578]
6744A82578J14270Q2292j7045p8815J88744O195o1443j45084q564j74085R0284
6733A79327J51969j94441K48750j14692J2806j12377j33754K14750j38360j5220
6723I8758k7630L11208q9821J4114m3252l32266K38302K3988j60216K52416q853
6712B76748j34674M3639j84135J50352k6724K3453J66988j06254k38064K49074
6702B20403J24375O2838p1645J2081Q4789j8583q3192l98529K17850j21408J89684
6691B18663j42603P5198J40266j9928n4233j06265K10520j64817j0199J00694
6681B47296O4468j06717l1217J92623L3196k40996j8171K9265M2913j07489J92388
6670B97559M3094j68630J32987j42217k23139K71120p8373N5313n1797k6067K2010
$$ y = [182578, 296848, 379140, 362095, 283280, 472024, 478219, 416776, 271692, 263128, 89043, 179327, 331296, 136855, 385605, 270913, 283719, 171342, 37588, 252338, 113978, 98758, 71128, 382336, 292515, 306629, 263377, -68889, 169413, 193401, 33185, 285601, 276748, 142074, 185713, 1578, 151930, 125206, 148659, 315647, 209393, -28671, 220403, 344778, 407616, 335971, 348052, 432841, 414258, 331066, -67463, 150387, 28979, 218663, 76060, 151258, 291524, 271596, 217363, 111098, 321618, 156801, 146602, 247296, 311764, 205047, 173830, 366453, 399649, 158653, 140482, 169747, 212660, 105171, 297559, 340653, 172023, 305010, 162793, -60346, 210774, 132401, 187714, 135917, 109850, 131860]
6659A31860P6662p3817l4475J06014P8927k99157j4240M9795J82098Q4868P2484
6648C61019k6878P9829j83813M9960J05940k14756k79066J73155M9190J52516
6638B67096r203K12152j44779j95001l9365N8227o6282J57539j566J19513k13227
6627A45104P2765L8331N5435m9003j53587J12346N9699N8339j56370l0631K05995
6616C58423j29705O3861j18294J17281j45053j68705K55138O1549J4496r7984
6606B11007L2166J29269j86958K5103J94235N5634j44372l6203j3591J03298P8861
6595D48449k5270J29087J01273k17909M7168q483R3043Q6870J2109j40903K68470
6584G93904J37956n7554R3110J09601j48681m36751J99115j04630j21782K71832
$$ y = [131860, 208522, 134705, 100230, 206244, 285171, -13986, -28226, 21569, 203667, 288535, 361019, 334141, 413970, 230157, 280117, 386057, 171301, -107765, 65390, 114580, 267096, 257893, 470045, 325266, 130265, 90900, 149127, 82845, 240384, 238818, 358331, 145104, 217869, 256200, 311635, 262632, 109045, 221391, 281090, 339429, 183059, 152428, 358423, 228718, 292579, 174285, 291566, 146513, -22192, 232946, 294495, 308991, 211007, 243173, 372442, 185484, 210587, 404822, 460456, 316084, 279881, 266290, 369588, 448449, 423179, 552266, 653539, 435630, 482798, 474315, 567358, 654228, 666337, 525434, 793904, 931860, 874306, 967416, 1077017, 928336, 491585, 690700, 586070, 464288, 736120]
6574G36120n34980K22076m6674j5973R6588J7891L8276K0129K50327j09771j14734
6563E59275j4523K85619J65926J20388L42255L03476j56368K1668j21773l12923
6553A193020k41435r5848j92679q5832J15445n7796K15146j30059J11101q0017
6543G51046k9103J88582r5152J44481j63484n7032O4540j538p2597M8276j6521
6532G61498j39066k79025K83567M8199P8029r6431J36912J53433M1105k25879
6522G62342K15990K15080m1965l2353k22522J79520p403m70L6211J05656j02516
6511A107570Q8978R8474k6283L0154j11325k74739o4555P870R9205P7177j96093
6500H36433o202j36730J5803L7519J22708M5348L8607j15792j80995K90777K2360
$$ y = [736120, 201140, 423216, 376542, 360569, 457157, 475048, 513324, 533453, 783780, 674009, 559275, 544752, 830371, 996297, 1116685, 1458940, 1762416, 1606048, 1627716, 1505943, 1193020, 951585, 855737, 663058, 577226, 692671, 634875, 850021, 719962, 831063, 751046, 721943, 910525, 815373, 959854, 796370, 739338, 803878, 802340, 729743, 778019, 761498, 622432, 343407, 626974, 675173, 753202, 656771, 793683, 947116, 988221, 762342, 978332, 1193412, 1151447, 1119094, 896572, 1076092, 1068689, 1068219, 1104430, 1210086, 1107570, 1196548, 1295022, 1268739, 1298893, 1187568, 912829, 848274, 856144, 955349, 1032526, 836433, 830231, 693501, 709304, 746823, 869531, 914879, 953486, 837694, 656699, 947476, 969836]
6489I69836J04774K29767j20399j21717N7376j00512Q323j31497J1711o8522J22468
6478I61608j65869J45180J10016l85238o7835j20663L32440K7027j54441J0479
6468F92704j3080J34962O6952j74565L0435j48654L00128Q4961k53703k641M35194
6457A152693j69588O5639k12274J17558J64559k17458M35135j33845j38316L0575
6447A094678N9847J31895k51405O3092O067J34929R3670J25524K7395K9768r8737
6436A416723J69673P2298J4981n3289j53955j37214J68219J5218k5158J29629
6426A617125l05919J23587K01151J6645j09758j73765j77375K17199O4787M4602
6416A518279J10687L3086M6109N7535j09258M1225N872M4507j54884N8393L39140
$$ y = [969836, 1074610, 1304377, 1183978, 1062261, 1119637, 1019125, 1027448, 895951, 907662, 839140, 961608, 795739, 940919, 1050935, 665697, 597862, 477199, 809639, 836666, 682225, 692704, 679624, 814586, 881538, 706973, 737408, 588754, 888882, 973843, 720140, 717499, 1152693, 983105, 1048744, 836470, 954028, 1118587, 901129, 1336264, 1202419, 1064103, 1094678, 1154525, 1286420, 1035015, 1098107, 1104174, 1239103, 1332773, 1458297, 1485692, 1515460, 1416723, 1586396, 1658694, 1673675, 1620386, 1466431, 1329217, 1497436, 1512654, 1487496, 1617125, 1311206, 1434793, 1635944, 1652589, 1542831, 1369066, 1191691, 1408890, 1473677, 1518279, 1628966, 1662052, 1708161, 1765696, 1656438, 1697663, 1703535, 1748042, 1593158, 1651551, 1990691]
6405A990691n8744K66705q1051N6019r8449J97193p95r8393J11123Q9496j25519
6394B248276Q1043L9602J72697r4441J67695J31886L64018j85356R5040J00779
6384C121239Q7740P5479k48841j39166K36018J59606q1120k9167L18086j1674
6374C488200J40647r7027N093J52874l2217M7235j6235q4396K40784j65710K61099
6363C940347j05881P8843K25174J55994J9923P1232k0669J40199L2203L10319
6353D847684J36175L07856K39419Q7987K39663L30142L59437J33583M29348L53395
6343G464689M76964N33799L64907Q06603O87871N51537Q01499J094377J427249
6334A4209495J158402J500775J280630K031025K109118K540598L386440L576241
$$ y = [1990691, 1931947, 2198652, 2117601, 2173620, 2075171, 2272364, 2271569, 2173176, 2284299, 2373795, 2248276, 2329319, 2368921, 2541618, 2447177, 2614872, 2746758, 3110776, 2925420, 3020460, 3121239, 3208979, 3284458, 3035617, 2896451, 3132469, 3292075, 3210955, 3181788, 3499874, 3488200, 3628847, 3531820, 3536913, 3689787, 3657570, 3704805, 3688570, 3604174, 3844958, 3679248, 3940347, 3834466, 3913309, 4138483, 4294477, 4314400, 4385632, 4364963, 4505162, 4537365, 4847684, 4983859, 5291715, 5531134, 5619121, 5858784, 6188926, 6548363, 6681946, 7111294, 7464689, 7941653, 8475452, 8840359, 9646962, 10334833, 10886370, 11687869, 12782246, 14209495, 15367897, 16868672, 18149302, 20180327, 22289445, 24830043, 28216483, 31792724]
6326C1792724M527419O176232Q018251J0626943J2583483J3820897J2246631P951827
6318A07744407J734682m553274r675253j2405703j2475650j1302191r630539p976821
6310D1459658o223605n007516m182374l098635k701890k421938j710397j811240
6302A4302063j062760r32837r42387q21191l16842p69052l70428l72453l00369
6293H413744k90087k02175k37984j64982j62278j96695k23619j08136k2623k70526
6283F534639j87005j60520P6454R5734j83251J5548k6163J07755j16200k34221
6273E922770K51595J87657J55875j78819K82406K12860k5855K37680K17901J73630
6263G437700J52062K23898N23791N12990L14679N94345M34475N65027Q97313J354633
$$ y = [31792724, 36320143, 42496375, 50514626, 61141569, 73725052, 87545949, 99792580, 107744407, 109479089, 104925815, 95250562, 82844859, 70369209, 59067018, 49436479, 41459658, 35236053, 30228537, 26046163, 22947528, 20245638, 17823700, 16113303, 14302063, 13239303, 12306466, 11364079, 10542888, 10226046, 9456994, 9086566, 8714113, 8413744, 8123657, 7921482, 7683498, 7518516, 7356238, 7159543, 6935924, 6827788, 6805165, 6534639, 6347634, 6187114, 6263568, 6359302, 6176051, 6191599, 6165436, 6273191, 6156991, 5922770, 6174365, 6362022, 6517897, 6339078, 6621484, 6834344, 6808489, 7046169, 7264070, 7437700, 7589762, 7813660, 8337451, 8850441, 9165120, 9759465, 10193940, 10758967, 11656280, 13010913]
6253A3010913J634658J468031K337333K456816L041841L003942K638833J932905
6245C1525272N20556p90072j132528j677315j812499j111279q24806j76734J16722
6236B4637317N06690J314002J469540J789903K548430K322220K829061K676370
6228D0093533K287772J811906J145016j14676o25416j405802k296345j972124
6220C8923864k575788k484553k127655k177000j639306j170865j445979l86521
6212B4916197j28571L02644J030333J700238J896995K200723J321302M20388j330742
6203C2329507k355611l004958k656215l027857k576524j986435j734249j494076
6195A3493582j394600j181611j062953r59180n95168k93740l98609n18383k36097
$$ y = [13010913, 14645571, 16113602, 18450935, 20907751, 23949592, 26953534, 29592367, 31525272, 32045828, 31255756, 30123228, 28445913, 26633414, 25522135, 24697329, 24520595, 24637317, 25144007, 26458009, 27927549, 29717452, 32265882, 34588102, 37417163, 40093533, 42381305, 44193211, 45338227, 45223551, 44598135, 43192333, 40895988, 38923864, 36348076, 33863523, 31735868, 29558868, 27919562, 26748697, 25302718, 24916197, 24787626, 25090270, 26120603, 27820841, 29717836, 31918559, 33239861, 33660249, 32329507, 29973896, 26968938, 24312723, 21284866, 18708342, 16721907, 14987658, 13493582, 12098982, 10917371, 9854418, 8895238, 8300070, 8006330, 7607721, 7089338, 6853241]
6186F853241k77210j33650r4947R2695j15808K70549M70032R30626J020833K49085
6176I265446L75386K46197n43482q12972j015782p53617m65507n40549l85789
6167E369331l61171m20620l68771l44762k44119j6238k55153r0534j77112j04744
6157B986107k24838K4601J08155O7980K77161n5166k70921j52249l06141l5747
6147B418942q9726j56628k12483o7231J1270Q6753j37531K6450k43922j83835
6137A452059K16184k61502J81855J98781k74677M30457l29128j29868R563Q4021
6127A577745l00354P6043o5650o6136J3659P5667m1699J40873k48950P2969l19137
6116I15030j2691l0286J36355n4852J6377q7191N4765q9488J47157k27056k20233
$$ y = [6853241, 6576031, 6442381, 6347434, 6440129, 6324321, 6594870, 7064902, 7995528, 9016361, 9265446, 9640832, 9887029, 9343547, 8530575, 7514793, 6761176, 6295669, 5755120, 5369331, 5008160, 4587540, 4218769, 3874007, 3629888, 3613650, 3358497, 3267963, 3090851, 2986107, 2761269, 2785870, 2894025, 2962005, 3239166, 3184000, 2913079, 2760830, 2454689, 2418942, 2329216, 2172588, 1960105, 1892874, 1904144, 1990897, 1853366, 1879816, 1635894, 1452059, 1668243, 1406741, 1588596, 1787377, 1512700, 1943157, 1614029, 1484161, 1493724, 1577745, 1277391, 1353434, 1287784, 1221648, 1235307, 1310974, 1269275, 1410148, 1161198, 1234167, 915030, 902339, 872053, 1008408, 953556, 969933, 882742, 937507, 848019, 995176, 768120, 547887]
6105E47887L45391j75542J88774j37431K4229N6300j97112M7124k778n7983k0511
6094F18348N9304P8498R4491K0804j39596p4412n8972J61339j48198J55732p3604
6083F93734k29403K44130j92124K82363j99475j80471L87867j97203M6902J67299
6073H23619k8098O2194j60889k38991J07968j14012J42923K4035k82196j35574
6063B00979K96886q0095N751J56642K1951m669K89485O8279q2288m6755J23442
6052I49608j0362r8006L10600j33002P0145j79911L1466o4129J44347l9043J2706
6041I94419p1747K26777m01240j1133p6040M3960M5849l16865j22368K13831k3900
6030E01543n2615k16300K68662P3201J38028j42743N0912M3986k9966R6722J14635
$$ y = [547887, 893278, 717736, 906510, 769079, 793308, 849608, 652496, 699620, 696842, 638859, 618348, 677652, 756150, 850641, 871445, 731849, 657437, 598465, 759804, 611606, 767338, 693734, 464331, 708461, 516337, 798700, 599225, 418754, 806621, 609418, 656320, 823619, 795521, 857715, 696826, 457835, 565803, 451791, 594714, 618749, 336553, 200979, 497865, 417770, 423521, 580163, 602114, 597445, 886930, 955209, 872921, 826166, 949608, 939246, 841240, 1151840, 1018838, 1088983, 909072, 940538, 876409, 1020756, 981713, 994419, 922672, 1149449, 748209, 737076, 661036, 704996, 750845, 433980, 311612, 525443, 501543, 448928, 232628, 501290, 574491, 712519, 569776, 620688, 664674, 634708, 731430, 846065]
6019H46065l7144N9764J2766o6401K1581j41416l0409k3182k10161n0006j13966
6008B67491K47260k4587k36223K94816k38358K49211k53176N2557L6870k93706
5998A02155L90181q0682r1378m0775J0444j449K08480j61110K38802l85612J58752
5987C47808l7918j24846K72479l23535K18475M788k6167N0143k33569j28886L17174
5976C35946j07707L6397L5390p9240P5448J44172L2983K52931r4174J7878J03388
5965G53412P5134j85788L990m2421k16721j27919N5182P5630q4782o4959l7375
5954B03383j4938K80428j90560m2319J59483o9046K36756k17451R1280j17107
5944C19909J98322J42098j21064k13343j99406J70766K61503r8015K4350j59021
$$ y = [846065, 808921, 868685, 881451, 815050, 836631, 695215, 664806, 641624, 431463, 381457, 267491, 514751, 490164, 253941, 548757, 310399, 559610, 306434, 358991, 395861, 102155, 492336, 411654, 320276, 279501, 289945, 288496, 496976, 335866, 574668, 189056, 347808, 309890, 185044, 457523, 133988, 352463, 357251, 331084, 381227, 147658, 18772, 335946, 228239, 264636, 300026, 220786, 296234, 440406, 473389, 726320, 632146, 650024, 753412, 828546, 642758, 646748, 604327, 387606, 259687, 314869, 390499, 305717, 240758, 203383, 188445, 468873, 278313, 235994, 395477, 326431, 563187, 345736, 437016, 319909, 518231, 660329, 539265, 325922, 126516, 297282, 558785, 460770, 485120, 326099]
5934C26099K14811L1148k22536j3868O2030k70918J96875K38893j01686J68617
5924F29465j24277O138j55302J54359l581j85272L281M8138j19338O2631J3372
5913C29614o5952o4311J93488j3414j0823j02821K20257j37402J71621N1983M1669
5902F13909j74322j91796K08572j07033J43151j28991j69793L45517k28983j53133
5892A57098J21317o9105L43944k87375Q5701K52509j97004M7817J56667l33267
5882B78302J13516l10531P5117L32076K11395l03071K14522k1565o832j42521
5872D40408j11917j575K19094k66960K3087N6363K84987j91334k57281M4186J6881
5861B55939P642J37012L6061n6307r9549L20686j15800K96010r1697l02015L049
$$ y = [326099, 540910, 572058, 349522, 335654, 397684, 126766, 323641, 562534, 460848, 629465, 505188, 511326, 356024, 510383, 506802, 321530, 324811, 372949, 253611, 316242, 329614, 263662, 199351, 392839, 379425, 368602, 265781, 486038, 348636, 520257, 572240, 613909, 439587, 247791, 456363, 349330, 492481, 363490, 193697, 539214, 310231, 157098, 278415, 209310, 553254, 265879, 351580, 604089, 407085, 454902, 611569, 278302, 391818, 81287, 156404, 488480, 699875, 396804, 611326, 589761, 582929, 440408, 328491, 326916, 546010, 279050, 302137, 358500, 643487, 452153, 194872, 239058, 255939, 263581, 400593, 436654, 380347, 280798, 601484, 485684, 781694, 689997, 387982, 391031]
5850C91031K37840j76795K46751k3175l53087J39726P4066n1058k6211L3705J4888
5839E07681q0861J24814J7669J12799m988k4269j23185O5707q3165M591L853J19239
5827F39885J1807j45557J11492R1011j36997j20369M0099O7921J2065J5781J26956
5816G14094L1349l3611L844P5438k7842K1830k8387j40286J5487J12717l5199
5805G09434j49775J9370J21945J08270q7936M9652p1595k62141O7121R4612O745
5794F05702o0299K3882J41971j76735K15334k22293J16419m1912m8131J41109
5784F95047o2860J1741l9576r274j6397k9543o2481J71578n8736p9178J73491
5773F93812k03790n3265M2917j44386J07604J17082r3936J06789Q1512l9637o6798
$$ y = [391031, 628871, 452076, 698827, 675652, 322565, 462291, 536357, 485299, 459088, 492793, 507681, 426820, 551634, 569303, 682102, 677114, 652845, 529660, 595367, 512202, 516793, 520646, 639885, 651692, 506135, 617627, 708638, 571641, 451272, 491371, 559292, 571357, 587138, 714094, 745443, 711832, 715676, 791114, 763272, 785102, 756715, 616429, 631916, 744633, 709434, 559659, 579029, 700974, 809244, 721308, 770960, 699365, 437224, 504345, 598957, 605702, 545403, 569285, 711256, 534521, 749855, 527562, 643981, 602069, 553938, 695047, 632187, 643928, 604352, 595078, 578681, 549138, 486657, 658235, 599499, 520321, 693812, 490022, 436757, 479674, 335288, 442892, 559974, 466038, 572827, 654339, 614702, 547904]
5762E47904K21158r6315n4680j1839N9686K19736k46919k9393Q7149J20476j79189
5751F37774J15058J37031j67065Q8187k29765K11146n7422K5122q0850P253J36054
5740H22523P2389j69975J95861N0062M8931j80590N3999o6430K51668n2088J13567
5729A139917k97562J25620L0830j02281Q5372L03381o3491j6784K84716j86917
5719A302801n6148r2799L78478K0831l7811J66642J71174L40114K2834J16442
5709B332558l2463n1332k97766J55405N0064q5552o7490o9996J4169k6115n2306
5698A869176J21234K23799J49835n6727O9574N7903K85088L72696J96510K96841
5688C585929L32513Q87398R59771R20274P76599M60317j52894n37478p44309p06594
$$ y = [547904, 769062, 672747, 618067, 606228, 665914, 885650, 638731, 609338, 696487, 816963, 637774, 752832, 889863, 722798, 810985, 581220, 792366, 734944, 760066, 679216, 686469, 822523, 894912, 724937, 920798, 970860, 1019791, 839201, 893200, 826770, 1078438, 1026350, 1139917, 842355, 967975, 998805, 896524, 981896, 1285277, 1221786, 1205002, 1489718, 1302801, 1246653, 1153854, 1532332, 1553163, 1515352, 1681994, 1853168, 2193282, 2216116, 2332558, 2300095, 2248763, 1950997, 2106402, 2156466, 2070914, 2003424, 1933428, 1947597, 1921482, 1869176, 1990410, 2214209, 2364044, 2307317, 2376891, 2434794, 2719882, 3092578, 3289088, 3585929, 3918442, 4805840, 5765611, 6685885, 7462484, 7922801, 7769907, 7232429, 6488120, 5781526]
5678E781526o48160l21437p0002n71829J00333j53723J09992n0932k96512M19580
5668D298836K36476J23915J53500L48306N87909M69563N93551J322632J420846
5659I555534K240286K274398K392330J295256P7148j295392j774523k309460j628088
5650A0827489j444975q91752p11181n83950l79855k33760k48174j00278R8099
5641F331663J06103L48173L93314L47664J16357Q28790O17073J537192J806233
5632A2432562K710572L280766L458703K256749Q22951j261566k418616k947390
5624A8334731k816600k281892j769507j306542p63456p71585m22363m58521m94686
5615G249579K52868j39111m491j03252N32693J69708K98570N94294Q44450J105849
$$ y = [5781526, 5133366, 4811929, 4741927, 4170098, 4270431, 4116708, 4226700, 4175768, 3879256, 4298836, 4535312, 4659227, 4812727, 5161033, 5748942, 6218505, 6812056, 8134688, 9555534, 11795820, 14070218, 16462548, 17757804, 17834952, 16539560, 14765037, 12455577, 10827489, 9382514, 8490762, 7779581, 7195631, 6815776, 6582016, 6333842, 6233564, 6331663, 6437766, 6785939, 7179253, 7526917, 7643274, 8472064, 9089137, 10626329, 12432562, 15143134, 18423900, 21882603, 24139352, 24962303, 23700737, 21282121, 18334731, 15518131, 13236239, 11466732, 10160190, 9396734, 8625149, 8202786, 7744265, 7249579, 7502447, 7363336, 7358845, 7255593, 7788286, 7957994, 8256564, 8850858, 9695308, 10801157]
5605A0801157J771071K515344K921379K023088J091035k59097j503313k162571
5597A7198093k148802k127096j255767r94520p60823m77415m06553l92220J20741
5588H755638R2504R2256J31055L15237K79323N23953N83011M47473J002436R32036
5578A3154922J580494K292207K384176K471460K644236K683450K296077K410876
5570C1917898K409753J714181Q90222o03181j528486j895476k322804j501382
5562B9080725j535906q19508j81717K54269N26913J131452J424277J807455J941936
5553C3629896K199876K074793K341522J809059J704685J182879M32375n15465
5545D4859620j598529k084090k637380k962665k454787k384162k033575j898986
$$ y = [10801157, 12572228, 15087572, 18008951, 20032039, 21123074, 20863977, 19360664, 17198093, 15049291, 12922195, 11666428, 10671908, 9911085, 9433670, 9027117, 8634897, 8755638, 8848142, 8940398, 9071453, 9386690, 9666013, 10189966, 10772977, 11220450, 12222886, 13154922, 14735416, 17027623, 19411799, 21883259, 24527495, 27210945, 29507022, 31917898, 34327651, 36041832, 36932054, 36328873, 34800387, 32904911, 30582107, 29080725, 27544819, 26725311, 26543594, 26797863, 27324776, 28456228, 29880505, 31687960, 33629896, 35829772, 37904565, 40246087, 42055146, 43759831, 44942710, 45375085, 44859620, 43261091, 41177001, 38539621, 35576956, 33122169, 30738007, 28704432, 26805446]
5537B6805446j516028j085161n15287j30981L79222J083084J411592J613439J532569
5528B9577895Q57744n85082j851662k355853k951787k656720k641395k182676
5520A5210464j693736j469410j246381j180960q43647m90612n70634n01972q14989
5511F398123p3273l38912j88832k90611m02898j51428R5898m77299k02911j42452
5501D225405j36119Q6025k24762j6246j14481m13994o9453K24734k1071j98966
5491C341072M383j04209n7026K26627k74537j93572J23789m8929K48930M8063
5481C314591j35126j74371k12365J67857K8334j11891K2589J2338q0622q681k13439
5470B609214J23517J73147l37792M777J35445l8726R4632m8668j01530m5749K09402
$$ y = [26805446, 25289418, 24204257, 23688970, 23557989, 23937211, 25020295, 26431887, 28045326, 29577895, 30435639, 29850557, 27998895, 25643042, 22691255, 20034535, 17393140, 15210464, 13516728, 12047318, 10800937, 9619977, 8776330, 8285718, 7715084, 7213112, 6398123, 6324850, 5985938, 5797106, 5506495, 5103597, 4952169, 5048067, 4570768, 4367857, 4225405, 4089286, 4175311, 3950549, 3934303, 3819822, 3405828, 3336375, 3561109, 3540038, 3341072, 3345455, 3241246, 3184220, 3410847, 3136310, 2942738, 3066527, 3017598, 3266528, 3314591, 3179465, 3005094, 2792729, 2960586, 2988920, 2877029, 2899618, 2911956, 2831334, 2822653, 2609214, 2732731, 2905878, 2568086, 2572863, 2708308, 2669582, 2764214, 2715546, 2614016, 2568267, 2777669]
5459B777669p2229J23482L09028J39546L29n1156o553k03043n4723J19149j02797
5448B978702P0808k69278J47119P5824L8456j63841K10800J93292O1595j94802
5438C148675L37061J3139J3626K04968M21105o5088j92331q1191j24524j4325
5428C661115j1757n7742j27775k07799M7316J03881L6280L33158j17648j9769
5418C639260K20226K1929j76902M00369M2465Q5183K73658j47854J84803l7344
5408D505793l3937R2586j22557M7137L5674m2076j0637K08895P2061J94205K59352
5397E206496R0037J00045l3047J37694O1485J06170K24408K96572K10596j38074
5387F262382N91939K16752K07230m063K27083J48719K90440J80413L70743M43829
$$ y = [2777669, 2705440, 2828922, 3137950, 3277496, 3277825, 3226669, 3220116, 3017073, 2962350, 3081499, 2978702, 3049510, 2780232, 2927351, 3003175, 3041631, 2877790, 3088590, 3281882, 3343477, 3148675, 3485736, 3498875, 3512501, 3717469, 4138574, 4073486, 3881155, 3799964, 3675440, 3661115, 3649358, 3591616, 3463841, 3256042, 3303358, 3407239, 3443519, 3776677, 3659029, 3639260, 3859486, 3881415, 3704513, 4104882, 4147347, 4232530, 4506188, 4358334, 4543137, 4505793, 4471856, 4564442, 4441885, 4489022, 4524696, 4482620, 4471983, 4680878, 4752939, 4947144, 5206496, 5296533, 5396578, 5363531, 5501225, 5562710, 5668880, 5893288, 6189860, 6400456, 6262382, 6854321, 7071073, 7278303, 7274240, 7501323, 7650042, 7940482, 8120895, 8491638, 8935467]
5377H935467L73333O04372M9204K71157O02270K06210N01058M10708L50470P38267
5367A3042516M17156O33657R21557O66114O11957O41620R40706Q67181P53633
5358A9496097J113819J081464J014055J203744J087272J079975J323246J342325
5350B8741997J350914J254850J181553J014686J199375J199666J025845P54738
5342C7723624M65715M55925J43192j65661k61047m84755p22974q81838r98824
5333C5273357j109295j239357j099092j263941j435930j073918j582291j035761
5325B5433772j310371j283589j239974j167622r30929r70193p64415r31731p78305
5316A6056643q57699n30822n02496r03140o05321n22541k61126l65227o88945
$$ y = [8935467, 9308800, 9913172, 9962376, 10233533, 10835803, 11042013, 11543071, 11953779, 12304249, 13042516, 13459672, 14093329, 15014886, 15681000, 16292957, 16934577, 17875283, 18742464, 19496097, 20609916, 21691380, 22705435, 23909179, 24996451, 26076426, 27399672, 28741997, 30092911, 31347761, 32529314, 33544000, 34743375, 35943041, 36968886, 37723624, 38189339, 38645264, 38788456, 38622795, 38361748, 37876993, 37154019, 36272181, 35273357, 34164062, 32924705, 31825613, 30561672, 29125742, 28051824, 26469533, 25433772, 24123401, 22839812, 21599838, 20432216, 19501287, 18531094, 17766679, 16834948, 16056643, 15198944, 14668122, 14165626, 13262486, 12657165, 12134624, 11873498, 11508271, 10819326]
5307A0819326l71120m65176o80020m30356j02586j88194m09704q9126n38025q6958
5297G458061m22581k26011j06841k32097k69410r5367j60548j04363j65957k23939
5287E450947P2884l06797l21813J0664j63042k8070R6386m99638n3475j81379
5277D076667j89789Q3225j36535p5648k4668k73550j64569J17439m13264K2762
5267C022070J66367M307j40406k02416M50j6213j10237j77789J1323k37310j18782
5256B201364K17284j06753N4328r7258j60869j51582j96211O9240J03989q774
5246A924758k67561P7559n3387L1815K5032j63249J04743j71566J5890J44194
5236A668228k72248m717r2761L9276J93124m9440k40703L7378n2184R0281k8721
$$ y = [10819326, 10448206, 9983030, 9303010, 8872654, 8770068, 8581874, 8172170, 8083044, 7545019, 7458061, 7035480, 6809469, 6702628, 6470531, 6201121, 6105754, 5945206, 5840843, 5674886, 5450947, 5523831, 5217034, 4895221, 4905885, 4742843, 4714773, 4811159, 4311521, 4258046, 4076667, 3886878, 3970103, 3833568, 3757920, 3733252, 3459702, 3295133, 3412572, 2999308, 3022070, 3188437, 3192744, 3052338, 2849922, 2850372, 2834159, 2723922, 2546133, 2557456, 2320146, 2201364, 2418648, 2311895, 2366223, 2268965, 2108096, 1956514, 1760303, 1829543, 1933532, 1924758, 1657197, 1734756, 1681369, 1713184, 1738216, 1574967, 1679710, 1508144, 1524034, 1668228, 1395980, 1391263, 1298502, 1337778, 1530902, 1481462, 1240759, 1278137, 1225953, 1316234, 1287513]
5225A287513l226P2691k31382k7503p6604P5210j81137k106O5796j91948l2989
5214G54315L03401l1699j84411J23522n3320l1841k7659P4110j19090N2721j41354
5203G18695J85622k09432J82355j00041P9162j24665L18117j48369K23168k48565
5193H76047P582n3155J76711r9587p1326j0646N6954k87683K82194l991J0106
5182H83206j01154k809q5857P6538j68265K50567J9565k8147n2574q6482j3816
5171F90772Q8244j77110J0366o8578n8863K34635j83222J48636j35710J79357
5161G28527k05156J60144m28139Q3876N3736R8525j98979L2821J21273J29819
5151E76447k36559K92882k56008k6895K28542J09109K1402n3495j09464j1926
$$ y = [1287513, 1284287, 1356978, 1125596, 1098093, 1021489, 1096699, 915562, 913456, 979252, 787304, 754315, 1057716, 1026017, 841606, 965128, 911808, 879967, 852308, 926418, 807328, 860049, 718695, 904317, 694885, 877240, 777199, 856361, 731696, 1049813, 901444, 1124612, 876047, 883629, 830474, 1007185, 907598, 836272, 825626, 882580, 594897, 877091, 873100, 883206, 782052, 779243, 693386, 769924, 601659, 852226, 871791, 843644, 791070, 704588, 690772, 779016, 601906, 612272, 543694, 484831, 719466, 536244, 684880, 549170, 728527, 523371, 683515, 255376, 339252, 392988, 491513, 292534, 325355, 446628, 576447, 339888, 632770, 376762, 349867, 578409, 687518, 708920, 655425, 545961, 534035]
5141E34035j75006L1358k5315j5844R4199J82297m2747n8625l41001J44113j42066
5130A85398K46551j65012j5128J0068K55123j71450j15014r7524k0958r772R9649
5119B01931K64846p4880k09010N0702K15002o2282m1273j98807p4071J25181K7648
5108B24987J0679K0194j65516P3399J39802j32252J69749o612q0520n8035N9946
5097B55821K4908J66873q6442J2756J8589N2996p768j63543k4664j7273r9768
5086A32485J23647j06352N1793Q7914o4844j24148j10895R4163p0186M56768m12848
5075E7497N3538j00654J07091K74082k61689J2653J02487j40861J17673P6260
5065B98077J31262J09724k91267j49412K60623M4769K7326j94968J24512q3025
$$ y = [534035, 359029, 390387, 365072, 349228, 443427, 625724, 582977, 524352, 183351, 327464, 185398, 431949, 266937, 251809, 261877, 517000, 345550, 230536, 133012, 112054, 102282, 201931, 466777, 391897, 182887, 233589, 448591, 386309, 345036, 146229, 72158, 197339, 224987, 235666, 255860, 90344, 163743, 303545, 171293, 341042, 334430, 253910, 195875, 255821, 280729, 447602, 361160, 373916, 392505, 445501, 437733, 274190, 249526, 232253, 132485, 256132, 149780, 201573, 289487, 224643, 100495, -10400, 83763, 13577, 470345, 57497, 111035, 10381, 117472, 391554, 129865, 142518, 245005, 104144, 221817, 298077, 429339, 539063, 247796, 98384, 359007, 403776, 431102, 236134, 360646, 277621]
5055B77621j46371M8870l1281n7421o922l3434j26753K51074j87885P3255n8950
5044A803j25007M4880L74161j16537r3872r3467M2070J81960k60437J17413J97815
5033B70782K9335q2442r3333J54343J5348q1868K4543p3003j61472j42806J04862
5022c5711R9391j28978J17652P3384q8815j74990p4923K88766j25724J9374M8487
5011A7913J83980J9565N3751l48398J27206J87820j49019j88652K47514l24169
5001a72489L77385j43958J26690j93676J61897j43339J3983k4152o3961K20865
4991A59245j40651j67l1910J25180p6555q389L3239L09631l81826P7486N3957
4980A19240o1018q6523M3579j10473K33015q5041N9036j01782J79068o5408j54254
$$ y = [277621, 131250, 180120, 148839, 91418, 84496, 51062, -75691, 175383, -12502, 60753, 1803, -123204, -78324, 295837, 179300, 85428, -8039, 34031, 215991, -44446, 72967, 270782, 300117, 217675, 124342, 278685, 294033, 212165, 236708, 163705, 2233, -140573, -35711, 63680, -65298, 52354, 125738, 36923, -138067, -212990, 75776, -49948, -30574, 17913, 201893, 221458, 275209, -73189, 54017, 241837, 92818, -95834, 151680, -172489, 204896, 60938, 187628, -6048, 155849, 12510, 26493, 2341, -61620, 159245, 18594, 18427, -13483, 111697, 35142, 26753, 59992, 369623, -12203, 65283, 119240, 58222, -28301, 15278, -95195, 137820, 52779, 111815, 10033, 189101, 123693, -30561]
4969c0561J48822k6243n2146J20697j27699L9843k4603J75737j29363K20599q225
4958C06858k82663N9073o0113K0273J21379M4910R3105o1012j74464m6636L6443
4947E7153q4623p4617Q5073j10090J29222L265J29971l5823R5775r2489k00825
4936i8008K5571J2312K70940J22911j30124R7649j57297K02352k00646O0008o600
4925A99068p163J37374j60974k4890K4219j3238K12627m51465K06023r9234j49061
4914a26714R6417j4711J67415J1953k5866M3332j35844j10008L1040O5832R9402
4903A02248o3645j83385M25350k98444J45606k362j91408J7625R5557J03306J04719
4892B55167k8214k42142L4196P4941k20457J97024j07218m4098P5130J9162J16460
$$ y = [-30561, 118261, 92018, 39872, 160569, 32870, 72713, 48110, 223847, 94484, 315083, 306858, 24195, 83268, 23155, 43428, 164807, 209717, 302822, 241810, 67346, 20710, 57153, -27470, -102087, -17014, -127104, 2118, 5383, 135354, 99531, 195306, 102817, -98008, -72437, -60125, 210815, 333726, 203602, 301251, 143954, 346306, 145660, 205668, 199068, 191905, 329279, 168305, 143415, 167634, 154396, 367023, -84442, 121581, 22347, -126714, -30297, -45008, 122407, 134360, 108494, 151826, 15982, -94026, -62986, 2846, 102248, 38603, -144782, 280568, -17876, 127730, 125368, -66040, -48415, 47142, 150448, 255167, 226953, -15189, 19007, 93948, -126509, 70515, -36703, -80801, -5671, 13491, 129951]
4881A29951q42j79729P4123j07181J82680q6637R1663j20850Q1718l6599M4254
4870G2551K02651m5927j83489J07440k15888j64620K00561J11726J86669j55138
4860A16536j76934K03955j38154j52322J28461J08407O0589k63689K29497n2948
4850F3398Q7630Q598J2414m05608J74487j10149L92734k47595J4843J60477K09479
4839C60708k98305O0615P6480j53597j3128j37180K65564K49570k65142m2158
4829A03427J97164k00125J63382r6141j30943J21220j47086N4901j50076K93670
4819B09393k02497J53629J01742o0381j16744j41435p0934K64382j51795m0652
4809e5292K10285K3560j12925j6019o9472K63409l80942n228K29089o2268L12961
$$ y = [129951, 129109, -50620, 23503, -83678, 99002, 12365, 104028, -16822, 64896, 28297, 72551, 275202, 229275, 45786, 153226, -62662, -227282, -26721, 85005, 271674, 116536, -60398, 143557, 5403, -146919, -18458, 89949, 150538, -113151, 116346, 63398, 151028, 159626, 172040, -233568, -59081, -169230, 223504, -24091, -9248, 151229, 360708, 62403, 123018, 199498, 45901, 32773, -104407, 161157, 410727, 145585, 103427, 300591, 100466, 263848, 167707, 36764, 157984, 10898, 65799, -84277, 209393, 6896, 160525, 262267, 201886, 85142, -56293, -127227, 137155, -14640, -55292, 154993, 178553, 65628, 49609, -19863, 243546, -137396, -142624, 86465, 24197, 337158]
4798C37158j23019k28584K67616j26294O8000m2752M1982j23843k88898K27677
4788I043L12787j06662q8229l685k6597J8522j45772K5096J99815k03814N961
4777c535O2930l9520J7297K590Q1920n0564K54760l23605l566l0579J09627P4302
4765A52057M6553k44838K06240M4609j64564j39100k493M3072J18131k2881L3306
4754G0092K14716j93030J54149P5389l33417q305J72254N4953n7705j62938J09957
4743I6115J02338j98661P4859P8293J07688l9859K6413O0609J38132m60789L3819
4732A8957j09268J68213J9583J1732R9603M0770r6550p1096P6943J37469o8379
4721B27977k18938J18089j39840N7650L05738m7069q6120p8730r3731r7934J20958
$$ y = [337158, 214139, -14445, 253171, 126877, 194877, 152125, 194107, 70264, -218634, 9043, 321830, 215168, 126939, 123254, 96657, 115179, -30593, -5497, 194318, -9496, -3535, 59395, 19875, 37172, 39762, 121682, 71118, 325878, 2273, -1293, -31872, 77755, 152057, 198610, -46228, 160012, 204621, 40057, -99043, -101536, -58464, 59667, 36786, 70092, 284808, 91778, 245927, 321316, -12101, -20406, 151848, 206801, 149096, -13842, 96115, 198453, -208, 74651, 152944, 260632, 220773, 247186, 307795, 445927, -14862, 18957, -90311, 77902, 97485, 109217, 208820, 249590, 153040, 81944, 158887, 296356, 227977, 9039, 127128, -12712, 44938, 350676, 303607, 217487, 138757, 45026, -52908, 68050]
4710F8050M2001P5442l0442n3786P8680Q0446O1494r6311n2710j64024L15468
4699C24308k96710J65124l5260K8877L8814n9315j31829J73383j08653l7407J85962
4688B47294m9110j81887L25559n2797K3808Q06j22796m7598J27518j03113J5699
4677A83383J70264j95137n935M8064o368P2020k05768K49204J11037k41234J10055
4666B89585o7819k75896J69534J06560p4956J13571m0862r0023K69799o571n5794
4655C37128L5915j34179Q0516p859j64319k86895J53142K22513K44455k95160
4645A85257q256J92288k8222J03419r0289m4438J34555j50957j03959J82605j77906
4634A94097J3874l97J00755N0270l6632o2331k0853L28730k48147j2990J27797
$$ y = [68050, 110051, 185493, 155051, 101265, 179945, 260391, 321885, 225574, 172864, 8840, 324308, 27598, 192722, 157462, 186339, 225153, 165838, 34009, 207392, 98739, 61332, 247294, 198184, 16297, 341856, 289059, 312867, 313673, 190877, 143279, 270797, 167684, 183383, 353647, 158510, 152575, 200639, 194271, 266291, 60523, 309727, 420764, 179530, 289585, 221766, -54130, 115404, 221964, 147008, 260579, 219717, 129694, 399493, 392922, 337128, 373043, 238864, 319380, 311521, 147202, -139693, 13449, 235962, 480417, 185257, 177001, 369289, 341067, 444486, 354197, 309759, 444314, 293357, 189398, 372003, 194097, 207971, 207574, 308329, 358599, 321967, 259636, 238783, 567513, 319366, 306376, 434173]
4623D34173N3125k68651J26359m7827Q2877j04636l640J84014Q7420k71436J97761
4612D69539P9735l8323l58978J92809K2484J52118O2796J54138j58976j69355
4602D07987K21473p1835k01270P1390j13185J05809K03296k9499O6484J50528
4592H11178j64885m9274p1966m5825J21494K20030K0667J89588J40487J54236
4582A325730L85879Q038L40045K01496m75713j35451j65882m12413M7161j76172
4572I42718J1412J14078j21705l14126J74191p4610j4761J14310p0346k32745
4562E28416O8247O1307L32808j04091n189P1343J76826K47767M24193O6241J00476
4551A968344o7760j78879l28388l4677j46876k63985j66375M2938J44122K4479
$$ y = [434173, 487298, 218647, 345006, 297179, 380056, 275420, 271780, 455794, 543214, 271778, 469539, 549274, 510951, 151973, 344782, 367266, 519384, 582180, 736318, 577342, 407987, 629460, 557625, 356355, 427745, 314560, 420369, 623665, 594166, 660650, 811178, 646293, 597019, 525053, 479228, 600722, 820752, 841419, 1031007, 1171494, 1325730, 1711609, 1719647, 2059692, 2261188, 1785475, 1650024, 1484142, 1071729, 1118890, 942718, 954130, 1068208, 946503, 632377, 806568, 731958, 717197, 831507, 761161, 528416, 596663, 657970, 990778, 886687, 881498, 952841, 1129667, 1377434, 1801627, 1867868, 1968344, 1900584, 1721705, 1393317, 1358640, 1211764, 947779, 781404, 824342, 968464, 992943]
4541I92943m13341R4901J35819L5874K4963l6322p3824q9549K4925j1616N1281
4530G36054J65368j2404j50806J63458J67623l37664K11999M6121k62174K11491
4520I39066k16740L29497k28304p198J75468o5673o3783O6989P7752P7024j53773
4509I30325Q0554m6512r0160L4806L3217K34205o2133Q3945j78819K1822m6124
4498I95126r6339O5229k68902K69302J48654J93374q1101o3672J23593j10965
4488A174299n3977J60108j58175J5191j34841K16393N3716m3319O7382l5665Q4207
4477A345319j34363r8380J04372j60664K99348J42285j64420J12334J96998j50994
4467A491835j09155J9844m4220R8084K69033k06801J64367J23129j57075j53271
$$ y = [992943, 579602, 674503, 810322, 846196, 871159, 834837, 761013, 671464, 696389, 684773, 736054, 901422, 889018, 738212, 901670, 1069293, 731629, 943628, 989749, 727575, 939066, 722326, 1051823, 823519, 816321, 991789, 926116, 862333, 929322, 1007074, 1084098, 930325, 1010879, 964367, 874207, 909013, 942230, 1176435, 1114302, 1198247, 1019428, 1041250, 995126, 898787, 964016, 695114, 964416, 1113070, 1306444, 1225343, 1161671, 1285264, 1174299, 1120322, 1280430, 1122255, 1137446, 1002605, 1218998, 1272714, 1229395, 1296777, 1261112, 1345319, 1210956, 1112576, 1216948, 1056284, 1355632, 1497917, 1333497, 1445831, 1642829, 1491835, 1382680, 1402524, 1358304, 1456388, 1725421, 1518620, 1682987, 1806116, 1649041, 1495770]
4457A495770p4694J80290J81153q3254n506L7980j0711K9277j59557J40739O2778
4446A794265K20599m8443J32717k69488K23072o6301o5236j38864L58014L9584
4436B179919k7119J98645P5922k5352j06105j20506N1725n5425K18532J65336
4426B555572O4846k35998K05024K18147M0748j10877K36839J79430j96085p5609
4416B882037M4441J85620R4831K36697j83169J54050J59536k24266L65291N248
4406C720316o5743L24069l45292L46294l7824r164J89219q4322K33049K10377
4396D480979k02242K44379j3173J84765J39890J60666q043J62633J55679J88721
4386E494254L29219K5195J01510N00739L22995K89324J48232j21985J39770J26457
$$ y = [1495770, 1421076, 1601366, 1782519, 1699265, 1693759, 1731739, 1721028, 1750305, 1590748, 1731487, 1794265, 2014864, 1966421, 2099138, 1829650, 2052722, 1986421, 1921185, 1782321, 2140335, 2179919, 2152800, 2351445, 2427367, 2402015, 2295910, 2175404, 2227129, 2171704, 2390236, 2555572, 2620418, 2384420, 2589444, 2807591, 2848339, 2737462, 2974301, 3153731, 2957646, 2882037, 2926478, 3112098, 3206929, 3443626, 3260457, 3414507, 3574043, 3349777, 3715068, 3720316, 3654573, 3978642, 3633350, 3979644, 3941820, 3932656, 4121875, 4037553, 4270602, 4480979, 4278737, 4523116, 4509943, 4694708, 4834598, 4995264, 4987221, 5149854, 5305533, 5494254, 5823473, 5848668, 5950178, 6450917, 6773912, 7063236, 7211468, 7089483, 7229253, 7355710]
4376G355710K06654J12079J58375K94348L32568l720L69799M93216J06838N80906
4366A0006773Q60669P02499K68409k7545M70028K60065M39277j05274P44296O34160
4356A4253357M27792Q32858M98766J046852J275465J180223J740345J533232J258135
4347B4047025J654506J916651K134905K606794L476402M313842N176690N427916
4339E0754731O735183Q996392J2890108K0652773L9481928O6820535P3286971
4332B79618621L9745613j6353312m9395507n2335371m3187253l3873886k5443653
4325I8775252j7593667j2075044q463084n474501m351323l105988j959100r84622
4317D4767923n86463P90817J986739L053549L774289M608666O596318R548164
$$ y = [7355710, 7562364, 7674443, 7832818, 8127166, 8459734, 8456014, 8825813, 9319029, 9425867, 10006773, 10867442, 11569941, 11838350, 11810805, 12280833, 12540898, 12980175, 12874901, 13619197, 14253357, 14681149, 15514007, 16012773, 17059625, 18335090, 19515313, 21255658, 22788890, 24047025, 25701531, 27618182, 29753087, 32359881, 35836283, 40150125, 45326815, 50754731, 57489914, 66486306, 79376414, 100029187, 139511115, 206331650, 279618621, 319364234, 303010922, 253615415, 201280044, 158092791, 124218905, 98775252, 81181585, 69106541, 60643457, 55168956, 50817633, 47711645, 45752545, 44767923, 44181460, 44972277, 46959016, 50012565, 53786854, 58395520, 64991838, 74540002]
4309G4540002J5203738K8305025N2895086P0338877N2723298K530274m1399574
4302B55136726n3419252m6597420l6363727k7452113j9891400j3919205r590963
4295D7902646p066847n190900m440867l551304k983361k344593k260498j522110
4287A8542166j477330j226619r04210r15522n34734l06741o44771l18944p41618
4278A1471677m44458l09636l06569l90251k29919n16492l52990m84729k69953
4269H166680o35010j96137l68672J71376k03426j26806m66923o1745j18376k12771
4259E948190j90357j27104j30721k22479j35929q1124k37683j09614j30782j26123
4249D456274R76k54845k52798j41980N879j10927j14334k42525J19335j2316k57964
$$ y = [74540002, 89743740, 118048765, 170943851, 241282728, 294006026, 296536300, 255136726, 201717474, 155120054, 118756327, 91304214, 71412814, 57493609, 47902646, 40835799, 35644899, 31204032, 27652728, 24669367, 22324774, 20064276, 18542166, 17064836, 15838217, 14934007, 14018485, 13483751, 13177010, 12532239, 12213295, 11471677, 11027219, 10717583, 10411014, 10020763, 9790844, 9274352, 8921362, 8436633, 8166680, 7531670, 7335533, 6966861, 7138237, 6934811, 6808005, 6341082, 6279337, 6160961, 5948190, 5757833, 5630729, 5500008, 5277529, 5141600, 5060476, 4822793, 4713179, 4582397, 4456274, 4457250, 4202405, 3949607, 3807627, 3813506, 3702579, 3588245, 3345720, 3465055, 3452739, 3194775]
4238C194775j53019k5062j21584M0272j11290K02955l06035j09942J05826O406
4228B723302k92553j19184l13150K98503l02851J86256j66925n8152Q9978j06935
4218A938289J17286n0106l58865l3342J12613M6327j76314P6765N3174l7247l37618
4207A350962R4256J14481j5824j45741l07250K69536j88857J26032k27586Q4057
4197A154066k44515n3804K90098k6739k8468n0159k26417n347P5609K33063k10377
4186I07010O726q1303m7115J6480J35967j66892j73946j32555J67752N4651j25809
4175E60966O900J60253k65727r6338P7607R7339l8546k15627R5633J58323n9642
4164D81141K7500j93625K5029J06299l9747p5065Q3186J18661j83228q7849o1197
$$ y = [3194775, 3041756, 3016694, 2895110, 2935382, 2824092, 3027047, 2721012, 2611070, 2716896, 2723302, 2430749, 2311565, 1998415, 2296918, 1994067, 2180323, 2013398, 1955246, 2045224, 1938289, 2055575, 2005469, 1646604, 1613262, 1725875, 1772202, 1595888, 1672653, 1725827, 1688580, 1350962, 1445218, 1559699, 1543875, 1398134, 1090884, 1360420, 1171563, 1297595, 1070009, 1154066, 909551, 855747, 1145845, 1119106, 1090638, 1040479, 814062, 808715, 884324, 1117387, 907010, 913736, 832433, 785318, 801798, 937765, 770873, 596927, 464372, 632124, 686775, 560966, 567866, 728119, 462392, 366054, 443661, 541000, 502454, 286827, 382460, 540783, 481141, 508641, 315016, 340045, 446344, 406597, 331532, 414718, 533379, 350151, 262302, 201105]
4153B01105O2657K24151j69693p9168n46l0377J4366q9366R4200M9965L2738k8890
4141B81142k54589J01876n7522J91287k5531l4992o5874M7807j93529J77721j66581
4130A215J39720L0859k1185j06762l8179L7811m2154p3706L55560j21715R5404
4119B56868l02407J27680j98967J60776j44421J43575L4744K2996k0136n1801
4109B8907k47918K81032O4365r7124P9679m0421j44996J20941k96955J49640n6981
4098a59831Q0093L84261k94109K37785J01280k16728J29363j45786q9883J65150
4088A91595k155K06111o8353M29010L8169K92969K83594j09557p411K8210m65944
4077H16238m3330m57396K0282P1913j0879j02809j10501J8718P135K06950m1145
$$ y = [201105, 263762, 487913, 318220, 239052, 238506, 208129, 222495, 133129, 227329, 277294, 310032, 281142, 26553, 128429, 70907, 262194, 236663, 201671, 135797, 183604, -9925, 167796, 1215, 140935, 171794, 150609, 43847, 5668, 43479, 1325, -72381, 283179, 161464, 256868, -45539, 82141, -116826, 43950, -100471, 43104, 77848, 100844, 80708, 28907, -219011, 62021, 126386, 29262, 108941, 68520, -76476, 44465, -252490, -102850, -159831, -79738, 304523, 10414, 248199, 349479, 132751, 262114, 116328, 26445, 191595, 189440, 395551, 327198, 756208, 794377, 1087346, 1370940, 1261383, 1253972, 1282182, 816238, 772908, 315512, 335794, 407707, 396828, 294019, 183518, 202236, 209371, 416321, 375176]
4066C75176J00232o5464k466M4778k21922J60832K07779J64431K68308J21005
4056A152689J20765M50521j0183m05221J8332l62549M7222l09094k2316J2570
4046F92736J39426j23574j6442l78547L85975l07888K41726q2363J88092j63948
4036E75193R25Q998J59795l4855Q5539j75649L7487k11027J87455j33033l439
4025D97389J9381k08716M9031M0705j36272j80642L44683q3626j9213K10404j27858
4014D05266J17533J4742M0516r3569Q805j64704J08510K5146O0198J16n8198k01975
4002B62386k0501j90385k5188L8109N1373l586n8742K87317l18792L8877J61478
3991B22346M851M6615k80315O6113N4158j46315J40137j82799j24212L37481p2399
$$ y = [375176, 475408, 409944, 407478, 452256, 230334, 391166, 598945, 763376, 1031684, 1152689, 1273454, 1723975, 1713792, 1308571, 1326903, 964354, 1011576, 702482, 680166, 692736, 832162, 708588, 692146, 313599, 699574, 391686, 633412, 551049, 739141, 575193, 576118, 585116, 744911, 710056, 795595, 619946, 657433, 446406, 633861, 500828, 497389, 516770, 308054, 357085, 397790, 261518, 80876, 425559, 341933, 322720, 533124, 405266, 522799, 537541, 578057, 484488, 493293, 328589, 437099, 462245, 522443, 522559, 464361, 262386, 241885, 51500, 26312, 64421, 115794, 112208, 53466, 340783, 21991, 60868, 222346, 227197, 273812, -6503, 59610, 113768, -32547, 107590, -75209, -199421, 138060, 65661]
3980F5661P115j32975P7422N6504m5531Q4628j01895j37737Q5797M9538j13312
3969a04785J42237k25891k679J63825j01144J87230l08884M07010k69657L01867
3959A89129L4687l11745o1892p6873k1561N5466m7865K84688q5330J7415j91768
3948b15649K35147j89221j4730J82601J24407l6783k05504R6881J26580l37551
3938b33822o7010Q3162Q1618q950K11232r2540j34858K74249k84912P6569K21366
3927A26104j23525k35847J41305J57332j5213k04868r6788n761j37445L56339
3917c8367J32088k49927Q1836k9970N8805k77485k9241K22485J23684K3948r9477
3906h1621j53747L09744k71856J25937J87308j45903p0585Q3939n8409J0110j5562
$$ y = [65661, 72776, -60199, 17223, 73727, 28196, 112824, 10929, -126808, -41011, 8527, -104785, 37452, -188439, -191118, -27293, -128437, 58793, -250091, 156919, -112738, 189129, 223816, -87929, -149821, -226694, -248255, -192789, -240654, 44034, -41296, -23881, -215649, 19498, -169723, -184453, -1852, 122555, 85772, -119732, -22851, 103729, -233822, -300832, -217670, -136052, -145002, 66230, -26310, -161168, 113081, -171831, -95262, 126104, 2579, -233268, -91963, 65369, 50156, -154712, -251500, -257261, -394706, -38367, 93721, -156206, -74370, -104340, -45535, -323020, -352261, -129776, -6092, 17856, -81621, -235368, 74376, -197480, -71543, 115765, -30138, -100723, -16784, -75193, -65083, -80645]
3895h0645j46348j50504L41281j79768j18864K00728m836j19393J03657j36526
3885b91218J50979k55702J57538O9927r0006K14700J8530j75333O7778j09158
3875b41965L6688J13126N636j59113R2227J40454k84076L58048l70904K78366
3865c1513j87787k5370K93036j86123j77966K01864l10254L94720k36660J19440
3855a46613r0067l58676R5151L07446j03606K85339j14627P0380J37908k99942
3845b17307P6921j45562q1912m7152Q3875J40902Q8512j01341j56476J59515O3756
3834a36269K4001J80961p7887r1634n5391k04361R5848J36548l2333j8849j12023
3823b91389n107J06656j95760P0005M9391j45881K7747J07995J80323j04305p4394
$$ y = [-80645, -226993, -377497, -36216, -215984, -334848, -134120, -138956, -258349, -154692, -291218, -140239, -395941, -238403, -168476, -258482, -43782, -25252, -200585, -132807, -241965, -205277, -92151, -86515, -245628, -153401, -12947, -297023, 61025, -309879, -31513, -219300, -244670, 48366, -137757, -315723, -113859, -424113, -29393, -266053, -146613, -236680, -595356, -500205, -192759, -296365, -11026, -125653, -55273, 82635, -217307, -140386, -285948, -367860, -415012, -331137, -190235, -101723, -203064, -359540, -200025, -136269, -112268, 68693, -9194, -100828, -156219, -360580, -264732, -128184, -160517, -179366, -291389, -296496, -189840, -385600, -315595, -266204, -412085, -384338, -276343, -96020, -200325, -274719]
3812b74719O1345j39896J93826K3565r4749r3020m3817M7905P0248K79279j27322
3801i7355m6176m9147j06886j4915J93458k53349J07200J83799j13516J21188
3791g5699j78109q4528p6833N3037N00437k25724k43223P840O3986L036K04449
3780e1331N6239k82600M9320K1786j4181j0989k68780R8595K9303Q0228J13830
3769a78580K6289k6737m3499r6029J66836k16063O4607Q9084M0938N4201k14480
3758c33433J64707k16481J36776M2707j6416J09197k23605K42152L55529l12092
3748e0959k64078J36362l2573O8094p9764j51524K11346k52640N3502K98828m13455
3737d76861J83957J16817K2019l18488J77191N0684K27990l04473J9380J4507
$$ y = [-274719, -213374, -353270, -159444, -135879, -230628, -323648, -367465, -319560, -249312, 29967, -97355, -143531, -192678, -299564, -314479, -121021, -374370, -267170, -83371, -196887, -75699, -253808, -338336, -415169, -362132, 138305, -87419, -330642, -322802, -258816, -255780, -51331, 4908, -277692, -228372, -206586, -220767, -231756, -500536, -401941, -372638, -292410, -178580, -152291, -179028, -222527, -318556, -151720, -367783, -303176, -214092, -173154, -118953, -333433, -168726, -385207, -248431, -205724, -222140, -112943, -336548, -94396, 261133, -50959, -315037, -178675, -211248, -143154, -222918, -374442, -163096, -415736, -362234, -63406, -476861, -292904, -176087, -154068, -472556, -295365, -244681, -16691, -321164, -301784, -287277]
3727b87277K1509o3408K64103k27515j9369R7726j18084J04662j29014K03987
3717a52680K60343j56938o6521M1592j4603o6632j27932O084P8209P8971k12196
3706c32303J54934R2824r520M323j65993l7836J22361j83688K25057J1409p7193
3695a95625J37026j43339k16460K27931n7180M5289J5769o1810k2206J98127j80259
3684b52737J4970N1858j14608j08562j3616L67414k37361J09103l34819L09665
3674b08693r2395K56297j19523K8039j60941J18248J12532k13176j39321P8204
3664c40729m7268J70563O8650j19065L3160K8475M3088p9488p2486j58244J08116
3653c65228J8284J46037M8528l8639k52710K42057K27329n1235p6880j3344j53347
$$ y = [-287277, -265768, -329176, -65073, -292588, -311957, -214231, -332315, -227653, -356667, -152680, 107663, -49275, -115796, -74204, -88807, -155439, -283371, -277287, -199078, -120107, -332303, -177369, -84545, -94065, -89742, -255735, -293571, -171210, -354898, -129841, -118432, -195625, -58599, -201938, -418398, -190467, -247647, -202358, -186589, -248399, -270605, -72478, -252737, -237767, -185909, -300517, -409079, -422695, -55281, -292642, -183539, -518358, -208693, -301088, -44791, -164314, -136275, -297216, -178968, -66436, -279612, -418933, -340729, -387997, -217434, -148784, -267849, -234689, -206214, -163126, -242614, -315100, -473344, -365228, -346944, -200907, -152379, -191018, -443728, -201671, 25658, -25577, -102457, -115801, -269148]
3642b69148R9765j19558J13205J42572J68930k47061m750j40322O715j19954K50413
3631a19193L4262Q8302j68728N0596M5729k2769M7769j25309P5242j3165J9607
3620h7657P7952j48273O558L4317j34797K93021j79445n3404K00336j22857j89704
3609c03953K54151j73910J92707l38633R1046J396Q2226K58400k809j05073k34760
3598b79212J3383J10305n0125O0172o0032K42147n8926K1794M6668j53889j31281
3587b38996j0272J7641L1196N5323K04691j21034p1084K5742j61484j8807J97705
3576h9379K7262l0457j11137j9921J51540j28158M7902j40218J95263n3668M2961
3565a08010K22201j22914n6615r2585p2268Q3488k46033L35342K6244j03317O4316
$$ y = [-269148, -169383, -288941, -175736, -33164, 135766, -111295, -116045, -256367, -249652, -369606, -119193, -84931, 3371, -165357, -114761, -69032, -91801, -44032, -169341, -94099, -107264, -87657, -9705, -157978, -151420, -117103, -251900, 41121, -138324, -191728, 8608, -114249, -303953, -49802, -223712, -31005, -369638, -278592, -277196, -194970, 63430, 60621, -44452, -279212, -265829, -155524, -205649, -145477, -205509, 36638, -22288, -494, 46174, -107715, -238996, -249268, -231627, -200431, -145108, 59583, -61451, -132535, -106793, -268277, -287084, -89379, -62117, -92574, -203711, -223632, -72092, -200250, -152348, -292566, -97303, -150971, -108010, 114191, -8723, -65338, -157923, -230191, -146703, -392736, -57394, -31150, -134467, -70151]
3554g0151l5471k17302O594L7139J24307K1593K25129O236j72065j06473k5006
3543b05470J34933J15143j4381M6198K81471M4530J1362J0978j34513k26070M6873
3532A11054L0254r0798M5597j09612j13901J01977p7816n4049m4879P864Q6731
3521a07578K59578J85443k7158o4397j71236m9152J5423o6392p0806J94546J48590
3510B46861O6067M2158m26656J67865j17514J1256q8619N8175k0149J7895j29832
3499a72493K08019j10389M7743k7869J07746r475l10893K30816j3628j46396N5939
3488a40880J7935J13137n5013q7734J04254J10649o6657J56024m9160o3371K29189
3477B68373k35152k965R5707j07242j30631O172k3240J23362K992k55935J95152
$$ y = [-70151, -105622, -322924, -316330, -279191, -154884, -133291, 91838, 98074, -73991, -180464, -205470, -70537, 44606, 30225, 76423, 357894, 402424, 413786, 424764, 290251, 64181, 111054, 141308, 50510, 96107, -13505, -127406, -25429, -103245, -157294, -202173, -194309, -107578, 152000, 337443, 310285, 245888, 74652, 25500, 40923, -25469, -96275, 98271, 246861, 312928, 355086, -71570, 96295, -21219, -9963, -98582, -40407, -60556, -42661, -172493, 35526, -74863, -27120, -54989, 52757, 43282, -267611, -36795, -50423, -196819, -140880, -122945, -9808, -64821, -152555, -48301, 62348, -4309, 151715, 102555, 39184, 268373, 33221, 30256, 125963, 18721, -111910, -105738, -128978, -5616, -2624, -258559, -63407]
3466f3407J13547J22210k2026o3546q2929J4484j1851M4207l2209k0297M9745
3455D7928n0462o8894n2301L81260j71992N4664K03458q3524j51127L35634j50862
3444B93782Q8838o7664K14481K76419K79255j71442M00368P02338L57018M3969
3434B417362l96921m37451k29690o34997n6304J07486j78817j83768J89114j43535
3424D52479l2297m6112J287L4793K05782p5436j13047P4714L2353J81590R8709
3413H14815q3652R2131j55991M85040J73695L08769r0644l4533R2852K12521k2078
3402A792925N6079K08774J63141M33783P34901O11586J756858L406332N038824
3393A4203203M105824M943l393230l912030k927672k016601j808428j207573q82516
$$ y = [-63407, 50140, 172350, 150324, 86778, 3849, 18333, 6482, 50689, 18480, -1817, 47928, -2534, -71428, -123729, 257531, 85539, 140203, 343661, 260137, 109010, 444644, 293782, 382620, 314956, 529437, 805856, 1085111, 913669, 1314037, 2016375, 2373393, 2417362, 2020441, 1582990, 1353300, 718303, 661999, 769485, 590668, 406900, 596014, 452479, 420182, 374070, 375357, 410150, 615932, 540496, 427449, 502163, 534516, 716106, 814815, 731163, 823294, 667303, 1152343, 1326038, 1634807, 1544163, 1509630, 1602482, 1815003, 1792925, 1849004, 2057778, 2220919, 2654702, 3389603, 4001189, 5758047, 9164379, 14203203, 18309027, 18313970, 14920740, 11008710, 8081038, 6064437, 4256009, 3048436, 2165920]
3384B165920l26529j91398l70948j51048r1104j47692J94670r1004m8169k35935
3374G06763q4307j976K0655j48800R5918l61231R1733J9687p2019K5809p0648
3363B21584K5944P1238j63671j56086j8462K27658o0457l1920N3799o1883r9258
3352H486R2065l8013N8540L6559k3664p2983J59633j40228J12574O253L1215k07970
3340B2467J02687Q6576K43628J44802K97842J69550k05633l57228k52661j81037
3330G0993O9926j88632m8320P8731J09160k7777j70912j5600M3461j3711j11240
3319b03921K6285J02214k5560k2612K06977j18157L4980r0670j555N7287P3924
3308C9192j79812J23318m3369m6836L8349L825j23378J82983j39145J15866J1420
$$ y = [2165920, 1839391, 1647993, 1277045, 1125997, 1034893, 887201, 1081871, 990867, 942698, 706763, 622456, 620480, 641135, 492335, 588253, 227022, 318755, 338442, 266423, 292232, 221584, 247528, 318766, 155095, -991, -19453, 208205, 147748, 115828, 169627, 107744, 8486, 100551, 62538, 121078, 157637, 133973, 60990, 220623, 80395, 192969, 199222, 230437, 22467, 125154, 211730, 455358, 600160, 898002, 1067552, 861919, 504691, 252030, 70993, 140919, -47713, -96033, -17302, 91858, 64081, -106831, -122431, -78970, -92681, -203921, -177636, -75422, -100982, -123594, 83383, -34774, 206, -90464, -92019, -34732, 39192, -140620, -17302, -60671, -107507, -69158, -65333, -188711, -5728, -144873, -29007, -17587]
3297a7587L6241Q4413m06570J21960j7373J7881j28620J6364L18872l56046J98991
3286a31474M8324n8712R0118l7347o4249J1896j37096m6616K64632R3501q6152
3275e3175o572j6134l7614K00872j2140j32712j18856N0325q4011J93800J3952
3264b265m9780K5961j28065J42985j25187O5806l1179l8628m3554J25319k61276
3253c19863L6932K09792j03613N1233k5138j11448R7330Q9263j9168J16164k81662
3242b60178J54943j35882k27283K58771J215M2756k7049p84J01044j50520K040
3231b40927n3716K37505j19097R4632P3740j01650L535m6577j55054J96872o9178
3220a79915J27139J04612l19451j5000Q3401J02280j4816j0735k9650M3247j19775
$$ y = [-17587, 18654, 103067, -303503, -181543, -198916, -181035, -309655, -293291, 25581, -330465, -131474, -83150, -141862, -51744, -89091, -153340, -141444, -278540, -325156, -60524, 32977, -53175, -59747, -75881, -113495, 87377, 75237, -57475, -176331, -126006, -210017, -16217, -2265, -52045, -26084, -154149, -11164, -136351, -70545, -101724, -140352, -183906, -58587, -319863, -282931, -73139, -176752, -125519, -150657, -262105, -164775, -75512, -94680, 21484, -260178, -105235, -241117, -468400, -209629, -208414, -165658, -192707, -193491, -92447, -242967, -240927, -294643, -57138, -176235, -81603, -7863, -109513, -105978, -152555, -307609, -110737, -179915, -52776, 51836, -267615, -282615, -199214, -96934, -111750, -122485, -152135, -108888, -228663]
3209b28663J17587J32111j97010J05858p3879O0556j85255j13095J01708j70054
3199d50136K26681k37431K52293K997j81594K09279J78277r7007m7942k01033
3189c45616J36104J86836m1430j06036j88450K59225k06181K69029l98538K24276
3179b10781N8772k9988J95265q454k24088K9778m8241l3552Q5783r4251j62937
3168d42694K56162r6135O4599J81995K7431J3834k26008j1476J12371r668N1452
3157g8137j72715K19508j44053M7017M4939k65449P4388J72451M5922j83798p3448
3146c13375J70500N7904j0556j79606K4886K6913J02456k13716K29197P0859j79157
3135b13695Q5358j74613L29861m1469k42239P1860j79734K71144q3666m7110o5671
$$ y = [-228663, -111076, 21035, -175975, -70117, -143996, -83440, -268695, -381790, -280082, -450136, -223455, -460886, -208593, -205596, -387190, -177911, 366, -96641, -144583, -345616, -209512, -22676, -64106, -170142, -358592, -99367, -305548, -36519, -435057, -210781, -152009, -181997, 13268, 4814, -219274, -189496, -237737, -271289, -185506, -279757, -442694, -186532, -282667, -218068, -36073, -8642, 5192, -220816, -232292, -119921, -129589, -78137, -250852, -31344, -175397, -128380, -83441, -348890, -274502, -102051, -56129, -239927, -313375, -142875, -84971, -95527, -275133, -250247, -223334, -120878, -334594, -105397, -34538, -213695, -128337, -302950, 26911, -14558, -256797, -184937, -364671, -93527, -177193, -224303, -289974]
3124b89974K16765p4038J32786J38781l64879j71277K10539j14616M0903K58753
3114a6257j82426J10069j96001m1207K65403j51770M3713k36482K9111Q6994K9150
3103b59703J07017k496N2460M7838l59723J30551K02639k638O9946p8571j34155
3092b26835J46538j19941J50553k3416j12550J85927k62140N4137j32653K08206
3082a32174k28758K56487r1279K0998j85472o4376J17142J12527j41020J87101
3072a48824j67903J67884J16829j55324J11005o345n3836l1120p3511Q4812K55977
3061I9644m09618J39724p7056n1727M9925J03696l4397k23381K31769q775j2183
3050a92379R2948j87198Q4467p8309J5758n9198L7923o7124J17356J58513o5680
$$ y = [-289974, -73209, -147247, -14461, 124320, -240559, -411836, -201297, -315913, -275010, -16257, -198683, -88614, -284615, -325822, -60419, -212189, -168476, -404958, -375847, -288853, -259703, -152686, -155182, -102722, -54884, -414607, -284056, -81417, -84055, -14109, -92680, -226835, -80297, -200238, -49685, -73101, -185651, 276, -261864, -207727, -340380, -132174, -360932, -104445, -195724, -174726, -360198, -424574, -307432, -194905, -335925, -148824, -316727, -148843, -32014, -187338, -76333, -82678, -136514, -167634, -241145, -156333, 99644, -309974, -170250, -247306, -299033, -249108, -145412, -179809, -403190, -171421, -180196, -192379, -99431, -286629, -202162, -280471, -264713, -323911, -285988, -353112, -235756, -77243, -142923]
3039a42923j4883j19488o5588J34693J55568j01968J74506k56800Q3202M4388
3029a09293l64379J41213J98188R0917j02577j96628J60002p4122R4517l9909
3019b02071Q9197j26874M3689K56466j96183j55647k447J62404q4750J5796L5169
3008a65251N6387r9823k1687j07804N2538K74622k74454P7224J20091m4045J46484
2997A4282P637n8494j17721j07125J12972k3394J34511j74665P391j02932M2031
2986b65507J79938P4095o3991q2895m5590p6515N1559J26391k71860J08732J46098
2975a19545m4120j22500J33337K4365k59159J72851J42924j18800j31923O9370
2965b53200J70315P141j61708K0175m2346J05070k12846J49549l1649K62866l3746
$$ y = [-142923, -157806, -277294, -342882, -208189, -52621, -154589, 19917, -236883, -153681, -109293, -473672, -332459, -134271, -43354, -145931, -342559, -182557, -256679, -162162, -202071, -112874, -239748, -196059, 60407, -135776, -291423, -293870, -131466, -216216, -200420, -165251, -108864, -208687, -230374, -338178, -285640, -11018, -285472, -208248, -88157, -132202, 14282, 21919, -36575, -154296, -261421, -148449, -171843, -37332, -211997, -204606, -307538, -265507, -85569, -11474, -75465, -158360, -203950, -280465, -228906, -102515, -374375, -265643, -119545, -163665, -286165, -152828, -128463, -387622, -214771, -71847, -190647, -322570, -253200, -82885, -75744, -237452, -217277, -259623, -154553, -367399, -217850, -249499, 13367, -20379]
2954b0379n4068O9160j23834J61793r4910j79095J53169k86633R1635j2744L66845
2943G0939n0136j88856K1380J42350l72254L176j387L31231K4127l040l56679
2932c79149L21603o8337M086M9197k06705j42596J76859j46231M44812j29449
2922g5910o243l21241J20701n2988J66986j61745L53195j44614N9048k44937R8812
2911b08936j0803n1010P460l312J76282M9684k14757J22086j03767k222k39390
2900d78685K09165Q7209o7902M3152J06581J22404J42064k96221j93485J64371
2890a61347J13046k00196K39129J2058k3457k84283K32954L8987j06942o1765
2880b01816M7786j42236K16318L1163l00184j5421L9623K01260P4105m6770J01772
$$ y = [-20379, -74447, -5287, -129121, 32672, -62238, -241333, -88164, -374797, -283162, -295906, 70939, 20803, -168053, -146673, -4323, -376577, -373401, -374788, -43557, -19430, -22470, -379149, -57546, -125883, -121797, -72600, -279305, -421901, -245042, -391273, 53539, -75910, -82153, -403394, -282693, -335681, -168695, -330440, 22755, -121859, -62811, -307748, -208936, -219739, -270749, -263289, -266601, -90319, -40635, -255392, -133306, -237073, -239295, -478685, -269520, -182311, -250213, -207061, -100480, 21924, 163988, -132233, -325718, -161347, -48301, -248497, -9368, 2690, -20767, -305050, -72096, -33109, -140051, -201816, -154030, -296266, -79948, -48785, -348969, -364390, -324767, -123507, -49402, -96172, 5600]
2869E600l33725p9800m8651K28120k694k4004K68200k23839J0377l0423P0553
2858a60286j78158J35077N4040m2232q3842J80958J72730j61540j18722k30697
2848d32672K12702j2517J84390p5332j91114j5076K56112j83306J83845j69630
2838b42598m8215o0484J001K97488j66399j17542J94411J17908j89467R4975j62801
2827b81723k82131M90175j23759J39046J51040j82649n9611j86922N5575J38593
2817a42366r577n4080K71865n02338K01687K51786p6635m2133k57779J64249Q4994
2806a10327l33696K78722J89544r4661o6879K0432j95881O4856R2686K66348l07097
2795a95953j77901J97970l3046K5525m1031k3523k3376P1787O8361O5884j20615
$$ y = [5600, -328125, -407925, -456576, -228456, -231150, -255154, 13046, -210793, -200416, -230839, -160286, -338444, -203367, -149327, -191559, -275401, -94443, 78287, -83253, -201975, -432672, -219970, -232487, -48097, -123429, -314543, -329619, -73507, -256813, -72968, -242598, -290813, -351297, -350296, -52808, -219207, -336749, -142338, -24430, -213897, -118922, -281723, -563854, -73679, -197438, -58392, 92648, -90001, -149612, -336534, -280959, -142366, -151943, -206023, 65842, -436496, -234809, 16977, -59658, -101791, -359570, -195321, -110327, -444023, -165301, 24243, -70418, -137297, -116865, -312746, -247890, -155204, 111144, -195953, -373854, -175884, -208930, -183405, -224436, -247959, -271335, -199548, -131187, -65303, -185918]
2784a85918K01333m4540k29860R7772j8214k0713q8547J75888j03030J16294j1201
2773a10736r5226P6433K0221K9302o6384j46396O4741N9272q2831N7686J40912
2762e3006r9906r3087m743n7936L07856j0208k6979l41767K15239l3248J13387
2751h4398k90645P9270J33594K6953j18112n0139j52996J76515K00761q4975O1297
2740a02875k01999K76044O4069k93395o9853J16158J1621M760M1191j25622K6797
2729b53104R0421l04780K40405K5604j73334J76756K12310j05498p938j16792
2719b15950j3633P308K8337J91267k2581k64696J64431j08882p5684J65172j38126
2708b83037o7536M6586J38984r0557J96249l86870J62901N5389K6795j08203J45501
$$ y = [-185918, 15415, -29125, -258985, -161213, -179427, -200140, -288687, -112799, -215829, -99535, -110736, -205962, -129529, -109308, -80006, -146390, -292786, -228045, -168773, -251604, -193918, -53006, -152912, -245999, -250742, -308678, -822, -11030, -38009, -379776, -164537, -197785, -84398, -375043, -295773, -162179, -135226, -253338, -303477, -456473, -279958, -79197, -164172, -102875, -304874, -28830, 35239, -258156, -328009, -211851, -200230, -195470, -154279, -279901, -253104, -162683, -467463, -227058, -201454, -374788, -198032, 14278, -91220, -99158, -215950, -229583, -222275, -193938, -2671, -25252, -289948, -125517, -234399, -310083, -144911, -283037, -350573, -303987, -165003, -255560, -59311, -446181, -283280, -227891, -201096, -309299, -163798]
2697a63798n8101J73644k88526J48093J58176j99201j5065K41183P403j51935
2687a48127p493l7129Q7363j52851K47297j11154j22331R4102P0020n6442M4712
2676i2033k70402L40736j35350k37012J59474l1244j4048K2834K34527l57051
2666c79569J78975O395q0408N2687l4990L4137j67090j43538L16854J01780m7293
2655a62060P9677j66686j14585J29518p3323N2619O7075k36069L91595Q6968k9559
2644B5170k36005O5196j8361o8208o3321J3810J76302k42680j33540M02826J30443
2633E1632k06907l85440K57937L2090K38449k56119l1587J64625J23351j1157
2623b3126J0015j76285n5017k6987j75248J98466N1640o4371J52418J9687L8089
$$ y = [-163798, -221899, -48255, -336781, -188688, -30512, -229713, -244778, -3595, 3808, -148127, -155620, -192749, -105386, -258237, -10940, -122094, -244425, -150323, -80303, -136745, -92033, -362435, -21699, -157049, -394061, -234587, -265831, -279879, -257045, -22518, -379569, -200594, -194199, -274607, -221920, -256910, -222773, -389863, -533401, -216547, -114767, -162060, -82383, -249069, -363654, -234136, -307459, -254840, -187765, -423834, -32239, 54729, 25170, -210835, -145639, -164000, -232208, -295529, -281719, -105417, -348097, -481637, -78811, 51632, -155275, -540715, -282778, -250688, -12239, -268358, -299945, -135320, -11969, -23126, -13111, -189396, -244413, -271400, -446648, -248182, -196542, -260913, -108495, -88808, -50719]
2612e0719k45350O2426J23326k90446K79322j2795J8302N6184l09621N869J54614
2601b08888q049L17802l57304J01542r6674J12012l4459L178L3587M7670r1107
2590a80690m7739L1067q2684q6404J76237J14431o937M3345J0962j27208q0444
2579b36064j04127J23379K43273j29507J89822k70526L3469M5123M1110j56000
2569b20048K9190j08954K34355j3291j37085j05825J87980l18812J71653J00132
2559a80705j314J85267k51501p3913K07816j36052j40078P3682R9738m3050O414
2548b53696J48629J15332K4936j41325j01838r1210J26810R3857p8895k0424J64361
2537a3463p6156J0200q8067j82283J60227N7051j46129J33831J60646K7178Q786
$$ y = [-50719, -296069, -233643, -110317, -400763, -121441, -134236, -115934, -59750, -369371, -363502, -208888, -216937, 100865, -256439, -154897, -251571, -139559, -174018, -170840, -137253, -89583, -180690, -228429, -197362, -280046, -366450, -190213, -75782, -82719, -39374, -28412, -155620, -236064, -340191, -216812, 26461, -103046, 86776, -183750, -150281, -105158, -64048, -220048, -190858, -299812, -65457, -78748, -215833, -321658, -133678, -452490, -280837, -180705, -182019, 3248, -248253, -322166, -114350, -250402, -390480, -316798, -217060, -260110, -253696, -105067, 10265, 35201, -106124, -207962, -299172, -172362, -78505, -157400, -177824, -13463, -89619, -79419, -167486, -349769, -189542, -132491, -278620, -144789, 15857, 43035, 51821]
2526E1821j81712n2492k6138m1041J12736n3196O5692j33650p1478J55228K1093
2515a53137n7075O7983r7943P3469k8597K8663J96635Q67l06516J51116j97069
2504c21604J11439J15694p4224r6961J84259r6762J44164q5539j08581r050j42195
2493c79360L3633K57829p4163J6970L8761O0285l2649j78558q3646K97880l16912
2482c59930R0781J43649n9419n9848n4628K02870k17764R0262J86620j46114o0814
2471b44335J97668J23212j30525l25297j35470L85794m4571j38457J52202n1965
2461b11744k1787l5155J89458l6693j28092j61325K33827Q4461k75150P5492L4253
2450b52455P1639K76669j49642j64472j3276p3051K81141j8550l75843L72090
$$ y = [51821, -129891, -182383, -208521, -249562, -136826, -190022, -124330, -257980, -329458, -174230, -153137, -210212, -142229, -240172, -166703, -195300, -166637, 29998, 30865, -275651, -124535, -321604, -210165, -94471, -168695, -265656, -81397, -178159, -33995, -119534, -228115, -237165, -379360, -345727, -87898, -162061, -145091, -106330, -46045, -78694, -257252, -340898, -43018, -359930, -269149, -125500, -184919, -244767, -299395, -96525, -314289, -224027, -37407, -183521, -244335, -46667, 76545, -53980, -379277, -514747, -128953, -173524, -311981, -159779, -211744, -233531, -268686, -79228, -115921, -244013, -405338, -171511, -87050, -362200, -286708, -252455, -180816, 95853, -53789, -218261, -231537, -304588, -23447, -41997, -417840, -45750]
2440d5750J06519l60778J47143j12395K37587k10378k8630J23140J96647k49392
2430a96287Q6432K46232l80586Q9265N0317N686K39238l17335K6851n9569P4499
2419a35257J14472l66169J21178Q9575M0428j02603K12395j07895p8862l4441
2409b47179O5155K8301K7590k12644K64590j71083j2268N369L2132j5444J57401
2398g8080p8394R3848J25450j24005l0983N5372j78329L70758j35119j85117M4322
2387a20277j02883J6080K3903L8717j25915N9100N1173P1574j03657k04741J93862
2376b03064j57834m1021J60001j40458K22440j51910k17680N03877k07976k9398
2366b63023p126J80943r0311N5659K9411L7036L3507j62561K3169N3543j58613
$$ y = [-45750, 60769, -300009, -152866, -265261, -27674, -238052, -266682, -143542, 53105, -196287, -109855, 136377, -244209, -154944, -104627, -98941, 140297, -177038, -150187, -209756, -135257, -20785, -386954, -265776, -176201, -135773, -238376, -25981, -133876, -212738, -247179, -182024, -153723, -126133, -338777, -74187, -245270, -257538, -252169, -220037, -235481, -78080, -156474, -62626, 62824, -61181, -92164, -36792, -215121, 155637, 20518, -164599, -120277, -223160, -207080, -183177, -144460, -270375, -211275, -160102, -88528, -192185, -396926, -203064, -360898, -401919, -241918, -382376, -159936, -311846, -529526, -25649, -233625, -263023, -270149, -89206, -179517, -123858, -94447, -57411, -23904, -186465, -163296, -109753, -268366]
2355b68366J28551N0368J43489n5245R1289k21030j79762N3708J07294J06613
2345d3091j770n041M1908j87559M4679q100p4301n275l666R4604n6791Q339l7919
2332b33983j32770j13069J99138j931K83982l34393P0260J08781K37347j07126
2322b3764j57365r5546K50317j08234K7091N1206L823Q1363j57559J3763j16279
2311b31184r9912J89824j47464R9135N1679j18393J01627J04365p0839j89251
2301c10413L18002k26766m0519O9350P2524J65104k75080j4777j36496J45888
2291b33183K68659j65572P5937l34591J14153Q9998O7795P119J03064k53283J39564
2280a20340J13109j78805K9823N6186n3270r2733k5675J96653O6076o2514r3914
$$ y = [-268366, -139815, -89447, 54042, -1203, 90086, -130944, -310706, -256998, -149704, -43091, -44861, -49902, -7994, -195553, -150874, -158974, -233275, -238550, -242216, -147612, -204403, -196064, -233983, -366753, -479822, -280684, -282615, 1367, -333026, -262766, -153985, 83362, -23764, -181129, -276675, -26358, -134592, -107501, -56295, -52472, 28891, -128668, -114905, -231184, -331096, -141272, -288736, -189601, -137922, -256315, -154688, -50323, -121162, -310413, 7589, -219177, -259696, -190346, -117822, 47282, -227798, -242575, -379071, -233183, 35476, -130096, -54159, -388750, -274597, -184599, -116804, -109685, -6621, -259904, -120340, -7231, -186036, -156213, -100027, -153297, -246030, -271705, -75052, -8976, -71490, -165404]
2269a65404N344M9832n4646N0585o3150J51229l8119o2628L796N4738j46867J3199
2257b02091K9528j87557Q7354O9445K62789j77419J02291o235j28449j7693q7697
2246b55734J89497K0868J56659m26680J08246K9565j30918K11767L1868n1730
2236a16592k8874R0885k07131K11473J0535k49181J67307j33230J30638P6282
2226d7888o0187O8953k49237j6065R3264o5477j9276N4192J7550N4906J94482
2215B5217n1763p3794m1226j73361L25804K7906j08726j83002p1016K37710k02083
2204b88334Q5306j94722L6121J50370j82310K61577k94550K09480R0402j73028
2194b99688K04805m7942j28037L2335l955n696J25914P0231j88079J99418n8735
$$ y = [-165404, -160060, -110228, -164874, -114289, -177439, -26210, -64329, -126957, -123161, -68423, -215290, -202091, -172563, -360120, -272766, -203321, 59468, -117951, -15660, -21895, -150344, -168037, -255734, -66237, -45369, 111290, -315390, -207144, -177579, -308497, -96730, -64862, -116592, -145466, -54581, -261712, -50239, -39704, -288885, -121578, -254808, -124170, -47888, -108075, -39122, -288359, -304424, -211160, -276637, -295913, -241721, -224171, -169265, 25217, -26546, -100340, -141566, -314927, 10877, 38783, -69943, -252945, -323961, -86251, -288334, -203028, -397750, -361629, -211259, -393569, -131992, -426542, -217062, -126660, -299688, -94883, -142825, -270862, -238527, -242482, -248178, -122264, -52033, -240112, -40694, -99429]
2183i9429R5201J27071L1191m60732L04613j11844K04946M8560j75550j07041
2173a43014P7632k68613K78224j95440K20705k6957J0652p7135j52651q1588K65952
2162i2233j91461K52663o7469R3087j05438j34871j14373J65017m7821J30417
2152a12482J8881J11168p5084k05868j831J48023m9714q0056j1118P5701k25178
2141d07558L10417L6919j77058j28022N9129P5610J25217p6782N7413l8485j1818
2130a75018p0158J87380K7079l88244N8033L25678p6869j92444K26885q202q8264
2119a74144k08053M6884L03759l42982K72372j33511N0510k04703O0236K89232
2109d0400j59025j22105J76606r5784L69276k43223j64514j11572P6330R4491
$$ y = [-99429, -4228, 122843, 154034, -306698, -2085, -113929, 91017, 139577, -35973, -143014, -65382, -333995, -55771, -251211, -30506, -57463, -46811, -123946, -276597, -358185, -92233, -283694, -31031, -98500, -5413, -110851, -245722, -360095, -195078, -242899, -112482, -93601, 17567, -57517, -263385, -265216, -117193, -166907, -246963, -258081, -182380, -407558, -97141, -60222, -237280, -365302, -306173, -230563, -105346, -182128, -124715, -163200, -175018, -245176, -57796, -30717, -418961, -360928, -35250, -112119, -304563, -77678, -85880, -174144, -382197, -335313, -31554, -374536, -102164, -235675, -185165, -389868, -329632, -40400, -199425, -321530, -144924, -240708, 128568, -114655, -279169, -390741, -314411, -219920]
2099b19920R7105j6165j2808j71552Q8103j16494R0650m3820K61156M7648J7635
2088B1538j81086p5012m1754p354J46656j82699M97760l70799L81796l24089j75176
2077c10219J49380j23516m7886K25800j2367K41952k73734L15767j64752l08022
2067c07597j31684P4369l9138K59903j0157O1738n5090j2968k09601J58282L2400
2056a79543O8282o2255K1162n8132K259O0505p447m7935l2251J47253J50082n5265
2044F715k41084j18702J24928j3086R1444K19430j99212j01299m7235J76730J17422
2033A6051n5550j4693o0942o9429j89157J32341J34549k6485j22660J52156j72115
2022b75934L03059k99936J37974r2174J53735j7638J47309k88400N8145N4680
$$ y = [-219920, -122815, -138980, -151788, -323340, -235237, -351731, -261081, -304901, -43745, 3903, 21538, -159548, -234560, -276314, -283668, -137012, -319711, 178049, -192750, 189046, -135043, -310219, -160839, -284355, -332241, -106441, -118808, 123144, -150590, 165177, 425, -307597, -439281, -364912, -404050, -144147, -154304, -92566, -147656, -160624, -370225, -211943, -179543, -111261, -173516, -152354, -210486, -208227, -147722, -155169, -203104, -235355, -88102, 61980, 6715, -234369, -353071, -228143, -241229, -149785, 69645, -129567, -230866, -278101, -101371, 16051, -39499, -54192, -115134, -184563, -373720, -241379, -106830, -133315, -255975, -103819, -275934, 27125, -272811, -134837, -227011, -73276, -90914, 56395, -232005, -173860, -119180]
2012a19180o181j31669j19569K84579j50638J96493j14088k70263K05899l7647
2002b62264M380q574K43872k17142P1735O4103J11122o6271q2991p4311J16860
1991i9481j12090K3357Q9840N6588k78736m729K00737J69027m6020r9280J36362
1980C5575j59318k8736j8485l0809o5408L8045J25441j5028j78406K32342j09954
1969a74741J55339r4876k6025o2849J36668k16753Q3474N8337P9450m1115k29133
1958c32224J57102m0877J11036n2267J53738j0624k8475R011q0609K20146k69483
1947a63526K85899j81086P7029l00611K99081k09682K68946j82214k15622Q81
1937c20905K6628K9611J88152k57849J69933m07743L97663r9267J20862r1944
$$ y = [-119180, -125361, -257030, -376599, -92020, -242658, -46165, -160253, -430516, -224617, -262264, -257884, -266458, -22586, -239728, -167993, -103890, 7232, -59039, -142030, -216341, -99481, -211571, -188214, -98374, -41786, -320522, -325251, -124514, 44513, -1507, -100787, 35575, -123743, -152479, -170964, -201773, -267181, -229136, -103695, -118723, -297129, -64787, -174741, -19402, -114278, -140303, -203152, -66484, -283237, -199763, -141426, -61976, -103091, -332224, -175122, -215999, -104963, -157230, -3492, -14116, -42591, -33580, -114189, 105957, -163526, 122373, -58713, 18316, -282295, 16786, -192896, 76050, -106164, -321786, -320905, -294277, -264666, -76514, -334363, -164430, -572173, -174510, -273777, -152915, -244859]
1927b44859J09802L6789J29642k02221J45286j07137J848P124J76861r4635k10148
1916b51648n3682J91665l2625Q8646M1855k7419k80117J38504r2935K95053K4203
1905D1500K5881j06372k51720O9849j30103J20566K5745J6133j10466p980l7059
1894c44026J06014L0774j82415L15993q878p6173J39525k0838p739r6835M8887
1883i5711l924k5542k5985Q8810j21574j0341n3774P4443n2708J49281k08932
1872b85957p7222R2019M9768K3012o4316P9153k27715K60766K0484l3701m5995
1861b09704J54175J15450j64246J00588J5291O9469l73342N0386J73957j95593
1851b63569o4928p2831K92609J0353k9068N9791p539k40768J77816o0927j05047
$$ y = [-244859, -135057, -98268, 31374, -170847, -25561, -132698, -130850, -123726, 53135, -41500, -251648, -305330, -113665, -146290, -57644, -15789, -43208, -323325, -184821, -277756, 17297, 41500, 67381, -38991, -290711, -220862, -350965, -230399, -204654, -188521, -298987, -306967, -344026, -238012, -207238, -389653, -73660, -82538, -158711, -19186, -40024, -47763, -144598, -95711, -99635, -125177, -151162, -62352, -183926, -194267, -248041, -173598, -226306, -77025, -285957, -363179, -271160, -221392, -198380, -262696, -183543, -411258, -150492, -130008, -163709, -209704, -55529, 59921, -104325, -3737, 11554, 81023, -292319, -241933, -67976, -263569, -328497, -401328, -108719, -98366, -127434, -67643, -75182, -315950, -138134, -199061, -304108]
1840c04108j48948K73127j21341J51384q1762J76789j74470n4687J75758J25256
1830A6998j99810j56813J63929J34206k7282K5629k02031J47557M5595J45000
1820I2978k49310O0466k45017K8661n201N2437L44122l15538R7830K78276k26387
1809h6683l00741P7336J69950r2671k9937o5016K15309j28j25253K01226P7521
1798D0913o8718k35498J77756j63990J99658l57031J32360J33750j35377O9688
1788b06489j02609L07631J3772k02309j89032R6944K03902j11307l5990K4670
1778b00817m839K21472r8960m0084R9020r7148j12465k330o4799R0670M5025K2112
1766a43143m7415L62J84409k59341o6305K13303K8408P8868m1747P9433L4815
$$ y = [-304108, -453056, -179929, -301270, -149886, -231648, -54859, -229329, -284016, -108258, 16998, -182812, -339625, -175696, -41490, -68772, -43143, -245174, -97617, -52022, 92978, -156332, -95866, -340883, -312222, -317423, -264986, 79136, -236402, -138572, 139704, -86683, -387424, -310088, -140138, -232809, -262746, -327762, -112453, -112581, -237834, -36608, 40913, -27805, -263303, -85547, -249537, -49879, -406910, -274550, -140800, -276177, -206489, -309098, -1467, 12305, -190004, -379036, -282092, -78190, -189497, -225487, -200817, -205656, 15816, -83144, -123228, -24208, -121356, -233821, -236151, -300950, -210280, -165255, -143143, -190558, -190196, -5787, -265128, -331433, -118130, -89722, -10854, -52601, 26832, 61647]
1755F1647k79964K7064L89737k65732j49482R8855q7294K14710j06376K0434j68469
1744b44870J75758j08488K07509J43704m81644J3342k1423J72170k4330j47832
1734c16104Q0263q2301J86769J4096J28757p5724k63355P2623k249J7819M0725
1723a98681J35061k06766L40623j23542k25998J58932l80918J75302J21788N2485
1713a51714J43484j65764J38428j05426j8626j29290p1940K86667k34648L49385
1703D0556J16895q0242l19478r9690L7292J43696n8644K05275j17877O3911P3485
1692E179L5608j97256R7528j20632K8033Q3465j28568J71140p8464J64602k25132
1681a64497M0124j08371Q2823J31266O724l09730k1890j07679M02294J2526J97121
$$ y = [61647, -218317, -191253, 198484, -67248, -216730, -117875, -205169, 9541, -96835, -76401, -244870, -69112, -177600, 29909, 173613, -308031, -294689, -316112, -143942, -168272, -316104, -235841, -318142, -131373, -117277, 11480, -64244, -327599, -254976, -257225, -239406, -198681, -63620, -270386, 70237, -53305, -279303, -120371, -501289, -325987, -204199, -151714, -8230, -173994, -35566, -140992, -159618, -288908, -360848, -74181, -308829, 40556, 157451, 77209, -242269, -341959, -304667, -160971, -219615, -14340, -132217, -68306, 5179, 40787, -156469, -58941, -179573, -151540, -68075, -196643, -25503, -103967, 60635, -164497, -124373, -232744, -149921, -18655, -11931, -321661, -343551, -451230, -48936, -36410, 160711]
1670A60711k58075n6585m7846l4714N1272j0120R2074P282j57397M8790K0470
1659a84138J89255q0261k79299J59059r5610K09674j8895O1483m6606o7Q927J2855
1647f3623k52512n8547L68360r7725J1656O2263l59731J64924j16020L20459L2366
1636A1870k38996M4331Q8331k31287M0572K10292J00574q2166r0780j23057J41953
1625a28363l50374L32723J77696n7795n7588r4761o9709J90495j8931N0360j13781
1614a40028K37140k72805P5166N7331k29170P7399q1678L3059J83355M3646J09300
1603I2715j10108k07297j06131m3881J9687Q3097J75024o5863j9710l6347N3J7399
1591b01362N893r752J39345j40154p3722R6901K9976M906R836m1929m0429L7773
$$ y = [160711, -97364, -153949, -201795, -236509, -185237, -195357, -103283, -96001, -253398, -204608, -184138, 5117, -75144, -354443, -195384, -290994, -81320, -100215, -38732, -85338, -85405, -76478, -63623, -316135, -374682, -6322, -104047, -92391, -30128, -389859, -224935, -340955, -20496, 11870, -227126, -182795, -94464, -325751, -285179, -74887, 25687, -56479, -147259, -270316, -128363, -478737, -146014, 31682, -26113, -83701, -178462, -248171, -57676, -76607, -26247, -140028, 97112, -175693, -100527, -43196, -272366, -194967, -276645, -243586, -60231, -16585, 92715, -17393, -224690, -330821, -374702, -355015, -271918, -96894, -162757, -182467, -218814, -218761, -201362, -195469, -205221, -65876, -206030, -279752, -182851, -152875, -147969, -138133, -180062, -220491, -182718]
1579a82718m0944P0190J84751m9939M5247r2560p9607m5866K4091J3149R457j08803
1567b53552L891J91036j67662J75146j90685j1510Q3827j18502N9888L03178k36692
1556a61637K02729r7236j14953N4905J909k0232n271k25623M00221k59598K53466
1545B8680l04145J71205j40293Q6731j4090J3623M1544K7237k98380J03499m5136
1534c29525M7431J7890P90k0158L6160L35424j05850L5017j32942l3126k36797
1523c85686O7329K2763J6300J87029M2478j94465O9109M9301j595M944N1821l14938
1511c85610L12520k17411L1923M3429M3308J20505j00022l04820K46128L6521
1501a73529k2883J61902M5316j57417j75537R1217j34217L96492m51321K16059
$$ y = [-182718, -223662, -153472, 31279, -18660, 26587, -65973, -145580, -191446, -167355, -154206, -144749, -253552, -249661, -58625, -226287, -51141, -241826, -253336, -169509, -288011, -228123, 75055, -161637, 41092, -56144, -171097, -116192, -114283, -134515, -139786, -365409, 34812, -224786, 28680, -275465, -104260, -244553, -157822, -171912, -158289, -116745, -89508, -387888, -284389, -329525, -282094, -264204, -263414, -283572, -247412, 88012, -17838, 17179, -115763, -148889, -385686, -318357, -295594, -279294, -92265, -49787, -244252, -175143, -125842, -127437, -122493, -70672, -385610, -73090, -290501, -258578, -215149, -171841, -51336, -151358, -456178, -210050, -173529, -196412, -34510, 10806, -146611, -322148, -230931, -365148, 31344, -419977, -203918]
1491b03918J99844j02244p2272L2838l37730L00342j70436L23318n0953L1980
1481d9231J17173P8608n0931k28898k33820J81605p1793M6769l5853J83335j83491
1470b46527K27779o9604l076n5882O648j58297p054r374N2072J43530l9879R4198
1458f5466J10356j74034J9390j81829r037J91384j2888O2694J10606j17442k60031
1447c26297Q88J02156Q529Q408J36942j24229j09560J50576n7314r945P0454j09084
1435b58476K16833j11969J73172q7289j19756o551J04341K76059j97116j81499
1425a92251p5779p9014K51229o971o2647l4904J26228J51619m3203k46538O7610
1414a44621k28946K27132P2845J11593p0949j32933J1507L3870j69122K82131
$$ y = [-203918, -4074, -106318, -178590, -145752, -483482, -183140, -353576, -30258, -81211, -49231, 67942, 146550, 95619, -133279, -367099, -185494, -257287, -210518, -246371, -63036, -246527, -18748, -88352, -91428, -147310, -140662, -298959, -306013, -315387, -263315, -119785, -159664, -65466, 44890, -129144, -109754, -291583, -300620, -109236, -122124, -59430, 51176, -66266, -326297, -325409, -223253, -214724, -206316, -69374, -193603, -303163, -152587, -209901, -219846, -149392, -258476, -41643, -153612, 19560, -67729, -187485, -194036, -89695, 186364, -10752, -192251, -268030, -347044, -95815, -102786, -165433, -200337, -74109, 77510, 34307, -212231, -144621, -373567, -146435, -73590, 38003, -32946, -165879, -154372, -120502, -289624, -7493]
1404g493J1590k19573q6968Q7618m9230J41767k19613K70680p8786m5042k38585
1393d33635J04269K05281N5718J14078k80313J40104q009P2457L4140k35057J22626
1382a08341K9727j46798Q8604q794J0053m9676Q82M7555K96440o6112m17284R4082
1370b29662L6165J84583n1126J4907j19756j81221K55152o0067j18129Q3967j87453
1359c72640k5504L8966N5780K36275n2656k11306K67085q6782n9734m7717p7319
1348c35552J67475J5754r6131J28459M7276j3484j79619O0715j30499O6617m2192
1337c11181K61437N8388j98175K8830J94360j38302q5766J05460j29236K4556
1327a89629P9071J20674j47703J13328j02417n1425K55735r813k44601r2698L084
$$ y = [-7493, 4097, -215476, -302444, -214826, -264056, -122289, -341902, -71222, -150008, -195050, -433635, -329366, -124085, -68367, 45711, -234602, -94498, -102507, -30050, 4090, -230967, -108341, -78614, -225412, -136808, -145602, -135549, -185225, -184343, -136788, 159652, 93540, -323744, -229662, -193497, -8914, -60040, -45133, -164889, -346110, -90958, -151025, -269154, -185187, -372640, -398144, -359178, -303398, -67123, -119779, -331085, -64000, -150782, -210516, -258233, -335552, -168077, -152323, -248454, -119995, -72719, -86203, -265822, -205107, -335606, -268989, -311181, -49744, 8644, -189531, -160701, 33659, -104643, -190409, -84949, -214185, -189629, -110558, 10116, -137587, -24259, -126676, -178101, 77634, 67821, -176780, -269478, -266394]
1316b66394J37298M4288k76635P5274K58834r2543J08330j44330j12695k3639
1306b92212J54558j18090k0470K13255j97393J79722Q8444K5464o6664m36498
1296d69884J56382K27401r1927J42322n971j01015j11852K71671m76100L99362
1286e9611j12799j69552L9022K37087j04474M1769J0177l4469j24209K15722m1333
1275a02670K48562k35570J15635p0407j9858j61966J626K79076p2816j35917N6213
1264i8092l7145j3489p5911j39330L4958K16363q5070L8948M8418J21412l0331
1253a9269k52045M6961j61211M7454L13914j54279j13169R9173j6575J79186l69103
1242c98963Q4616K51791L5917k7813k02862O1915p5298P0722j8453J02774n3764
$$ y = [-266394, -129096, -84808, -361443, -286169, -27335, -119878, -11548, -155878, -268573, -292212, -137654, -255744, -276214, -62959, -260352, -80630, 7814, 33278, -33386, -469884, -313502, -86101, -178028, -35706, -41677, -142692, -254544, 17127, -458973, -59611, -172410, -341962, -302940, -65853, -170327, -128558, -118381, -152850, -277059, -61337, -102670, 145892, -89678, 25957, -44450, -64308, -226274, -224648, 54428, -18388, -154305, -98092, -135237, -148726, -224637, -363967, -329009, -112646, -197716, -158768, -110350, 11062, -19269, -271314, -224353, -385564, -338110, -24196, -178475, -291644, -192471, -209046, -29860, -398963, -314347, -62556, -26639, -54452, -257314, -195399, -270697, -199975, -218428, -115654, -169418]
1231a69418o7086m492L53170k86636O6607K3702N071j50004J40908p7457l5725
1220b01360P8471k70662L84047j78707q9846j3295K3934K3125j3257J4512J62962
1209h0076j36054j38994K08861l043q6590O9637M7816J12512k10978N1473n5459
$$ y = [-169418, -236504, -240996, 112174, -174462, -107855, -84153, -79082, -229086, -88178, -165635, -201360, -122889, -393551, -9504, -188211, -278057, -291352, -267418, -244293, -257550, -243038, -80076, -216130, -355124, -146263, -149306, -235896, -166259, -118443, -5931, -216909, -165436, -220895]
$$ [...]
##END NTUPLES=NMR SPECTRUM
##END=
