##TITLE=abcd
##JCAMPDX= 6.0         $$ Bruker NMR JCAMP-DX V2.0
##DATA TYPE= NMR SPECTRUM
##DATA CLASS= NTUPLES
##ORIGIN= UXNMR, Bruker Analytische Messtechnik GmbH
##OWNER= root
$$ XWIN-NMR		Version 3.5
$$ Fri Jul 10 16:15:29 2026 Russian Standard Time (UT+4h)  servis@DPX200
##.OBSERVE FREQUENCY= 200.131235884673
##.OBSERVE NUCLEUS= ^1H
##.ACQUISITION MODE= SIMULTANEOUS
##.ACQUISITION SCHEME= undefined
##.AVERAGES= 32
##.DIGITISER RES= 18
##SPECTROMETER/DATA SYSTEM= spect
##.PULSE SEQUENCE= zg
##.SOLVENT NAME= CDCl3
##.SHIFT REFERENCE= (INTERNAL, CDCl3, 0, 16.4885)
##AUDIT TRAIL= $$ (NUMBER, WHEN, WHO, WHERE, WHAT)
$$ ##TITLE= Audit trail, XWIN-NMR		Version 3.5
$$ ##JCAMPDX= 5.01
$$ ##ORIGIN= Bruker BioSpin GmbH
$$ ##OWNER= servis
$$ F:\spectra/data/av/nmr/H1/1/pdata/1/auditp.txt
$$ ##AUDIT TRAIL=  $$ (NUMBER, WHEN, WHO, WHERE, WHAT)
(   1,<2026-07-10 16:12:14.14 +0400>,<servis>,<DPX200>,
      <created by zg, POWCHK disabled, PULCHK disabled
       configuration hash MD5:
       00 E9 B6 7A A2 85 ED C7 34 08 36 98 17 FE 4E 26
       data hash MD5: 32K
       23 C5 38 76 61 6F 07 50 19 E5 14 F6 EA 00 25 F0>)
(   2,<2026-07-10 16:15:08.07 +0400>,<servis>,<DPX200>,
      <Start of raw data processing
       efp BC_mod = 2 LB = 0.05 FT_mod = 6 PKNL = 1 PHC0 = -415.39 PHC1 = 3.101563 SI = 16K 
       data hash MD5: 16K
       E8 38 1D F4 39 92 6E 70 A8 85 5A 86 7B 5D 08 44>)
$$ ##END=
$$ 
$$ hash MD5
$$ 14 A2 DD 6C 83 00 8E DF 42 CE CF 64 08 E7 83 9A
##$RELAX= 
##$RELAX= 
##$RELAX= 
##$RELAX= 
##$RELAX= 
##$RELAX= 
##$RELAX= 
##$RELAX= 
$$ Bruker specific parameters
$$ --------------------------
##$DU= <F:\spectra>
##$EXPNO= 1
##$NAME= <H1>
##$PROCNO= 1
##$TYPE= <nmr>
##$USER= <av>
##$AMP= (0..31)
100 100 100 100 100 100 100 100 100 100 100 100 100 100 100 100 100 100 
100 100 100 100 100 100 100 100 100 100 100 100 100 100 
##$AQSEQ= 0
##$AQ_mod= 1
##$AUNM= <au_zg>
##$AUTOPOS= <>
##$BF1= 200.13
##$BF2= 200.13
##$BF3= 200.13
##$BF4= 200.13
##$BF5= 500.13
##$BF6= 500.13
##$BF7= 500.13
##$BF8= 500.13
##$BYTORDA= 1
##$CFDGTYP= 0
##$CFRGTYP= 5
##$CHEMSTR= <none>
##$CNST= (0..31)
1 1 145 1 1 1 1 1 1 1 1 1 1 1 1 1 1 1 1 1 1 1 1 1 1 1 1 1 1 1 1 1 
##$CPDPRG= <>
##$CPDPRG1= <>
##$CPDPRG2= <>
##$CPDPRG3= <>
##$CPDPRG4= <mlev>
##$CPDPRG5= <mlev>
##$CPDPRG6= <mlev>
##$CPDPRG7= <mlev>
##$CPDPRG8= <mlev>
##$CPDPRGB= <>
##$CPDPRGT= <>
##$D= (0..31)
0 2 0 0 0 0 0 0 0 0.06 0 0 0 0 0 0 0.0002 0 0 0 0 0 0 0 0 0 0 0 0 0 0 
0 
##$DATE= 1783685533
##$DBL= (0..7)
120 120 120 120 120 120 120 120 
##$DBP= (0..7)
150 150 150 150 150 150 150 150 
##$DBP07= 0
##$DBPNAM0= <>
##$DBPNAM1= <>
##$DBPNAM2= <>
##$DBPNAM3= <>
##$DBPNAM4= <>
##$DBPNAM5= <>
##$DBPNAM6= <>
##$DBPNAM7= <>
##$DBPOAL= (0..7)
0.5 0.5 0.5 0.5 0.5 0.5 0.5 0.5 
##$DBPOFFS= (0..7)
0 0 0 0 0 0 0 0 
##$DE= 6
##$DECBNUC= <off>
##$DECIM= 32
##$DECNUC= <off>
##$DECSTAT= 4
##$DIGMOD= 1
##$DIGTYP= 9
##$DL= (0..7)
0 120 120 120 120 120 120 120 
##$DP= (0..7)
150 150 150 150 150 150 150 150 
##$DP07= 0
##$DPNAME0= <>
$$ [...]
##$SUBNAM4= <"">
##$SUBNAM5= <"">
##$SUBNAM6= <"">
##$SUBNAM7= <"">
##$SUBNAM8= <"">
##$SUBNAM9= <"">
##$SW= 20.6817932712277
##$SWIBOX= (0..15)
0 0 3 0 0 0 0 0 0 0 0 0 0 0 0 0 
##$SW_h= 4139.07284768212
##$TD= 32768
##$TD0= 1
##$TE= 0
##$TE2= 300
##$TE3= 300
##$TEG= 300
##$TL= (0..7)
0 120 120 120 120 120 120 120 
##$TP= (0..7)
150 150 150 150 150 150 150 150 
##$TP07= 0
##$TPNAME0= <>
##$TPNAME1= <>
##$TPNAME2= <>
##$TPNAME3= <>
##$TPNAME4= <>
##$TPNAME5= <>
##$TPNAME6= <>
##$TPNAME7= <>
##$TPOAL= (0..7)
0.5 0.5 0.5 0.5 0.5 0.5 0.5 0.5 
##$TPOFFS= (0..7)
0 0 0 0 0 0 0 0 
##$TUNHIN= 0
##$TUNHOUT= 0
##$TUNXOUT= 0
##$USERA1= <user>
##$USERA2= <user>
##$USERA3= <user>
##$USERA4= <user>
##$USERA5= <user>
##$V9= 5
##$VALIST= <valist>
##$VCLIST= <CCCCCCCCCCCCCCC>
##$VD= 0
##$VDLIST= <DDDDDDDDDDDDDDD>
##$VPLIST= <PPPPPPPPPPPPPPP>
##$VTLIST= <TTTTTTTTTTTTTTT>
##$WBST= 1024
##$WBSW= 30
##$XGAIN= (0..3)
0 0 0 0 
##$XL= 0
##$YL= 0
##$YMAX_a= 431920
##$YMIN_a= -587630
##$ZGOPTNS= <>
##$ZL1= 120
##$ZL2= 120
##$ZL3= 120
##$ZL4= 120
##$ABSF1= 0
##$ABSF2= 0
##$ABSG= 0
##$ABSL= 0
##$ALPHA= 0
##$AQORDER= 0
##$ASSFAC= 0
##$ASSFACI= 0
##$ASSFACX= 0
##$ASSWID= 0
##$AUNMP= <proc_1d>
##$AZFE= 0.1
##$AZFW= 0.1
##$BCFW= 0
##$BC_mod= 2
##$BYTORDP= 0
##$COROFFS= 0
##$CY= 18.4799938201904
##$DATMOD= 1
##$DC= 0
##$DFILT= <>
##$DTYPP= 0
##$F1P= 9.9274215381318
##$F2P= -0.165520771350173
##$FCOR= 1
##$FTSIZE= 16384
##$FT_mod= 6
##$GAMMA= 0
##$GB= 0
##$INTBC= 1
##$INTSCL= 4.127829e-11
##$ISEN= 128
##$LB= 0.05
##$LEV0= 0
##$LPBIN= 0
##$MAXI= 10000
##$MC2= 0
##$MEAN= 0
##$ME_mod= 0
##$MI= 50
##$NCOEF= 0
##$NC_proc= -5
##$NLEV= 6
##$NOISF1= 3.799351
##$NOISF2= 2.8
##$NSP= 0
##$NTH_PI= 0
##$NZP= 0
##$OFFSET= 16.48848
##$PC= 4
##$PHC0= -415.39
##$PHC1= 3.101563
##$PH_mod= 1
##$PKNL= yes
##$PPARMOD= 0
##$PSCAL= 4
##$PSIGN= 0
##$REVERSE= no
##$SF= 200.130005582386
##$SI= 16384
##$SIGF1= 3
##$SIGF2= 2
##$SINO= 400
##$SIOLD= 16384
##$SREGLST= <1H.CDCl3>
##$SSB= 0
##$STSI= 16384
##$STSR= 0
##$SW_p= 4139.07284768211
##$SYMM= 0
##$S_DEV= 0
##$TDeff= 32768
##$TDoff= 0
##$TI= <>
##$TILT= no
##$TM1= 0
##$TM2= 0
##$TOPLEV= 0
##$USERP1= <user>
##$USERP2= <user>
##$USERP3= <user>
##$USERP4= <user>
##$USERP5= <user>
##$WDW= 1
##$XDIM= 16384
##$YMAX_p= 449812112
##$YMIN_p= -1082451
$$ End of Bruker specific parameters
$$ ---------------------------------
##NTUPLES= NMR SPECTRUM
##VAR_NAME=  FREQUENCY,     SPECTRUM/REAL,   SPECTRUM/IMAG
##SYMBOL=    X,             R,               I
##VAR_TYPE=  INDEPENDENT,   DEPENDENT,       DEPENDENT
##VAR_FORM=  AFFN,          ASDF,            ASDF
##VAR_DIM=   16384,         16384,           16384
##UNITS=     HZ,            ARBITRARY UNITS, ARBITRARY UNITS
##FACTOR=    0.252644378177508, 1,           1
##FIRST=     3299.83951724647, 0,            0
##LAST=      -839.233330435636, 0,           0
##MIN=       -839.233330435636, -1082451,    0
##MAX=       3299.83951724647, 449812112,    0
$$ Real data points
##PAGE= N=1
##DATA TABLE= (X++(R..R)), XYDATA
$$ [...]
12277a91405j6087P0059j0735q5333l7404J81811j40604J11667n9406K9952l5138
$$ -191405 -207492 -137433 -148168 -233501 -270905 -89094 -229698 -118031 -177437 -147485 -182623
12266a82623K3975K8997j62966N6109J10059l1149l9521o065j3128J05270j46052
$$ -182623 -158648 -129651 -292617 -236508 -126449 -157598 -197119 -203184 -216312 -111042 -257094
12255b57094J30387k1254l4311N5137k9478n3489M6424q2340J19035M1749j44635
$$ -257094 -126707 -147961 -182272 -127135 -156613 -210102 -163678 -246018 -126983 -85234 -229869
12244b29869K8211J20593j38260R7362q5047M6843k6327L6387l1267m3234J00811
$$ -229869 -201658 -81065 -219325 -121963 -207010 -160167 -186494 -150107 -181374 -224608 -123797
12233a23797j2496N2510k0075m9579k61j8402J1194O20K051M7158l4955k177k2168
$$ -123797 -136293 -83783 -103858 -153437 -153698 -172100 -160906 -160286 -158235 -111077 -146032 -148209 -170377
12220a70377O6314m5687K0757j04898J63593j8616n0578l8610J6619p4715O9373
$$ -170377 -104063 -149750 -128993 -233891 -70298 -88914 -139492 -178102 -161483 -236198 -166825
12209a66825K7471P9397j00644o7572J42342j68096R1043M5363j09947R6120j02988
$$ -166825 -139354 -59957 -160601 -228173 -85831 -253927 -162884 -117521 -227468 -131348 -234336
12198b34336N3828n3506J26700k9002l9841O4139n4068l0597J28551r6983k9658
$$ -234336 -180508 -234014 -107314 -136316 -176157 -112018 -166086 -196683 -68132 -165115 -194773
12187a94773M8441k5911r7317P8954J5255n9221J31941r82n1603P2625o7623o0872
$$ -194773 -146332 -172243 -269560 -190606 -175351 -234572 -102631 -103613 -155216 -82591 -150214 -211086
12175b11086j8722J67024l152k08211R8759p9396R1160k1781R1973j21278j7346
$$ -211086 -229808 -62784 -65936 -274147 -175388 -254784 -163624 -185405 -93432 -214710 -232056
12164b32056K6203p3410J06818o6991M26J40006o4992N9915r4997j2427k4891
$$ -232056 -205853 -279263 -172445 -239436 -239010 -99004 -163996 -104081 -199078 -211505 -236396
12153b36396K7039L9793j0633N907j02174P5854m1337M561J46338r0668N4201
$$ -236396 -209357 -169564 -180197 -174290 -276464 -200610 -241947 -237386 -91048 -181716 -127515
12142a27515j25133J339O9679m3431J08933L129p0709J8961j49979J60950j03220
$$ -127515 -252648 -251309 -181630 -225061 -116128 -112999 -183708 -164747 -314726 -153776 -256996
12131b56996N2717l1016k9301J8731q106R3701j1338o0392P3795n2679M947p249
$$ -256996 -204279 -235295 -264596 -245865 -253971 -160270 -171608 -232000 -158205 -210884 -205937 -213186
12119b13186k8014K4772j4943L0667M7215p7179P1603n2231Q1036q0214L8254
$$ -213186 -241200 -216428 -231371 -200704 -153489 -230668 -159065 -211296 -130260 -210474 -172220
12108a72220n6682P0383L2427j1008N0518j27856L9244P4404r4266R0233j13591
$$ -172220 -228902 -158519 -126092 -137100 -86582 -214438 -175194 -100790 -195056 -104823 -218414
12097b18414J22478j50382R4896j20439Q7315k8026N4955p5057j0918R6343m6252
$$ -218414 -95936 -246318 -151422 -271861 -184546 -212572 -157617 -232674 -243592 -147249 -193501
12086a93501p3804J51785j53289O3135M558R2128L1348p0474R799j19057j4739
$$ -193501 -267305 -115520 -268809 -205674 -201116 -108988 -77640 -148114 -138315 -257372 -272111
12075b72111R9140l8000J81639j32882J02864k13301K2398K7114J35169K2422
$$ -272111 -172971 -210971 -29332 -162214 -59350 -272651 -250253 -223139 -87970 -65548
12065f5548j78292J06848Q34j23740K8937J9283J48275p0722K5741Q3488k78023
$$ -65548 -243840 -136992 -136158 -259898 -230961 -211678 -63403 -134125 -108384 -24896 -302919
12054c02919K05269j14431J44910r9128J1528L1978m1248m3503j437q3464P4891
$$ -302919 -97650 -212081 -67171 -166299 -154771 -122793 -164041 -207544 -208981 -292445 -217554
12043b17554M3556J08774j92374O0135l5894J4428N8946n3559K1663J10948j25868
$$ -217554 -173998 -65224 -257598 -197463 -233357 -218929 -159983 -213542 -191879 -80931 -206799
12032b06799K0048p1388J12575r169J01130j32547r873k1959O9123m1637p3715
$$ -206799 -186751 -258139 -145564 -154733 -53603 -186150 -196023 -217982 -148859 -190496 -264211
12021b64211J16762Q7106n9663k4708j00335J33862q7226L9655j2723J1605p0095
$$ -264211 -147449 -60343 -120006 -144714 -245049 -111187 -198413 -158758 -171481 -159876 -229971
12010b29971Q7604n3902L8010o0640J70519o7619r2490Q9064o3420n8190J05774
$$ -229971 -142367 -196269 -158259 -218899 -48380 -115999 -208489 -119425 -182845 -241035 -135261
11999a35261o8637L5742k2551J17865l1919o3973m2884J6090q191n4533O9767
$$ -135261 -203898 -168156 -190707 -72842 -104761 -168734 -211618 -195528 -203719 -258252 -188485
11988a88485j27710R3941j39095J76673L145l2421O7775k3915k5546J4319n1047
$$ -188485 -316195 -222254 -361349 -184676 -181531 -213952 -146177 -170092 -195638 -181319 -232366
11977b32366J4797L0485J31494j16158K0458N1397j19438J20721r8490l9961J34109
$$ -232366 -217569 -187084 -55590 -171748 -151290 -99893 -219331 -98610 -197100 -237061 -102952
11966a02952j40796J63907j61777J54404q2595L0199N3143k10979P0856N5039
$$ -102952 -243748 -79841 -241618 -87214 -169809 -139610 -86467 -297446 -226590 -171551
11956a71551M666p5499K9106J36177j06767J6004o4290Q8481l6209L0529N0991
$$ -171551 -166885 -242384 -213278 -77101 -183868 -167864 -232154 -143673 -179882 -149353 -98362
11945i8362k9645n8104Q4550j18868J08827j15700J44545r1611J33977j00251
$$ -98362 -128007 -186111 -101561 -220429 -111602 -227302 -82757 -174368 -40391 -140642
11935a40642j72797J84087l307R61J8181M8250j03137L4645l1397o4995K1688
$$ -140642 -313439 -129352 -132659 -131698 -113517 -65267 -168404 -133759 -165156 -230151 -208463
11924b08463R9279l1703Q4714j31374Q5203j10510L2381J1950J8728K6223n968
$$ -208463 -109184 -140887 -56173 -187547 -102344 -212854 -180473 -168523 -149795 -123572 -129540
11913a29540l6438L1318k5193O1942j22218J33076j00847O9022m5977m2962M5209
$$ -129540 -165978 -134660 -159853 -97911 -220129 -87053 -187900 -118878 -164855 -207817 -162608
11902a62608j00355J23279K716o6405m0955J205O6944O5793r3359L1137K924P045
$$ -162608 -262963 -139684 -136968 -203373 -244328 -243123 -176179 -110386 -203745 -172608 -169684 -162639
11890a62639r6148L4054k9228J04892N0898L0978j49569P124Q967J21356q6250
$$ -162639 -258787 -224733 -253961 -149069 -98171 -67193 -216762 -209638 -200671 -79315 -165565
11879a65565k5325J5426L84J9530O188Q340n6107k7970J23138o9520o3814K3263
$$ -165565 -190890 -175464 -175080 -155550 -149362 -141022 -197129 -225099 -101961 -171481 -235295 -212032
11867b12032O9824q9342O9143J2705N3127j77202R2936M8792j0890K7289J7488
$$ -212032 -142208 -231550 -162407 -149702 -96575 -273777 -180841 -132049 -142939 -115650 -98162
11856i8162j89j09066o5830J10785J3814J5438o125q8401K1861n8369J64525n4950
$$ -98162 -98351 -207417 -273247 -162462 -148648 -133210 -139335 -227736 -205875 -264244 -99719 -154669
11844a54669K610n0855m0500n4857Q5769O3989p201L1427l8132k3497m166m2779
$$ -154669 -152059 -202914 -243414 -298271 -212502 -148513 -155714 -124287 -162419 -185916 -190082 -232861
11832b32861P8997J5812l1611j07450J35119j70491J84975p6168J2308J02915
$$ -232861 -153864 -138052 -169663 -277113 -141994 -312485 -127510 -203678 -191370 -88455
11822h8455N6346p3141L5154j78636N5414J727J14481j38450J20563j28003R6639
$$ -88455 -32109 -105250 -70096 -248732 -193318 -191591 -77110 -215560 -94997 -223000 -126361
11811a26361j04307K752J39206k6593J3326L2039j64107K8001r633L5259K9532
$$ -126361 -230668 -227916 -88710 -115303 -101977 -69938 -234045 -206044 -215677 -180418 -150886
11800a50886M2143o5118O5465p7186Q5628p1785Q9665o1617L1481l5989j1679
$$ -150886 -108743 -173861 -108396 -185582 -99954 -171739 -82074 -143691 -112210 -148199 -159878
11789a59878n0557P9684p4083M2002M6200j15652j4833Q9178k8043j2276O0270
$$ -159878 -210435 -130751 -204834 -162832 -116632 -232284 -247117 -157939 -185982 -198258 -137988
11778a37988O6447l7024o9780P0272n8989L7650j2367j30386K4482J26338k1864
$$ -137988 -71541 -108565 -178345 -108073 -167062 -129412 -141779 -272165 -247683 -121345 -143209
11767a43209j04428J21229P885n5697m8015L4466P9308j37186O1513k99J12898
$$ -143209 -247637 -126408 -118523 -174220 -222235 -187769 -108461 -245647 -184134 -184433 -71535
11756g1535n8251j151l1058q544j04618J52774o8574L0855j1920Q9286j10091
$$ -71535 -129786 -130937 -161995 -170539 -275157 -122383 -190957 -160102 -172022 -82736 -192827
11745a92827M1200n636q7818P3836m2014K8458O9915j1069M1176r5208J2569J9374
$$ -192827 -151627 -157263 -245081 -171245 -213259 -184801 -114886 -125955 -84779 -179987 -167418 -148044
11733a48044l2572L0520K3942K0433n4584m2388K2632o871J8911o5314J30817
$$ -148044 -180616 -150096 -126154 -105721 -160305 -202693 -180061 -186932 -168021 -233335 -102518
11722a02518P244j13246M8644O7204l0649m3599k6207P3566k3209r684L1931r0445
$$ -102518 -95274 -208520 -159876 -92672 -123321 -166920 -193127 -119561 -142770 -152454 -120523 -210968
11710b10968J7611J3016L5958o4351K2555J7603j05089J39662p328k2374m946
$$ -210968 -193357 -180341 -144383 -208734 -186179 -168576 -273665 -134003 -141331 -163705 -168651
11699a68651q492P5175r7180N5613r3770Q0774j8787M5331j03198Q2161p0990
$$ -168651 -177143 -101968 -199148 -143535 -237305 -156531 -175318 -129987 -233185 -151024 -222014
11688b22014J4103R3706o464j41199j0043J81734o8659j5112j4358k294l1810
$$ -222014 -207911 -114205 -120669 -261868 -271911 -90177 -158836 -173948 -188306 -190600 -222410
11677b22410N0695M3567q8638j2935J37084p1985j569M2761m3342L2070p3965
$$ -222410 -171715 -128148 -216786 -229721 -92637 -164622 -166191 -123430 -166772 -134702 -208667
11666b08667J5443l0128l1313N6821P3190K5124p6739r4777J59587k9478P9010
$$ -208667 -193224 -223352 -254665 -197844 -124654 -99530 -176269 -271046 -111459 -140937 -61927
11655f1927N0675j72489m2094J61524L9106r5892r2680J21028Q689q9013l2332
$$ -61927 -11252 -183741 -225835 -64311 -25205 -121097 -213777 -92749 -84060 -173073 -205405
11644b05405M0727J13409n7857j01011Q6830m3112k2426K4116J3761j00685J26767
$$ -205405 -164678 -51269 -109126 -210137 -123307 -166419 -188845 -164729 -150968 -251653 -124886
11633a24886q6444l9495K2233J08983o2087q6493K32449j42351j1842r548n539
$$ -124886 -211330 -250825 -228592 -119609 -181696 -268189 -35740 -178091 -189933 -199481 -205020
11622b05020N2649R827n6014O052K7108O5736j46998J42683k4165l0511Q5667
$$ -205020 -152371 -142544 -198558 -192506 -165398 -99662 -246660 -103977 -128142 -158653 -72986
11611g2986m2443j75634R5686O5990n4536M4014m7316R9255j6303k0107O7384
$$ -72986 -115429 -291063 -195377 -129387 -183923 -139909 -187225 -87970 -104273 -124380 -56996
11600e6996l653p3274L7978n1548M5313r8675M5606J32738P183j72215L5645K3047
$$ -56996 -60649 -133923 -95945 -147493 -102180 -200855 -155249 -22511 -15328 -187543 -151898 -128851
11588a28851J6734j819k428P296k8209N4464j27016M1656J02993k1311r3556M4792
$$ -128851 -112117 -113936 -116364 -109068 -137277 -82813 -209829 -168173 -65180 -86491 -180047 -135255
11576a35255q7643k6322P9037J03111j04470n7409J20599o935o051p2446l9432
$$ -135255 -222898 -249220 -170183 -67072 -171542 -228951 -108352 -115287 -121338 -193784 -233216
11565b33216r756J12663R9227k31659J01898j21924J41701p2527R4078p2985O7741
$$ -233216 -242972 -130309 -31082 -262741 -160843 -282767 -141066 -213593 -119515 -192500 -124759
11554a24759l9561J9470p5139R3850j13538P1390J01524m9215r1724J23970M0904
$$ -124759 -164320 -144850 -219989 -126139 -239677 -168287 -66763 -115978 -207702 -83732 -42828
11543d2828j93027J25485l3390r4095K8137n055J46183j55732J29451r4032l7032
$$ -42828 -235855 -110370 -143760 -237855 -209718 -214773 -68590 -224322 -94871 -188903 -225935
11532b25935k1276P5431j22956J43694O7388q0033M2278O8925o9032L3792l7382
$$ -225935 -247211 -171780 -294736 -151042 -83654 -163687 -121409 -52484 -121516 -87724 -125106
11521a25106l8005R3342p7050n6180O3459R2374r0167o5O4198j85383k0464J21874
$$ -125106 -163111 -69769 -146819 -202999 -139540 -47166 -137333 -137398 -73200 -258583 -279047 -157173
11509a57173l042k994L7772N4562k10513J92151Q3835k57546J13637q761Q255
$$ -157173 -160215 -163209 -125437 -70875 -281388 -89237 -5402 -262948 -149311 -158072 -149817
11498a49817L5494l9247N0293k17817J71779m5333Q3578l1585o9851L5145M5354
$$ -149817 -114323 -153570 -103277 -321094 -149315 -194648 -111070 -142655 -212506 -177361 -132007
11487a32007n639P5637j03286O6079n7490j3896j4970p924O381J04854l8177P245
$$ -132007 -137646 -62009 -165295 -99216 -156706 -170602 -185572 -193496 -187115 -82261 -120438 -113193
11475a13193q6245K2874r9064J56958K0117L9770k7964l0002j85029J49857p772
$$ -113193 -199438 -176564 -275628 -118670 -98553 -58783 -86747 -116749 -301778 -151921 -159693
11464a59693k516k492L6940k8339M2623j53720R2797r5962J87182L8649q053k1104
$$ -159693 -162209 -164701 -127761 -156100 -113477 -267197 -174400 -270362 -83180 -44531 -52584 -73688
11452g3688j12837n8827L2802N3744L9523p4673J46853j12129p1676J6081J02920
$$ -73688 -186525 -245352 -212550 -158806 -119283 -193956 -47103 -159232 -230908 -214827 -111907
11441a11907q7626J44625l6401o5780o2642M8238Q849P58L0829N5617p9704k6834
$$ -111907 -199533 -54908 -91309 -157089 -219731 -171493 -162644 -161886 -131057 -75440 -155144 -181978
11429a81978J4633m5481Q0633j5735Q3612k1904j37492N2978J2277l6749N9401
$$ -181978 -167345 -212826 -132193 -147928 -64316 -86220 -223712 -170734 -158457 -195206 -135805
11418a35805j896R5652j89749P4486p0339n6433J23337L7861J9383M7734j06312
$$ -135805 -137701 -42049 -231798 -157312 -227651 -284084 -160747 -122886 -103503 -55769 -162081
11407a62081q572l5438O4062j4829J42211o7851p0181M0930j11824J1820p11N7275
$$ -162081 -170653 -206091 -142029 -156858 -14647 -82498 -152679 -111749 -223573 -211753 -212464 -155189
11395a55189J18564j92739J07008p8698O2489n7584J33718l7173L2325p889j05585
$$ -155189 -36625 -229364 -122356 -201054 -138565 -196149 -62431 -99604 -67279 -75168 -180753
11384a80753K026N4696q3606J28542m0009P8466l3997j24399k3507O4106Q9765
$$ -180753 -178727 -124031 -207637 -79095 -119104 -40638 -74635 -199034 -222541 -158435 -68670
11373f8670p1006J70J2774l5731n9229M8322L9465J2644j058j7703m7669P3926
$$ -68670 -139676 -139506 -126732 -162463 -221692 -173370 -133905 -121261 -122319 -140022 -187691 -113765
11361a13765p4274J03111r1596K0793J53208k24426L4626Q619J27646j48709M8703
$$ -113765 -188039 -84928 -176524 -155731 -2523 -226949 -192323 -183704 -56058 -204767 -156064
11350a56064J48442n0798n3862r4782J44N5657N5117k560k872q63j279J7943j08888
$$ -156064 -7622 -58420 -112282 -207064 -206920 -151263 -96146 -98706 -101578 -102441 -103720 -85777 -194665
11337a94665K2206J25388p1219p1178J29808p7962l9017k2702Q9729j2666j0035
$$ -194665 -172459 -47071 -118290 -189468 -59660 -137622 -176639 -199341 -109612 -122278 -132313
11326a32313m3266r2587K0972J5880O2751J900j7172K9194p3357K02723j98087
$$ -132313 -175579 -268166 -247194 -231314 -168563 -166663 -183835 -154641 -227998 -25275 -223362
11315b23362Q9224j825N2326m0814k8234k7948Q7544j86855Q9685J43363p443
$$ -223362 -134138 -135963 -83637 -124451 -152685 -180633 -93089 -279944 -190259 -46896 -54339
11304e4339j81136J4806L2353j06657J30521K1427J4358L7443j5565r1889M0301
$$ -54339 -235475 -220669 -188316 -294973 -164452 -143025 -128667 -91224 -106789 -198678 -158377
11293a58377n8929J31817l5041J0849n0435L3362j09989K67606k13086O7633p0573
$$ -158377 -217306 -85489 -120530 -109681 -160116 -126754 -236743 30863 -182223 -114590 -185163
11282a85163j8126R4623J5413j08567J50611j63328J69374l431M856j38106O7935
$$ -185163 -203289 -108666 -93253 -201820 -51209 -214537 -45163 -48594 -43738 -181844 -113909
11271a13909j21982N1609R3516r024m2775k3620r4358J68142j12558J64575j50140
$$ -113909 -235891 -184282 -90766 -99790 -142565 -166185 -260543 -92401 -204959 -40384 -190524
11260a90524P0677j10298L1154m5503J02340n9097J63884j75329Q6696r5123J12201
$$ -190524 -119847 -230145 -198991 -244494 -142154 -201251 -37367 -212696 -126000 -221123 -108922
11249a08922n1299k4418L1426J0805M7093k4325p1273M8317n0173k0554o753J09643
$$ -108922 -160221 -184639 -153213 -142408 -95315 -119640 -190913 -142596 -192769 -213323 -220076 -110433
11237a10433n169J474o8547M3066n291L2616j0018r2709J50632r6171k8165N378
$$ -110433 -115602 -114128 -182675 -139609 -144900 -112284 -122302 -215011 -64379 -160550 -188715 -183337
11225a83337K7927L5498j5468k9259M7398n3394R805n1197N2940L042J64176j58554
$$ -183337 -155410 -119912 -135380 -164639 -117241 -170635 -160830 -212027 -159087 -156045 8131 -150423
11213a50423P2513j45462P9086j25536R3591J3264M3159j03787P0017N7546P0536
$$ -150423 -77910 -223372 -144286 -269822 -176231 -162967 -119808 -223595 -153578 -96032 -25496
11202b5496k68284J20781l2327Q1487m7791Q7587j34638Q6576K9608M799j18172
$$ -25496 -293780 -172999 -205326 -123839 -171630 -84043 -218681 -132105 -102497 -97698 -215870
11191b15870J14318N3379p6951K8825O671M7518K3206n0514l6966j45042K13864
$$ -215870 -101552 -48173 -125124 -96299 -89628 -42110 -18904 -69418 -106384 -251426 -37562
11180c7562j85714M3034J04146j56247J47282O4922j46793r8448J16237K3897
$$ -37562 -223276 -180242 -76096 -232343 -85061 -20139 -166932 -265380 -149143 -125246
11170a25246m2934J03213q8214n5751N0483m8225K7611L4907J00762j10366R5467
$$ -125246 -168180 -64967 -153181 -208932 -158449 -206674 -179063 -144156 -43394 -153760 -58293
11159e8293p2662J1476j0615j1571j0225P713j69439J59859L2881Q313l495k7279
$$ -58293 -130955 -119479 -130094 -141665 -151890 -144177 -313616 -153757 -120876 -112563 -116058 -143337
11147a43337L6573l5298n0971O6985k5427q3150O761J24392L2969n2639r3632
$$ -143337 -106764 -142062 -193033 -126048 -151475 -234625 -227864 -103472 -70503 -123142 -216774
11136b16774J8734j10070J64787m928j02235J74488n4223N5893p0306J48166j87926
$$ -216774 -198040 -308110 -143323 -148251 -250486 -75998 -130221 -74328 -144634 3532 -184394
11125a84394Q8498r9065J16070L1824m2178n2482o8136N9801P183L3446n2702
$$ -184394 -95896 -194961 -78891 -47067 -89245 -141727 -209863 -150062 -142879 -109433 -162135
11114a62135N3673r0118J0545Q0490j15496Q4108k7226L8201k4242l4293L2285
$$ -162135 -108462 -198580 -188035 -107545 -223041 -138933 -166159 -127958 -152200 -186493 -154208
11103a54208j03417J55662l7389K0342j8261P8700k09690R7026L9271M9201n4337
$$ -154208 -257625 -101963 -139352 -119010 -137271 -58571 -268261 -171235 -131964 -82763 -137100
11092a37100O731l375j4423k2483O9057j10515J91224j78931J51246r5636J0630
$$ -137100 -130369 -133744 -148167 -170650 -101593 -212108 -20884 -199815 -48569 -144205 -133575
11081a33575r1026J18741j11607J26015j35205K05056o1994J27470k65830Q4601
$$ -133575 -224601 -105860 -217467 -91452 -226657 -21601 -83595 43875 -221955 -137354
11071a37354J33492p9330j35817K26393j97762M1720j3294j2644O3526n9781Q3136
$$ -137354 -3862 -83192 -219009 7384 -190378 -148658 -161952 -174596 -111070 -170851 -87715
11060h7715j11326P6300o9916N4210l8827P53l3020L0068J0144P3632p9618J4910
$$ -87715 -199041 -122741 -192657 -138447 -177274 -176521 -209541 -179473 -169329 -95697 -175315 -160405
11048a60405Q5397j8553n4978K7359m5210N5837k2177M1609k0126k269l943K0622
$$ -160405 -75008 -93561 -148539 -121180 -166390 -110553 -132730 -91121 -111247 -113516 -117459 -96837
11036i6837L0804j05365j18341J91219l7717r016k3335M1058L4034K753j01196
$$ -96837 -66033 -171398 -289739 -98520 -136237 -145253 -168588 -127530 -93496 -90743 -191939
11025a91939P9843m9184K7606j8354J45826k21373J56648J6249j13367M5807J31748
$$ -191939 -112096 -161280 -133674 -152028 -6202 -227575 -70927 -54678 -168045 -122238 9510
11014I510k17268O8794p0463Q4941o0633N7212O0251o891j39985L2657j5632J22682
$$ 9510 -207758 -138964 -209427 -124486 -185119 -127907 -67656 -74547 -214532 -181875 -197507 -74825
11002g4825j13233R0898K265j73373N3754J15262k4961N6686p0680R7444r9084
$$ -74825 -188058 -97160 -94895 -268268 -214514 -99252 -124213 -67527 -138207 -40763 -139847
10991a39847o8011J12707k4932j3423K5440M4192r4213L2721l2602K9244o4476
$$ -139847 -207858 -95151 -120083 -133506 -108066 -63874 -158087 -125366 -157968 -128724 -193200
10980a93200r610J5890J44927j13582O7414q3521J16074q4535J14075j14624P3678
$$ -193200 -202810 -186920 -41993 -155575 -88161 -171682 -55608 -140143 -26068 -140692 -67014
10969f7014n0430m2449n0988J01487j06590N8488m3877J25614o2767n3246k0730
$$ -67014 -117444 -159893 -210881 -109394 -215984 -157496 -201373 -75759 -138526 -191772 -212502
10958b12502J19450j33068J09412o810Q0336k02203J51529l4575m9718P3014j6894
$$ -212502 -93052 -226120 -116708 -123518 -43182 -245385 -93856 -128431 -178149 -105135 -122029
10947a22029J3904o1374R440R2107r3576J56985q3406o391m2819j10851P4421
$$ -122029 -108125 -169499 -160059 -67952 -161528 -4543 -87949 -94340 -137159 -248010 -173589
10936a73589M8315j9880N4999l113l3444J9528j49269J60075r1703N9280P7615
$$ -173589 -125274 -145154 -90155 -93268 -126712 -107184 -256453 -96378 -188081 -128801 -51186
10925e1186m4502p3560M1123L0109k3349O2007j9579l9924J8780k9599n5209Q532
$$ -51186 -95688 -169248 -128125 -98016 -121365 -59358 -78937 -118861 -100081 -129680 -184889 -176357
10913a76357J19179l5439k7740r260l1169n382l5529O2666J10426j26910J0060
$$ -176357 -57178 -92617 -120357 -129617 -160786 -166168 -201697 -139031 -28605 -155515 -145455
10902a45455k1888O6164m5191N9029P0410o1839o4366M2095j72503J31315N7375
$$ -145455 -167343 -101179 -146370 -87341 -16931 -78770 -143136 -101041 -273544 -142229 -84854
10891h4854Q7180j42309O0713j08830O1185j2977k4481Q0467m7507o2202N7862
$$ -84854 2326 -139983 -79270 -188100 -126915 -139892 -164373 -83906 -131413 -193615 -135753
10880a35753P0865Q603p6137L4140j2398j1832k0882o1554k0482J14386J00780
$$ -135753 -64888 -56285 -132422 -98282 -110680 -122512 -143394 -204948 -225430 -111044 -10264
10869a0264r9990k5366J6145m8021j9825J88002l7425r2598N3974P9360k33353
$$ -10264 -110254 -135620 -119475 -167496 -187321 681 -36744 -129342 -75368 3992 -229361
10858b29361R0912R5690j14313r486L9581m6273R0056q2171K6588O6122L5390
$$ -229361 -138449 -42759 -157072 -166558 -126977 -173250 -83194 -165365 -138777 -72655 -37265
10847c7265j17561J49527j95671R8334j21375R0063L4143N4836j53809K4691O4547
$$ -37265 -154826 -5299 -200970 -102636 -224011 -133948 -99805 -44969 -198778 -174087 -109540
10836a09540p3854M2425L9546J8583j05987O721n7328O2668L3683k8295J05517
$$ -109540 -183394 -140969 -101423 -82840 -188827 -182106 -239434 -176766 -143083 -171378 -65861
10825f5861l4879q0701J7430Q1259j48546J36934K923j8789q7958j05418J24418
$$ -65861 -100740 -181441 -164011 -82752 -231298 -94364 -91441 -110230 -198188 -303606 -179188
10814a79188K1312J15478k7947O0462r258o5141j3890j00160Q0679O9369k7246
$$ -179188 -157876 -42398 -70345 -9883 -19141 -84282 -98172 -198332 -117653 -48284 -75530
10803g5530l3048r8417n3406K33113j32696R1550L8502r3081O0275k8015j1311
$$ -75530 -108578 -206995 -260401 -27288 -159984 -68434 -29932 -123013 -62738 -90753 -102064
10792a02064o1246M7637P0066j34875J15670j17811L6597L4354m986K5262j13594
$$ -102064 -163310 -115673 -45607 -180482 -64812 -182623 -146026 -111672 -116658 -91396 -204990
10781b04990R0591K7622K5676j7578r5492J10074n2276R1870q0632l7343n8698
$$ -204990 -114399 -86777 -61101 -78679 -174171 -64097 -116373 -24503 -105135 -142478 -201176
10770b01176J847Q5362o4684N8675K0612j5065p6084m3207O2110M1852l9545J01186
$$ -201176 -199329 -113967 -178651 -119976 -99364 -114429 -190513 -233720 -171610 -129758 -169303 -68117
10758f8117j23817J17877j15394o534J02770j00572J66228l3366N7792k40467
$$ -68117 -191934 -74057 -189451 -195985 -93215 -193787 -27559 -60925 -3133 -243600
10748b43600J3509J27570L4838p8457J43998j21905j2227J6660j8016n3778M6981
$$ -243600 -230091 -102521 -67683 -146140 -2142 -124047 -136274 -119614 -137630 -191408 -144427
10737a44427K4270K1836m4443l4489K8376K1559K819J59225j37747l0307m1946
$$ -144427 -120157 -98321 -142764 -177253 -148877 -127318 -124499 34726 -103021 -133328 -175274
10726a75274l395O1947L3577k689l5842m5798n455K6382l8948J2990k9935J55379
$$ -175274 -178669 -116722 -83145 -85834 -121676 -167474 -172929 -146547 -185495 -172505 -202440 -47061
10714d7061k1904j0530m9635O1604r1688L439L6959m1883k7626M9070j4865O6726
$$ -47061 -68965 -79495 -129130 -67526 -159214 -155775 -118816 -160699 -188325 -139255 -154120 -87394
10702h7394q8286J38660p1142k5767n8377Q2639j0142j0184L9128K1282n9609
$$ -87394 -175680 -37020 -108162 -133929 -192306 -109667 -119809 -129993 -90865 -69583 -129192
10691a29192L0182o3686J9319N532J19597r5040J41010j56713m6795J15186p9258
$$ -129192 -99010 -162696 -143377 -137845 -18248 -113288 27722 -128991 -175786 -60600 -139858
10680a39858J4573j4800M5212r7701J42644q7635r226J1127r591K6736k1186P8568
$$ -139858 -125285 -140085 -94873 -192574 -49930 -137565 -146791 -135664 -145255 -118519 -139705 -61137
10668f1137n8936K1368k6349L1421m8967K2213j34446J90057l6004K9426L857
$$ -61137 -120073 -98705 -125054 -93633 -142600 -120387 -254833 -64776 -100780 -71354 -67497
10657f7497O0527k04966P9184M802N8110j1719k4870j4486j46305R3706J22706
$$ -67497 -6970 -211936 -132752 -127950 -69840 -81559 -106429 -120915 -267220 -173514 -50808
10646e0808n8153J14008l8914j08577O770k1130P4123j18864R3493J27718j02849
$$ -50808 -108961 5047 -33867 -142444 -135674 -156804 -82681 -201545 -108052 19666 -83183
10635h3183m8807L3680M2308o0235l3845n823j3896J8606P532O6319j42600Q3973
$$ -83183 -131990 -98310 -56002 -116237 -150082 -155905 -169801 -151195 -143663 -77344 -219944 -135971
10623a35971P5049k8231m5999M3834K7009q7434M3107O6025j15553L2213M3146
$$ -135971 -60922 -89153 -135152 -91318 -64309 -151743 -108636 -42611 -158164 -125951 -82805
10612h2805o6220Q4359k5205j4337m8034J4447J6516O9194j54546R3311N5209
$$ -82805 -149025 -64666 -89871 -104208 -152242 -137795 -121279 -52085 -206631 -113320 -58111
10601e8111j15812L3823P7122j57695J84937k39153J38481q256J43780j03109
$$ -58111 -173923 -140100 -62978 -220673 -35736 -274889 -136408 -144664 -884 -103993
10591a03993N4772j46725K7521N4966J0397r709M0763l079N4968j92442J65606
$$ -103993 -49221 -195946 -168425 -113459 -103062 -112771 -72008 -75087 -20119 -212561 -46955
10580d6955q7969N0682m0243J01668j36476r906o398Q7758j17592J16691K9519
$$ -46955 -134924 -84242 -124485 -22817 -159293 -169199 -175597 -87839 -205431 -88740 -59221
10569e9221q1487J2753l6633K9704J669N5981m3439P2519r7409P6714j52949Q5052
$$ -59221 -140708 -127955 -164588 -134884 -133215 -77234 -120673 -48154 -145563 -68849 -221798 -136746
10557a36746r1727Q3284j9004j450n8943Q1070m246j7252P7828Q6541j70220P5883
$$ -136746 -228473 -145189 -164193 -165643 -224586 -143516 -147762 -165014 -87186 -645 -170865 -94982
10545i4982r622j45630L9536J74185q7364Q8034j3893k897j51035J22120N4002
$$ -94982 -104604 -250234 -210698 -36513 -123877 -35843 -49736 -52633 -203668 -81548 -27546
10534b7546n5093m4219J3208m5807J4270n0686M2920P3732m9190l8406K9389K2455
$$ -27546 -82639 -126858 -113650 -159457 -145187 -195873 -152953 -79221 -128411 -166817 -137428 -114973
10522a14973o4830N8352K6312M4239J1096N1152j02476j09624R2645n8546J3651
$$ -114973 -179803 -121451 -95139 -50900 -39804 11348 -91128 -200752 -108107 -166653 -153002
10511a53002Q2264n376p1999P9380o6492M5729J4851k2396o6816m545O017J9646
$$ -153002 -70738 -76114 -148113 -68733 -135225 -89496 -74645 -97041 -163857 -168402 -162385 -142739
10499a42739j563N1000R0769j12250N1738j46794J50366o3420R2293j31326Q786
$$ -142739 -144302 -93302 -2533 -114783 -63045 -209839 -59473 -122893 -30600 -161926 -153140
10488a53140M2910k4552J32332m1826j06627M0306N0622j45968L3824R2705r531
$$ -153140 -110230 -134782 -2450 -44276 -150903 -110597 -59975 -205943 -172119 -79414 -88945
10477h8945J3217j4701M7546L5818n8678n0941r311L6418j38099O5172J9517J07702
$$ -88945 -75728 -90429 -42883 -7065 -65743 -116684 -125995 -89577 -227676 -162504 -142987 -35285
10465c5285j24847M8189M9931j18456L5259J03851r6714M29Q6707N416o0629l9125
$$ -35285 -160132 -111943 -62012 -180468 -145209 -41358 -138072 -137643 -50936 -45520 -106149 -145274
10453a45274p1274K7399p2259P8427J51502j23138J24971j85176l1697R5156Q4616
$$ -145274 -216548 -189149 -261408 -182981 -31479 -154617 -29646 -214822 -246519 -151363 -66747
10442f6747L435j15489J3349j6172j083l542R7031P6304m1564j18435R6775l832
$$ -66747 -63312 -178801 -165452 -181624 -182707 -186249 -89218 -12914 -54478 -172913 -76138 -79970
10430g9970k05199J49792J25152k0526o2368p603q4734L0999R4352m0541r003
$$ -79970 -285169 -135377 -10225 -30751 -93119 -100722 -185456 -154457 -60105 -100646 -109649
10419a09649R0565j75390J26024j44077J46928p0455J23588j02929p355L5379
$$ -109649 -19084 -194474 -68450 -212527 -65599 -136054 -12466 -115395 -122750 -87371
10409h7371n3266Q299J8632k4359m923m7857J24753j07613N3214q7957L2208J51659
$$ -87371 -140637 -132338 -113706 -138065 -142988 -190845 -66092 -173705 -120491 -208448 -176240 -24581
10397b4581n7195p6952L9303r7852O0164L2195N9692o4770K6006J12141j67775
$$ -24581 -81776 -158728 -119425 -217277 -157113 -124918 -65226 -129996 -103990 8151 -159624
10386a59624J01538q5451k1075M3119P4906k0708q5262j0257J66574j75215L7944
$$ -159624 -58086 -143537 -164612 -121493 -46587 -67295 -152557 -162814 3760 -171455 -133511
10375a33511p1930R7840n2444O4989m348p4541p5113J28940M1423L847q8068J70853
$$ -133511 -205441 -107601 -160045 -95056 -99404 -173945 -249058 -120118 -78695 -74848 -162916 7937
10363G937j8847j10459k7827L9682P8658j00657k4829P936M4127m373K5738M4123
$$ 7937 -10910 -121369 -149196 -109514 -30856 -131513 -156342 -148406 -104279 -108652 -82914 -38791
10351c8791n1196j09597J12820j63508J06231O0990m6285k190j5178M4415o0756
$$ -38791 -89987 -199584 -86764 -250272 -144041 -83051 -129336 -131526 -146704 -102289 -163045
10340a63045J51559l7007k4123J637l281j13985J0771J5385M5640J18391p7321
$$ -163045 -11486 -48493 -72616 -70979 -74260 -188245 -177474 -162089 -116449 1942 -75379
10329g5379k1393J37410k18212j01585J58239L4388o0609J35834r1486j8438J6505
$$ -75379 -96772 40638 -177574 -279159 -120920 -86532 -147141 -11307 -102793 -121231 -104726
10318a04726k5513m866M6908J8875J2596n2353n5156n4908J19993j44767K17092
$$ -104726 -130239 -135105 -88197 -69322 -56726 -109079 -164235 -219143 -99150 -243917 -26825
10307b6825m4708N2985n8838l7445K0734M356j85103K87950j72873J2415J4433
$$ -26825 -71533 -18548 -77386 -114831 -94097 -89741 -274844 13106 -159767 -147352 -132919
10296a32919J1210q0221J00418R6263j64956j3668Q5721n3746Q4634K7564J9085
$$ -132919 -121709 -201930 -101512 -5249 -170205 -183873 -98152 -151898 -67264 -39700 -20615
10285b0615j85384J88667j66142J2121L4929J4391k593Q6014q4938J00991m9795
$$ -20615 -205999 -17332 -183474 -171353 -136424 -122033 -124626 -38612 -123550 -22559 -72354
10274g2354L4241r6472p513Q2495j98334J27573J2493k93L0151L8231M6722n2829
$$ -72354 -38113 -134585 -142098 -59603 -257937 -130364 -117871 -118164 -88013 -49782 -3060 -55889
10262e5889m0866k3809K9625k9251j03092J67759j9194N7054j65216O3454J02280
$$ -55889 -96755 -120564 -90939 -120190 -223282 -55523 -74717 -17663 -182879 -119425 -17145
10251a7145j70767J60846r4265r312O2869j57873N7396J19355l604j40856J22912
$$ -17145 -187912 -27066 -121331 -130643 -67774 -225647 -168251 -48896 -52500 -193356 -70444
10240g0444L7961j82653Q4739o5875R7107J05622j86677J64992j07042j2149M101
$$ -70444 -32483 -215136 -130397 -196272 -99165 6457 -180220 -15228 -122270 -134419 -130318
10229a30318l6984J09300p9313k8071r5709J43195m7850Q5348j5203m872J9995
$$ -130318 -167302 -58002 -137315 -165386 -261095 -117900 -165750 -80402 -95605 -100477 -80482
10218h0482J094l4058J4531p4298O6044Q91N3708n3130k4047L1625R2746q1948
$$ -80482 -79388 -113446 -98915 -173213 -107169 -106278 -52570 -105700 -129747 -98122 -5376 -87324
10206h7324R9386k1172p7609j02691K80281j85737J7569l8383M7191L2281j61680
$$ -87324 12062 -9110 -86719 -189410 90871 -94866 -77297 -115680 -68489 -36208 -197888
10195a97888J02226j14304o799P3051J16302P66r0142J23449r4536r254j819N8468
$$ -197888 -95662 -209966 -216765 -143714 -27412 -26646 -116788 6661 -87875 -97129 -98948 -40480
10183d0480L0453m0016j25264K07296k04650R9818r2764K0128K5764J54270j34890
$$ -40480 -10027 -50043 -175307 31989 -172661 -72843 -165607 -145479 -119715 34555 -100335
10172a00335J6242o1967J67391n5026l4482k8597l4304l8362M406j6718Q845R7173
$$ -100335 -84093 -146060 21331 -33695 -68177 -96774 -131078 -169440 -165034 -181752 -172907 -75734
10160g5734j23586N8271L3357O0776j34681J01493l117M9477q34o5843k7092L4688
$$ -75734 -199320 -141049 -107692 -46916 -181597 -80104 -83221 -33744 -34578 -100421 -127513 -92825
10148i2825q341R3884j86357J51830j46961J33325j1921M5076j07741J31103j69283
$$ -92825 -101166 -7282 -193639 -41809 -188770 -55445 -67366 -22290 -130031 1072 -168211
10137a68211O8093p7914J18820p8022J17558q9458n8443N5519M1343j27477N0085
$$ -168211 -100118 -178032 -59212 -137234 -19676 -109134 -167577 -112058 -70715 -198192 -148107
10126a48107N685j5040L5670J02927k29887J43159m8333j4838P6110j54075j4045
$$ -148107 -142422 -157462 -121792 -18865 -248752 -105593 -153926 -168764 -92654 -246729 -260774
10115b60774o0084J65563M9784r0307K8045l3323O843N7965O4699o260q2425J47133
$$ -260774 -320858 -155295 -105511 -195818 -167773 -201096 -194253 -136288 -71589 -77849 -160274 -13141
10103a3141j91411J43960j8286j03765j0533Q7963k1634m4233J03464j27082j511
$$ -13141 -204552 -60592 -78878 -182643 -193176 -105213 -126847 -171080 -67616 -194698 -196209
10092a96209M2841j02975N5054J0735N1256k1270j4455O0599m438L6883p321q4896
$$ -196209 -153368 -256343 -201289 -190554 -139298 -160568 -175023 -114424 -118862 -81979 -89300 -174196
10080a74196K9731J3786J16488j7094j2147J9825k8430p4525J76791j8632m2876
$$ -174196 -144465 -130679 -14191 -31285 -43432 -23607 -52037 -126562 50229 31597 -11279
10069a1279p8646l7753O711K993O1868n3605J19038j4469p7066p3614J23235o054
$$ -11279 -89925 -127678 -120967 -117974 -56106 -109711 9327 -5142 -82208 -155822 -32587 -38641
10057c8641o8242J02090o6053M5692p6001K9824K1698n8822K8045M3972o785j3352
$$ -38641 -106883 -4793 -70846 -25154 -101155 -71331 -49633 -108455 -80410 -36438 -43223 -56575
10045e6575j19834Q1138k3183l4569J63774q9900N9590j43365J23134L3475o8605
$$ -56575 -176409 -95271 -118454 -153023 10751 -79149 -19559 -162924 -39790 -6315 -74920
10034g4920R1038r5931J7450q361n8843L9433O1732m1649L3102l0101Q1020l1912
$$ -74920 16118 -79813 -62363 -70724 -129567 -90134 -28402 -70051 -36949 -67050 13970 -17942
10022a7942Q1004N8285L8149L0230n07N9795j57746J57323q9267M497p1931p3104
$$ -17942 63062 121347 159496 189726 189219 249014 91268 248591 159324 163821 91890 18786
10010A8786Q6219j33378Q4430j57252J07611P3864j61374M0175n7901r8720J48637
$$ 18786 105005 -28373 56057 -101195 6416 80280 -81094 -40919 -98820 -197540 -48903
9999d8903j7565j14139J47819p7574P2331j10129J12593m3490k5367J13549K3188
$$ -48903 -66468 -180607 -32788 -110362 -38031 -148160 -35567 -79057 -104424 9125 32313
9988C2313r8908r836j20267J38828r755J21080j90212J09153q0326O3905k3522
$$ 32313 -66595 -76431 -196698 -57870 -67625 53455 -136757 -27604 -107930 -44025 -67547
9977f7547o4713J36309p0926Q1283O8763k47940J83688j00206P2267L1168q2449
$$ -67547 -132260 4049 -66877 14406 83169 -164771 18917 -81289 -9022 22146 -60303
9966f0303L629l451N0748o7796J4238J74730j58487J70363j27529m9783k480O357
$$ -60303 -56674 -60125 -9377 -77173 -62935 111795 -46692 123671 -3858 -53641 -56121 -49764
9954d9764j9434P8505R702j3916j80545J88939q2310r4316N6150P6963J30408
$$ -49764 -69198 9307 19009 5093 -175452 13487 -68823 -163139 -106989 -30026 100382
9943A00382j9528j51766p406J3490P7689j30437Q0131Q9317k29237J43321m5148
$$ 100382 80854 -70912 -78318 -64828 12861 -117576 -37445 51872 -177365 -34044 -79192
9932g9192J3350K3329M3875j5941m2862R4363j09125K6935o9138N946N3211J12665
$$ -79192 -65842 -42513 1362 -14579 -57441 36922 -72203 -45268 -114406 -108460 -55249 57416
9920E7416K0473j25814N4109L752o1287J59190p0713L8015j33066K6175M7275
$$ 57416 77889 -47925 6184 9936 -51351 107839 37126 75141 -57925 -31750 15525
9909A5525P9140l7346K0213L6539L7746L5068k2462P6692J19076j4329o9366K1444
$$ 15525 94665 57319 77532 114071 151817 186885 164423 241115 360191 345862 276496 297940
9897B97940j35670R9630n3709R4081j06754J13423M7751K4962j12952M4352o6847
$$ 297940 162270 261900 208191 302272 195518 308941 356692 381654 268702 313054 246207
9886B46207R3084J14348K25134J42998P9862N5259R7891j83103L063J35920k2559
$$ 246207 339291 453639 678773 821771 901633 956892 1054783 871680 874743 1010663 988104
9875I88104j02950l5319q1977j07346L5919n5790N3128o8878l2611l300j07574
$$ 988104 885154 849835 767858 660512 696431 640641 693769 624891 592280 588980 481406
9864D81406k068k7003J34960o2235j4346O3929q6950n8701L1197J42179J32500
$$ 481406 479338 452335 587295 525060 510714 574643 487693 428992 460189 602368 734868
9853G34868M1644K35414K61331J30467J04128O644r7574N5974r7478J8644k57897
$$ 734868 776512 1011926 1273257 1403724 1507852 1514496 1416922 1472896 1375418 1394062 1136165
9842A136165k2505m9463q0210j13772j2688j37171j43144j5867m0773p6822Q263
$$ 1136165 1113660 1064197 983987 870215 857527 720356 577212 561345 520572 443750 452013
9831D52013L6404j04088j30048J36222r1511j1829n830K9271l2457o8540K492
$$ 452013 488417 384329 254281 390503 298992 287163 281333 310604 278147 209607 212099
9820B12099J71200j55131J92272m5065J16353j01697K438n8383j7650l6865O1351
$$ 212099 383299 228168 420440 375375 491728 390031 392469 334086 316436 279571 340922
9809C40922j39337M5027q8770Q534l5390o4215j8960R743J4581m0525j1099J25712
$$ 340922 201585 246612 157842 166376 130986 66771 47811 57554 72135 31610 20511 146223
9797A46223m6578N0227j52246J95361j76819o6574R1343k1805J01574p2515J06799
$$ 146223 99645 149872 -2374 192987 16168 -50406 40937 19132 120706 48191 154990
9786A54990p0311j3062Q1996k1646n0268M2979k1114l3111q3088J01717r4648
$$ 154990 84679 71617 153613 131967 81699 124678 103564 70453 -12635 89082 -5566
9775e566L7979J0844k1162P8352j28451J80058j17737l6800L0512j53044J98691
$$ -5566 32413 43257 22095 100447 -28004 152054 34317 -2483 28029 -125015 73676
9764G3676q3045P1928K4948o5254N7535M9482m6137J6762N80R4417j35432J94614
$$ 73676 -9369 62559 87507 22253 79788 129270 83133 99895 100475 194892 59460 254074
9752B54074k12993J23434K0904n7860q306o3453L5071k4788J22430j8437k08613
$$ 254074 41081 164515 185419 127559 119253 55800 90871 66083 188513 170076 -38537
9741c8537J96947k48090J36585O1135j36618O6320K5999N468k0104p4091P1132
$$ -38537 158410 -89680 46905 108040 -28578 37742 63741 69209 49105 -24986 46146
9730D6146m1348J01122j45579Q1838Q5403j53218k1175m3870J00024J1937O2796
$$ 46146 4798 105920 -39659 42179 127582 -25636 -46811 -90681 9343 21280 84076
9719H4076j45748j9165J17237l6588n6740R1531L3754j5001q0200R4720m1848
$$ 84076 -61672 -80837 36400 -188 -56928 34603 68357 53356 -26844 67876 26028
9708B6028Q625J8315n1226k191L5583K6780K0019j37962J48865Q742O4295j39457
$$ 26028 34653 52968 1742 -449 35134 61914 81933 -56029 92836 101578 165873 26416
9696B6416J4184l5809M6512j32377J68505j7162M4899j09132J0435m2445N0203
$$ 26416 40600 4791 51303 -81074 87431 70269 115168 6036 16471 -25974 24229
9685B4229l7117J83443j71037Q5783r7248K3818J4011O7551k6944m189M4005K640
$$ 24229 -12888 170555 -482 85301 -11947 11871 25882 93433 66489 62300 106305 108945
9673A08945Q7121r2899L9641J71609L3624M5526K09622P9607J1779m8970K37046
$$ 108945 196066 103167 142808 314417 348041 393567 603189 682796 694575 645605 882651
9662H82651O9297r5634J3537k13814J51320j99043O110n3457p1750j4671q8020
$$ 882651 951948 856314 869851 656037 807357 608314 614424 560967 489217 474546 386526
9651C86526k5451N2470k40782O3464R890L6491j3019P8441m1097J2974K8091N8538
$$ 386526 361075 413545 172763 236227 246117 282608 269589 348030 306933 319907 347998 406536
9639D06536J04485r200P8007K45966J14055L8427M6053k0332q5674p1299m9315
$$ 406536 511021 501821 579828 825794 939849 978276 1024329 1003997 918323 847024 797709
9628G97709J16628p0884p2813k00558L641r4052j10709m69j06648j15026j0031
$$ 797709 914337 843453 770640 570082 573723 479671 368962 368493 261845 146819 136788
9617A36788J01744r4482r0501m7002M7978J4464p6502J69042j39608J61982j82417
$$ 136788 238532 144050 53549 6547 54525 68989 -7513 161529 21921 183903 1486
9606A486R3281K6664k5877L0399j2456q4130M7439N2737M231L92j02001m424M5055
$$ 1486 94767 121431 95554 125953 113497 29367 76806 129543 133774 134166 32165 27741 72796
9593G2796k5761J02920m8538m1438r411l9305n0996J54288N649r5260J0468R680
$$ 72796 47035 149955 101417 59979 50568 11263 -39733 114555 120204 24944 35412 45092
9581D5092P4516m3928P2634n0292M6069m5659j9509n7737R1397r1652M4126l6715
$$ 45092 119608 75680 148314 98022 144091 98432 78923 21186 112583 20931 65057 28342
9569B8342P0710q1095J09439j2226m0385O729k7806m5523J5628l1854J57084j72617
$$ 28342 99052 17957 127396 115170 74785 81514 53708 8185 23813 -8041 149043 -23574
9557b3574J69864j01065K4255n0268O142l7302J24352o766N821j03163M1977J8590
$$ -23574 146290 45225 69480 19212 25354 -11948 112404 105638 111459 8296 50273 68863
9545F8863R1976j25634J61954j01944K7584N9857r8271N9482N0651o6279K8429
$$ 68863 160839 35205 197159 95215 122799 182656 84385 143867 194518 128239 156668
9534A56668l8654q8016K6244J03379J11104l6267j43663J5900M3845n5993Q8981
$$ 156668 118014 29998 56242 159621 270725 234458 90795 106695 150540 94547 183528
9523A83528j2122O8994j0677L5804q4827o2545k0353J70609L9884j5891r5258
$$ 183528 171406 240400 229723 265527 180700 118155 97802 268411 308295 292404 197146
9512A97146O4947n6531J28081j44372N2644O410J71048j25447J5791j7662K5796
$$ 197146 262093 205562 333643 189271 241915 248325 419373 293926 309717 292055 317851
9501C17851j9742K79789Q9781j29718L7781j5934M7219Q8706o2253P7825j26183
$$ 317851 298109 577898 667679 537961 575742 559808 607027 695733 633480 711305 585122
9490E85122P6234j13145N828J10058k4806L3375j689o652p4940K5660r8568N8824
$$ 585122 661356 548211 554039 664097 639291 672666 670977 664325 589385 615045 516477 575301
9478E75301J50060o4634j0831k1681q5181J62346J01169p474m1176J18280J1536
$$ 575301 725361 660727 649896 628215 543034 705380 806549 799075 757899 876179 887715
9467H87715O2644j21855J22445J18996o6010J21090M5927M9606J07697p5705R067
$$ 887715 950359 828504 950949 1069945 1003935 1125025 1170952 1220558 1328255 1252550 1261617
9456A261617n3413J39682p4916J1957R9821l5839m2227Q1538M5668J06814Q6371
$$ 1261617 1208204 1347886 1272970 1284927 1384748 1348909 1306682 1388220 1433888 1540702 1627073
9445A627073N4940K7084K65639o1395J3976j70866K6923q6849p8038j914k0059
$$ 1627073 1682013 1709097 1974736 1913341 1927317 1756451 1783374 1696525 1618487 1616573 1596514
9434A596514J10185o4052L1341j64150M5977j23177L6163p6394N6099K3657J34035
$$ 1596514 1706699 1642647 1673988 1509838 1555815 1432638 1468801 1392407 1448506 1472163 1606198
9423A606198n5513J13480N6372N9748r0771P1986n3816L9562J10757K98441o6550
$$ 1606198 1550685 1664165 1720537 1780285 1689514 1761500 1707684 1747246 1858003 2156444 2089894
9412B089894N6425j01373j2142j27779n6472j06780j60082j3956r1466j27752
$$ 2089894 2146319 2044946 2032804 1905025 1848553 1741773 1581691 1567735 1476269 1348517
9402A348517K5511j12567p2197M9553j57795J04765j87631R5L1406k26378K08162
$$ 1348517 1374028 1261461 1189264 1238817 1081022 1185787 998156 998251 1029657 803279 1011441
9391A011441M7521m6400N2978r5348J9316J8229R5577q5847L5407o8750L5890
$$ 1011441 1058962 1012562 1065540 970192 989508 1007737 1103314 1017467 1052874 984124 1020014
9380A020014m9544J50782l0006N1006j3692M3213j70749K596K1936M8424N5897
$$ 1020014 970470 1121252 1091246 1142252 1128560 1171773 1001024 1003620 1025556 1073980 1129877
9369A129877r120R8398j12789L0291J43309L3501p9699Q7476l9575j9963P128
$$ 1129877 1120757 1219155 1106366 1136657 1279966 1313467 1233768 1321244 1281669 1261706 1268834
9358A268834N5593J12112j1687p1510o471J17351J22341Q8217L00717O0638J14982
$$ 1268834 1324427 1436539 1424852 1353342 1346871 1464222 1586563 1674780 1975497 2036135 2151117
9347B151117Q4638n1842p7085j5387O0014m4J29738J66361l8127q8295o0025k1897
$$ 2151117 2235755 2183913 2106828 2091441 2151455 2151411 2281149 2447510 2409383 2321088 2261063 2239166
9335B239166j14616j06556O0799o0740p2745p1193J25885Q952p5997K06082K4858
$$ 2239166 2124550 2017994 2078793 2018053 1945308 1874115 2000000 2008952 1932955 2139037 2163895
9324B163895L6162N6861J30086J01651K3907K28928J41308K25619J94398J12256
$$ 2163895 2200057 2256918 2387004 2488655 2512562 2741490 2882798 3108417 3302815 3415071
9314C415071j14447J03054j01960J45184k06411k1187N521j43297n0273o2928
$$ 3415071 3300624 3403678 3301718 3446902 3240491 3219304 3224825 3081528 3031255 2968327
9304B968327P9166J9468m4536k2791J97004m2805O3051Q1492J02676K7301J8347
$$ 2968327 3047493 3066961 3022425 2999634 3196638 3153833 3216884 3298376 3401052 3428353 3446700
9293C446700k02306p9304n2289P7295r923p120K14052J44839M8283P2779J29327
$$ 3446700 3244394 3165090 3112801 3190096 3180173 3173053 3387105 3531944 3580227 3653006 3782333
9282C782333J44926K9090J2820l3737p724p5415j05845J0043j08842J6918q1073
$$ 3782333 3927259 3956349 3969169 3935432 3927708 3852293 3746448 3756491 3647649 3664567 3583494
9271C583494o3052O4334j855J77750j13042P6302j3193J5654O6490l8528J18821
$$ 3583494 3520442 3584776 3582921 3760671 3647629 3723931 3710738 3726392 3792882 3754354 3873175
9260C873175L6537L11726J06796L6050R9929L5760J09594J17617J22652K44611
$$ 3873175 3909712 4221438 4328234 4364284 4464213 4499973 4609567 4727184 4849836 5094447
9250E094447K6495J32797r0707q097q6461J25038r2933Q5986o3055j2372n2528
$$ 5094447 5120942 5253739 5163032 5154935 5068474 5193512 5100579 5186565 5123510 5111138 5058610
9239E058610K06450m9618J49796N2025R9953J34631q73K69714j02707L16822L2558
$$ 5058610 5265060 5215442 5365238 5417263 5517216 5651847 5650974 5920688 5817981 6134803 6167361
9228F167361M7076J74898J99521J38644J97548J08750J32988J07013Q9650J03491
$$ 6167361 6214437 6389335 6588856 6727500 6925048 7033798 7166786 7273799 7363449 7466940
9218G466940J03330K71851J36549K17491l2868J64819R6030J10309K92918L7296
$$ 7466940 7570270 7842121 7978670 8196161 8163293 8328112 8424142 8534451 8827369 8864665
9208H864665K86610K33040J11411J77652K77741L38414L45511K99692K95630K66020
$$ 8864665 9151275 9384315 9495726 9673378 9951119 10289533 10635044 10934736 11230366 11496386
9198A1496386O90843L11864O77518O79547P17738R01397J308680K083854K128080
$$ 11496386 12187229 12499093 13176611 13856158 14573896 15475293 16783973 18867827 20995907
9189B0995907J908289J782226J706667K278007K979991L798036L338547J595755
$$ 20995907 22904196 24686422 26393089 28671096 31651087 35449123 38787670 40383425
9181D0383425K05128j340919j766287j632541j340377j128391j404732j355029
$$ 40383425 40588553 39247634 37481347 35848806 34508429 33380038 31975306 30620277
9173C0620277j036989p99183k84080O03235J252649J627563J727362J385673J378805
$$ 30620277 29583288 28784105 28500025 29103260 30355909 31983472 33710834 35096507 36475312
9164C6475312J687590K741676L576605M429245M705892M296557L981606L462942
$$ 36475312 38162902 40904578 44481183 48910428 53616320 57912877 61894483 65357425
9156F5357425M017316O089686O419103O151722M842701M302929L907025K717009
$$ 65357425 69374741 75464427 81883530 88035252 92877953 97180882 101087907 103804916
9148A03804916k32129l439298o131309o524747n421807l324917l50412L992938
$$ 103804916 103572787 100133489 94002180 87477433 82055626 78730709 78380297 82373235
9140H2373235P678605J0435753J1088780J0510790J0299428J2495833K2373561
$$ 82373235 90051840 100487593 111576373 122087163 132386591 144882424 167255985
9133A67255985L7021707N4457910O3834352N8097061M1052707K2994787N097603
$$ 167255985 204277692 258735602 322569954 380667015 421719722 444714509 449812112
9126D49812112o962638k0246110l5356724m6155846n1202767n0174648m3146692
$$ 449812112 442849474 422603364 387246640 341090794 289888027 239713379 196566687
9119A96566687l5376637k7864453k0855165j4867869r333607l712689J683696
$$ 196566687 161190050 133325597 112470432 97602563 88268956 84556267 86239963
9112H6239963Q123967J2823686J2325505P073075K71790m065997l885081j403682
$$ 86239963 94363930 107187616 119513121 126586196 126857986 122791989 118906908 117503226
9104A17503226m93753j640962m695031p767448r133390r249734p914774o052483
$$ 117503226 117009473 115368511 110673480 102906032 93772642 84522908 76608134 70555651
9096G0555651m540934l746289k383926q66407P41031J576066J414790K301658
$$ 70555651 66014717 62268428 59884502 59018095 59759126 61335192 62749982 65051640
9088F5051640O602146R703113P226785Q77845l540124o452900o457640n714507
$$ 65051640 71653786 81356899 88583684 89461529 85921405 79468505 73010865 67296358
9080F7296358m101771k257070j277196K80366K07632j112022k954236m744989
$$ 67296358 63194587 60937517 59660321 59940687 60148319 59036297 56082061 51337072
9072E1337072n578828n437373m986297l947951k915036k074041r87816m15379
$$ 51337072 45758244 40320871 35334574 31386623 28471587 26397546 25409730 24994351
9064B4994351m08163j75699M1609J32391r2200p25530j055964q97771k45057N81051
$$ 24994351 24586188 24410489 24452098 24584489 24492289 23766759 22710795 21813024 21567967 22149018
9054B2149018P99206N17941k78325j197366j722174j855656j589468j286460p11696
$$ 22149018 22948224 23466165 23187840 21990474 20268300 18412644 16823176 15536716 14825020
9045A4825020r9866R9499j30542o85828p75312j107613j068457p91204q06778
$$ 14825020 14725154 14824653 14694111 14008283 13232971 12125358 11056901 10265697 9458919
9036I458919n67461m30999l71838m54172l88085k44994j13348k12638k16887j33538
$$ 9458919 8891458 8460459 8088621 7634449 7246364 7001370 6888022 6675384 6458497 6324959
9026F324959j94866k87749j70300j29593l4554j85135j30462q7547k68704k54988
$$ 6324959 6130093 5842344 5672044 5542451 5507897 5322762 5192300 5104753 4836049 4581061
9016D581061j16413m0678q4789k7368r9832j72598j19240j51935m3947k01929
$$ 4581061 4464648 4423970 4339181 4311813 4211981 4039383 3920143 3768208 3724261 3522332
9006C522332o973n9031j50214j74532J3240j89366N1167j06006j68419q5814o7963
$$ 3522332 3515359 3456328 3306114 3131582 3144822 2955456 3006623 2900617 2732198 2646384 2578421
8995B578421q3471P0578j20663N6230j77413J7438j05028k5490q3646k5831l352
$$ 2578421 2494950 2565528 2444865 2501095 2323682 2341120 2236092 2210602 2126956 2101125 2097773
8984B097773n6781q246j80085O5460j56523n1870j713j1821n2237n8926j51439
$$ 2097773 2040992 2032746 1852661 1918121 1761598 1709728 1708015 1696194 1643957 1585031 1433592
8973A433592J08966j66314N0702j6630r276l1349l7655m4831q7291j3948R793
$$ 1433592 1542558 1376244 1426946 1410316 1401040 1369691 1332036 1287205 1199914 1185966 1195759
8962A195759k2571o2417p9254l1803m8062M1493p2492p421N6066n0942m1959q1830
$$ 1195759 1173188 1110771 1031517 999714 951652 993145 920653 913232 969298 918356 876397 794567
8950G94567o2657J51859j48069J20629n2332j16644j7086j3635O1276k5757J8126
$$ 794567 731910 883769 735700 856329 803997 687353 670267 656632 717908 692151 710277
8939G10277O0252j33426n6306J5928J29219j55462l3391o1528j2085j34959P4399
$$ 710277 770529 637103 580797 596725 725944 570482 537091 475563 463478 328519 402918
8928D02918o530p0975K5489K0353m1401p4274R4634j31017Q2013L2489k4811q869
$$ 402918 396388 325413 350902 371255 329854 255580 350214 219197 301210 333699 308888 300019
8916C00019p307q421l8478N5236q6743J9903j4013j1478p9083l4647P9021j8966
$$ 300019 292712 284291 245813 301049 214306 234209 220196 208718 129635 94988 174009 155043
8904A55043O0009m0290m6414j12374J99595j8810M3784j17887K1827L5067m6345
$$ 155043 215052 174762 128348 15974 215569 196759 240543 122656 144483 179550 133205
8893A33205J6485j26018P4516m7927O2551p6043J22119q1060J2037J8599l9797
$$ 133205 149690 23672 98188 50261 112812 36769 158888 77828 89865 108464 68667
8882F8667J0032m171P2703o1320K6421k5732l093J40581k24967K1780L0129m737
$$ 68667 78699 74528 147231 85911 112332 86600 83507 224088 -879 20901 51030 46293
8870D6293n4078M5325k1499Q447R9410J03317j0519J29165L5215R809r1965J24432
$$ 46293 -7785 37540 16041 24488 123898 227215 216696 345861 381076 390885 298920 423352
8858D23352J3030r7220N5790m7243j06091j6777P102j0306m4395Q1888j76282
$$ 423352 436382 339162 394952 347709 241618 224841 231943 221637 177242 259130 82848
8847H2848J07748j22197J05486q1946N2752L6038r2106J29649q2746R1925J18521
$$ 82848 190596 68399 173885 91939 144691 180729 88623 218272 135526 227451 345972
8836C45972K4070M1486J55468J31323J38871Q0314J78899o1949J32736j15190
$$ 345972 370042 411528 566996 698319 837190 917504 1096403 1034454 1167190 1052000
8826A052000K9849r3297K4885Q8763r4102K4630l2729j36404k553p0092j31178
$$ 1052000 1081849 988552 1013437 1102200 1008098 1032728 999999 863595 861042 790950 659772
8815F59772j63666p9180n5296j66825J4053m4424L355J03284o7259J24687o7466
$$ 659772 496106 416926 361630 194805 208858 164434 167789 271073 203814 328501 261035
8804B61035J94014K2966J54198M7689M126J35271k9988J13069K8197r0924n0946
$$ 261035 455049 478015 632213 679902 684028 819299 789311 902380 930577 839653 788707
8793G88707m4813O9123j48764P002j63279j66352M5968P16N9931p1904l2246P186
$$ 788707 743894 813017 664253 671255 507976 341624 387592 388308 448239 376335 344089 351275
8781C51275k54870Q9606m9333j25673Q648n7060K15589j11998J70763j43043n6459
$$ 351275 96405 186011 136678 11005 19653 -37407 178182 66184 236947 93904 37445
8770C7445K9733K3120P5599J33063j28933j1237r3001K21240k61087J36409L8562
$$ 37445 67178 90298 165897 298960 170027 158790 65789 287029 25942 162351 200913
8759B00913j03759m070j17811K9184L185q6189J88591j00625o2575m5896M4194
$$ 200913 97154 93084 -24727 4457 7642 -78547 110044 9419 -53156 -99052 -54858
8748e4858p2653q075J04772n7193j9342k8303M1765j955P9035m703L1985j27515
$$ -54858 -127511 -135586 -30814 -88007 -107349 -135652 -93887 -95842 -16807 -21510 10475 -117040
8736a17040J12526r2959N0685j28474J28991j2047L5178M6768q1059o9408K7098
$$ -117040 -4514 -97473 -46788 -175262 -46271 -58318 -23140 23628 -57431 -126839 -99741
8725i9741j22224K3499J3015L8571J1345M6336j67800J51353Q9119r9375r9324
$$ -99741 -221965 -198466 -185451 -146880 -135535 -89199 -256999 -105646 -16527 -115902 -215226
8714b15226J26025m7520J0623M1216j23230J7280N4971n8782J17074j19256k6971
$$ -215226 -89201 -136721 -126098 -84882 -208112 -190832 -135861 -194643 -77569 -196825 -223796
8703b23796J29257l0983o0561m8110Q3751K7040q1519m7947M3186l0202J8544
$$ -223796 -94539 -125522 -186083 -234193 -150442 -123402 -204921 -252868 -209682 -239884 -221340
8692b21340P7202r6645J12841m0794K9917m0675j26485J12311L4912Q2234j08150
$$ -221340 -144138 -240783 -127942 -168736 -138819 -179494 -305979 -193668 -158756 -76522 -184672
8681a84672m3444P3482q5292J5261K9928J34226j02636m0160Q9010J0880J4090
$$ -184672 -228116 -154634 -239926 -224665 -194737 -60511 -163147 -203307 -114297 -103417 -89327
8670h9327O8667J27888n114L1709r9146j32709p8816M8312J9991J3888o5238Q678
$$ -89327 -20660 107228 102114 133823 34677 -98032 -176848 -128536 -108545 -94657 -159895 -151217
8658a51217J70p0198O8151m7776J16006j14686J8883j24753j1282K5193J01723
$$ -151217 -151047 -221245 -153094 -200870 -84864 -199550 -180667 -305420 -316702 -291509 -189786
8647a89786J8185J6709j1404j12439R7064o2903M8000l0676J5701J3712q4164
$$ -189786 -171601 -154892 -166296 -278735 -181671 -244574 -196574 -227250 -211549 -197837 -282001
8636b82001O2334j55803K38005K4772Q917K739p0817m6596j2888k5063O6466k5386
$$ -282001 -219667 -375470 -137465 -112693 -103776 -101037 -171854 -218450 -231338 -256401 -189935 -215321
8624b15321Q200J23946m6270k0890k8738J2753o6828k9350J36462j5007m2547
$$ -215321 -207121 -83175 -129445 -150335 -179073 -166320 -233148 -262498 -126036 -141043 -183590
8613a83590l0305j9360j4604J87322k3159j36691k2038j5641j3181L2821L6121
$$ -183590 -213895 -233255 -247859 -60537 -83696 -220387 -242425 -258066 -271247 -238426 -202305
8602b02305r6614J22771K9318j05144n3232J51465l9861q7113R7182q9054J23609
$$ -202305 -298919 -176148 -146830 -251974 -305206 -153741 -193602 -280715 -183533 -272587 -148978
8591a48978O947o0753P3353j74923Q7569l2259J22785n8747L4444j001o9619M0107
$$ -148978 -142031 -202784 -129431 -304354 -216785 -249044 -126259 -185006 -150562 -151563 -221182 -181075
8579a81075J647N2968n7671N777l9431P0562M435j4057n2029J0703j0567l6944
$$ -181075 -179428 -126460 -184131 -178354 -217785 -147223 -142788 -156845 -208874 -198171 -208738 -245682
8567b45682P7030k8811l7338p9749J75622L1159r4594j4555M8459q603p6896L7895
$$ -245682 -168652 -197463 -234801 -314550 -138928 -107769 -202363 -216918 -168459 -177062 -253958 -216063
8555b16063K1710M0398q1340J7027K9242o9617o7712N6320P8036M5781r0068J42097
$$ -216063 -194353 -153955 -235295 -218268 -189026 -258643 -326355 -270035 -191999 -146218 -236286 -94189
8543i4189j44113l8777K6073N3203p7081N0603m4382R4885k00178p08495J115490
$$ -94189 -238302 -277079 -251006 -197803 -274884 -224281 -268663 -173778 -373956 -1082451 33039
8532C3039r0924j15529J71254j16787m5801n472l704j3233J32633q5161K5566
$$ 33039 -57885 -173414 -2160 -118947 -164748 -170220 -173924 -187157 -54524 -139685 -114119
8521a14119r4774k7134J7992J5053O2530K4827k5573o8743O737j00470P2442J44567
$$ -114119 -208893 -236027 -218035 -202982 -140452 -115625 -141198 -209941 -203204 -303674 -231232 -86665
8509h6665o2777m2798j6926N1784M890j05775J22147Q5545j52855J4563k2544
$$ -86665 -149442 -192240 -209166 -157382 -152492 -258267 -136120 -50575 -203430 -188867 -211411
8498b11411o8482p806J13757p30M9365N6450q3494k6883m696l4904O4624O2497
$$ -211411 -279893 -287699 -173942 -174672 -125307 -68857 -152351 -179234 -183930 -218834 -154210 -91713
8486i1713j36229j5099j5656N1550L0271Q2435p4930k029O8240K398o4653o2126
$$ -91713 -227942 -243041 -258697 -207147 -176876 -94441 -169371 -171400 -103160 -100762 -165415 -227541
8474b27541P0642m0556O7878P3839j67032N5662N7028j27946O6534O210R120l6832
$$ -227541 -156899 -197455 -129577 -55738 -222770 -167108 -110080 -238026 -171492 -165282 -156162 -192994
8462a92994P2349j20755J04912n2221M1995L999Q4475j35361q0242k326J64017
$$ -192994 -120645 -241400 -136488 -188709 -146714 -142715 -58240 -193601 -273843 -276169 -112152
8451a12152j87831J95129M877p780j45724R1071l0816N7182o7663J21847o3265
$$ -112152 -299983 -104854 -99977 -107757 -253481 -162410 -193226 -136044 -203707 -81860 -145125
8440a45125o4384k9826n9035R0620l408J2140P4189m0359q2778Q301R6143q4446
$$ -145125 -209509 -239335 -298370 -207750 -211158 -199018 -124829 -165188 -247966 -239665 -143522 -227968
8428b27968J80342k3217p5343m7244k8680J0893r3515J40022R9246p8170m8133
$$ -227968 -47626 -70843 -146186 -193430 -222110 -211217 -304732 -164710 -65464 -143634 -191767
8417a91767k459r7312J83336L6538p8543L8458r1354N2249n0029p9236J77987
$$ -191767 -194226 -291538 -108202 -71664 -150207 -111749 -203103 -150854 -200883 -280119 -102132
8406a02132L734m8198k0793p698Q305k9154N0630O6641n3080k4175k7155L7602
$$ -102132 -98398 -146596 -167389 -175087 -166782 -195936 -145306 -78665 -131745 -155920 -183075 -145473
8394a45473j66944J39469Q8952r1149j81156J59409R129l2898K6448L7923N4684
$$ -145473 -312417 -172948 -83996 -175145 -356301 -196892 -187763 -220661 -194213 -156290 -101606
8383a01606j06145o0166J38158o7326l0152J21728J3583q5994L7285j27259Q3272
$$ -101606 -207751 -267917 -129759 -197085 -227237 -105509 -91926 -177920 -140635 -267894 -184622
8372a84622J5199M9194m1757L1083l4426L7552q0453l0642J12137L2190j02744
$$ -184622 -169423 -120229 -161986 -130903 -165329 -127777 -208230 -238872 -126735 -94545 -197289
8361a97289M8422L078O908j04450K0810p1647J52502P4973r7984K6010j35887
$$ -197289 -148867 -145789 -138881 -243331 -222521 -294168 -141666 -66693 -164677 -138667 -274554
8350b74554L166J54812M7537k07622J46773N6344j49145L1016R1240K8473l5059
$$ -274554 -271388 -116576 -69039 -276661 -129888 -73544 -222689 -191673 -100433 -71960 -107019
8339a07019L7803p6855r0392L2773J16734j00735J13699l0761p2659K765l0200
$$ -107019 -69216 -146071 -236463 -203690 -86956 -187691 -73992 -104753 -177412 -174647 -204847
8328b04847l1566L8711j9699K8637M5974M905m4299P9118j12229J8546N8040k1093
$$ -204847 -236413 -197702 -217401 -188764 -142790 -137885 -182184 -103066 -215295 -196749 -138709 -159802
8316a59802l7396j09331K22813p5094l9788L8167J9727K2372o8328O1817J649
$$ -159802 -197198 -306529 -83716 -158810 -198598 -160431 -140704 -118332 -186660 -124843 -123194
8305a23194L4914J737m2989N9454j17379J15528j23855o645J13520K7854j58643
$$ -123194 -88280 -86543 -129532 -70078 -187457 -71929 -195784 -202429 -88909 -61055 -219698
8294b19698J17611p3873R0177n8620r3923R020K3471r983J5166O451L1736q740
$$ -219698 -102087 -175960 -85783 -144403 -238326 -229306 -205835 -215818 -200652 -194201 -162465 -171205
8282a71205J01184r5413r1216P9688O8771q2770P3870k3658M3968q0621n4031
$$ -171205 -70021 -165434 -256650 -176962 -108191 -190961 -117091 -140749 -96781 -177402 -231433
8271b31433L7384o422j5641P2536M5939j08550O563k6684O7315k6510L5950l5785
$$ -231433 -194049 -200471 -216112 -143576 -97637 -206187 -199624 -226308 -158993 -185503 -149553 -185338
8259a85338P3592j17277N0223L3647j18275N9615J17021n1858M4301j04777J06739
$$ -185338 -111746 -229023 -178800 -145153 -263428 -203813 -86792 -138650 -94349 -199126 -92387
8248i2387j65446K60972j44005L0033k5940L7034N754o3221L1692O6640p2211
$$ -92387 -257833 3139 -140866 -110833 -136773 -99739 -93985 -157206 -125514 -58874 -131085
8237a31085Q111l3119l4359J5508M8376l6334l7184L6005j1321m3892L3357M5832
$$ -131085 -122974 -156093 -190452 -174944 -126568 -162902 -200086 -164081 -175402 -219294 -185937 -140105
8225a40105q112Q3451j67474Q4819l3219O6371q1990J65232k05934J74586j09338
$$ -140105 -148217 -64766 -232240 -147421 -180640 -114269 -196259 -31027 -236961 -62375 -171713
8214a71713J4069k1673k5144k3775J77353r8580j5626o8037K27424j42153j06440
$$ -171713 -157644 -179317 -204461 -228236 -50883 -149463 -165089 -233126 -5702 -147855 -254295
8203b54295J10569m5637n516n717P9315j08581L9609Q9790k0337P348n9352P07643
$$ -254295 -143726 -189363 -194879 -200596 -121281 -229862 -190253 -100463 -120800 -113452 -172804 534839
8191E34839q27492J79575O512j3266Q6541j51534M9075M7163j35715M439J02268
$$ 534839 -292653 -113078 -106566 -119832 -33291 -184825 -135750 -88587 -224302 -219863 -117595
8180a17595K8575L2688M6157p3550j34750O0857l6288J88762j39155r8753L7225
$$ -117595 -89020 -56332 -10175 -83725 -218475 -157618 -193906 -5144 -144299 -243052 -205827
8169b05827J36663r5303N5910J0247l7590Q3859j66367J27966q8501L1857J0059
$$ -205827 -69164 -164467 -108557 -98310 -135900 -52041 -218408 -90442 -178943 -147086 -137027
8158a37027M7306o2716j0143m768M9548o9035J25462j25557r1630J19329k7378
$$ -137027 -89721 -152437 -162580 -167348 -117800 -186835 -61373 -186930 -278560 -159231 -186609
8147a86609K0270k457J0330L0299O2183n0887j7346K6889j7222o2184O6203P1264
$$ -186609 -166339 -168796 -158466 -128167 -65984 -116871 -134217 -107328 -124550 -186734 -120531 -49267
8135d9267m4997q2049J36005O5004j61461J9467J15093j25511N8356n7889J4109
$$ -49267 -94264 -176313 -40308 24696 -136765 -117298 -2205 -127716 -69360 -127249 -113140
8124a13140L1184M0465n4287k9894L1048l9218O5132J04607m2385k6113K7879
$$ -113140 -81956 -41491 -95778 -125672 -94624 -133842 -68710 35897 -6488 -32601 -4722
8113d722j54076P8942m9665M7090J1138m4019J06035K040q4824J8649L8870p102
$$ -4722 -158798 -79856 -129521 -82431 -71293 -115312 -9277 -7237 -92061 -73412 -34542 -41644
8101d1644P8708o0868l7298R3953k3420q2640J38197k6819J2495j04598M9008
$$ -41644 37064 -23804 -61102 32851 9431 -73209 64988 38169 50664 -53934 -4926
8090d926n965Q1008q6001j7949J6880M4526o1179K2902Q3101p466r2692J82641
$$ -4926 -10891 70117 -15884 -33833 -16953 27573 -33606 -10704 72397 64931 -27761 154880
8078A54880J4032P0100R2976M3551j38486P1409q5554L9068L0904K5147j11597
$$ 154880 168912 239012 331988 375539 237053 308462 222908 261976 292880 318027 206430
8067B06430k3078l6991o6722Q8199j6034n1960K7581M7922n8971q6576L5084P4040
$$ 206430 183352 146361 79639 167838 151804 99844 127425 175347 116376 29800 64884 138924
8055A38924l9280J71417J43117m7080J85244K53156J06097J70024q0064j23149
$$ 138924 99644 271061 414178 367098 552342 805498 911595 1081619 1001555 878406
8045H78406j48632o1233j50933m4789j25448Q0605k60558O5893l1527j0685r8409
$$ 878406 729774 668541 517608 472819 347371 427976 167418 233311 201784 191099 92690
8034I2690N3911j23803J26829l9045k0000M3480P7140O5143K7491K83813K51258
$$ 92690 146601 22798 149627 110582 90582 134062 211202 276345 303836 587649 838907
8023H38907R9637Q1487P9508n8137j26249j48560j47363q3397j39520j66418k3995
$$ 838907 938544 1020031 1099539 1041402 915153 766593 619230 535833 396313 229895 205900
8012B05900K4908K3638j91124J10385j74319K0992J1942l7670J7745K76L1606
$$ 205900 230808 254446 63322 173707 -612 20380 32322 -5348 12397 12673 44279
8001D4279p8045N2217M0922J06933N2960J61905j172J2983j41904j04622Q3018
$$ 44279 -33766 18451 59373 166306 219266 381171 379999 392982 251078 146456 229474
7990B29474o5858k8904l063n7110j50613J25462r6659p7882Q5103j764m8046k6086
$$ 229474 163616 134712 131649 74539 -76074 49388 -47271 -125153 -40050 -41814 -89860 -115946
7978a15946N9130J1056p0714J85961j84968K4125O0454o4363J9925J1902P0723
$$ -115946 -56816 -45760 -116474 69487 -115481 -91356 -30902 -95265 -75340 -63438 7285
7967G285q9604O9795l0761l1753K7939P8800n4241q3868O0618l0253P7033j58266
$$ 7285 -82319 -12524 -43285 -75038 -47099 31701 -22540 -106408 -45790 -76043 990 -157276
7955a57276N8109O7909j15572J46195j35684J4240m5328K4438J11479o4782k0405
$$ -157276 -99167 -31258 -146830 -635 -136319 -122079 -167407 -142969 -31490 -96272 -116677
7944a16677J02553p8418q5475K9342K1948J2559R9570k9393q5284k8965m4827
$$ -116677 -14124 -92542 -178017 -148675 -126727 -114168 -14598 -43991 -129275 -158240 -203067
7933b03067J59495j14728J77836j28453M6190J7577q6441j8862K1682M4984L9062
$$ -203067 -43572 -158300 19536 -108917 -62727 -45150 -131591 -150453 -128771 -83787 -44725
7922d4725l489r2747M146M046N6120q7733L4416M2036r7436O5738q3636J42880
$$ -44725 -48214 -140961 -136815 -132769 -76649 -164382 -129966 -87930 -185366 -119628 -203264 -60384
7910f0384l7170Q9592j1298j29027O0670O2258j38689J03413k0878M0825j32529
$$ -60384 -97554 -7962 -19260 -148287 -87617 -25359 -164048 -60635 -81513 -40688 -173217
7899a73217r779N5612L3003o3581K06647j89118R7949j60596J7343J6794M6707
$$ -173217 -182996 -127384 -94381 -157962 48685 -140433 -42484 -203080 -185737 -168943 -122236
7888a22236k8318R9824m429r7474J82358j89118P6520J35706j57862J07469p7432
$$ -122236 -150554 -50730 -55159 -152633 29725 -159393 -82873 52833 -105029 2440 -74992
7877g4992j1651k6560l3975Q191J29390o1510J35706m0036j20828J0689Q9522
$$ -74992 -86643 -113203 -147178 -138987 -9597 -71107 64599 24563 -96265 -85576 3946
7866C946q1823O2819o1446l5635M3918n6834N5632L0469P389k16j56005K02733
$$ 3946 -77877 -15058 -76504 -112139 -68221 -125055 -69423 -38954 -31565 -31781 -187786 14947
7854A4947j43387J2174J94365o03K03996l37614o7016j3676n9791J48908j39930
$$ 14947 -128440 -116266 78099 77496 281492 -56122 -123138 -136814 -196605 -47697 -187627
7843a87627J39322o8831o9879j9299R1748L221j2239J7885j2200k2749p211p0432
$$ -187627 -48305 -117136 -187015 -206314 -114566 -111345 -123584 -105699 -117899 -140648 -147859 -218291
7831b18291J14485M9249n640M8049j72824J46739j42314l500J8160M8029l3862
$$ -218291 -103806 -54557 -60197 -12148 -184972 -38233 -180547 -184047 -165887 -117858 -151720
7820a51720Q9252j53233K0118j8962R2627l6436Q4731q4391L2344J6226L7141
$$ -151720 -62468 -215701 -195583 -214545 -121918 -158354 -73623 -158014 -125670 -109444 -72303
7809g2303L1997j53180M7324j3611l096J86058j46744q6842J59429p5220K538
$$ -72303 -40306 -193486 -146162 -159773 -162869 23189 -123555 -210397 -50968 -126188 -123650
7798a23650O8260n3119R1165K9765J5760j75509R8312m8587j20592M1726J81296
$$ -123650 -55390 -108509 -17344 12421 28181 -147328 -49016 -97603 -218195 -176469 4827
7787D827j22673M0202Q4761j11928M2436j01718P3512q0k9642N4460m4760K463
$$ 4827 -117846 -77644 7117 -104811 -62375 -164093 -90581 -90661 -120303 -65843 -110603 -108140
7775a08140K7127o3201L3230J66454k41011N1798o1218N5699O3696J4012k4293
$$ -108140 -81013 -144214 -110984 55470 -185541 -133743 -194961 -139262 -75566 -61554 -85847
7764h5847M1596R095j81868P8841O1929O8128p6742Q3590l9171j94350R0469R5229
$$ -85847 -44251 -35156 -217024 -138183 -76254 -8126 -84868 -1278 -40449 -234799 -144330 -49101
7752d9101Q63J16728j90565O4792m9911l0843P836M0588r4075J41383m2149r121
$$ -49101 -48238 68490 -122075 -57283 -107194 -138037 -130201 -89613 -183688 -42305 -84454 -93575
7740i3575j11791J52884R473k0365P348m546m3168J16499k02060J12324n300J8785
$$ -93575 -205366 -52482 -43009 -63374 -56026 -60572 -103740 12759 -189301 -76977 -82277 -63492
7728f3492P0234l4907N5707k16328K2465n8149J03514Q4152j5587o7498j2406
$$ -63492 6742 -28165 27542 -188786 -166321 -224470 -120956 -36804 -52391 -119889 -132295
7717a32295q3602O7394Q247L653K1950J67092j71855k5981j4582O5542j9078P3171
$$ -132295 -215897 -148503 -140256 -136603 -114653 52439 -119416 -145397 -159979 -94437 -113515 -40344
7705d0344j6134K7064j70079J65907n1382J2007Q7866k05129J47594o8227l2257
$$ -40344 -56478 -29414 -199493 -33586 -84968 -72961 14905 -190224 -42630 -110857 -143114
7694a43114r5303J78014o9704L9165O3970k4289l7804j5292O752J2594j04856
$$ -143114 -238417 -60403 -130107 -90942 -26972 -51261 -89065 -104357 -97605 -85011 -189867
7683a89867J75405o2141j081q7065Q6981p9332o775Q8053L0142j07496P410o869
$$ -189867 -14462 -76603 -77684 -164749 -77768 -157100 -163875 -75822 -45680 -153176 -145766 -152635
7671a52635n497P8002j5346m8400K3140N1152j4821p1651M3585k3490P3201k6549
$$ -152635 -158132 -80130 -95476 -143876 -120736 -69584 -84405 -156056 -112471 -135961 -62760 -89309
7659h9309o3266l4193L2743j44575J45141K5849K0157M5151k9846J3844o1906
$$ -89309 -152575 -186768 -154025 -298600 -153459 -127610 -107453 -62302 -92148 -78304 -140210
7648a40210l8419N1281J07177j24001j1609M9716j17330M6308j4904M1610K0959
$$ -140210 -178629 -127348 -20171 -144172 -155781 -106065 -223395 -177087 -191991 -150381 -129422
7637a29422p2598Q3926M7392j09208J79980j45908K8230M2587j6750J6654j10614
$$ -129422 -202020 -118094 -70702 -179910 70 -145838 -117608 -75021 -91771 -75117 -185731
7626a85731J15137n6036O3600o8837N983P765J38588j12399j6178Q7627j56009
$$ -185731 -70594 -126630 -63030 -131867 -125884 -118119 20469 -91930 -108108 -20481 -176490
7615a76490J33184M6844p2578k5140j27472J98223j22950R5791N2393J0295j33725
$$ -176490 -43306 3538 -69040 -94180 -221652 -23429 -146379 -50588 1805 12100 -121625
7604a21625J11433j17981j8910N7809o853q451K09890j77083J53762k18235R0742
$$ -121625 -10192 -128173 -147083 -89274 -96127 -104578 105312 -71771 81991 -136244 -45502
7593d5502L2145R3747j32101O2218q058k5941j28388J13195j446J39182j38045
$$ -45502 -13357 80390 -51711 10507 2449 -23492 -151880 -38685 -40131 99051 -38994
7582c8994j6922Q6360J9221j03944k7100O9749K00m3147L451p0867M7822k744
$$ -38994 -55916 30444 49665 -54279 -81379 -11630 -11430 -54577 -51126 -121993 -74171 -76915
7570g6915j21183J82614k3991n067m1580O5824n6829L6886l9270N761q5806J05780
$$ -76915 -198098 -15484 -39475 -44542 -86122 -20298 -77127 -40241 -79511 -73750 -159556 -53776
7558e3776l7529J03119j17842K7319r1328O8087O3139q5669k815J21748j56321
$$ -53776 -91305 11814 -106028 -78709 -170037 -101950 -38811 -124480 -127295 -5547 -161868
7547a61868O2183K5876J0662p8109J25646N057j19321J8686L8595K0602j6271
$$ -161868 -99685 -73809 -63147 -141256 -15610 -10553 -129874 -111188 -72593 -51991 -68262
7536f8262o5200L4837J5877K8487r8507R0317n2020P7343P692l6854k6160m8367
$$ -68262 -133462 -98625 -82748 -54261 -152768 -62451 -114471 -37128 -29436 -66290 -92450 -140817
7524a40817J01632O7235n7519j4172J5726k5422r7917K4608J10481q9964k470
$$ -140817 -39185 28050 -29469 -43641 -27915 -53337 -151254 -126646 -16165 -106129 -108599
7513a08599R0333r9232j300J09358p4090N3901r1979J80055j69813J3515M45J6203
$$ -108599 -18266 -117498 -118798 -9440 -83530 -29629 -121608 58447 -111366 -97851 -97406 -81203
7501h1203j8833J82633j63435N8189m1093o6176Q7362L5218k428R8008j21245
$$ -81203 -100036 82597 -80838 -22649 -63742 -129918 -42556 -7338 -9766 88242 -33003
7490c3003n1881m4930K4329K152N6264N0268L9602r9222p0361o764J3789J28031
$$ -33003 -84884 -129814 -105485 -103333 -47069 3199 42801 -56421 -126782 -133546 -119757 8274
7478H274L2499l35m6406j12612N0582J2380K9698q4685P7287M1678j53865J78140
$$ 8274 40773 40438 -5968 -118580 -67998 -55618 -25920 -110605 -33318 8360 -145505 32635
7466C2635K9323j92707J67112p7071K0822o6736K4092l1203R0505q1870Q0781
$$ 32635 61958 -130749 36363 -40708 -19886 -86622 -62530 -93733 -3228 -85098 -4317
7455d317M4442q6530q2512J5380O8076N2660q5343R070j6166n3039L2820l1111
$$ -4317 40125 -46405 -128917 -113537 -45461 7199 -78144 -69074 -85240 -138279 -105459 -136570
7443a36570Q1126l6996M5179j67675J09772J44677o1960o897M4222j3179j1537
$$ -136570 -55444 -92440 -47261 -214936 -105164 39513 -22447 -29344 14878 1699 -9838
7432i838m7449k8178K6755J18191o2083m7239m8593M2037M2674j9888O0522M4359
$$ -9838 -57287 -85465 -58710 59481 -2602 -49841 -98434 -56397 -13723 -33611 26911 71270
7420G1270j5884j8938O075n5830p355j09717J67718k0126l987j78133J12267R655
$$ 71270 55386 36448 42523 -13307 -20662 -130379 37339 17213 13226 -164907 -52640 -42985
7408d2985o9581J70185p1855q7709M3583m3033J433k6519J89380j3937r5724M4113
$$ -42985 -112566 57619 -14236 -101945 -58362 -101395 -99962 -126481 62899 48962 -46762 -2649
7396b649o0073R202q6295K03184j01440j2619m627l7789O3797M0549J6268K4674
$$ -2649 -62722 -53520 -139815 63369 -38071 -50690 -55317 -93106 -29309 11240 27508 52182
7384E2182p3743n4818m1085K6129J6419N2672Q57K1960m5811l4151p1081N7422
$$ 52182 -21561 -76379 -117464 -91335 -74916 -22244 -21387 573 -45238 -79389 -150470 -93048
7372i3048o639P3800n3661N813K3957N8338j09444K2542n6568J57423j00210Q5116
$$ -93048 -99687 -25887 -79548 -73735 -49778 8560 -100884 -78342 -134910 22513 -77697 7419
7360G419N2278j87500J13275q2097M2988l7601Q7154p6440J38811k08137J10323
$$ 7419 59697 -127803 -14528 -96625 -53637 -91238 -4084 -80524 58287 -149850 -39527
7349c9527K2111j9941O8255q3332k1986m1788J9841O6561q4782J12616j6059m2224
$$ -39527 -17416 -37357 30898 -52434 -74420 -116208 -96367 -29806 -114588 -1972 -18031 -60255
7337f0255K4388O80k7765n2231Q4044N5926l5216O36q0487o819Q0654L7601j8490
$$ -60255 -35867 -35187 -62952 -115183 -31139 24787 -10429 -9793 -90280 -97099 -16445 21156 2666
7324B666j17133P36l3279J02384j1126j2380J05637j80245m6421J7150P1689k2032
$$ 2666 -114467 -113731 -147010 -44626 -55752 -68132 37505 -142740 -189161 -172011 -100322 -122354
7312a22354P4249O9005K1761m1632n0310k0237O4945p7787J09487j21050P8246
$$ -122354 -48105 20900 42661 1029 -49281 -69518 -4573 -82360 27127 -93923 -15677
7301a5677j38473O4006R9835p3163J02830o3399N7998r6164l5998M9114l9028
$$ -15677 -154150 -90144 9691 -63472 39358 -24041 33957 -62207 -98205 -49091 -88119
7290h8119M7293O9133N596k64332K23350l695P7968o6978M7132j69381Q2566j6733
$$ -88119 -40826 28307 33903 -230429 -7079 -10774 67194 216 47348 -122033 -39467 -56200
7278e6200o6096L1559R6880P3874j06377p9702Q6075p102P4244j5909l8371m9369
$$ -56200 -122296 -90737 6143 80017 -26360 -106062 -19987 -27089 47155 31246 -7125 -56494
7266e6494P9847p0082l6800K0374J51321M7020J2421r0210J102M1690r2433O0233
$$ -56494 23353 -46729 -83529 -63155 88166 135186 147607 57397 58499 100189 7756 67989
7254F7989M5942O44j27039L1389r229q7439J14816O0382r3445L5881k4026J29720
$$ 67989 113931 114575 -12464 18925 9696 -77743 37073 97455 4010 39891 15865 145585
7242A45585j50438R7476o822J75410n6736r7278k4789K04111n8837O1324r3730
$$ 145585 -4853 92623 85801 261211 204475 107197 82408 286519 227682 289006 195276
7231A95276J6880k23295J44540l6792K0502n4885j2077N5783K0479K3473M9924
$$ 195276 212156 -11139 133401 96609 117111 62226 50149 105932 126411 149884 199808
7220A99808q1169R7780P1843o3434M1994Q2884K570R3099L7257k0517j5828J5664
$$ 199808 118639 216419 288262 224828 266822 349706 352276 445375 482632 462115 446287 461951
7208D61951q8609o9589P2610q0518J46755J45137j17766K1395o6149R2467J299
$$ 461951 373342 303753 376363 295845 442600 587737 469971 491366 425217 517684 518983
7197E18983O2372M9571o5064j2901J19206j6055l047K2732q817P0207j22444R3726
$$ 518983 581355 630926 565862 552961 672167 656112 653065 675797 666980 737187 614743 708469
7185G08469l0185m5193P7008o3099O3107J3798k37254J27330J7906Q8047j60663
$$ 708469 678284 633091 710099 647000 710107 723905 486651 613981 631887 719934 559271
7174E59271R916J13898j3378K5304m0580j11664J03650j10555j6403p4618J9790
$$ 559271 569187 683085 669707 695011 654431 542767 646417 535862 519459 444841 464631
7163D64631n7333R0243J3019K4872q705N3966j40786L3625J0458j32193L5327
$$ 464631 407298 497541 510560 535432 526727 580693 439907 473532 483990 351797 387124
7152C87124m114m6176l0727n8655J38665p1550M1704o9149j1073o617J33203o4284
$$ 387124 383010 336834 306107 247452 386117 314567 356271 287122 276049 269432 402635 338351
7140C38351j05234J26035l0466Q2511O9672L2467j41760l3927o4785R8761m5912
$$ 338351 233117 359152 328686 411197 480869 513336 371576 337649 272864 371625 325713
7129C25713l9995N7991J6007o3942o3962K8775L8724n9350J55574l325p5369p9193
$$ 325713 285718 343709 359716 295774 231812 260587 299311 239961 395535 392210 316841 237648
7117B37648Q6112m8645J60457o1421k5968j65029K42671p6249j3161K1360m0454
$$ 237648 323760 275115 435572 374151 348183 183154 425825 349576 336415 357775 317321
7106C17321P2005k6516o6566L6796R8592k5597j15462J49690N418j52893K8369
$$ 317321 389326 362810 296244 333040 431632 406035 290573 440263 445681 292788 321157
7095C21157K8503O8508r3498J30312k4901q642N9878k7343j8597k2741N7529P3490
$$ 321157 349660 418168 324670 454982 430081 421439 481317 453974 435377 412636 470165 543655
7083E43655j45325P7064m8426J04812m6455N973O9552m0675l9070M3196r296O2100
$$ 543655 398330 475394 426968 531780 485325 491298 560850 520175 481105 524301 515005 577105
7071E77105j12939J86308j21769J89398j70191P4561l2367L901R9642Q978o6170
$$ 577105 464166 650474 528705 718103 547912 622473 590106 594007 693649 702627 636457
7060F36457N3342o563J32622l8152k5524P2273o0962M9470j44674R4289J6419
$$ 636457 689799 683236 815858 777706 752182 824455 763493 812963 668289 762578 778997
7049G78997J45902j83667Q5450J1751o404J52935j37713k3945M2734K1481J58623
$$ 778997 924899 741232 826682 838433 832029 984964 847251 823306 866040 887521 1046144
7038A046144K4321L2082q3940M6971j781p2174J28340K6749q5789Q0423P4213
$$ 1046144 1070465 1102547 1018607 1065578 1063797 991623 1119963 1146712 1060923 1141346 1215559
7027A215559m6962P9987M535O4548M7448l3834r155o079J42262n3037L3227L1690
$$ 1215559 1168597 1248584 1253119 1317667 1365115 1331281 1322126 1316047 1458309 1405272 1438499 1470189
7015A470189N3141J33992j06235M4781O6068K201J6318J18946p2633J33108j38092
$$ 1470189 1523330 1657322 1551087 1595868 1661936 1664137 1680455 1799401 1726768 1859876 1721784
7004A721784J85842R4268j4950l0449J53609j30838J26479N8403J4233R3011j0179
$$ 1721784 1907626 2001894 1986944 1956495 2110104 1979266 2105745 2164148 2178381 2271392 2261213
6993B261213O9892K5175J53908L2764K9987P2099N7782M7282n5861K37242j05324
$$ 2261213 2331105 2356280 2510188 2542952 2572939 2645038 2702820 2750102 2694241 2931483 2826159
6982B826159J54444J9712J3928J14990O2821P6428R3959N0225Q7449J28162J53679
$$ 2826159 2980603 3000315 3014243 3129233 3192054 3268482 3362441 3412666 3500115 3628277 3781956
6971C781956l4063L38755M6004K95197J24030L59701M85351N17070R54938J110638
$$ 3781956 3747893 4086648 4132652 4427849 4551879 4911580 5396931 5914001 6868939 7979577
6961G979577J317474P21018K90824j98320m01061n90352n48802n38108k46010
$$ 7979577 9297051 10018069 10308893 10110573 9709512 9119160 8570358 8032250 7786240
6952G786240k47508l7461L8966K79757K45207M78917R11910J116373J582230J820919
$$ 7786240 7538732 7501271 7540237 7819994 8065201 8544118 9456028 10572401 12154631 13975550
6942A3975550J313541Q57133K83940L17109J79162N5634o12395o39388p74843
$$ 13975550 15289091 16146224 16430164 16747273 16926435 16982069 16369674 15730286 14955443
6933A4955443p07637n11365k93403O7399J04130N74065P55394R24471J420409
$$ 14955443 14247806 13736441 13443038 13510437 13614567 14188632 14944026 15868497 17288906
6924A7288906J716063K387192L513878N791316Q868840J0265642Q674902M680012
$$ 17288906 19004969 21392161 24906039 30697355 39566195 49831837 58506739 63186751
6916F3186751J27663k906755m609884m930281m343845l155798j561446Q60325
$$ 63186751 63314414 60407659 55797775 50867494 46523649 43367851 41806405 42666730
6908D2666730M242975P551167Q732335P046039M671807L377826L572068L578669
$$ 42666730 46909705 54460872 63193207 70239246 74911053 78288879 81860947 85439616
6900H5439616K273235k05722j901519j215969J912736M180915L043796l72693
$$ 85439616 87712851 87507129 85605610 84389641 86302377 90483292 93527088 93154395
6892I3154395l123579l833588j441052K204205L819786J790614j535858l453206
$$ 93154395 90030816 86197228 84756176 86960381 90780167 92570781 91034923 87581717
6884H7581717l172786r72648J468674K300618J039675P33408J407673J721245
$$ 87581717 84408931 83436283 84904957 87205575 88245250 88978658 90386331 92107576
6876I2107576n34119l643514o785675q561269r023066p944311o628131m996029
$$ 92107576 91573457 87929943 81144268 72582999 63559933 55615622 48987491 43991462
6868D3991462l277299p50848K415863O287217Q180156O667809K267715k091800
$$ 43991462 40714163 39963315 42379178 48666395 56846551 63514360 65782075 63690275
6860F3690275n296166o929605p161552o844291n979960n061981m016603l135034
$$ 63690275 58394109 51464504 44302952 37458661 31478701 26416720 22400117 19265083
6852A9265083k090813j589418j095292r80679m63137j82305L51835M59307N31423
$$ 19265083 17174270 15584852 14489560 13508881 13045744 12863439 13215274 13674581 14206004
6843A4206004L07561R7662M14682O49272P04308K03119n92638r64336j250509
$$ 14206004 14513565 14611227 15025909 15675181 16379489 16582608 15989970 15025634 13775125
6834A3775125j264912j305060r64155j077686q00799n65156l69733k77670j38585
$$ 13775125 12510213 11205153 10240998 9163312 8362513 7797357 7427624 7149954 7011369
6825G011369K8207J95469O39783J033005J055063O24353M2366n11421p21658r47716
$$ 7011369 7039576 7235045 7874828 8907833 9962896 10587249 10629615 10118194 9396536 8448820
6815H448820j001767q97849o20731p11848n08501l61036k67809l23159r3374j97959
$$ 8448820 7447053 6549204 5928473 5216625 4708124 4347088 4079279 3756120 3662746 3464787
6805C464787j46479k13093m0602j06231j21281j22250j75030M4730j16131J0007
$$ 3464787 3318308 3105215 3064613 2958382 2837101 2714851 2539821 2584551 2468420 2478427
6795B478427o9468o5590q5631J3069K6k23533R077o9382R454p6530M0243j45855
$$ 2478427 2408959 2343369 2257738 2270807 2270833 2047300 2056377 1986995 1996449 1919919 1960162 1814307
6783A814307K1994j53267P0645j12182j7883J1989j80035M1912j8389j10969j0230
$$ 1814307 1836301 1683034 1753679 1641497 1623614 1635603 1455568 1497480 1479091 1368122 1357892
6772A357892l6398Q1066M4812n1324r8391P3682l3563o8003Q590K0066j47535
$$ 1357892 1321494 1402560 1447372 1396048 1297657 1371339 1337776 1269773 1278363 1298429 1150894
6761A150894J36497j8492O9453p242j78343K18216k14444Q2163L7022n9424j31433
$$ 1150894 1287391 1268899 1338352 1331110 1152767 1370983 1156539 1238702 1275724 1216300 1084867
6750A084867K0464j26200N6326k9372p1173n6379q6745j454O1867j58757R1137
$$ 1084867 1105331 979131 1035457 1006085 934912 878533 791788 790334 852201 693444 784581
6739G84581j1721L4813j51699J25854q8057o901K863K6097l6524M5891o1844k2943
$$ 784581 772860 807673 655974 781828 693771 686870 689733 715830 679306 725197 663353 640410
6727F40410L5247r6724k0171L6150m4295m7301R8079j64457L9371l4300m5804
$$ 640410 675657 578933 558762 594912 550617 503316 601395 436938 476309 442009 396205
6716C96205j1198K02277j47870j2865j09495K500J20257J8609l9865r3149P8863
$$ 396205 385007 587284 439414 426549 317054 319554 439811 458420 418555 325406 404269
6705D04269N1117j35543J20363k6628P978J67564p1349L5047j9617O1012r6125
$$ 404269 455386 319843 440206 413578 421556 589120 517771 552818 533201 594213 498088
6694D98088J68317p9935l0018o9195l2009J7357j08554l1944O6667K9341r5115
$$ 498088 666405 586470 556452 487257 455248 472605 364051 332107 398774 428115 333000
6683C33000o7234L294L922m4309L0837P1301J1429k6823K7677n9027R8959J05116
$$ 333000 265766 269060 272982 228673 259510 330811 342240 315417 343094 284067 383026 488142
6671D88142N0007J21684J11752j14971n3158o4795k7595j06437M4564M6974j34583
$$ 488142 538149 659833 771585 656614 603456 538661 511066 404629 449193 496167 361584
6660C61584J17006k33166J9582L5372M1874k4858Q075J1618r5473l8537J26497
$$ 361584 478590 245424 265006 300378 342252 317394 325469 337087 241614 203077 329574
6649C29574p1104J1221N5805Q2193L718K6946J42185J00152J08044k06286L8996
$$ 329574 258470 269691 325496 407689 411407 438353 580538 680690 788734 582448 621444
6638F21444N3933j00667j11926P1008q1987o0569m9549J00475l3816p0627n0740
$$ 621444 675377 574710 462784 533792 451805 391236 341687 442162 408346 337719 286979
6627B86979R2173k11029J99129j08702N1066J26627p4165N05R4012K8365P1428
$$ 286979 379152 168123 367252 258550 309616 436243 362078 362583 456595 484960 556388
6616E56388P0554R1828p7421J75271j19831J94320K4777J8375l9888r9898L0532
$$ 556388 626942 718770 641349 816620 696789 891109 915886 934261 894373 794475 825007
6605H25007j53855M8549K11025k05361j0771Q6282j01877j35285J35789J9870
$$ 825007 671152 719701 930726 725365 714594 800876 698999 563714 699503 719373
6595G19373O947Q0169n2790o1593n8884J14372R5318r0445K51428L8210P5338
$$ 719373 726320 806489 753699 692106 633222 747594 842912 752467 1003895 1042105 1117443
6584A117443M2386j53854P5501K5644j02476n0945q023p2054Q773m2223r3473
$$ 1117443 1159829 1005975 1081476 1107120 1004644 953699 945676 873622 882395 840172 746699
6573G46699r7405o528j0311j14734m2439L2262R126J4582k7985J24775K8112N8383
$$ 746699 649294 642766 632455 517721 475282 507544 516670 531252 503267 628042 656154 714537
6561G14537j9732K8070k42267K15319p5331Q3200L9138k16288j3201n5889M5788
$$ 714537 694805 722875 480608 695927 620596 703796 742934 526646 513445 457556 503344
6550E03344L5625j01108L5132J4649M5007j33600q7085M8833q8174Q2586K06579
$$ 503344 538969 437861 472993 487642 532649 399049 311964 360797 272623 355209 561788
6539E61788l0463j80345n3600J20162p6505J29850k4587l8080l211o2874J65168
$$ 561788 531325 350980 297380 417542 341037 470887 446300 408220 405009 342135 507303
6528E07303l4735l7974J30488N616M2201q1768p0155Q0548p0573N4054J3466j9328
$$ 507303 472568 434594 565082 570698 612899 531131 460976 541524 470951 525005 538471 519143
6516E19143p3830J33191r9186l6895J86760j16326P5792K8461k8166j28718o5402
$$ 519143 445313 578504 479318 442423 629183 512857 588649 617110 588944 460226 394824
6505C94824J35082J34383q4210P9400j8776j7321p0981r4549P2352L2462j5492
$$ 394824 529906 664289 580079 659479 640703 623382 552401 457852 530204 562666 547174
6494E47174Q2937O57J1797r8481J6857L5637J78052r339P3846l6716m4566L1583
$$ 547174 630111 630768 642565 544084 560941 596578 774630 765291 839137 802421 757855 789438
6482G89438o8215J20077R4800N8533m9743r3429O3057J9360j29316K11715l9545
$$ 789438 721223 841300 936100 994633 944890 851461 914518 933878 804562 1016277 976732
6471I76732N338p5380J9604q5181J10963j07965K50737Q42k435o0470J01600J6876
$$ 976732 982070 906690 926294 841113 952076 844111 1094848 1095690 1093255 1032785 1134385 1151261
6459A151261J24699o0748J46301K1094j41129J78171m385M8247n4372J800K5564
$$ 1151261 1275960 1215212 1361513 1382607 1241478 1419649 1415264 1463511 1409139 1410939 1436503
6448A436503N5691j13292j17595q074o7875J14255K3974L8196n3730o1358J4825
$$ 1436503 1492194 1378902 1261307 1253233 1185358 1299613 1323587 1361783 1308053 1246695 1261520
6437A261520j2169J38947K11812p1621m2745J22569n1406R4946Q0550J38208K6735
$$ 1261520 1249351 1388298 1600110 1528489 1485744 1608313 1556907 1651853 1732403 1870611 1897346
6426A897346j2337K8037L2931k1587M2162J53172j11325J56896j85238k4628k8922
$$ 1897346 1885009 1913046 1945977 1924390 1966552 2119724 2008399 2165295 1980057 1955429 1926507
6415A926507J1513J59721J39958j16336J2455O261j2089J7639L0657R4153J60847
$$ 1926507 1938020 2097741 2237699 2121363 2133818 2140079 2127990 2145629 2176286 2270439 2431286
6404B431286K0179n4903J59989M1618J55684L8320Q3963J45569L1635K11055q1919
$$ 2431286 2451465 2396562 2556551 2598169 2753853 2792173 2876136 3021705 3053340 3264395 3182476
6393C182476K55517J83719K90708K17251K60168L49975L9339L43569J74635P9881
$$ 3182476 3437993 3621712 3912420 4129671 4389839 4739814 4779153 5122722 5297357 5377238
6383E377238L17644L15274L66936M21701O83323R60426J131050K345344L394142
$$ 5377238 5694882 6010156 6377092 6798793 7482116 8442542 9573592 11918936 15313078
6374A5313078M177003M286968K912948J162661p25110j981274k389803k717457
$$ 15313078 19490081 23777049 26689997 27852658 27127548 25146274 22756471 20039014
6366B0039014k041168j919766j328466o98611m56466l60822j01455j08404r1828
$$ 20039014 17997846 16078080 14749614 14051003 13594537 13233715 13132260 13023856 12932028
6357A2932028L44907M32368Q08610J172233J363557K106889L368549O014362J0275679
$$ 12932028 13276935 13709303 14517913 15690146 17053703 19160592 22529141 28543503 38819182
6348C8819182J3425174J3706169R911254L412102k813554p394064r046379r495554
$$ 38819182 52244356 65950525 75861779 79273881 76460327 69066263 60019884 50524330
6340E0524330q334258p064703n460467m129450k798969j938463j350809j164684
$$ 50524330 42190072 35125369 29664902 25535452 22736483 20798020 19447211 18282527
6332A8282527o35597l58309M4223M20565P68794J248132J816532L139636N757328
$$ 18282527 17646930 17288621 17332844 17753409 18522203 19770335 21586867 24726503 30483831
6323C0483831R901457J3473621J3756159J0271105L483282l032511p628382r850752
$$ 30483831 40385288 53858909 67615068 77886173 81369455 78336944 70708562 60857810
6315F0857810r987648r122971p659418o196570m834756l581809k449323j829542
$$ 60857810 50870162 41747191 34087773 27891203 23056447 19474638 17025315 15195773
6307A5195773j287819j218405o95428n26818k79056j47933J08698L44065J074517
$$ 15195773 13907954 12689549 11994121 11467303 11188247 11040314 11149012 11493077 12567594
6298A2567594J710724L013976M112501M154636L205613R74460j034029k512122
$$ 12567594 14278318 17292294 21404795 25559431 28765044 29739504 28705475 26193353
6290B6193353l282622l411114l187251k779466k164045j666844j330403j047469
$$ 26193353 22910731 19499617 16312366 13532900 11368855 9702011 8371608 7324139
6282G324139p07365o50114n66532l53585j96608l00270k61086k62146k01695k27969
$$ 7324139 6616774 5966660 5400128 5046543 4849935 4549665 4288579 4026433 3824738 3596769
6272C596769l9538j63240j32407j30382P3002j56662n1509n0131Q3414j18445
$$ 3596769 3557231 3393991 3261584 3131202 3204204 3047542 2996033 2945902 3029316 2910871
6262B910871p3264P8409r1466m5247j42939j56011Q7212k6641P5079M5494O1563
$$ 2910871 2837607 2916016 2824550 2779303 2636364 2480353 2567565 2540924 2616003 2661497 2723060
6251B723060o9808r7639j14324R0464j90419K2772J4312m9318m3613m2297R4998
$$ 2723060 2653252 2555613 2441289 2531753 2341334 2364106 2378418 2329100 2285487 2243190 2338188
6240B338188k08180Q6066o4053J13569k47380l977n9412q3558j40286J1043J44324
$$ 2338188 2130008 2216074 2152021 2265590 2018210 2014233 1954821 1871263 1730977 1742020 1886344
6229A886344r8167J2273L0083m8542J19316N41J97882K79781L17532J04220K20035
$$ 1886344 1788177 1800450 1830533 1781991 1901307 1901848 2099730 2379511 2697043 2801263 3021298
6218C021298o2032k70951j24086j43186j37442k53765j46353j59798M2475j36351
$$ 3021298 2959266 2688315 2564229 2421043 2283601 2029836 1883483 1723685 1766160 1629809
6208A629809R1658M7778K61752J09462K33475L75156R4693q1364J21153l4742
$$ 1629809 1721467 1769245 2030997 2140459 2373934 2749090 2843783 2762419 2883572 2848830
6198B848830m2863j73060J79522J61846L88348K35899J14816l3050l31296m30517
$$ 2848830 2805967 2632907 2812429 2974275 3362623 3598522 3713338 3680288 3348992 2918475
6188B918475k51083l67788l7601k42118K5306q9235p0643L54612J56948M43996
$$ 2918475 2667392 2299604 2262003 2019885 2045191 1955956 1885313 2239925 2396873 2840869
6178B840869N82562J85281K24394j67599j34126l17327N2802j3549J30779k62600
$$ 2840869 3423431 3608712 3833106 3665507 3531381 3214054 3266856 3253307 3384086 3121486
6168C121486j64296k62770l06872k82082j72760l25193N6029k79151M691j20198
$$ 3121486 2957190 2694420 2387548 2105466 1932706 1607513 1663542 1384391 1389082 1268884
6158A268884K7995M4938J42303K88657K54516K04203R5637J11427k16373m3212
$$ 1268884 1296879 1341817 1484120 1772777 2027293 2231496 2327133 2438560 2222187 2178975
6148B178975k77360k19891k02403r3067k99917j15787l8789o4667L9460j26024
$$ 2178975 1901615 1681724 1479321 1386254 1086337 970550 931761 867094 906554 780530
6138G80530k5892p1235J16107Q8749J5588J15581m5046J46893q75k4176L3792
$$ 780530 754638 683403 799510 888259 903847 1019428 974382 1121275 1120400 1096224 1130016
6127A130016Q9236j32207j04594j98031P7279M4353j55525m3192J5606p4481j2259
$$ 1130016 1219252 1087045 982451 784420 861699 906052 750527 707335 722941 648460 636201
6116F36201k2321l9337J24728q0324Q4203J13955p7411Q5908N9762o8813k8188
$$ 636201 613880 574543 699271 618947 703150 817105 739694 825602 885364 816551 788363
6105G88363o0282L6759n7772r8719K6640j2190k8217j01611j22445J38370p9982
$$ 788363 728081 764840 707068 608349 634989 622799 594582 492971 370526 508896 428914
6094D28914J08029m8683Q0131p7137n3028K1838k0810j0746J11605o2411M0127
$$ 428914 536943 488260 568391 491254 438226 460064 439254 428508 540113 477702 517829
6083E17829k5904Q2629q1047R7503Q3381J3097J98685j22942j20871k5396p2225
$$ 517829 491925 574554 493507 591010 674391 687488 886173 763231 642360 616964 544739
6072E44739o6532J5245P9983M5122j05943O783n0261j01419Q3183Q1110n6226
$$ 544739 478207 493452 573435 618557 512614 519397 469136 367717 450900 532010 475784
6061D75784N9125l9024k00251K38046N4074M4690J42320o9155P6227j45472J29278
$$ 475784 534909 495885 295634 533680 587754 632444 774764 705609 781836 636364 765642
6050G65642p765p6126r310q378j15532K194j93520J51510r1070K6045j3461m1010
$$ 765642 757877 681751 672441 664063 548531 550725 357205 508715 417645 443690 430229 389219
6038C89219o2109M3680j0076Q7973n6015J35705o9380o1593j39394J23714r5357
$$ 389219 327110 370790 360714 448687 392672 528377 458997 397404 258010 381724 286367
$$ [...]
##END NTUPLES=NMR SPECTRUM
##END=
