##TITLE=abcd
##JCAMPDX= 6.0         $$ Bruker NMR JCAMP-DX V2.0
##DATA TYPE= NMR SPECTRUM
##DATA CLASS= NTUPLES
##ORIGIN= UXNMR, Bruker Analytische Messtechnik GmbH
##OWNER= root
$$ XWIN-NMR		Version 3.5
$$ Thu Jul 16 18:58:27 2026 Russian Standard Time (UT+4h)  servis@DPX200
##.OBSERVE FREQUENCY= 200.131235884673
##.OBSERVE NUCLEUS= ^1H
##.ACQUISITION MODE= SIMULTANEOUS
##.ACQUISITION SCHEME= undefined
##.AVERAGES= 32
##.DIGITISER RES= 18
##SPECTROMETER/DATA SYSTEM= spect
##.PULSE SEQUENCE= zg
##.SOLVENT NAME= CDCl3
##.SHIFT REFERENCE= (INTERNAL, CDCl3, 0, 16.4885)
##AUDIT TRAIL= $$ (NUMBER, WHEN, WHO, WHERE, WHAT)
$$ ##TITLE= Audit trail, XWIN-NMR		Version 3.5
$$ ##JCAMPDX= 5.01
$$ ##ORIGIN= Bruker BioSpin GmbH
$$ ##OWNER= servis
$$ F:\spectra/data/av/nmr/H1/1/pdata/1/auditp.txt
$$ ##AUDIT TRAIL=  $$ (NUMBER, WHEN, WHO, WHERE, WHAT)
(   1,<2026-07-16 18:58:03.23 +0400>,<servis>,<DPX200>,
      <created by zg, POWCHK disabled, PULCHK disabled
       configuration hash MD5:
       00 E9 B6 7A A2 85 ED C7 34 08 36 98 17 FE 4E 26
       data hash MD5: 32K
       D8 93 28 DC 9E 33 AA C2 1A 14 6C 4F A1 66 3E 76>)
(   2,<2026-07-16 18:58:06.73 +0400>,<servis>,<DPX200>,
      <Start of raw data processing
       efp BC_mod = 2 LB = 0.05 FT_mod = 6 PKNL = 1 PHC0 = -414.59 PHC1 = 3.101563 SI = 16K 
       data hash MD5: 16K
       DB 24 96 DA 37 91 40 D9 1C 6C 0D 13 B6 E2 CD C9>)
$$ ##END=
$$ 
$$ hash MD5
$$ 8D E7 1F 6B F3 9E 38 6B E4 E9 A0 E0 8A 12 DC 9A
##$RELAX= 
##$RELAX= 
##$RELAX= 
##$RELAX= 
##$RELAX= 
##$RELAX= 
##$RELAX= 
##$RELAX= 
$$ Bruker specific parameters
$$ --------------------------
##$DU= <F:\spectra>
##$EXPNO= 1
##$NAME= <H1>
##$PROCNO= 1
##$TYPE= <nmr>
##$USER= <av>
##$AMP= (0..31)
100 100 100 100 100 100 100 100 100 100 100 100 100 100 100 100 100 100 
100 100 100 100 100 100 100 100 100 100 100 100 100 100 
##$AQSEQ= 0
##$AQ_mod= 1
##$AUNM= <au_zg>
##$AUTOPOS= <>
##$BF1= 200.13
##$BF2= 200.13
##$BF3= 200.13
##$BF4= 200.13
##$BF5= 500.13
##$BF6= 500.13
##$BF7= 500.13
##$BF8= 500.13
##$BYTORDA= 1
##$CFDGTYP= 0
##$CFRGTYP= 5
##$CHEMSTR= <none>
##$CNST= (0..31)
1 1 145 1 1 1 1 1 1 1 1 1 1 1 1 1 1 1 1 1 1 1 1 1 1 1 1 1 1 1 1 1 
##$CPDPRG= <>
##$CPDPRG1= <>
##$CPDPRG2= <>
##$CPDPRG3= <>
##$CPDPRG4= <mlev>
##$CPDPRG5= <mlev>
##$CPDPRG6= <mlev>
##$CPDPRG7= <mlev>
##$CPDPRG8= <mlev>
##$CPDPRGB= <>
##$CPDPRGT= <>
##$D= (0..31)
0 2 0 0 0 0 0 0 0 0.06 0 0 0 0 0 0 0.0002 0 0 0 0 0 0 0 0 0 0 0 0 0 0 
0 
##$DATE= 1784213882
##$DBL= (0..7)
120 120 120 120 120 120 120 120 
##$DBP= (0..7)
150 150 150 150 150 150 150 150 
##$DBP07= 0
##$DBPNAM0= <>
##$DBPNAM1= <>
##$DBPNAM2= <>
##$DBPNAM3= <>
##$DBPNAM4= <>
##$DBPNAM5= <>
##$DBPNAM6= <>
##$DBPNAM7= <>
##$DBPOAL= (0..7)
0.5 0.5 0.5 0.5 0.5 0.5 0.5 0.5 
##$DBPOFFS= (0..7)
0 0 0 0 0 0 0 0 
##$DE= 6
##$DECBNUC= <off>
##$DECIM= 32
##$DECNUC= <off>
##$DECSTAT= 4
##$DIGMOD= 1
##$DIGTYP= 9
##$DL= (0..7)
0 120 120 120 120 120 120 120 
##$DP= (0..7)
150 150 150 150 150 150 150 150 
##$DP07= 0
##$DPNAME0= <>
$$ [...]
##$SUBNAM4= <"">
##$SUBNAM5= <"">
##$SUBNAM6= <"">
##$SUBNAM7= <"">
##$SUBNAM8= <"">
##$SUBNAM9= <"">
##$SW= 20.6817932712277
##$SWIBOX= (0..15)
0 0 3 0 0 0 0 0 0 0 0 0 0 0 0 0 
##$SW_h= 4139.07284768212
##$TD= 32768
##$TD0= 1
##$TE= 0
##$TE2= 300
##$TE3= 300
##$TEG= 300
##$TL= (0..7)
0 120 120 120 120 120 120 120 
##$TP= (0..7)
150 150 150 150 150 150 150 150 
##$TP07= 0
##$TPNAME0= <>
##$TPNAME1= <>
##$TPNAME2= <>
##$TPNAME3= <>
##$TPNAME4= <>
##$TPNAME5= <>
##$TPNAME6= <>
##$TPNAME7= <>
##$TPOAL= (0..7)
0.5 0.5 0.5 0.5 0.5 0.5 0.5 0.5 
##$TPOFFS= (0..7)
0 0 0 0 0 0 0 0 
##$TUNHIN= 0
##$TUNHOUT= 0
##$TUNXOUT= 0
##$USERA1= <user>
##$USERA2= <user>
##$USERA3= <user>
##$USERA4= <user>
##$USERA5= <user>
##$V9= 5
##$VALIST= <valist>
##$VCLIST= <CCCCCCCCCCCCCCC>
##$VD= 0
##$VDLIST= <DDDDDDDDDDDDDDD>
##$VPLIST= <PPPPPPPPPPPPPPP>
##$VTLIST= <TTTTTTTTTTTTTTT>
##$WBST= 1024
##$WBSW= 30
##$XGAIN= (0..3)
0 0 0 0 
##$XL= 0
##$YL= 0
##$YMAX_a= 317860
##$YMIN_a= -386065
##$ZGOPTNS= <>
##$ZL1= 120
##$ZL2= 120
##$ZL3= 120
##$ZL4= 120
##$ABSF1= 0
##$ABSF2= 0
##$ABSG= 0
##$ABSL= 0
##$ALPHA= 0
##$AQORDER= 0
##$ASSFAC= 0
##$ASSFACI= 0
##$ASSFACX= 0
##$ASSWID= 0
##$AUNMP= <proc_1d>
##$AZFE= 0.1
##$AZFW= 0.1
##$BCFW= 0
##$BC_mod= 2
##$BYTORDP= 0
##$COROFFS= 0
##$CY= 18.4799938201904
##$DATMOD= 1
##$DC= 0
##$DFILT= <>
##$DTYPP= 0
##$F1P= 9.9274215381318
##$F2P= -0.165520771350173
##$FCOR= 1
##$FTSIZE= 16384
##$FT_mod= 6
##$GAMMA= 0
##$GB= 0
##$INTBC= 1
##$INTSCL= 4.127829e-11
##$ISEN= 128
##$LB= 0.05
##$LEV0= 0
##$LPBIN= 0
##$MAXI= 10000
##$MC2= 0
##$MEAN= 0
##$ME_mod= 0
##$MI= 50
##$NCOEF= 0
##$NC_proc= -5
##$NLEV= 6
##$NOISF1= 3.799351
##$NOISF2= 2.8
##$NSP= 0
##$NTH_PI= 0
##$NZP= 0
##$OFFSET= 16.48848
##$PC= 4
##$PHC0= -414.59
##$PHC1= 3.101563
##$PH_mod= 1
##$PKNL= yes
##$PPARMOD= 0
##$PSCAL= 4
##$PSIGN= 0
##$REVERSE= no
##$SF= 200.130005582386
##$SI= 16384
##$SIGF1= 3
##$SIGF2= 2
##$SINO= 400
##$SIOLD= 16384
##$SREGLST= <1H.CDCl3>
##$SSB= 0
##$STSI= 16384
##$STSR= 0
##$SW_p= 4139.07284768211
##$SYMM= 0
##$S_DEV= 0
##$TDeff= 32768
##$TDoff= 0
##$TI= <>
##$TILT= no
##$TM1= 0
##$TM2= 0
##$TOPLEV= 0
##$USERP1= <user>
##$USERP2= <user>
##$USERP3= <user>
##$USERP4= <user>
##$USERP5= <user>
##$WDW= 1
##$XDIM= 16384
##$YMAX_p= 340814506
##$YMIN_p= -1291227
$$ End of Bruker specific parameters
$$ ---------------------------------
##NTUPLES= NMR SPECTRUM
##VAR_NAME=  FREQUENCY,     SPECTRUM/REAL,   SPECTRUM/IMAG
##SYMBOL=    X,             R,               I
##VAR_TYPE=  INDEPENDENT,   DEPENDENT,       DEPENDENT
##VAR_FORM=  AFFN,          ASDF,            ASDF
##VAR_DIM=   16384,         16384,           16384
##UNITS=     HZ,            ARBITRARY UNITS, ARBITRARY UNITS
##FACTOR=    0.252644378177508, 1,           1
##FIRST=     3299.83951724647, 0,            0
##LAST=      -839.233330435636, 0,           0
##MIN=       -839.233330435636, -1291227,    0
##MAX=       3299.83951724647, 340814506,    0
$$ Real data points
##PAGE= N=1
##DATA TABLE= (X++(R..R)), XYDATA
$$ [...]
12376a99782J07788o4300J8416N4909N0644l6586K499m1325Q4707p9568k045j4236
12364a18879o5027O3602o8183J11886j2256O665L2017q755K5025p8421J13451
12353A125r6059O0157k0414m0365k9037K2354j0108k8944j2548P6023p865K1131
12341f4550j10897R9634R0525k19834R5862j6304m6981J75096L932j42786M1148
12330i5155M944j27148J13720k5944P4578r3265J17022l9462o3261K2131M8241
12319f3599o3725J330k8737p975J19005m6679m4826j1380r8127M3034R9842Q82
12307a00955q1971Q947k9280J49461J07234j45108j53079K41802j19623N016K7234
12296i0322m230P7702p5439l2826N7688P9310j24130J19804j80185O1354Q5380
$$ y = [-199782, -91994, -156294, -137878, -82969, -32325, -68911, -66412, -107737, -23030, -102598, -104643, -118879, -183906, -120304, -188487, -76601, -88857, -82192, -50175, -58930, -33905, -112326, 1125, -94934, -34777, -55191, -95556, -124593, -102239, -112347, -141291, -153839, -77816, -85681, -64550, -175447, -75813, 14712, -205122, -109260, -125564, -172545, 2551, 6483, -136303, -95155, -90211, -217359, -103639, -129583, -55005, -148270, -31248, -70710, -133971, -111840, -63599, -127324, -125994, -154731, -162706, -43701, -90380, -135206, -146586, -244713, -201679, -101837, -100955, -182926, -173979, -203259, -53798, 53436, -91672, -244751, -2949, -122572, -117556, -90322, -94552, -16850, -92289, -125115, -67427, 11883, -112247, 7557, -172628, -111274, -25894]
12285b5894K2018k27944Q6246Q4796m0411l6051n7124O4327N5395m750m4306o326
12273a30024O8542j11953K0292P4545m7241r9993J03339j940K6047p3032k1968
12262a93386J15807k6531l5350p049n1963N1117R7148j6692l5326q798J36462
12251B5439j27331l3092J2874Q2777J1376p0820O7872l7636o8604p5605j4519
12240b27269J06036N536J8411K3596l1818Q1064j5178o4153K7278r425L6082K326
12228d7514J8773j48074R8898n9982O6713p3400o069k5886L1000O1037p82q559
12216i3845r6187O1869n5228O0338l7208k2405J33220m8834P55M4727L6707o7714
12204h3805K0275p5924K6581p7643N1741J10528J1449r1580N3096k6223l2222
$$ y = [-25894, -3876, -231820, -145574, -60778, -101189, -137240, -194364, -130037, -74642, -79392, -123698, -130024, -61482, -173435, -153143, -78598, -125839, -225832, -122493, -124433, -98386, -171418, -193386, -77579, -104110, -139460, -146509, -198472, -147355, -50207, -66899, -102225, -111023, 25439, -101892, -134984, -122110, -39333, -27957, -98777, -30905, -68541, -137145, -212750, -227269, -121233, -115697, -97286, -73690, -105508, -24444, -39622, -103775, -76497, -85922, -49840, -47514, -28741, -176815, -77917, -137899, -71186, -144586, -150655, -176541, -145541, -84504, -85286, -93845, -190032, -128163, -183391, -123053, -160261, -182666, -49446, -98280, -97525, -52798, -16091, -83805, -63530, -139454, -112873, -190516, -138775, -28247, -16798, -108378, -55282, -81505, -113727]
12193a13727P6434j31762R9564o708q791L3255q7199O1912M1297n7866P226j0063
12181i6428O8335l9201p3107R7370j44562J03864P8131l2673m7978k0247m8800
12170a55296k2839J62063q9397M911J9133N5418J1060j97733J48262j12254R7028
12159g9644L5306k7550p2819N8932K1079o4361j4196O5832l8504p8217k0856J37431
12147g7567j2243J0660O0724j2459n9009P8704R340j42602J203O1181k2228p6800
12135a81096P9588l8341J05846j11452L2839m3436N2872P1034m2644j14732M1005
12124a48517K2376O8352o5836L0350J592N8593p9479L1113r713J10477j00927
12113h1619M3224j37051O3356J0877K778n5209N07P4979M17k5678k5541K9563
$$ y = [-113727, -37293, -169055, -69491, -76199, -84990, -51735, -138934, -77022, -35725, -93591, -86365, -96428, -28093, -67294, -140401, -43031, -187593, -83729, -5598, -38271, -86249, -106496, -155296, -178135, -16072, -105469, -100558, -81425, -26007, -14947, -212680, -64418, -176672, -79644, -44338, -71888, -144707, -85775, -64696, -129057, -143253, -77421, -115925, -194142, -214998, -77567, -89810, -79150, -18426, -30885, -89894, -11190, -1850, -144452, -143249, -82068, -104296, -181096, -101508, -139849, -34003, -145455, -112616, -156052, -103180, -32146, -74790, -189522, -148517, -126141, -57789, -123625, -93275, -91683, -33090, -112569, -81456, -91169, 19308, -81619, -38395, -175446, -112090, -101213, -98435, -153644, -153137, -78158, -77741, -103419, -128960, -99397]
12101i9397L0942M0639p6337K3671j1756O448K1189n6167O8135j23668J41441
12090c4860o4454p9757j134J0436J32995j02362P4492q5645O3841J763o5215n0730
12078b00630R7516j9004j6478L115j05018J19636q3183J13061L7963l184p3076
12067a29282Q6060M441j01853R3919p5028R4181q8350M2927o4881l6820J14758
12056e9928k2346o845j21071J52160l7349K0426q1698J43251j02823O518Q2655
12045b7050j53299j218J10762q8451P3664J2883M8313n3379J923n3950J00686
12034b9116P2783q5565j19364P9242n6752M2914N5466n7792m2704M4996N1926
12023d3966m8895J6671N080P5082n2361j25103J16731O58p9321L4454P3422j09500
$$ y = [-99397, -68455, -27816, -104153, -80482, -92238, -85790, -64601, -120768, -52633, -176301, -34860, -99314, -179071, -180205, -169769, -36774, -139136, -64644, -150289, -86448, -84685, -149900, -200630, -103114, -122118, -138596, -135481, -240499, -120863, -204046, -90985, -53022, -56206, -129282, -43222, -38781, -140634, -46715, -121743, -27562, -115912, -72985, -137866, -174686, -59928, -82274, -89119, -210190, -58030, -95379, -74953, -156651, -13400, -116223, -109705, -27050, -180349, -181567, -70805, -159256, -85592, -72709, -24396, -77775, -75852, -129802, -29116, 43667, -41898, -161262, -82020, -138772, -95858, -40392, -98184, -140888, -95892, -43966, -92861, -76190, -71110, 3972, -48389, -173492, -56761, -56103, -135424, -100970, -27548, -137048]
12011a37048O4585k1367p9569N6395M193R4218q7274l6471l701o0674P2577m043
11999a38179N5819j7217l9914L8095L2564Q814o6096j0628K0170K0009q7242M1458
11987a42347j10131J86677M9077p9210j19232J4358J00506n5074J52659k6859
11977b9576o2299K7365j4585q3790P0980j21952J35938k3241K166j40948J06774
11966a33168Q1543o594k5949p5131J05667p2683m9315J01009p8215N6853p2439
11955a68422L0899k3770J6737O204j6268q61M536m7914Q7905j6291K1777l0497
11943a35965J09464k14614J49386J2412J3242J3766m4285K5494q4448L9181m6341
11932a62708N8875K6173m3087N2412j22839R0051o2779l4528J35279L3580o5483
$$ y = [-137048, -72463, -93830, -173399, -117004, -112811, -18593, -105867, -142338, -146039, -206713, -134136, -138179, -82360, -99577, -139491, -101396, -68832, -60018, -126114, -136742, -116572, -96563, -183805, -142347, -252478, -65801, -16724, -95934, -215166, -200808, -100302, -155376, -2717, -29576, -91875, -64510, -79095, -162885, -91905, -213857, -77919, -101160, -98994, -239942, -133168, -51625, -58219, -84168, -159299, -53632, -126315, -175630, -74621, -152836, -95983, -168422, -137523, -161293, -144556, -138352, -154620, -155481, -150945, -198859, -110954, -127245, -105468, -135965, -26501, -241115, -91729, -79317, -66075, -52309, -96594, -71100, -155548, -116367, -162708, -103833, -77660, -120747, -68335, -191174, -101123, -163902, -198430, -63151, -29571, -95054]
11921i5054O7540m0465j34676J49364r9187j4680K5330j1964M1033k6081p47L9233
11909a00354P5888M0720k9763K5656N6616o6107l9289m4951M705R1877j11846
11898i6848O267J03668m0934L5093P4810r6092j4172o8361M6765p4796j4081j8275
11886a56956j8438L444P3130L5259n7613k0029R8085k7030j8407K2620O0317o7786
11874g3404m5177j7930n3390m312N9607N6539p7930l2071J52893j11616n523m4246
11862a96560J72401p7440j426j797m4463l1563J76096j50565l2579O5655o845
11851a29086q3658M7314J09263K5408M5727n8756j06651l7411Q6416j9670m8965
11840a70069K9915P2689n6231l7724O141Q3879r3113o3385J04006k4668O7564
$$ y = [-95054, -27514, -67979, -202655, -53291, -152478, -167158, -141828, -153792, -112759, -138840, -139587, -100354, -24466, 16254, -13509, 12147, 68763, 2656, -36633, -81584, -76879, 14998, -96848, -90581, 13087, -27847, 7246, 82056, -14036, -28208, -96569, -49804, -124600, -138681, -156956, -175394, -171950, -98820, -63561, -121174, -141203, -43118, -70148, -88555, -65935, -5618, -73404, -118581, -136511, -189901, -194213, -134606, -78067, -155997, -188068, -35175, -146791, -152314, -196560, -24159, -101599, -103025, -104822, -149285, -180848, -4752, -155317, -187896, -122241, -129086, -212744, -165430, -56167, -30759, 14968, -43788, -150439, -187850, -101434, -121104, -170069, -140154, -67465, -123696, -161420, -155279, -71400, -164513, -227898, -123892, -148560, -80996]
11829h0996o0786J01223r5209L443k4914l9683J00995L4385j27017J71698j10815
11818a27676J27415l0793j07539J42021j49001J07903o6607j0047P38m9690m0376
11807b03652J13567j20585P2370p5362R1828O0062m2803N5503L3166m8607l1499
11796i6012J0396o1879O0802k9477J6900p9448J6216J10434p3676m2872l0867
11785a99483P9861N056n4956R1617J5421M667r3973J00561l0932k2061O4430O1345
11773B1553n5194p6796j09186J13542L2573O2094n0970m3321M2221p0180L7939
11762i5725r367J146O9903m9689k627O8719m2100k7306l9708j1871R0545r6080
11750a44160O8910o53M2068m8316j7881n6207J12786J1383j417K3593n2031q2737
$$ y = [-80996, -141782, -40559, -135768, -132325, -157239, -196922, -95927, -61542, -188559, -16861, -127676, -261, -31054, -138593, 3428, -145573, -37670, -104277, -114324, -113586, -163276, -203652, -90085, -210670, -138300, -213662, -121834, -61772, -104575, -49072, -15906, -64513, -96012, -85616, -147495, -86693, -116170, -99270, -178718, -162502, -52068, -125744, -168616, -199483, -119622, -114566, -169522, -77905, -62484, -57817, -151790, -51229, -82161, -104222, -39792, 21553, -33641, -110437, -219623, -106081, -73508, -11414, -62384, -105705, -63484, -133664, -95725, -105092, -103946, -34043, -83732, -86359, -17640, -59740, -87046, -126754, -138625, -48080, -144160, -75250, -75903, -33835, -82151, -100032, -156239, -43453, -32070, -33487, -9894, -61925, -144662]
11738a44662N7868n717p8326k1195J63032l6281k5776r3800J93208o1010l6996
11727h9655O709o998J8399q073j866m6982N5819o28j18410P0711O0550l5407P5870
11714a9961q7353O4619q3691o7249N6047M8091O4330q1795k3207J47563m8757
11703c1363j05282J01607k03078P8163J41157q2477r580P2142p7292l8749J0860
11692a43892l993J4327L0192l3390L5027j8394J17511k06012N4993Q3376o3907
11681a34162j8535J14556n3256q994Q6170m6178p6071O0926j4034j1139M4194
11670e6523N0520j38720P1726M1486n5182R7203j22061p4321N4621Q4107j817
11659d8961r1516j9196O5032J968P4441p7289N8190p0720K805j803O6916m2718
$$ y = [-144662, -86794, -92511, -170837, -192032, -29000, -65281, -91057, -184857, 8351, -52659, -89655, -82946, -89944, -71545, -79618, -81484, -128466, -72647, -73275, -191685, -120974, -60424, -95831, -19961, -107314, -42695, -126386, -193635, -137588, -89497, -25167, -106962, -130169, 17394, -31363, -136645, -35038, -238116, -159953, -18796, -101273, -110853, -38711, -116003, -154752, -143892, -147885, -133558, -103366, -136756, -101729, -120123, -2612, -208624, -153631, -70255, -134162, -152697, -38141, -91397, -100391, -14221, -60399, -136470, -75544, -89578, -100717, -56523, -6003, -144723, -72997, -31511, -86693, 10510, -111551, -185872, -131251, -47144, -48961, -140477, -159673, -94641, -92673, -18232, -95521, -37331, -108051, -105246, -107049, -40133, -82851]
11647h2851o1333R8825q4700m6945Q1653r309R4714o9350j8076n9752L9958Q2051
11635c5115o8720J6740p1925J04512n9535m4973M6994k1818k2035N9777j6522
11624a12620m6825J02975m2600R3939r1933M0400l2689O1642k7427l5846J2994
11613g7990p171j02367M5906O316M8670n5196k2531J32812j10543R2472m4499
11602i4121K7004o6003O2770o6891L7802M5644N313k246j38514R6181l7220O5696
11590f4585q7645L5966l6123q05o1540N1445R5352m8730l8512J1312Q328k1885
11578a57422j0290L6249Q3613m9123j0498L0006Q9958j23874K2030N0349p4146
11567a13148k0707n0891J0931M6012N3343M4647J6989j38736M4064m0403j3220
$$ y = [-82851, -144184, -45359, -130059, -177004, -95351, -104660, -9946, -79296, -97372, -157124, -117166, -35115, -103835, -87095, -159020, -54508, -114043, -159016, -112022, -133840, -155875, -96098, -112620, -159445, -56470, -99070, -5131, -97064, -56664, -89353, -27711, -55138, -90984, -77990, -85161, -187528, -141622, -135306, -86636, -141832, -164363, -31551, -142094, -49622, -94121, -67117, -133120, -70350, -137241, -99439, -53795, -48482, -50728, -189242, -93061, -130281, -64585, -152230, -116264, -152387, -153192, -214732, -163287, -67935, -116665, -155177, -143865, -135537, -157422, -167712, -131463, -47850, -96973, -107471, -77465, 12493, -111381, -89351, -39002, -113148, -133855, -184746, -173815, -127803, -74460, -29813, -12824, -151560, -107496, -147899, -161119]
11556a61119L7333O8536l3759J4737N9478J1926m7177j1127N9135o5101k0989
11545h8127k5576k6646n1228J31748J5543P5405j67012l3975K2425J13261j53498
11534a87680J09329L6512k7547n7427l8711L5945O5199N423K2098p8669l8258
11523a53786J14147j04807M7626N6562O404q5017k8694M1962J9673q835k6306
11512a21071L2445j8284K8922k2779M2947l1417Q713r0309Q6628o2336J40610
11501e931j40655J0373L0007m2304N1774j3470L0606k2897P7411J099l82p7157
11489a01526Q9697j30227j7149N9482P32j0274N1777K164j35907K9569P8199k1245
11477a04708L1263M854L104k6587Q846L7515j35757O4414O6459p5084N0724O9000
$$ y = [-161119, -123786, -55250, -89009, -74272, -14794, -2868, -50045, -61172, -2037, -67138, -88127, -113703, -140349, -191577, -59829, -44286, 31119, -135893, -169868, -147443, -34182, -187680, -78351, -41839, -69386, -126813, -165524, -129579, -64380, -58957, -36859, -115528, -153786, -39639, -144446, -96820, -40258, -33854, -118871, -147565, -105603, -85930, -94765, -121071, -88626, -106910, -77988, -100767, -57820, -89237, -80524, -170833, -84205, -146541, -5931, -146586, -136213, -106206, -148510, -96736, -110206, -79600, -102497, -25086, -23987, -24369, -101526, -11829, -142056, -159205, -99723, -98991, -109265, -57488, -55324, -191231, -161662, -83463, -104708, -73445, -68591, -65487, -92074, -83228, -45713, -181470, -117056, -50597, -125681, -74957, -5957]
11465e957j04951K8095l611q065l9485J0635J933j11105J12332Q8209o0927n9928
11453a52825Q6487O0254j04965k2471L3927Q1159p8746j1069m9061Q3191j04140
11442a78259P9599n8633J862P7880o3223J9360m6689K7068L5567R4666q0710N675
11430h5837J2093j39023J38926l117M0170m5815P396j209J017m0021J2738R2932
11418i750q1940m5946J59514j52872J31058J7381j75207K0420Q1485j02605J43659
11407a4803j33684L8187m9175N8037l7899k074n190O3319q4615M4488p4238J13930
11395h3717o5998O0329K4365j08188L5125Q8543p14j20778Q10O326N9059l6905
11383a41743J00957J4870r9325M7365n2038R0928M828p5877P6175j06873K9960
$$ y = [-5957, -110908, -82813, -86424, -94489, -133974, -123339, -121406, -232511, -120179, -31970, -92897, -152825, -66338, -6084, -111049, -133520, -99593, -18434, -97180, -108249, -157310, -74119, -178259, -98660, -157293, -155431, -77551, -140774, -121414, -168103, -141035, -105468, -10802, -91512, -85837, -73744, -212767, -73841, -76958, -36788, -82603, -75207, -76416, -75399, -115420, -102682, -9750, -91690, -137636, 21878, -130994, 64, 17445, -157762, -137342, -55857, -158462, -14803, -148487, -110300, -159475, -101438, -139337, -141411, -146601, -83282, -167897, -123409, -197647, -83717, -149715, -89386, -65021, -173209, -138084, -49541, -50255, -171033, -170223, -163897, -104838, -141743, -40786, -25916, -125241, -77876, -129914, -38986, -34158, -110035, -33860, -140733, -110773]
11372a10773L0871l473O4288j25235J27934p2047O1375j49592k111J16680o1810
11361a23893m0369J16487m1708r2682J29511q3843J10081k9227L4360l2242j53944
11350b07469J30205j11881L2597R9141j12061L5330n2421J11016m7922M6772R218
11339f7475k9343n3955J7628O2438K2679o8830Q4611K86p6120L1557R1240j28789
11327a14073J4012L4067p6597J06941j13572J74100p3239p5553J36094j41028
11317a28848J18342p5444K1618O3206J6915j35850L9883l980J2057k0433l2537
11306a25071O7275o6932J30700j5005J4949j00445L9197O3734r8987L797M0958
11295d5830j52505J38498l3735J02932m5650m9992J4867l4401q790P9237m8035
$$ y = [-110773, -79902, -83375, -19087, -144322, -16388, -88435, -27060, -176652, -178763, -62083, -123893, -164262, -47775, -89483, -182165, -52654, -136497, -26416, -55643, -21283, -53525, -207469, -77264, -189145, -156548, -57407, -169468, -134138, -186559, -75543, -123465, -76693, -67475, -96818, -150773, -133145, -70707, -48028, -116858, -32247, -31961, -108081, -76524, 14716, -114073, -100061, -65994, -142591, -35650, -149222, 24878, -48361, -123914, 12180, -128848, -10506, -85950, -64332, -1126, 15789, -120061, -80178, -84158, -72101, -92534, -125071, -57796, -124728, 5972, -9033, 5916, -94529, -55332, 8402, -90585, -86788, -45830, -198335, -59837, -93572, 9360, -36290, -86282, -71415, -105816, -114606, -35369, -83404]
11284h3404O6925j2654j78p735R6271l5206l9877J10462r5270N072l302K9703
11272C0807l3699p6767Q4039j99167Q7921j0185N656q9310R9990L2943K3183k1291
11260f5880k768l7932J04683M42n8291n2406M5023k8250J5426K1727m2682j438
11248a02346j3735J3274R539l1268N2840M0529j09338L7821K0642j8015P9174
11237b0883n8901K9665p1343J13302j56679j3170J31253k8101j13078N903N2021
11226a30011K5081p1784Q5384M40K9580j09448P1335J7825j3693l1969n1778P6967
11214a02071l3420k7619P3391K9082k4786L933L8084j28341K5945J9225J2505
11203a14072J7403K5441L5700q3964m3583J6844R4128O4539j63828L7492K8123
$$ y = [-83404, -16479, -29133, -29311, -37046, 59225, 24019, -15858, 94604, -666, 4406, 1104, 30807, -2892, -79659, 4380, -194787, -106866, -117051, -111395, -200705, -100715, -67772, -44589, -65880, -68648, -106580, -1897, -1455, -59746, -112152, -67129, -95379, -79953, -58226, -100908, -102346, -116081, -102807, -93268, -124536, -71696, -31167, -140505, -102684, -82042, -100057, -20883, -79784, -50119, -121462, -8160, -164839, -178009, -46756, -74857, -187935, -182032, -130011, -104930, -176714, -91330, -90890, -61310, -170758, -99423, -81598, -95291, -127260, -179038, -102071, -135491, -163110, -89719, -60637, -85423, -81490, -43406, -171747, -145802, -126577, -114072, -96669, -71228, -35528, -119492, -163075, -146231, -52103, 12436, -151392, -113900, -85777]
11192h5777n0313P1678n5401j3138J33798j179m4593n5851n6374O3368j5373o9535
11180a78690R517J15352j2762J5956q9650J15324K7434o4819N3903n6902m699
11169g0036p68k1410l0172L536l8220O1463O3102l5049m1509M3900o4769j588
11157a31520N258Q9240J9179r5907m6893O3498j5471R0185q8393M7754n5363L7292
11145h1141n0393N5022j7745n6958L0936o6546O0081k478N1131l2060K108L9817
11133f8226m3717P243m7783J791J45158q3369P347K2092l6574n8423L7526M6903
11121g0032n8653K7544O133K7711o2487q652P0833j5238m608j2087M7162o8038
11109a20412J3937K0619l9043K4270j6411M9859q1104N7453k371l9151j3714J05679
$$ y = [-85777, -136090, -64412, -119813, -132951, 847, -332, -44925, -100776, -157150, -93782, -109155, -178690, -169173, -53821, -66583, -50627, -140277, -24953, 2481, -62338, -8435, -65337, -70036, -70804, -92214, -122386, -118850, -157070, -95607, -32505, -67554, -109063, -65163, -129932, -131520, -126262, -37022, -17843, -113750, -160643, -97145, -112616, -22431, -110824, -63070, -118433, -81141, -131534, -76512, -94257, -151215, -120279, -186825, -126744, -129222, -78091, -110151, -108043, -68226, -111943, -104700, -152483, -150692, -5534, -88903, -81556, -59464, -96038, -154461, -116935, -70032, -128685, -101141, -95008, -67297, -129784, -138436, -67603, -82841, -87449, -99536, -52374, -120412, -106475, -85856, -124899, -100629, -117040, -67181, -148285, -90832, -93203, -132354, -146068, -40389]
11097d0389o4188K3642K8297j07525N6897o1106P5642R232k7910M9333j2118n5337
11085a25530K9796k082J2975j38663P0510J557M7826o987p3354K6820J79186j00294
11073g8240j03057O0211P4788n0925k4356o7509M2885o7243P2701N8441K4858
11062e7446q001m1462L4437j1840j0239P074R3882n5691k8931Q0038q6837j808
11050h6824p016r090K1531n5034j5563L7336m8758N9308l6541N132J345Q3438
11038e0736n2299J12203k05287M8158J22050j03978L9344j7744O1633q1451J20549
11027g558j40836L4388n2332J30790j24898J01172K268R3298j15137P3254q9943
11016i5534k0867K3880l5681l7578M0661M5169j0687J18763k5094q2275K9395
$$ y = [-40389, -104577, -80935, -52638, -160163, -103266, -164372, -88730, -79498, -107408, -58075, -70193, -125530, -95734, -97816, -84841, -223504, -152994, -151437, -103611, -110598, -183952, -157132, 22054, -78240, -181297, -121086, -46298, -97223, -121579, -189088, -146203, -213446, -140745, -82304, -57446, -65447, -106909, -72472, -84312, -94551, -87477, 6405, -49286, -78217, 1821, -85016, -86824, -93840, -102930, -81399, -136433, -151996, -114660, -163418, -104110, -140651, -135519, -134174, -50736, -103035, 9168, -196119, -147961, -25911, -129889, -90545, -108289, -46656, -128107, -7558, -148394, -114006, -166338, -35548, -160446, -59274, -57006, 36292, -78845, -5591, -95534, -116401, -92521, -128202, -165780, -125119, -79950, -90637, 28126, 3032, -79243, -49848]
11005d9848O853n0347J6432K3534j04186N3697o9676M6024l0656P689L1766M727
10993a13991N6420l3720K8701O383m6767j087j18771J56045K0039M2450o8740
10982g3038o196l0929K7672O0755o9750n7388N1265L8456j6616N4249j32893J10620
10970d3793o9105n9974N2388q817Q5285p1282K3573J9893p0477P0755j41873M0292
10958a73135K1608P2898m3366P2385L4058k22506J36305M1952p6294j0897K1859
10947a25133J2215J8680O6413j89464J61683r4991J45689o2213J6834m3920J4243
10936g9964O8105j18448J24218K4190j25644L0006O8167q8230k580k7212O265
10925a21127k605J8587P6200J3655r2380J36426j26620M0515q5488L0962L096
$$ y = [-49848, -42995, -93342, -76910, -53376, -157562, -103865, -173541, -127517, -158173, -150484, -118718, -113991, -57571, -91291, -62590, -56207, -102974, -104061, -222832, -66787, -46748, -4298, -73038, -79234, -110163, -82491, -21736, -91486, -148874, -97609, -59153, -75769, -21520, -154413, -43793, -112898, -172872, -120484, -129301, -44016, -115298, -91725, -71832, -142309, -71554, -213427, -173135, -151527, -78629, -121995, -49610, -15552, -238058, -101753, -59801, -136095, -146992, -125133, -112918, -94238, -27825, -217289, -55606, -150597, -4908, -67121, -50287, -94207, -79964, -11859, -130307, -6089, 18101, -107543, -77537, -9370, -97600, -100180, -127392, -121127, -123732, -105145, -28945, -15290, -107670, 28756, -97864, -57349, -142837, -111875, -108779]
10914a08779K509p4616J450l7689P3152l0933k2024J22684K876J1857j2258J9297
10902e2474q743q5031p9062J03013m3855Q549N7015l27J6819R2363m6372J3679
10890b4426N4753q3501N8166j28294m774l0599O7952M7681j03855J00640J3981
10879c2276L53J4814k1296k2119K567n2568k9440R8323k2697j19583R4055o0721
10867a50588R7647j4639Q7106j49375N1324q8171O3336L5944k0245l3136K2898
10856i7899J9888l4987P2637j29119L487J27782n1806J18687o9428P0131k9355
10845A8p9989o872P491J09451j11922J1019o9931L0367O7558l5237J21945k47181
10833b03283J96872m5999p4931J13142l0492l1105L8030l5095Q7930j52565K0591
$$ y = [-108779, -106270, -180886, -179436, -217125, -143973, -174906, -196930, -74246, -71370, -59513, -71771, -52474, -61217, -146248, -225310, -122297, -166152, -157603, -100588, -100915, -84096, 8267, -38105, -24426, 30327, -53174, 4992, -123302, -128076, -158675, -90723, -43042, -146897, -46257, -32276, -31923, -17109, -38405, -60524, -57957, -110525, -139965, -41642, -64339, -183922, -89867, -150588, -52941, -67580, 19526, -129849, -78525, -166696, -103360, -67416, -87661, -120797, -97899, -78011, -112998, -40361, -169480, -165993, -38211, -90017, 28670, -40758, 29373, 18, -79971, -86843, -79352, 30099, -81823, -70804, -140735, -110368, -42810, -78047, 43898, -203283, -6411, -52410, -127341, -14199, -44691, -75796, -37766, -72861, 15069, -137496, -116905]
10822a16905J2734O2540j09367K3857J8678J6268L1810r9490R1105p2428K962
10811a38236O9432n0674k8308J06356o9565L0413J5255j7476J5032N0140N4754
10800C7123l9123j38144L8739J23586j25284N660J15059j00528O5655k2565l8698
10789g8520M8788j06707P0800p5328J04944M4232p0763P7150r0581j5667N6236
10778c5416m6727j0240O7511m6178N6913p1536K7403m7576q031n2361J41707j25588
10766a50119K2838J1900N1722P2124p8490L9068o1596Q2707n4719P8085j07500
10755i3980N3659l4938L8405o6500L9282Q2963r043j5821k15449J41715m0822
10744a20529K5002j19563Q0925M4567J6322m1465K1577J169j1962p0834J04385
$$ y = [-116905, -104171, -41631, -150998, -127141, -108463, -92195, -60385, -159875, -68770, -141198, -138236, -68804, -119478, -147786, -41430, -110995, -80582, -65327, -82803, -67771, -17631, 37123, -2000, -140144, -101405, 22181, -103103, -97443, 17616, -82912, -17257, -39822, -78520, -29732, -136439, -65639, -140967, -36023, 8209, -62554, 14596, -75985, -91652, -35416, -82143, -92383, -24872, -71050, -14137, -85673, -58270, -105846, -113877, -166238, -24531, -150119, -127281, -115381, -63659, 8465, -70025, -30957, -92553, -9846, -64565, 13520, -93980, -40321, -75259, -36854, -103354, -64072, 18891, 9848, -5973, -221422, -79707, -120529, -95527, -215090, -134165, -89598, -73276, -114741, -93164, -91995, -103957, -174791, -70406]
10733g0406K584p882M6900j15346M0934M1324O3808n1199J6734K4172l3012J3389
10721b8000l4837j08888K42137m5019j51445J47088j46536j9014O5383l9221M1970
10710g6382P339k4137R3655j62384J32832j81676J56024j05832L5469j8244L9128
10699a04208l5797N3083K8260j3654M1300N0334p4568m0782M2607N3159l9193
10688c9459J0610l9919m6540M6378r254P5184q886K9890j04629M4111l7638l2752
10676a12904P0714l0062N646p8998q601M5640K6301L1420L0676r3972K5587P1722
10664a6831j01995J22011o1328q144L1259k5553K4675R832j41700M6658N1297
10653f9819M102P739n922K6896r4760N1310L3423p53n5352L4610q2335J09277
$$ y = [-70406, -67822, -75704, -28804, -144150, -103216, -61892, 1916, -49283, -32549, -8377, -41389, -28000, -62837, -171725, 70412, 25393, -126052, 21036, -125500, -144514, -79131, -118352, -76382, -69043, -93180, 475, -161909, -29077, -210753, -54729, -160561, -125092, -143336, -104208, -140005, -86922, -58662, -72316, -31016, 19318, -55250, -96032, -53425, -266, -39459, -28849, -68768, -115308, -68930, -78184, -3000, -11886, 18004, -86625, -42514, -80152, -112904, -42190, -72252, -66606, -145604, -154205, -108565, -82264, -50844, -20168, -114140, -88553, -16831, -118826, 3185, -58143, -66287, -35028, -60581, -35906, -26074, -167774, -121116, -69819, -65717, -57978, -63900, -37004, -131764, -80454, -47031, -47784, -103136, -68526, -150861, -41584]
10641d1584j32632K8715P4953m0090P1594k2535l7195K3585K8708L441j00565
10630a43605M5006J46013j65011M9343l8765P8117j22694N5488k299P6298o3203
10619h5312M0560j7008L2259K109j6658O101k8966j1527M4414N3260j60210J58925
10607A7947j03560K3365k56k6888m2423K3587M5227Q5846n5301k2638K4803J2293
10595a7998l4978J7414n129J3608M777j6116p6206R0188m775q4317J9629P8241
10583a5662L0991r4586O5933j23540J75267j41908P3589o4921j2453R5806j12044
10572a23528M9151K7941P4040o6750n0282M4300l9855J947m4513M1741L9487j36834
10560a83155J66584j27053O5607o1709L8317O8288p915M0273m1575j06956O3200
$$ y = [-41584, -174216, -145501, -70548, -110638, -39044, -61579, -98774, -75189, -46481, -43040, -143605, -98599, 47414, -117597, -68254, -107019, -28902, -151596, -96108, -98407, -22109, -85312, -44752, -61760, -29501, -27392, -44050, -37949, -66915, -78442, -34028, 19232, -140978, 17947, -85613, -62248, -62504, -89392, -131815, -108228, -63001, 22845, -32456, -55094, -30291, -17998, -52976, -35562, -40691, -27083, -22306, -38422, -114628, -24440, -29215, -113532, -93903, -15662, 15329, -79257, -13324, -136864, 38403, -103505, -29916, -94837, -107290, -11484, -123528, -74377, -46436, 27604, -39146, -89428, -45128, -84983, -83036, -127549, -85808, -46321, -183155, -16571, -143624, -78017, -139726, -101409, -33121, -41036, -763, -42338, -149294, -86094]
10549h6094J18242j31056N998l0807J18560r2628o2377J47671k314j0637j10302
10538a35744R5012L7964n0431J01022j57721O1826J0408n5014J9110R0822p9209
10527f1955j6671K9412k1058j5265l523N52R0486k6031J1388p3837l7089Q639
10515a14952M9236J5970m3832N1528R933n8415K1452m39Q3585l4007l9705K2926
10503c6720J1069o9719O1710L6588k6397o1797k1753K5065M3692r3749R7600r5336
10491a29747N2901K2931P709j3954n9847J3866N1787m6018O8892J26150j37845
10480d3175r9671O1736k4325l9602L4389O5362n7737J5883J10906n3943n1112
10469h1289l0368o4223J39913N125j0886k2746N0969m8058Q7170l6476r9057k2144
$$ y = [-86094, 32148, -98908, -92910, -123717, -5157, -97785, -160162, -12491, -14805, -25442, -135744, -40732, -2768, -53199, 47823, -109898, -48072, -37664, -92678, -73568, 17254, -61955, -78626, -49214, -70272, -85537, -89060, -88508, 1978, -24053, -12665, -86502, -123591, -114952, -65716, -49746, -93578, -42050, -32117, -90532, -69080, -69519, 14066, -19941, -59646, -36720, -25651, -95370, -33660, 2928, -23469, -85266, -107019, -81954, -38262, -132011, -34411, -129747, -76846, -53915, -46206, -60160, -120007, -106141, -54354, -100372, -31480, 94670, -43175, -142846, -81110, -105435, -145037, -110648, -45286, -103023, -87140, 23766, -30177, -81289, -111657, -175880, -35967, -30842, -41728, -64474, -13505, -61563, 25607, -10869, -109926, -132070]
10457a32070J06514j9736K6283l9256k8494k5938o6813R6505L7018L0538N781
10446i668o9365M2280R683o7364O3675o2454P921k6137R8641M7590q7619P4710
10434B1893j04558M3669M1166q2547L066k2190M2943n7445O1369n4440J21869
10423A4795j24015J43149j17133K8904n6691J17270j4402K7766r1659J10354l1159
10412G179j21229M4270Q2526n6828m0313M1451k2777j1347N4539P875M5894m1454
10400a0214Q1178j00797j9O524m7361L6134M8515m0423L9877j9901r2008N1802
10388d6693J4439j8416m0007o844O8744k6982j6288O6903M558j19483M4693M817
10376g0559M5645n4729J0470k541l8543J18332k2068K4656p3035O0208p0298J2922
$$ y = [-132070, -25556, -45292, -19009, -58265, -86759, -112697, -179510, -83005, -45987, -15449, -9668, -79033, -36753, -27070, -94434, -30759, -93213, -85292, -111429, -12788, 34802, -52817, 21893, -82665, -38996, 2170, -80377, -77311, -99501, -56558, -114003, -52634, -107074, 14795, -109220, 33929, -83204, -54300, -110991, 6279, -8123, 19643, -72016, 38338, 7179, -114050, -69780, 12746, -44082, -84395, -42944, -65721, -77068, -22529, -14654, 31240, -10214, 70964, -29833, -29852, -23328, -70689, -34555, 13960, -26463, 13414, -6487, -98495, -46693, -32254, -50670, -90677, -97521, -28777, -55759, -72047, -5144, -586, -120069, -75376, -70559, -24914, -79643, -69173, -71714, -110257, 8075, -13993, 10663, -62372, -2164, -72462, -59540]
10364e9540p2811P898K0235O1596k8118M4962q3830j0393L7637P5149r2946q851
10352a09012O9691k5709L5803O00m8092P4850j25122M2739K6639p0249N1997P6258
10340C93j42055M7377o2234J6872K4671L8683p5627P8832N5648o0217K7359P8324
10328B8026j66426J5730O1499n3987P7541j67143J34926j59500J74008J8017K3249
10317a4060p485o0638k2453O1721m6076P7657m0723n6115j0087R0928j7640q7486
10305a32457J65364j21181L1142k3683n8274L9781J09201p9892K5838n4018N4290
10294d3889M5971k04518q2358J32012R4598P7095r7138k5415j3262l5134P1670
10283h0368R636k0731p6385J01501J5990m8969m6655Q8015M6494p8887m4254P1200
$$ y = [-59540, -132351, -124453, -104218, -42622, -70740, -25778, -109608, -120001, -82364, -7215, -100161, -109012, -39321, -65030, -29227, -28627, -76719, -1869, -126991, -84252, -57613, -127862, -75865, 393, -141662, -94285, -156519, -139647, -114976, -76293, -151920, -73088, -17440, -77657, -50298, 28026, -138400, -122670, -61171, -115158, -37617, -204760, -69834, -229334, -55326, -37309, -14060, -21545, -82183, -104636, -42915, -88991, -11334, -52057, -108172, -118259, -27331, -44971, -132457, 32907, -88274, -57132, -80815, -139089, -99308, 9893, -69999, -44161, -98179, -43889, 2082, -202436, -284794, -152782, -58184, 18911, -78227, -103642, -116904, -152038, -80368, -70732, -91463, -167848, -66347, -50357, -99326, -145981, -57966, -11472, -90359, -134613, -63413]
10271f3413N6625q5954N5831l6158J5643N8401j42858N1188N7699n7466q6500
10260a76962J48343J4169j154o3166N7206o6461Q2362m6853O542O45l1922M1555
10248c5696N005q2346L1061M5211k1690Q534M2358J7102q933m2390K0485P290
10236a4009p9145J9729K7188K9380J3385n3765J1998R805R7282k24995J38714
10225b4433p2872O7281K8553K0040j07749R16J21020j7686j39252l7614J52596
10214i200p3215N7107m5291N8463Q0706j65159K8384O2334p4983j2280m8278N8401
10202h3011J6043K1347j34716P8412R2976p2327q5765R2646J2253j03197Q1320
10191h4019m2343O6973j7491J8921Q4704k7540p4790M964M1200n2347J08552j51288
$$ y = [-63413, -6788, -92742, -36911, -73069, -57426, 975, -141883, -90695, -32996, -90462, -176962, -28619, -14450, -15604, -78770, -21564, -88025, -5663, -52516, -45974, -45329, -77251, -35696, -30691, -113037, -81976, -36765, -58455, -49921, -7563, 9539, 606, -41784, -21299, -14009, -93154, -73425, -46237, -16857, -3472, -57237, -45239, -35434, 61848, -163147, -24433, -97305, -30024, -1471, 18569, -89180, -88264, 32756, 15070, -124182, -161796, -9200, -82415, -25308, -70599, -12136, 68570, -96589, -68205, -5871, -80854, -93134, -141412, -83011, -66968, -45621, -180337, -101925, -8949, -81276, -167041, -74395, -62142, -165339, -84019, -126362, -59389, -76880, -57959, 26745, -795, -75585, -70621, -29421, -81768, 26784, -124504]
10179a24504J04140k1317O897r2124J13054J1095l8221k146l8006O483N3331Q07
10167b0511j01967R7593q4084o7469P5795q780k4308R3323q2407O2563o7385O1958
10155f5679j4642m2299L5820l620K7316l4883j09463J16765M2025j67709J10548
10144a05821m6978N9855J7703P992j01938N3799R5500o5659J6701L8076L184L6542
10132H956q0546N8023k1003o2803N7096O3507r1964N0380M89O2478r0731k6718
10120g2836l1825N1033k8568Q2854M3337k1778l0655k5068n6074L7112m5655R2781
10108e342n3370M362o7949J0980J9320l5991M432N6784j308L0265o7361J11852
10096F674j49428J09756m6357Q21M5158K5970j00714k342J57019k2669k9482p4061
$$ y = [-124504, -20364, -41681, -34784, -126908, -13854, -2759, -40980, -43126, -81132, -74649, -21318, -20511, -122478, -24885, -108969, -176438, -100643, -109423, -133731, -40408, -122815, -60252, -127637, -65679, -80321, -122620, -86800, -90420, -63104, -97987, -207450, -90685, -48660, -216369, -105821, -152799, -92944, -75241, -67249, -169187, -115388, -19888, -85547, -68846, -30770, -27586, 8956, -71590, -13567, -34570, -97373, -40277, 23230, -68734, -18354, -17865, 44613, -46118, -72836, -104661, -53628, -82196, 658, 43995, 22217, -8438, -33506, -89580, -52468, -98123, -5342, -58712, -54350, -122299, -111319, -91999, -127990, -123558, -66774, -68082, -37817, -105178, 6674, -142754, -32998, -79355, -78534, -33376, -7406, -108120, -110462, 46557, 23888, -5594, -79655]
10084g9655J25306j1501n2886l9723N8721l2695M8231l0976m6779m3118L4799
10073g0276J5432l6975k2905m182R0059L3209p7684N343P989q8468K7087q995
10061a30366J12755J7663O976j03676J28940J767J018j24114K5752M070j02185
10050a61400O2884M8408j8071q6859J15327Q366J2660m7324J0961J3640J35575
10039I4167m463j34510M6763K0175m8310o4677P3803k0265p0781Q6303l5014k4499
10027h1308o079R5660j15278J00017j07928J11197l4242p541n6231L6205J7111
10016d8417o0160O6361J04273k03097J29177J04592j31617m6178N8259m8351R8594
10005B3436n1643M6286j3497p2169R425N5352p6271J29439l2851q1540J41365
$$ y = [-79655, 45651, 34150, -18736, -58459, 262, -32433, 15798, -15178, -61957, -105075, -70276, -54844, -91819, -114724, -118906, -28847, 4362, -73322, -67979, -59990, -148458, -121371, -130366, -17611, 52, 7028, -96648, 32292, 34059, 35077, -89037, -63285, -59215, -161400, -98516, -50108, -68179, -155038, -39711, -31345, -18685, -66009, -55048, -41408, 94167, 89704, -44806, 1957, 22132, -26178, -90855, -17052, -37317, -108098, -21795, -56809, -81308, -87387, 8273, -107005, -6988, -114916, -3719, -37961, -45502, -101733, -65528, -48417, -108577, -42216, 62057, -141040, -11863, 92729, -38888, -85066, -26807, -75158, 23436, -28207, 18079, 4582, -67587, -58162, -2810, -79081, 50358, 17507, -64033, 77332]
9994G7332J5449j07867M4564q0981J65954n4356J8215r0633N6505k6372l0579
9983a2769K2365j7234J6421k5049O2878j0494j21722R4482O7M0312o0252J04355
9971I3360n6344J7883l3431J11482j38003K2051R2814k4036J53548j00842P5757
9960B14239k45j485j63804K3898J51740o7418J7315r109P8536J25341q323L7740
9948C98425J53969m870O5187n5620Q062p2808j27672l8029J9095J07349J38573
9937E91661m7255L5096L8643J03449j34198K6926l1094j32591o4204j22300K2040
9926B86173n1920K2203R2211J2771l0379l8029j04897J03167n4553R6444l4361
9915B98830k7411O5048m8882m2260o9144J18942N6018j04261O6751J29128p1875
$$ y = [77332, 92781, -15086, 29478, -51503, 114451, 60095, 78310, -12323, 44182, 17810, -12769, 9596, -7638, 8783, -16266, 46612, 36118, -85604, 8878, 8945, 49257, -10995, 93360, 37016, 54899, 21468, 132950, -5053, 16998, 109812, 85776, 239324, 138482, 214239, 213994, 212509, 48705, 72603, 224343, 156925, 174240, 165131, 243667, 369008, 360685, 398425, 552394, 547524, 612711, 557091, 565153, 492345, 364673, 326644, 345739, 453088, 591661, 544406, 579502, 618145, 721594, 587396, 614322, 583228, 450637, 386433, 264133, 286173, 234253, 256456, 348667, 361438, 331059, 293030, 188133, 291300, 236747, 333191, 298830, 271419, 336467, 287585, 245325, 176181, 295123, 351141, 246880, 313631, 442759, 370884]
9904C70884L4970O5634R7906J60184P5637m0963m1927L6115p9466K2777l7532
9893F64219J5049q1975J41480j14504l6280j9675N1854K00911K10927P214J79639
9882A218859K10796J20867K21230K0741J7036M5095p9952k3525j00402j15689
9872A535056m8659k20977K3649p0166j6246N4673n7580j4963O1706l962J01070
9861A343601O800J66350N8424J68749P9048J33408J08181J40697K25393L82472
9851B813123N51760N63626L13244R9123J99719k89068j53244j46612j75907j31853
9841C643911q6998k68219l53741k82363k92159k63737k58952j75133k16217j83353
9831A263039k1801k1484j32055k0188l5294Q8465L0314M2977O7050j0911Q1392
$$ y = [370884, 405854, 471488, 569394, 729578, 805215, 764252, 722325, 758440, 678974, 701751, 664219, 679268, 597293, 738773, 624269, 587989, 568314, 620168, 821079, 1032006, 1039220, 1218859, 1429655, 1550522, 1771752, 1792493, 1809529, 1854624, 1774672, 1751147, 1650745, 1535056, 1486397, 1265420, 1289069, 1218903, 1202657, 1257330, 1199750, 1184787, 1246493, 1242531, 1343601, 1350401, 1516751, 1575175, 1743924, 1822972, 1956380, 2064561, 2205258, 2430651, 2813123, 3364883, 3928509, 4241753, 4340876, 4540595, 4251527, 4098283, 3951671, 3775764, 3643911, 3556913, 3288694, 2934953, 2652590, 2360431, 2096694, 1837742, 1662609, 1446392, 1263039, 1241238, 1219754, 1087699, 1067511, 1032217, 1120682, 1150996, 1193973, 1261023, 1250112, 1331504]
9820A331504P8693m0892P2161O7284L61449J76438K5180P6215r0518k32108j23895
9809A701511k65073k03965j4581j78007J4331j38384J05082j06797N4776k7174
9799I41719J28380M6018o1954J32114j95778P4356R566o7253M9107l7172K0319
9788A039422j02508P2817k2921M578j19735j38721p1541o7574l6446k2158r6420
9777D38793l3049o4182J75652j24618J02522R3339q1040J1012J61479M8809O1674
9766G90391J00748P3747J24134j1406o2525o3625J01852L9244o1408l1455M9688
9755A049385j25198N5979l1454j34649q6796j02739j09983Q540p4793L1027o1197
9744D18122q9753q1568m095r007J14988j48973M9169j9635m7668J0864q9926P1415
$$ y = [1331504, 1410197, 1369305, 1441466, 1508750, 1870199, 2046637, 2071817, 2148032, 2057514, 1825406, 1701511, 1436438, 1232473, 1217892, 1039885, 1054216, 915832, 1020914, 914117, 968893, 941719, 1070099, 1116117, 1054163, 1186277, 990499, 1064855, 1074421, 1007168, 1056275, 1019103, 1039422, 936914, 1009731, 986810, 991388, 871653, 732932, 661391, 593817, 557371, 535213, 438793, 405744, 341562, 517214, 392596, 495118, 588457, 507417, 518429, 679908, 728717, 790391, 891139, 964886, 1089020, 1077614, 1015089, 951464, 1053316, 1092560, 1031152, 999697, 1049385, 924187, 980166, 948712, 814063, 727267, 624528, 514545, 523085, 448292, 479319, 418122, 328369, 246801, 242706, 233699, 348687, 199714, 248883, 229248, 181580, 192444, 102518, 173933]
9732A73933N2769j45993N198J22837j1077p5299j0769J9044O3300p5863M5807
9721A63887M7923j3925k0630j41320J20293j9521J0384k8573P1794j36305O7457
9710A21464K8306m9111J6794m9249m6169Q3843J615q706k7373L3910K1940j2749
9698A14515r1503J1302L1911R1690j02519o8140J42536m2386m6466M5085r119
9687G6906q9449Q3527j0916m0915j01236O8683P2649K2492q1204M7071k341l8994
9675F273J00137o1757m559O5635O230j18669J37735o5305R7805j09380J63048
9664B17193l9183L1452k9325n7660P7684P1198o3693j4780J169p3918K178N4784
9652A77099o3307O527R434j8582j00104M0518J1245j02468J08975p9601J63826
$$ y = [173933, 226702, 80709, 85907, 208744, 197667, 122368, 111599, 130643, 193943, 118080, 163887, 211810, 197885, 177255, 35935, 156228, 136707, 147091, 118518, 190312, 54007, 121464, 149770, 100659, 117453, 68204, 22035, 105878, 107493, 98787, 71414, 105324, 127264, 114515, 23012, 34314, 66225, 157915, 55396, -12744, 129792, 87406, 40940, 86025, 76906, -12543, 70984, 60068, 19153, -82083, -13400, 59249, 81741, 537, 47608, 45267, 6273, 106410, 44653, 40094, 105729, 111959, -6710, 131025, 65720, 163525, 54145, 217193, 178010, 209462, 180137, 122477, 200161, 271359, 207666, 192886, 194055, 120137, 122315, 177099, 113792, 120319, 129753, 111171, 11067, 51585, 62830, -39638, 69337, -10264, 153562]
9641A53562r2300k2238n175P1553j2927R404R1083K7805o961n4834R9359N626
9629B63957k8372n7762J35026j38602k417M1489o2896p804q1250Q723o306j8384
9617D5402Q7873l043o3051O3966n4946M5811q7201P011J22973r292q0828K8387
9605A03062k2461n0425K2645O8702k8173m9407M1042P0263p8010r4675R3403k3033
9593E2933O099L562n5510Q9046p6120l1816P5215p7900j9941J4018M8109l7073
9581i378k6064Q3289j2507M5564k2593R9888m0172J1658l6664Q1512n7279l9539
9569G7715P2410m1496j0703l9799n9683O5337L5593n5470P2525q4473N6991o263
9557H2684n09K1269j7222m1013L3776J2277j17333J10934n7447N6952Q592j7853
$$ y = [153562, 61262, 39024, 33849, 105402, 92475, 101879, 192962, 220767, 213806, 158972, 258331, 263957, 235585, 177823, 312849, 174247, 171830, 213319, 150423, 142619, 61369, 70092, 63786, 45402, 133275, 130232, 67181, 131147, 76201, 122012, 34811, 41822, 164795, 155503, 74675, 103062, 80601, 30176, 52821, 121523, 93350, 43943, 84985, 155248, 77238, -17437, 75966, 52933, 59032, 62594, 7084, 96130, 20010, -11806, 63409, -14491, -34432, -20414, 27695, -9378, -35442, 47847, 35340, 80904, 58311, 158199, 118027, 129685, 93021, 174533, 117254, 77715, 150125, 108629, 97926, 58127, -1556, 63781, 99374, 43904, 116429, 31956, 88947, 82684, 82175, 103444, 86222, 45209, 78985, 91262, -26071, 84863, 27416, 84368, 92960, 75107]
9545G5107p6041J01200q002m1708k7489M4903O1318o9243N0291l0873k148J756
9533G9071J07589n0143k6348M6309j4092L2155O8663j15839N2622l5413L9243
9522A83817m8591L0613L0622k3633M5465M676J5119j8811m932O8387j5684r3685
9510A73363L1235M5057k3062N8503O503n0888j2671P7224O6587p5344J40234K8764
9498D65505J03817j3124L6120l5025q9899O6414K2510K139J7390r4222N0331L7587
9486E69543o9899M2049j8756j760p926Q1186J7661l7508J4095l986P8210O6077
9474G28986l8220J25698J7371O7750k4623N9758L9564l8255l807O3035J02698
9463A099955l5322Q0808K1867m6414J95907j14072K3609M0921q9920q45L5942
$$ y = [75107, -934, 100266, 92264, 50556, 23067, 67970, 129288, 60045, 110336, 79463, 77315, 79071, 186660, 136517, 110169, 156478, 142386, 174541, 243204, 127365, 179987, 144574, 183817, 135226, 165839, 196461, 172828, 218293, 222969, 238088, 219277, 214345, 282732, 267048, 173363, 204598, 249655, 226593, 285096, 291599, 240711, 228040, 305264, 371851, 296507, 436741, 465505, 569322, 556198, 592318, 557293, 467394, 533808, 556318, 558457, 575847, 481625, 531956, 569543, 499644, 541693, 522937, 521177, 513251, 594437, 612098, 574590, 588685, 584699, 662909, 728986, 690766, 816464, 833835, 901585, 876962, 936720, 976284, 938029, 934222, 997257, 1099955, 1064633, 1145441, 1167308, 1120894, 1316801, 1202729, 1226338, 1267259, 1177339, 1176494, 1212436]
9452A212436P5451J2063R7707j00929R2426j8584L59673R7464J85080Q5495J42215
9441B240497J6011N3908j38999l6320L5064J3853l2455q7446L9379j26731l4243
9430A942518j07268r5221k36917Q2227j06348K1074K6935R5936o7479K3812j9044
9419A560225R4183Q6164K71457J77764Q6996J7693J39862j8792O1424M3369k6152
9408B494193j21808j02798j08881l4089j68097p6927j25851k18375r5877M6418
9398A487908n6051j00468k9768o1469K9044r4032J4364m6391n1181j0338j7442
9387A064176l2385k4417j18812J00537j00784M286m9386Q4258j2966j2513J25797
9376A027791P1478O240J03261J23723j35552J39923k095J26646R5361l8573j15162
$$ y = [1212436, 1287887, 1299950, 1397657, 1296728, 1389154, 1370570, 1730243, 1827707, 2012787, 2098282, 2240497, 2256508, 2310416, 2171417, 2135097, 2170161, 2184014, 2151559, 2064113, 2103492, 1976761, 1942518, 1835250, 1740029, 1503112, 1585339, 1478991, 1500065, 1527000, 1622936, 1555457, 1579269, 1560225, 1654408, 1740572, 2012029, 2189793, 2276789, 2294482, 2434344, 2415552, 2476976, 2520345, 2494193, 2372385, 2269587, 2160706, 2126617, 1958520, 1881593, 1755742, 1537367, 1441490, 1487908, 1431857, 1331389, 1301621, 1240152, 1269196, 1175164, 1189528, 1143137, 1091956, 1081618, 1064176, 1031791, 1007374, 888562, 989099, 888315, 892601, 843215, 927473, 914507, 901994, 1027791, 1099269, 1105509, 1208770, 1332493, 1196941, 1336864, 1334769, 1461415, 1556776, 1518203, 1403041]
9365A403041O7976j04680m56p8321k3463Q9628J03919k6956R072J24572J27892
9354A692224J50076J12087K34291K10554K30979J07826J58849K0293n408J42548
9344C054319J08976K01158k0148j3134m975M25k79244p5941J36892j08925n8189
9333B941214J61564l0784O394p1704m5094P451k2014P7818L9364J97491J90684
9322C452384J34012J26160L58380K87617K42330O20137R5392K19730K63639m815
9312E794966P5381r2028j46608k38371j3641Q6731K17303J70348J38610j82215
9302E810476l19477l75855m29609l99928k56203j55197j93233j76049j26438j0532
9292C367955p3526J5461L055J42853J98822K19193J95020J59085J15093j8159
$$ y = [1403041, 1471017, 1366337, 1365881, 1287560, 1264097, 1353725, 1457644, 1430688, 1439760, 1564332, 1692224, 1842300, 1954387, 2188678, 2399232, 2630211, 2738037, 2896886, 2917179, 2911771, 3054319, 3163295, 3364453, 3344305, 3331171, 3326196, 3326621, 3047377, 2971436, 3108328, 2999403, 2941214, 3102778, 3071994, 3078388, 3006684, 2961590, 2969041, 2947027, 3024845, 3064209, 3261700, 3452384, 3586396, 3712556, 4070936, 4358553, 4600883, 5221020, 5316412, 5536142, 5799781, 5794966, 5870347, 5778319, 5631711, 5393340, 5379699, 5466430, 5683733, 5854081, 5992691, 5810476, 5490999, 5115144, 4685535, 4285607, 4029404, 3874207, 3680974, 3504925, 3378487, 3367955, 3294429, 3309890, 3312945, 3455798, 3654620, 3873813, 4068833, 4227918, 4343011, 4324852]
9282D324852j37988k50636o3494j54988r6027j69367l3311P4463J5821Q8779J65216
9271C763320N9143J39633k603j19397k0739j23608k57012n8288j11163k0281q1153
9260C167852J02729l8572M0973r100K18473P5470R9313O2379k9138o3496J19769
9249C746652l3155j5808j342l058m1056J26047R3703J6148K49809j1277J09690
9238D236353j1081P1730l8973N6564J6859O6074K40596q1485J59864J13938N2027
9227D882466l895J21670J2608J7421J51453J48688J20522J66963L52396J52909
9217F123201P6909L27696O2862N5641J31634R5673K17656j5967J79003J29501
9207G383809K14809K11803L41303J69418N21530L24692M01175L90881L50636M62678
$$ y = [4324852, 4186864, 3936228, 3872734, 3717746, 3621719, 3452352, 3419041, 3493504, 3509325, 3598104, 3763320, 3822463, 3962096, 3959493, 3840096, 3819357, 3695749, 3438737, 3380449, 3269286, 3249005, 3167852, 3270581, 3232009, 3272982, 3263882, 3482355, 3557825, 3657138, 3719517, 3690379, 3626883, 3746652, 3713497, 3697689, 3696347, 3693289, 3652233, 3778280, 3871983, 3888131, 4137940, 4126663, 4236353, 4225272, 4297002, 4258029, 4314593, 4331452, 4397526, 4638122, 4556637, 4716501, 4830439, 4882466, 4878571, 5000241, 5012849, 5030270, 5181723, 5330411, 5450933, 5617896, 5970292, 6123201, 6200110, 6527806, 6590668, 6646309, 6777943, 6873616, 7091272, 7075305, 7254308, 7383809, 7598618, 7810421, 8151724, 8321142, 8842672, 9167364, 9568539, 9959420, 10310056, 10772734]
9197A0772734M81199O56197Q49675R78009Q08414P17041N60133R34715R47797
9188A7705914J137729J016736J090821O80842L92027K71272L40011K52052M95131
9179B3382535L03558K96811M55296N76916P04972R67428J043226P79810O54282
9170B9164834L40421J34043N39603R72676J750697K343473K351146K185130J912777
9161D1694800K039414K410409L829266M899326N404855M425550K671668K244430
9153F9619718L159893K788273J830890Q32836J28473Q06968P64247J498569K350874
9144H3780741K819807L179222M237670P176147J2653853K1798774L3341739M4443004
9136B13430957M9461999M4031577K6776674P113299j0975932k5640599l5336744
$$ y = [10772734, 11253933, 11910130, 12759805, 13737814, 14546228, 15263269, 15823402, 16758117, 17705914, 18843643, 19860379, 20951200, 21632042, 22024069, 22295341, 22635352, 22887404, 23382535, 23686093, 23982904, 24438200, 25015116, 25720088, 26687516, 27730742, 28510552, 29164834, 29505255, 29639298, 30178901, 31151577, 32902274, 35245747, 37596893, 39782023, 41694800, 43734214, 46144623, 49973889, 54873215, 60278070, 64703620, 67375288, 69619718, 72779611, 75567884, 77398774, 78231610, 78360083, 79167051, 79931298, 81429867, 83780741, 86600548, 89779770, 94017440, 101193587, 113847440, 135646214, 168987953, 213430957, 262892956, 306924533, 333701207, 340814506, 329838574, 304197975, 268861231]
9129B68861231l7969260l5672164l1188963k5127326j8214622j1429496n472868
9122A03786532p65973J245432R28463o26968k600952l574032l160448k839253
9114I2392801l161440l783916m727705n085282n089857n266901m701991m018584
9106E6557125k716535j723155q17124r44549j357843j653627k069446k165581
9098D3109265j937525j814691j322786n42550j16137L16380O11434O55557J451277
9089D0410224L119211N054593N984026M150155P28412m277230m807032n613698
9081D4748661o202161m957821l991778l040791k184581j398073q73234o81886
9073B1418336l61964j27467q2975j22137n4820k57116l79452l17314m26524n92414
$$ y = [268861231, 230891971, 195219807, 164030844, 138903518, 120688896, 109259400, 103786532, 103020559, 104265991, 105194454, 104567486, 101966534, 98392502, 95232054, 92392801, 89231361, 85447445, 80719740, 75634458, 70544601, 65277700, 60575709, 56557125, 53840590, 52117435, 51300311, 50355762, 48997919, 47344292, 45274846, 43109265, 41171740, 39357049, 38034263, 37491713, 37375576, 37691956, 38303390, 38958947, 40410224, 43529435, 48584028, 54568054, 58718209, 59446621, 55169391, 50362359, 44748661, 38546500, 33588679, 29596901, 26556110, 24371529, 22973456, 22100222, 21418336, 21056372, 20928905, 20845930, 20723793, 20668973, 20411857, 20032405, 19715091, 19288567, 18696153]
9063A8696153q69551j032784r57031j056667q55638n86580l52082l9751j74760
9054A2771309l29501l88943o21513n59787o56715n65056m49559n02192l16966
9045H381077k44894k74316k44076j43364j38005l18721j42273k29978j89241j55611
9035F300598j25266k04092k07693k56703q6274j66622k11699m2242j35710j65627
9025D698670j79947j53371p2146p8304j05349n4805j94037r8552j03618q8714
9015C569827m2713j03142j94575l9107j12990j4421p5898q2753k6603J973K3722
9004B903320j39575n7603j57220L1124n4808p3261j13012j9774k9108k6898j6730
8993B246455n1719P8640q9617J9134j19214L6415J1431O3507j40335k4129k5001
$$ y = [18696153, 17826602, 16793818, 15836787, 14780120, 13924482, 13337902, 12985820, 12946069, 12771309, 12441808, 12052865, 11431352, 10871565, 10214850, 9649794, 9200235, 8698043, 8381077, 8136183, 7861867, 7617791, 7474427, 7336422, 7017701, 6875428, 6645450, 6456209, 6300598, 6175332, 5971240, 5763547, 5506844, 5420570, 5253948, 5042249, 5000007, 4864297, 4698670, 4518723, 4365352, 4293206, 4214902, 4109553, 4054748, 3860711, 3762159, 3658541, 3569827, 3527114, 3423972, 3229397, 3190290, 3077300, 3062879, 2986981, 2904228, 2877625, 2879598, 2903320, 2763745, 2706142, 2548922, 2580046, 2525238, 2451977, 2338965, 2319191, 2290083, 2263185, 2246455, 2194736, 2273376, 2183759, 2202893, 2083679, 2120094, 2131525, 2195032, 2054697, 2030568, 2005567]
8982B005567j16128r161l9567j11707j6412k2653j63221J40166K0489j03713O0679
8971A644339j03876K7819k4570K6662j05638l1070K6879j1523j20307r4082L4943
8960A269576n6125o930Q5711q5181Q5387q9432j05240P2911Q493j34536n2757
8949I91877L5333M3858l1228j88667Q0468L3276n3910o5608K7231j00107j2257
8938G60266j7769m4648j1552m4039K9125K0485j33997O2186K3857m6437J3853
8927F11330r3204J23275j17516O3583r4465l2272O8707m0244n823k2894l6335
8916D24142l679n1238Q3406q0971Q448P0170l7859j23020Q9829M2648j38601N9125
8904C42400p3541N4964p8436J5980n9685J13354K4596q0259Q4094j46349J16011
$$ y = [2005567, 1889439, 1880278, 1840711, 1729004, 1712592, 1689939, 1526718, 1666884, 1687373, 1583660, 1644339, 1540463, 1568282, 1543712, 1570374, 1464736, 1433666, 1460545, 1449022, 1328715, 1234633, 1269576, 1213451, 1206521, 1292232, 1207051, 1292438, 1203006, 1097766, 1170677, 1179170, 1044634, 991877, 1027210, 1071068, 1039840, 851173, 931641, 964917, 911007, 845399, 872630, 772523, 760266, 742497, 697849, 686297, 642258, 671383, 691868, 557871, 620057, 643914, 597477, 611330, 518126, 641401, 523885, 587468, 493003, 460731, 529438, 489194, 483371, 460477, 424142, 420463, 369225, 452631, 371660, 380108, 450278, 412419, 289399, 379228, 421876, 283275, 342400, 268859, 323823, 245387, 261367, 201682, 315036, 339632, 259373, 343467, 197118, 313129]
8893C13129m3734N4278n5111L7268Q3370j85267R3336M4343k5149n1314l6902
8882B28247R3019k6746j13407O8712j39724J42565p8797K4897R767P8664j10050
8871A77147O3904o9392O2568J46327p8243K6837P626M8504N6042l856m3700K9546
8859D23310p4549M6691j31307J25532o3483J09692j02564M2301N7602o0635l8976
8848C33614n2998l348O9796L1052p4491l3422N3369J15157K7448J04635J13270
8837F84082l6266P4429J17511n660J30586K5149J8878r4468k8598j1588k15562
8826F58493N9474o9810M33q8721K3121j17595L4369r1528n305M9784m2699K9979
8814D39995p7786J31599j1810R831J01462m2157M3535L8947Q5973P1017q2889
$$ y = [313129, 269395, 323673, 268562, 305830, 389200, 203933, 297269, 341612, 316463, 265149, 228247, 321266, 294520, 181113, 249825, 110101, 252666, 173869, 198766, 208533, 287197, 177147, 241051, 171659, 234227, 380554, 302311, 329148, 336774, 385278, 441320, 437464, 393764, 423310, 348761, 395452, 264145, 389677, 326194, 435886, 333322, 375623, 433225, 372590, 333614, 280616, 277268, 347064, 378116, 303625, 270203, 323572, 438729, 466177, 570812, 684082, 647816, 722245, 839756, 834096, 964682, 989831, 1008709, 914241, 885643, 874055, 658493, 717967, 648157, 648590, 559869, 582990, 465395, 499764, 408236, 402931, 452715, 410016, 439995, 362209, 493808, 481998, 491829, 593291, 551134, 594669, 633616, 719589, 790606, 707717]
8803G07717M6656J4301l5433j5552k097k6672n6285o9618p3217l2057k1439j0324
8791D25980K43j81603L5344n3181P7118k07241J45759K4117K4831J540k3022j4304
8779B55581Q6810O5467p3256j3903p8067p075k2284J1601m2616N842N4064M7181
8767B89345j39860L7147l9391j3518o1616J13041k7036N3638j16375N9273r9825
8756E4823J06747j62817J55784p2173J2445j3076j1714J22374q7828k3142n7973
8745B3450J12096K1577q8327n4713k5759j6144J52634j64196J9416J29264p0902
8734C8396J4995O019j13447J22758r1187k0987J05876p2715n5911Q9021Q8341
8723A11159j28193P1521k4613k0583p289Q3577j08881l3485J44924j47325L095
$$ y = [707717, 754373, 768674, 733241, 717689, 715592, 688920, 632635, 563017, 489800, 457743, 436304, 425980, 426223, 244620, 279964, 226783, 303901, 96660, 242419, 266536, 291367, 292907, 269885, 255581, 342391, 407858, 334602, 320699, 242632, 235557, 213273, 224874, 182258, 188100, 242164, 289345, 149485, 186632, 147241, 133723, 72107, 185148, 158112, 211750, 95375, 154648, 54823, 161570, -1247, 154537, 82364, 94809, 81733, 70019, 192393, 104565, 81423, 23450, 135546, 157123, 68796, 14083, -11676, -27820, 124814, -39382, -19966, 109298, 38396, 53391, 59410, -54037, 68721, -22466, -43453, 62423, -10292, -66203, 22818, 111159, -17034, 54487, 29874, 9291, 2002, 85579, -23302, -56787, 88137, -59188, -56093]
8712e6093J11569K001n3142p9476k779k893K5695J1584J2018R0952m7195J8738
8700C0979q8484M0175L8706M6053M4663j13196l4661n9261P8123j00201L5954
8689h1150O4677j24701J52690p1406l6098J30464m0975l8984L2401j42515J21609
8678c3988M7408L4204k4407n4919O811j071N8740l098P3371N794o9483N6516P6304
8665A72182j80261O3791n0473Q6371j74378J6678P117L1166N5734j3237j33885
8654a19195Q3877l3508P7176J3960j3508q8500P8073j0029l1531P9153n5804j7343
8642c7179L4324K151l8926k4558k7688M4944Q5934p5940k1249j29237J85001k7086
8630b9509j9577o142M6181M9280l3289j4198q3732J11457n5241p931q1983P7699
$$ y = [-56093, 55476, 57477, 4335, -75141, -77920, -80813, -55118, -43534, -31516, 59436, 12241, 30979, -57505, -17330, 21376, 67429, 112092, -1104, -35765, -95026, -16903, -117104, -81150, -16473, -141174, 11516, -59890, -95988, 34476, -6499, -45483, -13082, -155597, -33988, 13420, 47624, 23217, -31702, -24891, -25962, 32778, 29680, 103051, 108845, 39362, 95878, 172182, -8079, 55712, 5239, 91610, -82768, -66090, -58973, -27807, 27927, 14690, -119195, -35318, -68826, 8350, 22310, 8802, -79698, -1625, -11654, -43185, 35968, -19836, -37179, -2855, -704, -39630, -64188, -91876, -46932, 39002, -36938, -58187, -187424, -2423, -29509, -49086, -55228, -9047, 40233, 6944, -7254, -90986, 20471, -34770, -42701, -124684, -46985]
8618d6985j1442m1054L713M8374q1722J38496o9160K2063m8131K0642k8136J1180
8606h2162J4440K5767O4636j23959R8281k3486j3563k7054O0705l7008l8743j9279
8594a01425L3106N6580j14858J15494j77290J91151j6037j24835J56118k1192
8584c188l372j13675K878J19870j06744k2312N0847L6785j7504N8949j315M8059
8572D9278j5701q4954l211O3330P388r5502J07970m7595j5836K1551o1132o7818
8560a42232M5302o108O0153L4641n294q9639K5550N2753j2336K9187l0225K4684
8548a3564l1580k1818m8254J44024k00m1203J22690p4757l1428k4375M88369j141043
8536f73139N75261M5022L8380q3044M2723j6927K7536j6471k3896K9614l3771
$$ y = [-46985, -58427, -99481, -95768, -47394, -129116, 9380, -59780, -37717, -85848, -65206, -93342, -82162, -67722, -41955, 22681, -101278, -2997, -26483, -40046, -67100, -6395, -43403, -82146, -101425, -68319, -11739, -126597, -11103, -188393, 2758, -13279, -138114, 18004, -3188, -6560, -120235, -117357, 2513, -104231, -126543, -75696, -38911, -56415, 2534, 1219, 49278, 33577, -51377, -54588, 8742, 16130, -79372, 28598, -18997, -34833, -13282, -74414, -142232, -96930, -103038, -42885, -8244, -13538, -103177, -77627, -24874, -37210, -8023, -38248, -13564, -45144, -66962, -115216, 28808, 28608, -12595, 110095, 35338, 3910, -20465, 467904, -673139, -97878, -52856, -14476, -97520, -54797, -71724, -44188, -60659, -84555, -54941, -88712]
8525h8712M494k0988J61128o2969N0334j80891J48404j12488J17720j70425M8541
8514a05852j6770R7862j49737R8130N1425j08897J68562k6012q7179k3085J0981
8503i0572Q0582j10803J61257j90239R1717o6337J10644K8008k4834j12320J39970
8492A7073j24661M0690J2252j43427J47061r7142J01852j1105M6348J704j987
8481a1342p7910L2973N4747p29p5793N6218p233o5067M2954J26480j03547J51904
8469A23655j58691L7879k481r3125m9647J58448K1264o0205j05224J25011o1062
8458f4178L7560P1579q3250J9552k0250J01330j78299R3144J31877o7899r3745
8447e2579q317k5027j9871R2081l8807L3527O5800o6426j08489P6564O8933o1765
$$ y = [-88712, -84218, -105206, 55922, -7047, 43287, -137604, 10800, -101688, 16032, -154393, -105852, -122622, -24760, -174497, -76367, -24942, -133839, 34723, 8711, -78468, -101553, -90572, -9990, -120793, 40464, -149775, -58058, -124395, -13751, 14257, -10577, -122897, 17073, -107588, -66898, -54646, -198073, -51012, -148154, -46302, -57407, -11059, -9355, -11342, -89252, -56279, -1532, -2261, -78054, -21836, -29069, -94136, -51182, 75298, -28249, 123655, -35036, 2843, 362, -92763, -142410, 16038, 37302, -22903, -128127, -3116, -64178, -26618, 44961, -38289, -18737, -38987, 62343, -115956, -22812, 109065, 41166, -52579, -60896, -85923, -105794, -13713, -52520, -18993, 46807, -19619, -128108, -51544, 17389, -44376]
8435d4376J736M0242o1445l4913P115o6534Q3775N7284L7452p5904L7170k1476
8423c9874o2698P2660j89542J12653K9582n471p897n3228O3894M5463p1988N3067
8411e3379K9720j3455Q3574m0199k7756m3224m9079M0186P3209o7639O5670p7224
8399g9596k411Q4250n5152P8458p9274M2685j7848m115l9277J72420j59922m2086
8387a01868R2952o2165k0078R3195K764J6380o5626o8365O1100J0109j4740mJ05993
8374D9647k00074J10650j8564L7996o179L4038o8738m326k824M3072l6565j7653
8362g9520L9572N1637q7179j0912J388P2376R268L9489r6772j5371O7331j04904
8350a13597k9820Q5641J8377m1857N7019p6566R611M4428p0171M7859N3994J1675
$$ y = [-44376, -42640, -2398, -63843, -98756, -91641, -158175, -74400, -17116, 20336, -55568, -18398, -39874, -102572, -29912, -219454, -106801, -77219, -82690, -90587, -143815, -79921, -34458, -106446, -53379, -23659, -37114, 46460, 6261, -21495, -64719, -113798, -73612, -403, -68042, -2372, -79596, -82007, 2243, -52909, 25549, -53725, -11040, -28888, -33003, -72280, 100140, -59782, -101868, -8916, -71081, -91159, 2036, 4800, 21180, -44446, -112811, -51711, -41602, -56342, -56346, 49647, -150427, -39777, -58341, -20345, -26524, 7514, -61224, -65550, -68374, -25302, -61867, -79520, -39948, 11689, -75490, -86402, -85014, -12638, -3370, 36119, -60653, -76024, -8693, -113597, -143417, -57776, -39399, -81256, -24237, -100803, -91192, -46764, -116935, -69076, -15082, -3407]
8338c407j03601J04632p6799l3393J21742j05198L916j7062O6141n1701j1511
8327a06241O9371L5149j3757o2516j0928L5523L3615M8551p4387k5510J35618
8316F4488q7762j02772J11315K8621R76k5800p156m6803L6704k3016n5242k9679
8304a36126L756L2778J22224j32073M2234k2842J5953L2697J860J00618n4700
8293F379k9967o53J710j4630M1648k1079m0935J11911k08180P6889K288J0312
8281f4307J8621n5914j8669J45622q8084L8324k9952M3983o2458n2364P3955P8689
8269B7446o8409j1517j0049n1914P0963l9617N5781O1877j4654m0193l8133O061
8257e2358j1010m4323M9327Q2817j20350N0859q5460j6989J20091M2646j7810
$$ y = [-3407, -107008, -2376, -79175, -112568, 9174, -96024, -92108, -109170, -43029, -94730, -106241, -36870, -1721, -15478, -77994, -88922, -53399, -19784, 28767, -45620, -71130, 64488, -23274, -126046, -14731, 13890, 14866, -10934, -18090, -64893, -28189, -51205, -106447, -136126, -132370, -99592, 22632, -109441, -67207, -90049, -74096, -41399, -39539, 61079, 6379, -23588, -24241, -22531, -37161, 4487, -16592, -57527, 54384, -153796, -76907, -74619, -64307, -45686, -101600, -120269, 25353, -62731, -24407, -54359, -10376, -72834, -125198, -51243, 27446, -40963, -52480, -62529, -114443, -43480, -83097, -27316, 34561, 19907, -20286, -58419, -52358, -63368, -107691, -58364, 24453, -95897, -45038, -130498, -147487, -27396, 15250, -2560]
8246b560M5020n1839q3278l0254M2058L3594k0846P2392L9618q7362J6674K7374
8234E91l1404p6739R0227K637m3355Q1972j34818Q0290p2265k5493N0834Q1916
8222D393J2202m6979p843R3175j74686O1902M2051p9841K6328L2696n9651l605
8210i9858J91798q6809p8888L5945o598M0363o1082l1817q317J10720p5118L9523
8198c0138L5219j09755J69994m0178M8613p1394j293588J102184J24105l6416
8188a01354P7443r8161k5407J20322j17607K8147J50082j5594j3887j02176L1137
8177f7055q8114j6700J22795P9697q8416j07598J08076j8519p537N506R1027k1207
8165h045j7749o9949N5199r9761K4218o481J6160O1234m8678N771p6272K8045
$$ y = [-2560, 42460, -9379, -92657, -122911, -80853, -47259, -68105, 4287, 43905, -43457, -26783, 591, -30813, -107552, -17325, -14688, -58043, 23929, -110889, -30599, -102864, -128357, -77523, 4393, 16595, -30384, -38227, 54948, -119738, -57836, -15785, -95626, -69298, -36602, -96253, -99858, 91940, 5131, -73757, -37812, -44410, -4047, -65129, -96946, -105263, 5457, -69661, -30138, 5081, -104674, 65320, 25142, 73755, 2361, -1291227, -189043, -64938, -101354, -23911, -122072, -147479, -27157, -144764, -116617, 33465, 17871, 3984, -98192, -67055, -155169, -171869, -49074, 30623, -57793, -165391, -57315, -75834, -83371, -77865, 13162, -8045, -25794, -95743, -40544, -140305, -116087, -122568, -106408, -45174, -93852, -88081, -164353, -136308]
8153a36308L4660J09417o455j15744j5267r620Q2776j85982M5179Q1118j47898
8142b64124J16878j088M1252J02099j30782N1429l3952L4301q4838J8929q029
8131a57925O2876j29669J17128Q9471j1311m316O6987k2706n923j08482O3997
8120c9873K566l6285j6192K471J9713n4146J30051j23428P4023P3570j0007M7945
8108G0408Q816k6646n6540N7036j46597N5113k264m3418p5862P4778J0814P6296
8096A934o1006L3640j11884J56786j16891K7265O7474k0922o4715J09986K1596
8085D3263o2545k5384R1639j38279M5009n9185Q5389q6346n7646J10216J1741
8074d2128M0164o5348J2594k8008l4047L8108l938K3032j78908K64428j54928
$$ y = [-136308, -101648, 7769, 1314, -114430, -129697, -139317, -56541, -242523, -197344, -116226, -264124, -147246, -148334, -107082, -4983, -135765, -84336, -118288, -83987, -168825, -149896, -157925, -95049, -224718, -107590, -18119, -29430, -33746, 33241, 10535, 4612, -103870, -39873, -37307, -73592, -89784, -87313, -67600, -121746, 8305, -115123, -41100, 32470, 22463, 70408, 79224, 52578, -3962, 53074, -93523, -38410, -40674, -84092, -159954, -85176, -74362, 1934, -59072, -25432, -137316, 19470, -97421, -70156, -2682, -23604, -88319, 21667, 43263, -19282, -44666, 46973, -91306, -46297, -105482, -20093, -106439, -164085, -53869, -42128, -1964, -67312, -54718, -82726, -116773, -78665, -82603, -59571, -238479, 25949, -128979]
8063a28979R4516r6350l8L3144j021m3689J9811M1216o079M1617k8715L976M9654
8050b0937j85049J24336M241N026N9078j05302J03272l2849n0236Q1082K9767
8039A2429k5451m3501j3936P038K4284m4809O4804n2843q0137N1773N6992n1230
8027i4587P0892l9727P0658n9861J848l8682L2024p0619Q6656R9142q5901j0892
8015c9049J1302N1979k4277m7583p738l7516L7630J9973P5833j24658R4728j20845
8003a10221J42048j27399j0545K5784J24548j36546J1912K4023n4425P1402q17
7992d0236n6690J7767N4051R6926k04151J33312l4203O9643o596p1287L3493m9806
7980e7777p877m8243J00680o9250M9198K535p3755m4984J73498n2742O3645k8522
$$ y = [-128979, -34463, -130813, -130851, -97707, -98728, -142417, -122606, -81390, -87469, -45852, -74567, -70591, -20937, -205986, -81650, -77409, -72383, -13305, -118607, -15335, -48184, -98420, -17338, 12429, -13022, -56523, -70459, -63421, -39137, -83946, -19142, -71985, -152122, -100349, -43357, -94587, -23695, -63422, 7236, -52625, -50777, -89459, -57435, -128054, -41398, 57744, -28157, -39049, -27747, 24232, -45, -47628, -55366, -92882, -55252, -35279, 40554, -84104, 10624, -110221, 31827, -95572, -106117, -80333, 44215, -92331, -80419, -56396, -110821, -39419, -40236, -96926, -79159, -25108, 71818, -132333, 979, -33224, 36419, 29823, -41464, -7971, -57777, -65654, -113897, -13217, -82467, -33269, -30734, -104489, -149473, 24025, -28717, 34928, 6406]
7968F406j06172K8215L0959l1461O9877j06128J49338l1695l1514J8268n3441
7957e7348K3502M168J5631j1262K1169j26014R7278O138m0574R456N9661j15j70532
7944a68842J00119J0974K1420M3139K6820n6512K2832k4024j542N8854r9079O672
7932e9169j831k3975K6797K5974j4199O1660q9123N4594k0613l6477N6340k8615
7920d8637k0778M5265N40K6771m1608m5669N3133o649P2058N93n7264M7019m5242
7907b0468M5043j4490l4834r5155Q7234N1425n1286k8005j1442N7898R345j00606
7895a05341K7088K7722k5668K573R6808k9870q463M1831o590k7742K4703k3715
7883f664l8010L8161k9448o078n2924N4289j37565R2046R4515o3457K71L9689
$$ y = [6406, -99766, -71551, -40592, -72053, -2176, -108304, 41034, 9339, -22175, -3907, -57348, -33846, -29678, -14047, -25309, -4140, -130154, -32876, -26738, -67312, -57856, 1805, 1690, -168842, -68723, -57749, -36329, 6810, 33630, -22882, -50, -24074, -25616, 33238, -65841, -59169, -61000, -84975, -58178, -32204, -46403, 15257, -73866, -19272, -39885, -76362, -20022, -48637, -69415, -24150, -23610, 3161, -38447, -84116, -30983, -37632, 34426, 35019, -22245, 24774, -20468, 24575, 10085, -24749, -119904, -32670, 18755, -32531, -60536, -71978, -14080, -4735, -105341, -78253, -50531, -76199, -73626, 23182, -6688, -15151, 26680, 20090, -7652, 17051, -6664, -44674, -6513, -35961, -42039, -94963, -40674, -178239, -86193, 8322, -55135, -54864, -15175]
7871a5175o3097K942O9028m3487Q5522J8982k5666n5139j746q6242J63506j56641
7859a07213r867L675J54927j12104P868m5038L0563K4624L9522r917o8762j23063
7847b14785R97260o08451q1844p9378n877n3619L6683J7851j36036J54332j24988
7836i8852O0336r990N4636m6080O0109k8073k8871k7126P6402j8905j5026o5870
7824h7310R4669q2853O9738k9209O301o3443K859J20858r6559J03743p4484Q4980
7812D9290q8466p28L885q1950j5688M0640L3495l6945J37510m4805m9685q6567
7800a40014J60812j16730K8673P8723q1232J264n1768J09820o3446J16860l1687
7789A1275m1836m0339O6966j27470Q717N9093K4060k4155O8942l8814N8573L814
$$ y = [-15175, -78272, -75330, -6302, -49789, 35733, 54715, 29049, -26090, -27836, -114078, 49428, -107213, -117080, -113405, 41522, -70582, -62714, -107752, -77189, -52565, -13043, -22960, -91722, -214785, 782475, 174024, 92180, 12802, 6925, -46694, -10011, 7840, -128196, 26136, -98852, -38516, -48506, 6130, -39950, 20159, -7914, -36785, -63911, 12491, -6414, -21440, -87310, 7359, -75494, -5756, -34965, -28664, -92107, -89248, 31610, -64949, 38794, -35690, 49290, -39176, -39904, -36019, -117969, -133657, -93017, -59522, -96467, 41043, -3762, -53447, -140014, 20798, -95932, -67259, 11464, -69768, -68504, -120272, -10452, -73898, 42962, 11275, -30561, -70900, -3934, -131404, -122687, -63594, -39534, -63689, 5253, -33561, 25012, 28826]
7777B8826r5385K9751j03171P9909Q1860j44942J51419j31597P4380L7680p6337
7766f7607N547K380J1217J1320n2722R6195q6176O9711L2022l0364p1383M9251
7754c0609N7735m381j16522M2304L3052m1090J6584L5524L5067N1220p5908o1486
7742e8510m7008J14664j10596J30916n2703m4595N4103P864l268m5868Q3657j17816
7730h9160O7639p5264J47078j96361P1738M5971j22722P4742n8078J06722J07327
7719G9632q9663k887j6176J01801p4022L2167O4255j61236M8214M3608M9343m2681
7707C2355K1482K995p1250R494J10838J3126m1654m5837L1060L6765r3903j6918
7695a1447J4175O1797L3189n0751L5756K1516q236j05357J1367k4563N8868q143
$$ y = [28826, -66559, -36808, -139979, -60070, 21790, -123152, 28267, -103330, -28950, 8730, -67607, -62060, -59680, -48463, -37143, -89865, 6330, -79846, -10135, 21887, -8477, -79860, -30609, 27126, 22745, -93777, -51473, -18421, -59511, -42927, -7403, 27664, 78884, 2976, -58510, -105518, 9146, -101450, 29466, -23237, -67832, -13729, -5865, -9133, -55001, 28656, -89160, -21521, -96785, 50293, -146068, -74330, -28359, -151081, -76339, -134417, -27695, 79632, -10031, -12918, -29094, 72707, -1315, 30852, 95107, -66129, -17915, 25693, 75036, 32355, 53837, 56832, -14418, -4924, 105914, 119040, 77386, 31549, 62609, 99374, 5471, -11447, 2728, 64525, 97714, 46963, 82719, 104235, 95999, -9358, 2009, -22554, 36314, 28171]
7683B8171j9475J1342j05689K8430L9055j5079o41j1705n802r7138K00388r3778
7671d1921O555n224J20148j16265j0262R3453k2384n8152K4991L3912j17472M4182
7659d8439R3626j01831J1509M7730o7735l0387J3989J02179o2932L9326J0714
7648G749m0599O7092Q5105n7700m5701j4508q7497J22025j8858Q6230j07107R8318
7636I4549L8111l1680M4157n5812m281m8091m515J14626j09298l5947M7654N8625
7624A08098J7371j4353l2304p1093O7795j34322J25345K3704J1466r0194J14822
7613A26335n9126N4277p5950j2207M1301J3862J5421O6399J16753K36526J09288
7602F32879J72263J44495J56704K1473J44469j85043j02738j10778k40207j20644
$$ y = [28171, 8696, 20038, -85651, -57221, -18166, -33245, -33886, -45591, -51393, -148531, 51857, -41921, -35366, -40590, 79558, -36707, -46969, 46484, 24100, -34052, -9061, 24851, -92621, -48439, 45187, -56644, -45135, 2595, -65140, -95527, -81538, 20641, -42291, -2965, 7749, -32850, 34242, 119347, 61647, 15946, 1438, -86059, 35966, 17108, 103338, -3769, 94549, 132660, 100980, 145137, 89325, 85044, 36953, 32438, 147064, 37766, 1819, 49473, 108098, 125469, 111116, 78812, 7719, 75514, -58808, 66537, 90241, 101707, 11513, 126335, 67209, 121486, 45536, 33329, 74630, 88492, 103913, 170312, 287065, 523591, 632879, 805142, 949637, 1106341, 1127814, 1272283, 1087240, 984502, 873724, 633517, 512873]
7592E12873j19599q888p3852j01530K2943n5407n6009N3990r4042k7586Q3565
7581A36458j21923J21872j0575o8932j07778R6377M1928j59191J37265l6852O4248
7570I2897j11884k705J5811L248K6055p6092P9943o3701M6846M318m0769J898
7558b4135L7414J3896r1612r319J02761r9033R724Q8389R627k6188R964o334q7171
7545g2017R5993M7241p2860l7515P9737n5416j5227l4223J4941L4019j151L6655
7533B0177k0834k6911J2349L9131J2539q6466J7221P0115l6846o5532L3950k1290
7521e2397n412J15979j2842o2822m7314L9011M3169K0988j15093r290P384R0584
7509A1945q3336J6589O2424k0706N541M3160m0442j5237l3143R184L9879O7473
$$ y = [512873, 393274, 384386, 310534, 209004, 231947, 176540, 120531, 174521, 80479, 52893, 136458, 14535, 136407, 125832, 56900, -50878, 45499, 87427, -71764, 65501, 28649, 92897, -18987, -21692, -5881, -2633, 23422, -52670, 27273, -36428, 10418, 14736, -26033, -24135, 13279, 27175, -64437, -73756, 29005, -70028, -60304, 28085, 37712, 11524, 21488, 15154, -72017, 23976, 71217, -1643, -39158, 40579, -14837, -30064, -64287, -49346, -15327, -16478, 20177, -657, -27568, -15219, 23912, 36451, -50015, -32794, 37321, 475, -65057, -31107, -52397, -57809, 58170, 45328, -17494, -64808, -25797, 17372, 38360, -76733, -86023, -78639, 11945, -71391, -54802, 7622, -13084, -7543, 35617, -4825, -20062, -53205, -44021, -4142, 63331]
7497F3331r3824J4200n4468L9519p650q2808J21984k2637L6644J26756j81629
7486d0582Q9526j1907m6582L5050o8756q9306N3636J7936O6151l7550j1620J19042
7474G5038r0691O963n6195R6219J11236j95553P176P6685j1781k1787n1993O5061
7462A0378m061j7408k0977N774M719K4545n9950K6991Q9758q103j18568J63211
7450I6309L662j49795P0951r4806Q4797l7860L8887p5904J78811j89000O0297
7439a3651r8071Q8605j9595P3232O8563j10824K7580j13244J21966r1529J09726
7428D2758o2058K3169J6554R0419m2673M5530q0756L2646N5847n7211P3002r2724
7416D4503n2739J01676m2120L0275p442j09348m6616R9932L2861l0949r549k9422
$$ y = [63331, -30493, -16293, -70761, -31242, -38892, -121700, 284, -22353, 14291, 141047, -40582, 48944, 37037, -9545, 25505, -43251, -132557, -78921, -60985, 5166, -32384, -44004, 75038, -15653, -8690, -64885, 31334, 142570, -52983, -45807, 30878, 19097, -2690, -54683, 10378, 6317, -11091, -32068, -26294, -21575, 2970, -56980, -29989, 59769, 51666, -66902, 96309, 99971, -49824, 21127, -73679, 11118, -26742, 12145, -63759, 115052, -73948, -13651, -111722, -23117, -42712, 30520, 99083, -11741, 15839, -97405, 24561, -66968, 42758, -19300, 3869, 20423, 110842, 68169, 113699, 32943, 65589, 121436, 64225, 137227, 44503, -8236, 93440, 51320, 81595, 74153, -35195, -81811, 18121, 50982, 20033, 10484, -18938]
7404a8938M4732j36J18919o5329n804m7878j7422Q5608j20662N2590k8423l737
7392f480k8054j0484J16146j13871J3036P8074j6438n6581K7585L8915N7880O26
7380A00354q8632m6174O6656k2200Q4327O8818l4200L5495n1043P3756j00156
7369H7001P9542M0033P9031j53397L6549j1637P6884l7659j53350J62802j20664
7358H5135N3859r8768Q0772R3627l4610N1041O904p262p1984O0351j4505P9419
7346B83979O0149K6131O3825R7575J42251J61095J52597M88685N71958N34123
7336B582368P10594O53168J46683Q0036k39688n41994l51700n41402n62468l73903
7326A561694l20884k67208j18084j06970q5469j15957o3821r1785r740r1602L1628
$$ y = [-18938, 25794, 25658, 144577, 79248, 73444, 25566, 8144, 93752, -26910, 25680, -2743, -6480, -34534, -45018, 71128, -42743, -29707, 48367, 31929, -24652, 2933, 41848, 99728, 100354, 11722, -34452, 32204, 10004, 94331, 163149, 128949, 164444, 113401, 187157, 87001, 166543, 206576, 285607, 132210, 168759, 157122, 234006, 196347, 42997, 205799, 85135, 138994, 40226, 120998, 214625, 180015, 231056, 237960, 230698, 158714, 219065, 204560, 283979, 344128, 370259, 434084, 531659, 673910, 835005, 987602, 1476287, 2048245, 2582368, 3292962, 3946130, 4092813, 4172849, 3933161, 3391167, 3039467, 2498065, 1935597, 1561694, 1240810, 973602, 855518, 748548, 663079, 547122, 483301, 391516, 381776, 290174, 321802]
7315C21802J0081j32173J5673J56990j95031L0437J04534j60515J00217j34138
7305A17877J11612K4310o157k5455p0544m5009K5989Q6567M7810j68595K0891
7294A19296R5748n4455m7408J05513K961r9858O957J78506j79296J73561j59475
7283A42050k4203l8519R7501p2234K02783q7700k5061l040J67692n8540O8592
7272C69321j5384M3221J07477L4629j43J6946o9909N4726m1626n7143j0615L750
7260D35250k0700q7509n2231N7623K4241P8348J3889J20098J20197J33637J2661
7249H35504J16699M0981J703Q801r2021j15542o9598L0597j61173R70j40162m4302
7237D12457K777k5951j59857J60484J00495p6213J60261R9942K0243J96966o4664
$$ y = [321802, 331883, 199710, 215383, 372373, 177342, 207779, 312313, 151798, 252015, 117877, 229489, 253799, 247642, 222187, 151643, 106634, 132623, 219190, 267000, 98405, 119296, 215044, 160589, 113181, 218694, 221655, 121797, 128754, 307260, 127964, 301525, 142050, 117847, 79328, 176829, 104595, 307378, 219678, 194617, 191577, 359269, 300729, 369321, 353937, 397158, 504635, 539264, 539121, 556067, 486158, 540884, 499258, 442115, 431500, 435250, 414550, 327041, 274810, 332433, 356674, 435022, 448911, 569009, 689206, 822843, 835504, 952203, 993184, 994887, 1003688, 911667, 796125, 726527, 757124, 595951, 596921, 456759, 412457, 415234, 389283, 229426, 389910, 490405, 414192, 574453, 674395, 694638, 891604, 826940]
7226H26940R8625R2527j17734j05262r3473L698j35404r0263j1890O6976j24392
7215D10348K4330j73853P9708o6065J36M9447j3239j40908J48412j25345j8025
7204A74946P6983n2484K12228q9451k3254K2685J67444k0835K03102P5964J25788
7193H73116P9627M6753k9374q237j16925j17622k2271j11949p6911p9533j3741
7182D22933q4371j0989M4323k2500m6669m8581p5397M2985j3125J9265R0910O3173
7170C81957l7102j1831J589K6823m6380k4375J73147j23771N1685J20293j02660
7159D09375O6607r3017o955Q7100m4994o2443J69129r4698m1577J9931k4146m4491
7147C39821l5296K0503M6585k5653O5971p3168l735j6175k3516J28760l0701J717
$$ y = [826940, 925565, 1018092, 900358, 795096, 701623, 705321, 569917, 479654, 467764, 534740, 410348, 434678, 260825, 340533, 274468, 274604, 324051, 310812, 169904, 318316, 192971, 174946, 251929, 199445, 411673, 322222, 298968, 321653, 489097, 468262, 671364, 747328, 873116, 952743, 999496, 970122, 961885, 844960, 727338, 705067, 593118, 516207, 436674, 422933, 338562, 327573, 371896, 349396, 302727, 254146, 178749, 221734, 208609, 227874, 318784, 381957, 344855, 333024, 334613, 361436, 315056, 290681, 463828, 340057, 391742, 512035, 409375, 475982, 382965, 376010, 463110, 418116, 355673, 524802, 430104, 388527, 408458, 384312, 339821, 304525, 325028, 371613, 345960, 411931, 338763, 335028, 318853, 295337, 424097, 393396, 395113]
7135C95113J17263p8129J12671n7331L8058J3890q1981O9402K9651p9698K2857
7124E01766j74350P0062k221L961N5998P846K9623N5098o2595j246J59759m0196
7112F03505J6128J8704r093q287j02311R641P6065m0703N0408k0962l5817O892
7100E64170O0929j03381J71139n9563l5037J20148o2418R953J9242m7389J04433
7089G42226K4092q3619N8439q0563R8395Q696N8904J7289K7686N2983j65J3755
7077I38118J8964J38203n4043M0399m972j16711K94777j6601O3500J28083k1670
7066A408047J83713J34466R6948Q4696Q1661R4649n2323O346q6536J8345r8761
7055A871251K5742l0964m6857r198n5121O1973j33437n7114J21684j01894J08218
$$ y = [395113, 512376, 434247, 546918, 489587, 527645, 541535, 459554, 528956, 558607, 478909, 501766, 327416, 397478, 395257, 399218, 455216, 463062, 492685, 547783, 485188, 483942, 643701, 603505, 619633, 638337, 629244, 620957, 518646, 528287, 604352, 563649, 614057, 593095, 557278, 564170, 625099, 521718, 692857, 633294, 598257, 718405, 655987, 665940, 685182, 637793, 742226, 766318, 682699, 741138, 660575, 758970, 767666, 826570, 843859, 871545, 924528, 924363, 938118, 957082, 1095285, 1041242, 1081641, 1076669, 959958, 1254735, 1238134, 1301634, 1429717, 1408047, 1591760, 1726226, 1823174, 1907870, 1989531, 2084180, 2031857, 2038203, 1951667, 1970012, 1871251, 1896993, 1866029, 1819172, 1809974, 1754853, 1816826, 1683389, 1626275, 1747959, 1646065, 1754283]
7044A754283j42487J05925O0378L060P9042K9040O56L5570J62766J8624M4906
7033B151763o6529N4526L4869j7723M449J5687J3649O7845l3058K0972N6002J39875
7021B442327o3590P6187J05507J36805M1373K1605O8252R3352J13901j8440J75261
7010C192540q9275K69805L8254O6085J68116R3232M6163K79898J60890L10315
7000D536023L52203J32860L07217N04553L68776M39773N62704N06111N56203O45821
6990H912244O35241N75674N37709K07980K43954M08504K74211O74976Q10195J304309
6980A4584997J770180K502225L941536O574432R994980J2899403J2205020Q214105
6972G2686878J896832k988175n285063p063590o767918n550566m422687l506368
$$ y = [1754283, 1611796, 1717721, 1778099, 1781159, 1860201, 1889241, 1889897, 1925467, 2088233, 2106857, 2151763, 2085234, 2139760, 2174629, 2156906, 2161355, 2177042, 2190691, 2258536, 2225478, 2246450, 2302452, 2442327, 2378737, 2454924, 2560431, 2697236, 2738609, 2760214, 2828466, 2921818, 3035719, 3017279, 3192540, 3103265, 3373070, 3411324, 3477409, 3645525, 3738757, 3784920, 4064818, 4225708, 4536023, 4888226, 5021086, 5328303, 5832856, 6201632, 6641405, 7204109, 7710220, 8266423, 8912244, 9547485, 10123159, 10660868, 10868848, 11112802, 11521306, 11795517, 12470493, 13280688, 14584997, 16355177, 18857402, 22798938, 29373370, 39368350, 52267753, 64472773, 72686878, 74583710, 71595535, 66310472, 59246882, 52478964, 46928398, 42505711, 38999343]
6964C8999343k663066k028286j022535l59031O77234K482001N147616Q712095
6956D9945371J2851754J5683505J6047284J3044273Q917666K626220l038384p635546
6948A08442143j1616053j2895477j2344168j1185481r235804o819148m618498
6941C9727514k723910j409348m55043p5751O37051K008494M853543Q541343J1485119
6932F2589012J1001574O853228Q5047n189990p770378r488112r757057q252932
6924D0070392p028329n482815m218086l130487k186356j775680j521978j195588
6916A3531073j047530q36058p16791o00760l68952m62821m03701k87268k40517
6907H566675k80945k81468l54291j67059k43629k40100k30752j46582k32789J0464
$$ y = [38999343, 36336277, 34307991, 33285456, 32926425, 33603659, 36085660, 41233276, 49945371, 62797125, 78480630, 94527914, 107572187, 116489853, 119116073, 116077689, 108442143, 96826090, 83930613, 71586445, 60400964, 51165160, 44346012, 39727514, 37003604, 35594256, 35139213, 35063462, 35700513, 37709007, 42562550, 51103893, 62589012, 73590586, 80443814, 80528861, 75338871, 67568493, 58080381, 48323324, 40070392, 33042063, 27559248, 23341162, 20210675, 18024319, 16248639, 14726661, 13531073, 12483543, 11647485, 10930694, 10329934, 9960982, 9498161, 9094460, 8807192, 8566675, 8285730, 8004262, 7649971, 7482912, 7239283, 6999183, 6768431, 6621849, 6389060, 6399524]
6897F399524j38971q2062m285k0369J08221m38N8843k24164p7429j74420l57158
6886E487292k19250j84466l03632l16861j65793j87985n7421j96186j08138j23166
6876C624394j9309j20233o9895o5995L3556j2249k28377J902p4900J67492j71139
6865C065247l8281m4516j33166q3747p2773J0428K5561J1542P269J00060n4361
6854B793263N1744J85135L4168J18403K51052J63620R0975j18638j27887k35176
6844C206659k14212k41872j81962k31622k31729l5650o4767r4005P518N963k7193
6833A897128Q7241k5540J07427J58662J08801M0483p4478l2917k12900r3251j04542
6822A856114q0827k45026q0991p003j1855r6819M4387m7469Q2553j86793P4152
$$ y = [6399524, 6260553, 6178491, 6174206, 6153837, 6262058, 6261620, 6320463, 6096299, 6018870, 5844450, 5487292, 5268042, 5083576, 4779944, 4463083, 4297290, 4109305, 4051884, 3855698, 3747560, 3624394, 3605085, 3484852, 3414957, 3348962, 3382518, 3370269, 3141892, 3143794, 3068894, 3236386, 3065247, 3026966, 2982450, 2849284, 2765537, 2692764, 2703192, 2728753, 2740295, 2747564, 2847624, 2793263, 2845007, 3030142, 3064310, 3182713, 3433765, 3597385, 3688360, 3569722, 3441835, 3206659, 2992447, 2750575, 2568613, 2336991, 2105262, 2069612, 2004845, 1910840, 1918358, 1924321, 1897128, 1984369, 1958829, 2066256, 2224918, 2333719, 2374202, 2299724, 2266807, 2053907, 1960656, 1856114, 1775287, 1530261, 1449270, 1442267, 1430412, 1333593, 1377980, 1330511, 1413064, 1226271, 1300423]
6811A300423R1919P8301J26677N6080M593J11478J3001j44823j03499l9497k35157
6800A259496j05069l4437j47195L2937K4879j16185K9175k5938K576j34442J8040
6789H03837K3450k0792l0036J15697l5002R56J13859j212J9899O7121k6073P7879
6777A109583j49184j46755Q1484o8378j34885n5497L594j39535R3602j6009k1091
6766E56929j9979J9882j5936p2089Q9390O3082o5834J52078m1264o8651J9993
6755F17601K2428l2151l7738Q8269J19946k5707R1173J18415K22o1397n6660o2720
6743G81681n360p3309P6957j22690o8767q122l1731r6817o0461O8321m1461m8206
6731C70035Q9849k7865p6677O3453L2575j1106n1840k3416L2322Q8919l5553O4018
$$ y = [1300423, 1392342, 1470643, 1597320, 1653400, 1657993, 1769471, 1782472, 1637649, 1534150, 1494653, 1259496, 1154427, 1119990, 972795, 1005732, 1030611, 914426, 943601, 917663, 920239, 785797, 803837, 827287, 806495, 776459, 892156, 857154, 858110, 971969, 970757, 990656, 1057777, 1031704, 1109583, 960399, 813644, 895128, 826750, 691865, 636368, 639962, 500427, 594029, 578020, 556929, 536950, 556832, 540896, 468807, 558197, 621279, 555445, 707523, 666259, 597608, 617601, 640029, 607878, 570140, 658409, 778355, 752648, 843821, 962236, 962458, 901061, 844401, 781681, 776321, 703012, 779969, 657279, 588512, 580390, 548659, 451842, 391381, 459702, 418241, 370035, 459884, 432019, 355342, 418795, 451370, 440264, 388424, 365008, 397330, 486249, 450696, 514714]
6719E14714M4593J7322P0858K12644m2364k5885n2315o0902l3280m9698K8675
6708F24362p8492q2587m9780N27o2243M1388P8446l8277n2804n3662L5543Q5894
6696D48315j9566J65480j59867L8578j2702j6292j00934J56183p7630N3569o5860
6685D09274Q1964n1336N293m1328P3164J9857J3256r2731J21359q2821J82702
6674F38653J09548k6132Q8310p7083K9486n4965j56189j6036J59570j23384n081
6663E66697m696q438J530K9063l1615N4348R0386j47366J77745J27381O1696N5924
6651I72655N2227K1288j53394O4415j85874M0059J0293q1245l1794J03618j16930
6640F95318L7258K3002n9297N0338J43413J58853J20916L65089M77476O4380K14288
$$ y = [514714, 559307, 576629, 647487, 860131, 817767, 791882, 739567, 678665, 645385, 595687, 624362, 545870, 463283, 413503, 414030, 351787, 393175, 471621, 433344, 380540, 326878, 362421, 448315, 428749, 594229, 434362, 472940, 460238, 443946, 343012, 499195, 421565, 475134, 409274, 491238, 439902, 445195, 403867, 477031, 496888, 510144, 417413, 538772, 455951, 638653, 748201, 722069, 810379, 733296, 762782, 707817, 551628, 535592, 695162, 571778, 566697, 562001, 553563, 555093, 584156, 552541, 606889, 697275, 549909, 727654, 855035, 916731, 972655, 1024882, 1046170, 892776, 957191, 771317, 811376, 821669, 740424, 708630, 812248, 695318, 732576, 755578, 696281, 746619, 890032, 1048885, 1169801, 1534890, 2012366, 2076746, 2291034]
6629B291034n7608j82432o0141l31273k21105j96202j10118k28117k0221r1517
6619G92300j26564K9163M3178j29040m3133K2854J43042o9069m946p6444O0244
6608F41585n2981j14855O6867L8319n4353J8589J8732o7507j04512J06859M2572
6597E39315p9510J66701M9086K6474K3474O9494o4770L9979m158L7560j3280p6797
6585G13568R6909L0377M1599K941r3180J10284o3535J79227p7240J53713q3376
6574A011287J30537K47313K39767K72373K00410J02613J30234M837k87382r8935
6564A953054l3290m680K7111J0130M43278N43706L55063N51055k3670N6139L4640
6553C912536P8227K09126N04710P32823O70293J26627j76841m12147o10771n26779
$$ y = [2291034, 2233426, 2050994, 1990853, 1659580, 1438475, 1242273, 1132155, 904038, 883817, 792300, 665736, 694899, 738077, 609037, 565904, 588758, 731800, 662731, 657785, 581341, 641585, 588604, 473749, 540616, 578935, 524582, 543171, 561903, 494396, 389884, 496743, 539315, 459805, 626506, 675592, 702066, 725540, 795034, 730264, 770243, 766085, 803645, 790365, 713568, 810477, 840854, 882453, 885394, 792214, 902498, 838963, 1018190, 940950, 1094663, 1011287, 1141824, 1389137, 1628904, 1901277, 2101687, 2204300, 2334534, 2339371, 2051989, 1953054, 1919764, 1915084, 1942195, 1952325, 2395603, 2939309, 3294372, 3845427, 3821757, 3877896, 3912536, 3990763, 4199889, 4704599, 5437422, 6107715, 6234342, 6057501, 5645354, 5034583, 4507804]
6543D507804m40288m05620k40103j8345O340M58040L93859N11791M28998L93827
6533E596303L71437K90431M95614O44818P02403N55338M19936q5634o20774q12673
6523G557199r89103q62011q20931o62201n03752l34016l67526k52617j41707j80103
6513B443232j05174n7482L9430J5515L3723K48916L64058N26845L74963K36644
6503D120670q6748k01590m04037k21184l37013l08210k18914j64578m9080j52122
6493A977194j5396j6874p5906l3357N3874O5452r7086l7870j1891L5628J5140
6482A858908j0949O4716K089Q3942o389J11592J00449J52281L7087J90409K66535
6471B850670L55653K74772L87543J93563K34893Q5549j39441M3680j01512o1151
$$ y = [4507804, 4067516, 3661896, 3421793, 3403448, 3409788, 3867828, 4261687, 4773478, 5202476, 5596303, 5967740, 6258171, 6753785, 7398603, 8101006, 8656344, 9076280, 8990646, 8369872, 7557199, 6568096, 5706085, 4885154, 4222953, 3719201, 3385185, 3017659, 2765042, 2623335, 2443232, 2338058, 2280576, 2320006, 2335521, 2369244, 2618160, 2982218, 3509063, 3884026, 4120670, 4033922, 3832332, 3428295, 3207111, 2870098, 2561888, 2342974, 2178396, 2129316, 1977194, 1961798, 1944924, 1869018, 1835661, 1889535, 1954987, 1857901, 1820031, 1808140, 1843768, 1858908, 1847959, 1912675, 1914764, 1998706, 1992317, 2103909, 2204358, 2356639, 2393726, 2584135, 2850670, 3206323, 3481095, 3868638, 4062201, 4297094, 4382643, 4243202, 4286882, 4185370, 4124219]
6461D124219J29879J54037K93337O74354Q93123J133326J335189J251502J075547
6452A1064513O88010N80816k02085o19410p11353j029733j099750j065733p60605
6443F844670q21476l88858m30431k66746j62083q7491q7068Q8257p9055L2581
6433D642300J10761r5875j06022L7625n8398L6938j10033j04982O6378k8681J61937
6422D551948J22104O1716L48015K06468M04845N74016L84650M51613K58649L5038
6412G399062n9268j51200l5084j19208O8474Q3192Q1189K44397J56176K11426
6402G879156J16012K51192J65534L28916L12422L45382L34221K74672J55088J06396
6392A0268991J99703Q0988J32540J49069K79785K08739K79113L52854N75289N75273
$$ y = [4124219, 4254098, 4408135, 4701472, 5375826, 6268949, 7402275, 8737464, 9988966, 11064513, 11752523, 12333339, 12131254, 11511844, 10800491, 9770758, 8671008, 7605275, 6844670, 6023194, 5634336, 5203905, 4937159, 4775076, 4687585, 4600517, 4688774, 4609719, 4642300, 4753061, 4657186, 4551164, 4588789, 4530391, 4567329, 4457296, 4352314, 4418692, 4390011, 4551948, 4674052, 4735768, 5083783, 5290251, 5695096, 6269112, 6653762, 7105375, 7364024, 7399062, 7339794, 7188594, 7153510, 7034302, 7102776, 7185968, 7267157, 7511554, 7667730, 7879156, 7995168, 8246360, 8411894, 8740810, 9053232, 9398614, 9732835, 10007507, 10162595, 10268991, 10468694, 10549682, 10682222, 10831291, 11111076, 11319815, 11598928, 11951782, 12527071, 13102344]
6382A3102344P36855J180815J776848K437589K904305L461239L888003M223803
6374C3711801M801446O734830J1988902K3080026L8563626N1348434N3570752
6367B23799817M0544599J7529003n121268k2550498l3800625l8301941l5944465
6360A46154622l0492798k4663485j8145979j3148742r566612p281225n620654
6353C7235127m699751l872597l144857k223161j772084j134179r57581o65129
6345A8765788p12586p60884p81330q99723o73772o74753o08104n70090m84868
6336A2599678m82082n14316n22526m36399l04603n70029l68675l91419k92550
6327H717079l84841k23189k45905k69244l02002j22728k90212j24604p7498r9384
$$ y = [13102344, 13839199, 15020014, 16796862, 19234451, 22138756, 25599995, 29487998, 33711801, 38513247, 45248077, 57236979, 80317005, 118880631, 170229065, 223799817, 264344416, 281873419, 276752151, 254201653, 220401028, 182099087, 146154622, 115661824, 90998339, 72852360, 59703618, 50137006, 42855781, 37235127, 32535376, 28662779, 25517922, 23294761, 21522677, 20388498, 19430917, 18765788, 18053202, 17292318, 16510988, 15611265, 14937493, 14262740, 13654636, 13084546, 12599678, 12117596, 11603280, 11080754, 10644355, 10339752, 9769723, 9401048, 9009629, 8717079, 8332238, 8109049, 7863144, 7593900, 7291898, 7169170, 6878958, 6754354, 6676856, 6577472]
6317F577472j31155j10475j36688n6585j6346j70418p6532o1180q1817P1119L7840
6306E845235m8451j08615n5221j43321n1584j81731m9504l7910O1728p8758O6263
6295E218131M3496M6205L5471J51462K5410J2091k2244j6753K674j21148K16651
6284E591446k6106K00721J81215O29871N10849M32283O66O3679l77059n58157
6274F649408l95488m64861l31931m13706j95330q8603k16913m5317r0409j90377
6264D216473n8226j42254k46999k06557j60941j70709o6351j13957L5031J28079
6254C213589q5336p0705O6799K0203j05997M4202r8612j06071n4332n3626J00829
6243B870943Q1543K05643K74919K6346J62020J84937J3276m6635J7860r4328j9129
$$ y = [6577472, 6446317, 6335842, 6199154, 6142569, 6126223, 5955805, 5879273, 5818093, 5736276, 5807395, 5845235, 5796784, 5688169, 5632948, 5489627, 5438043, 5256312, 5206808, 5168898, 5230626, 5151868, 5218131, 5261627, 5307832, 5343303, 5494765, 5520175, 5532266, 5510022, 5493269, 5495943, 5374795, 5591446, 5565340, 5766061, 5947276, 6577147, 7087996, 7520279, 7520945, 7584624, 7207565, 6649408, 6253920, 5789059, 5457128, 5043422, 4848092, 4759489, 4542576, 4497259, 4406850, 4216473, 4158247, 4015993, 3768994, 3562437, 3401496, 3230787, 3164436, 3050479, 3085510, 3213589, 3128253, 3057548, 3124347, 3144550, 3038553, 3082755, 2984143, 2878072, 2823740, 2770114, 2870943, 2952486, 3158129, 3433048, 3459394, 3621414, 3806351, 3819627, 3772992, 3790852, 3696524, 3677395]
6232C677395j65735O4108p6854M6959O7022K18221K21604j9151j76889j68949
6222C687731l74164j68732j61314k30338r0822K3049n307p2966O464J725M2868
6211B658194R0356J41289K24122J15288J18377J35320J14926J31035J81657J90050
6201D100614L78555L11378L51827J46739M8354j3215j73994l95056l52191n08412
6191C894599n08931k93518k99558k71624k10261o6709q2729j12212q0800m8275
6181A919982k91J29534n979j6285O258P8092k6548j68690J42378r1393r0187J03450
6169A980321P7317M5911q730Q8405Q9515J8406J12351J9313J96748J7470j00983
6158B536044Q1430m8929r7574p4373l1159n5121r734r1055J32608m4648J0486
$$ y = [3677395, 3511660, 3575768, 3498914, 3545873, 3612895, 3831116, 4052720, 4033569, 3856680, 3687731, 3313567, 3144835, 2983521, 2753183, 2662361, 2685410, 2680103, 2607137, 2613601, 2615326, 2658194, 2748550, 2889839, 3113961, 3229249, 3347626, 3482946, 3597872, 3728907, 3910564, 4100614, 4479169, 4790547, 5142374, 5289113, 5337467, 5324252, 5150258, 4755202, 4403011, 3894599, 3385668, 3092150, 2792592, 2520968, 2310707, 2243998, 2161269, 2049057, 1968257, 1919982, 1919691, 2049225, 2043246, 2026961, 2033219, 2111311, 2084763, 1916073, 2058451, 1967058, 1876871, 1980321, 2057638, 2103549, 2094819, 2183224, 2272739, 2291145, 2403496, 2422809, 2619557, 2637027, 2536044, 2617474, 2568545, 2470971, 2396598, 2365439, 2310318, 2300584, 2209529, 2342137, 2297489, 2307975]
6147B307975K4606j05758L1194j71177k6112k30023j86220p965n2425j39523K1604
6136A466176N9030j19883j9118r3839K6954j37487J05457p4735p8230Q0945J78654
6125A393924j27273J05401k1686n2564R152n6370J9262j65680J50078p7082M4999
6114A222161q5752n4113n6190j1898n8194R4362L1715O1023K1370P4643J14562
6103A353689K03765J84536L11448R7264J19130r8447q5948j53890k82533q6817
6093A562197k33907j56913j37194k7700j84835M9961J07619r7908L8034o2449
6083H56905p3757Q8662N9035l3215R0913Q6841M055j6786m262j19635k2368J3514
6071I29902o9187L9533j61313R2794k9795J23720K5260p9141k9193J38548Q1150
$$ y = [2307975, 2332581, 2226823, 2258017, 2086840, 2060728, 1830705, 1644485, 1636520, 1584095, 1444572, 1466176, 1525206, 1405323, 1386205, 1292366, 1319320, 1181833, 1287290, 1212555, 1134325, 1215270, 1393924, 1266651, 1372052, 1350366, 1297802, 1306954, 1250584, 1269846, 1104166, 1254244, 1177162, 1222161, 1136409, 1082296, 1026106, 1014208, 956014, 1050376, 1082091, 1143114, 1164484, 1239127, 1353689, 1557454, 1741990, 2053438, 2150702, 2269832, 2171385, 2085437, 1931547, 1649014, 1562197, 1328290, 1171377, 1034183, 1006483, 821648, 871609, 979228, 881320, 919354, 856905, 783148, 871810, 930845, 897630, 988543, 1075384, 1079439, 1062653, 1058391, 938756, 916388, 929902, 860715, 900248, 738935, 831729, 801934, 925654, 950914, 871773, 842580, 981128, 1062278]
6060A062278J05734K63569L95989L24731N69652L27728L46484o1702j05334l53727
6050B875402l81937k80012k41983k31696j60361j26747L7101l8896q7021l6947
6040A326903j38961k8213j37100k2039m8011p9087p3733o6081n3146J04113K2915
6029H07560o8204N3601R7297R3774J73906J26224J78463P0225j78565j35736r1953
6018A126592J7058m5364p7885M7302Q3088P7910j41910L7625l0209k3565O9103
6007A139745J52370K42994K84904L82705K66916k8774o7628k41385l10177k17502
5997A604168k82986k18856k15398K578r2446l5967j07798n640j43036J21502o7962
5986E58159J1054K19K0136j27494J1365N2224m9453J45125M9372K0713J07252
$$ y = [1062278, 1168012, 1431581, 1827570, 2152301, 2721953, 3049681, 3396165, 3334463, 3229129, 2875402, 2493465, 2213453, 1971470, 1739774, 1579413, 1452666, 1489767, 1450871, 1363850, 1326903, 1187942, 1159729, 1022629, 1000590, 952579, 873492, 799759, 733678, 680532, 784645, 807560, 739356, 792957, 890254, 984028, 1157934, 1284158, 1462621, 1532846, 1354281, 1218545, 1126592, 1143650, 1098286, 1020401, 1067703, 1150791, 1228701, 1086791, 1124416, 1094207, 1070642, 1139745, 1292115, 1535109, 1820013, 2202718, 2469634, 2440860, 2373232, 2131847, 1821670, 1604168, 1321182, 1102326, 886928, 889506, 797060, 761093, 653295, 647655, 504619, 626121, 558159, 569213, 569432, 589568, 462074, 473439, 525663, 476210, 621335, 670707, 691420, 798672]
5975G98672O6784n1878L7469m2127o2198n1446k6184r0985o2763K4656J1072P2321
$$ y = [798672, 865456, 813578, 851047, 808920, 746722, 695276, 669092, 578107, 515344, 540000, 551072, 623393]
$$ [...]
##END NTUPLES=NMR SPECTRUM
##END=
