##TITLE=abcd
##JCAMPDX= 6.0         $$ Bruker NMR JCAMP-DX V2.0
##DATA TYPE= NMR SPECTRUM
##DATA CLASS= NTUPLES
##ORIGIN= UXNMR, Bruker Analytische Messtechnik GmbH
##OWNER= root
$$ XWIN-NMR		Version 3.5
$$ Tue Jul  7 19:27:26 2026 Russian Standard Time (UT+4h)  servis@DPX200
##.OBSERVE FREQUENCY= 200.131235884673
##.OBSERVE NUCLEUS= ^1H
##.ACQUISITION MODE= SIMULTANEOUS
##.ACQUISITION SCHEME= undefined
##.AVERAGES= 32
##.DIGITISER RES= 18
##SPECTROMETER/DATA SYSTEM= spect
##.PULSE SEQUENCE= zg
##.SOLVENT NAME= CDCl3
##.SHIFT REFERENCE= (INTERNAL, CDCl3, 0, 16.4885)
##AUDIT TRAIL= $$ (NUMBER, WHEN, WHO, WHERE, WHAT)
$$ ##TITLE= Audit trail, XWIN-NMR		Version 3.5
$$ ##JCAMPDX= 5.01
$$ ##ORIGIN= Bruker BioSpin GmbH
$$ ##OWNER= servis
$$ F:\spectra/data/av/nmr/H1/1/pdata/1/auditp.txt
$$ ##AUDIT TRAIL=  $$ (NUMBER, WHEN, WHO, WHERE, WHAT)
(   1,<2026-07-07 19:22:51.29 +0400>,<servis>,<DPX200>,
      <created by zg, POWCHK disabled, PULCHK disabled
       configuration hash MD5:
       00 E9 B6 7A A2 85 ED C7 34 08 36 98 17 FE 4E 26
       data hash MD5: 32K
       A0 AA AD A4 58 32 7C 34 C9 7B 9D 96 DE 84 75 B8>)
(   2,<2026-07-07 19:23:26.56 +0400>,<servis>,<DPX200>,
      <Start of raw data processing
       efp BC_mod = 2 LB = 0.05 FT_mod = 6 PKNL = 1 PHC0 = -415.99 PHC1 = 3.101563 SI = 16K 
       data hash MD5: 16K
       F4 BE BC EE 9C 13 5D 48 D7 41 7A 68 13 35 D8 33>)
$$ ##END=
$$ 
$$ hash MD5
$$ 05 7A 43 79 6C A8 6A 56 35 D9 2E CC 52 69 57 2B
##$RELAX= 
##$RELAX= 
##$RELAX= 
##$RELAX= 
##$RELAX= 
##$RELAX= 
##$RELAX= 
##$RELAX= 
$$ Bruker specific parameters
$$ --------------------------
##$DU= <F:\spectra>
##$EXPNO= 1
##$NAME= <H1>
##$PROCNO= 1
##$TYPE= <nmr>
##$USER= <av>
##$AMP= (0..31)
100 100 100 100 100 100 100 100 100 100 100 100 100 100 100 100 100 100 
100 100 100 100 100 100 100 100 100 100 100 100 100 100 
##$AQSEQ= 0
##$AQ_mod= 1
##$AUNM= <au_zg>
##$AUTOPOS= <>
##$BF1= 200.13
##$BF2= 200.13
##$BF3= 200.13
##$BF4= 200.13
##$BF5= 500.13
##$BF6= 500.13
##$BF7= 500.13
##$BF8= 500.13
##$BYTORDA= 1
##$CFDGTYP= 0
##$CFRGTYP= 5
##$CHEMSTR= <none>
##$CNST= (0..31)
1 1 145 1 1 1 1 1 1 1 1 1 1 1 1 1 1 1 1 1 1 1 1 1 1 1 1 1 1 1 1 1 
##$CPDPRG= <>
##$CPDPRG1= <>
##$CPDPRG2= <>
##$CPDPRG3= <>
##$CPDPRG4= <mlev>
##$CPDPRG5= <mlev>
##$CPDPRG6= <mlev>
##$CPDPRG7= <mlev>
##$CPDPRG8= <mlev>
##$CPDPRGB= <>
##$CPDPRGT= <>
##$D= (0..31)
0 2 0 0 0 0 0 0 0 0.06 0 0 0 0 0 0 0.0002 0 0 0 0 0 0 0 0 0 0 0 0 0 0 
0 
##$DATE= 1783437770
##$DBL= (0..7)
120 120 120 120 120 120 120 120 
##$DBP= (0..7)
150 150 150 150 150 150 150 150 
##$DBP07= 0
##$DBPNAM0= <>
##$DBPNAM1= <>
##$DBPNAM2= <>
##$DBPNAM3= <>
##$DBPNAM4= <>
##$DBPNAM5= <>
##$DBPNAM6= <>
##$DBPNAM7= <>
##$DBPOAL= (0..7)
0.5 0.5 0.5 0.5 0.5 0.5 0.5 0.5 
##$DBPOFFS= (0..7)
0 0 0 0 0 0 0 0 
##$DE= 6
##$DECBNUC= <off>
##$DECIM= 32
##$DECNUC= <off>
##$DECSTAT= 4
##$DIGMOD= 1
##$DIGTYP= 9
##$DL= (0..7)
0 120 120 120 120 120 120 120 
##$DP= (0..7)
150 150 150 150 150 150 150 150 
##$DP07= 0
##$DPNAME0= <>
$$ [...]
##$SUBNAM4= <"">
##$SUBNAM5= <"">
##$SUBNAM6= <"">
##$SUBNAM7= <"">
##$SUBNAM8= <"">
##$SUBNAM9= <"">
##$SW= 20.6817932712277
##$SWIBOX= (0..15)
0 0 3 0 0 0 0 0 0 0 0 0 0 0 0 0 
##$SW_h= 4139.07284768212
##$TD= 32768
##$TD0= 1
##$TE= 0
##$TE2= 300
##$TE3= 300
##$TEG= 300
##$TL= (0..7)
0 120 120 120 120 120 120 120 
##$TP= (0..7)
150 150 150 150 150 150 150 150 
##$TP07= 0
##$TPNAME0= <>
##$TPNAME1= <>
##$TPNAME2= <>
##$TPNAME3= <>
##$TPNAME4= <>
##$TPNAME5= <>
##$TPNAME6= <>
##$TPNAME7= <>
##$TPOAL= (0..7)
0.5 0.5 0.5 0.5 0.5 0.5 0.5 0.5 
##$TPOFFS= (0..7)
0 0 0 0 0 0 0 0 
##$TUNHIN= 0
##$TUNHOUT= 0
##$TUNXOUT= 0
##$USERA1= <user>
##$USERA2= <user>
##$USERA3= <user>
##$USERA4= <user>
##$USERA5= <user>
##$V9= 5
##$VALIST= <valist>
##$VCLIST= <CCCCCCCCCCCCCCC>
##$VD= 0
##$VDLIST= <DDDDDDDDDDDDDDD>
##$VPLIST= <PPPPPPPPPPPPPPP>
##$VTLIST= <TTTTTTTTTTTTTTT>
##$WBST= 1024
##$WBSW= 30
##$XGAIN= (0..3)
0 0 0 0 
##$XL= 0
##$YL= 0
##$YMAX_a= 567401
##$YMIN_a= -774926
##$ZGOPTNS= <>
##$ZL1= 120
##$ZL2= 120
##$ZL3= 120
##$ZL4= 120
##$ABSF1= 0
##$ABSF2= 0
##$ABSG= 0
##$ABSL= 0
##$ALPHA= 0
##$AQORDER= 0
##$ASSFAC= 0
##$ASSFACI= 0
##$ASSFACX= 0
##$ASSWID= 0
##$AUNMP= <proc_1d>
##$AZFE= 0.1
##$AZFW= 0.1
##$BCFW= 0
##$BC_mod= 2
##$BYTORDP= 0
##$COROFFS= 0
##$CY= 18.4799938201904
##$DATMOD= 1
##$DC= 0
##$DFILT= <>
##$DTYPP= 0
##$F1P= 9.9274215381318
##$F2P= -0.165520771350173
##$FCOR= 1
##$FTSIZE= 16384
##$FT_mod= 6
##$GAMMA= 0
##$GB= 0
##$INTBC= 1
##$INTSCL= 4.127829e-11
##$ISEN= 128
##$LB= 0.05
##$LEV0= 0
##$LPBIN= 0
##$MAXI= 10000
##$MC2= 0
##$MEAN= 0
##$ME_mod= 0
##$MI= 50
##$NCOEF= 0
##$NC_proc= -5
##$NLEV= 6
##$NOISF1= 3.799351
##$NOISF2= 2.8
##$NSP= 0
##$NTH_PI= 0
##$NZP= 0
##$OFFSET= 16.48848
##$PC= 4
##$PHC0= -415.99
##$PHC1= 3.101563
##$PH_mod= 1
##$PKNL= yes
##$PPARMOD= 0
##$PSCAL= 4
##$PSIGN= 0
##$REVERSE= no
##$SF= 200.130005582386
##$SI= 16384
##$SIGF1= 3
##$SIGF2= 2
##$SINO= 400
##$SIOLD= 16384
##$SREGLST= <1H.CDCl3>
##$SSB= 0
##$STSI= 16384
##$STSR= 0
##$SW_p= 4139.07284768211
##$SYMM= 0
##$S_DEV= 0
##$TDeff= 32768
##$TDoff= 0
##$TI= <>
##$TILT= no
##$TM1= 0
##$TM2= 0
##$TOPLEV= 0
##$USERP1= <user>
##$USERP2= <user>
##$USERP3= <user>
##$USERP4= <user>
##$USERP5= <user>
##$WDW= 1
##$XDIM= 16384
##$YMAX_p= 510261254
##$YMIN_p= -615836
$$ End of Bruker specific parameters
$$ ---------------------------------
##NTUPLES= NMR SPECTRUM
##VAR_NAME=  FREQUENCY,     SPECTRUM/REAL,   SPECTRUM/IMAG
##SYMBOL=    X,             R,               I
##VAR_TYPE=  INDEPENDENT,   DEPENDENT,       DEPENDENT
##VAR_FORM=  AFFN,          ASDF,            ASDF
##VAR_DIM=   16384,         16384,           16384
##UNITS=     HZ,            ARBITRARY UNITS, ARBITRARY UNITS
##FACTOR=    0.252644378177508, 1,           1
##FIRST=     3299.83951724647, 0,            0
##LAST=      -839.233330435636, 0,           0
##MIN=       -839.233330435636, -615836,     0
##MAX=       3299.83951724647, 510261254,    0
$$ Real data points
##PAGE= N=1
##DATA TABLE= (X++(R..R)), XYDATA
$$ [...]
14440 -261550 -298165 -184811 -281560 -337230 -307854 -227634 -282681 -297455 -394807 -263295 -173948
14429 -173948 -266222 -300681 -235326 -249229 -251461 -240027 -302891 -153988 -326107 -322534 -154603
14418 -154603 -126101 -226644 -358672 -210392 -246587 -338385 -247133 -281225 -203144 -236174 -254039
14407 -254039 -252500 -203752 -276169 -254302 -202844 -290341 -224113 -240788 -221965 -281542 -369467 -239176
14395 -239176 -217015 -338329 -301744 -220682 -340477 -314827 -305351 -243126 -192394 -222469 -193374
14384 -193374 -238552 -199088 -225963 -307778 -226164 -261556 -311869 -307958 -304696 -332508 -259286 -190431
14372 -190431 -242014 -236165 -234606 -247505 -171118 -209949 -239502 -215923 -198261 -155718 -253217 -306239
14360 -306239 -256414 -253063 -328227 -317223 -220709 -237043 -246165 -244193 -235675 -229199 -242395 -307984
14348 -307984 -284484 -236182 -255667 -190750 -307886 -266629 -162361 -262963 -249485 -160833 -170433
14337 -170433 -434396 -350578 -283254 -278974 -293811 -433247 -313954 -289405 -147969 -249607 -208989
14326 -208989 -324250 -228308 -167774 -218447 -274276 -240238 -235513 -236995 -305392 -212286 -281472 -338995
14314 -338995 -169000 -316352 -293908 -339652 -290797 -216112 -367486 -256528 -226098 -301129 -266418
14303 -266418 -133900 -219485 -233731 -219574 -258223 -243719 -299028 -150324 -179635 -266947 -259216
14292 -259216 -313303 -307464 -267680 -194806 -267427 -382110 -174593 -140166 -290124 -251311 -258303
14281 -258303 -268279 -271227 -151900 -195322 -185163 -159711 -186567 -257043 -288584 -261237 -191104 -355169
14269 -355169 -344654 -263819 -343735 -326213 -254897 -275249 -317719 -323236 -152663 -202429 -293931
14258 -293931 -188296 -154335 -172569 -271650 -184732 -224849 -210742 -322471 -273535 -256792 -200962
14247 -200962 -358755 -285753 -227135 -233790 -308848 -303616 -324794 -168790 -329426 -178965 -213366
14236 -213366 -89270 -187555 -322086 -294689 -167748 -197900 -199447 -351773 -262195 -238199 -231369
14225 -231369 -327122 -364621 -364289 -280917 -158453 -237278 -371862 -279397 -214059 -275653 -317466
14214 -317466 -312017 -285809 -168100 -153826 -285521 -167036 -175243 -205279 -296198 -122422 -178216
14203 -178216 -314448 -231256 -218596 -36524 -333231 -400193 -249181 -153870 -272363 -351786
14193 -351786 -209589 -210402 -254055 -258459 -222590 -101862 -142421 -332942 -212076 -159029 -244487
14182 -244487 -280466 -294398 -213825 -124185 -341387 -264402 -319645 -414095 -207197 -270435 -230945
14171 -230945 -253698 -303680 -199950 -156593 -278073 -310734 -206710 -202288 -325791 -235687 -231505
14160 -231505 -253337 -243147 -242405 -165423 -258046 -334812 -280440 -164193 -206956 -248694 -269711 -156586
14148 -156586 -190923 -246101 -278950 -303976 -205633 -202294 -248183 -173685 -130682 -182035 -176617 -302601
14136 -302601 -193353 -157427 -251904 -219705 -294696 -400075 -268226 -254764 -331844 -341332 -207161
14125 -207161 -345465 -248600 -319456 -221222 -123991 -146004 -261115 -265676 -255595 -231368 -173023
14114 -173023 -227008 -152974 -168848 -221730 -358562 -281160 -194532 -281469 -340387 -133311 -256559
14103 -256559 -248755 -152887 -302209 -206301 -264362 -252783 -276048 -196921 -202308 -206274 -175211 -262455
14091 -262455 -238993 -143114 -330058 -136777 -286348 -226131 -270285 -182772 -356774 -275842 -330587
14080 -330587 -153595 -201030 -188205 -279083 -225722 -328657 -318754 -167972 -265668 -168180 -326454
14069 -326454 -196658 -293667 -185698 -122552 -313365 -279949 -206150 -228064 -182811 -270977 -291703
14058 -291703 -297356 -242742 -225963 -232211 -331238 -291636 -291066 -177365 -259058 -329166 -204804 -344177
14046 -344177 -163541 -227105 -337243 -215333 -279899 -234327 -270143 -349887 -372513 -220550 -279680
14035 -279680 -226788 -278061 -251324 -245941 -206018 -97998 -345540 -184657 -205887 -239702 -330481
14024 -330481 -195181 -237944 -229619 -293314 -350418 -132780 -254804 -229181 -274383 -166935 -206496
14013 -206496 -225151 -200681 -269829 -195967 -176981 -214942 -265123 -204380 -314752 -308560 -262084
14002 -262084 -272387 -309336 -375780 -211531 -296221 -145210 -301478 -290827 -314907 -192805 -272089
13991 -272089 -265408 -257061 -335399 -168813 -260627 -213045 -327770 -210115 -144449 -274330 -259787
13980 -259787 -321205 -173404 -279609 -271117 -255888 -177751 -266653 -295372 -310654 -367907 -194904
13969 -194904 -220828 -337323 -319086 -217537 -232038 -232670 -244506 -227729 -165617 -296329 -226476
13958 -226476 -268865 -206681 -293132 -194985 -190141 -279952 -287795 -274334 -230946 -336835 -291634 -320205
13946 -320205 -281039 -179520 -187157 -152668 -304429 -281595 -230783 -147122 -229902 -284758 -236772
13935 -236772 -230403 -175979 -323583 -283843 -295267 -289927 -247849 -280899 -301182 -179931 -320789
13924 -320789 -225969 -199108 -209509 -132177 -278777 -219002 -207826 -180121 -120923 -243331 -208828
13913 -208828 -281562 -186126 -216098 -258967 -191434 -242079 -261053 -270137 -239666 -231299 -206940 -324916
13901 -324916 -198824 -266537 -250046 -152944 -315497 -270866 -217018 -250331 -315552 -224870 -226116
13890 -226116 -205109 -262955 -330776 -224565 -146836 -262204 -311615 -294271 -251898 -369399 -248323
13879 -248323 -336285 -188981 -212680 -224809 -283726 -178802 -176281 -252652 -224919 -277564 -165470
13868 -165470 -216196 -287906 -278786 -245857 -282405 -311830 -307166 -326721 -285648 -354382 -196014 -153804
13856 -153804 -293483 -198692 -173999 -123633 -331246 -236306 -229609 -210923 -266179 -246803 -318254
13845 -318254 -286262 -281566 -325588 -233782 -223225 -282087 -187430 -228663 -168673 -276091 -286872
13834 -286872 -346428 -235005 -274929 -262041 -261231 -188978 -273794 -251725 -219864 -285341 -269744 -257556
13822 -257556 -304683 -229995 -270260 -322197 -201791 -261726 -303745 -260548 -245804 -266958 -269837
13811 -269837 -196153 -65266 -147834 -240912 -290813 -346818 -202335 -129176 -310598 -342972 -217152
13800 -217152 -282431 -355339 -280821 -205263 -244580 -224015 -272323 -170540 -256332 -261628 -306853
13789 -306853 -222539 -243198 -272415 -251213 -325612 -139983 -295779 -298369 -258343 -204177 -243998
13778 -243998 -260238 -251890 -251154 -331356 -311942 -233007 -312374 -222447 -206581 -204525 -213827 -256340
13766 -256340 -204676 -231225 -175888 -313094 -165965 -126739 -253185 -241015 -229982 -207613 -261699
13755 -261699 -302340 -361576 -191953 -252039 -353358 -257804 -150387 -229822 -170420 -220575 -344839
13744 -344839 -134833 -341063 -360332 -244179 -264955 -304370 -256440 -243643 -271491 -245782 -375753
13733 -375753 -362125 -225823 -219478 -184086 -247453 -302791 -309791 -123102 -187131 -238043 -251853
13722 -251853 -129819 -127644 -139294 -255097 -279856 -168995 -347802 -249572 -233053 -162175 -248770
13711 -248770 -357946 -258763 -201542 -240758 -276817 -310392 -223921 -180959 -297353 -274022 -156982
13700 -156982 -224556 -216186 -236373 -202604 -342425 -252681 -263141 -224437 -205524 -194463 -202440 -238397
13688 -238397 -261589 -241077 -281274 -222511 -179554 -213856 -194763 -280184 -358749 -213004 -163333
13677 -163333 -182531 -209215 -261218 -220737 -232066 -218744 -215578 -211273 -296547 -196067 -268773 -206972
13665 -206972 -203851 -195538 -282224 -228398 -226477 -334156 -250981 -331874 -328829 -341442 -225893 -333202
13653 -333202 -263167 -201843 -249979 -180537 -183720 -224921 -222549 -232226 -313473 -218217 -191210 -299176
13641 -299176 -314645 -200844 -214212 -253454 -271789 -214293 -158864 -260430 -362410 -176951 -237364
13630 -237364 -372872 -251345 -140250 -289136 -222316 -275904 -83913 -86728 -281970 -349334
13620 -349334 -97634 -179460 -262496 -339554 -299578 -314400 -228445 -224954 -301123 -275840 -315372
13609 -315372 -351590 -187220 -307742 -307095 -293275 -206982 -316297 -345153 -299176 -207207 -308692
13598 -308692 -193124 -176964 -275521 -330917 -387163 -339202 -336625 -280820 -298001 -289932 -289198 -235934
13586 -235934 -303251 -195261 -196741 -219661 -225215 -269852 -212135 -157457 -100388 -301150 -254131
13575 -254131 -198041 -268516 -231150 -361790 -311443 -273686 -312941 -299547 -210640 -261855 -263249
13564 -263249 -297327 -275614 -271151 -190790 -322423 -395301 -244249 -216970 -267632 -254772 -290699
13553 -290699 -352762 -365454 -306214 -316659 -270304 -198934 -238251 -298705 -302566 -318745 -275384 -284245
13541 -284245 -235718 -230648 -250745 -397328 -289274 -255811 -262459 -232579 -263074 -248590 -226479
13530 -226479 -268791 -273016 -259800 -236462 -320909 -244641 -257702 -331647 -263314 -266067 -375327 -352488
13518 -352488 -279460 -137050 -178876 -332886 -257427 -131490 -255429 -166501 -328150 -180378
13508 -180378 -261637 -306500 -326848 -199044 -312104 -387586 -319900 -248612 -270250 -221799 -294364
13497 -294364 -249363 -240805 -181002 -329968 -257922 -300183 -262755 -245563 -283067 -276426 -225186 -141245
13485 -141245 -289827 -199982 -212306 -191632 -303129 -229945 -253371 -277978 -301666 -330632 -253220
13474 -253220 -237032 -304642 -348454 -274907 -256977 -274110 -257188 -271094 -313949 -295851 -166041
13463 -166041 -173141 -208539 -351884 -257576 -214218 -283938 -224647 -253107 -346685 -160001 -261652
13452 -261652 -222167 -214970 -276339 -370903 -266863 -309914 -261440 -227145 -279702 -195480 -183552
13441 -183552 -210661 -161937 -251855 -258230 -256720 -223992 -224288 -255854 -266120 -251800 -169939 -369106
13429 -369106 -275977 -226599 -244887 -326649 -355158 -222906 -252414 -296914 -236222 -244247 -295619
13418 -295619 -261455 -265491 -188498 -289904 -421946 -284709 -308161 -231876 -261365 -257297 -251934
13407 -251934 -258014 -220391 -319573 -283816 -252996 -274810 -232788 -313960 -277757 -257747 -179633 -199938
13395 -199938 -317510 -328863 -198519 -171839 -218002 -290123 -168566 -230413 -179848 -265077 -274733
13384 -274733 -288351 -325464 -293606 -258704 -364917 -352076 -210742 -97857 -258132 -337439 -290467
13373 -290467 -215588 -237690 -161191 -192783 -243364 -231261 -247436 -139305 -215868 -339097 -314017
13362 -314017 -283954 -237178 -358328 -257341 -245255 -325180 -307713 -316406 -199253 -308634 -299030
13351 -299030 -264354 -218331 -236022 -240352 -261858 -218455 -147163 -300482 -153248 -120492 -299450
13340 -299450 -252581 -180304 -226321 -243936 -365309 -233501 -156208 -193490 -201519 -275576 -305485
13329 -305485 -282600 -223502 -230112 -293641 -247215 -159804 -204012 -253633 -286927 -180180 -194229
13318 -194229 -214009 -236442 -143809 -336219 -271983 -302482 -313925 -385813 -198300 -348234 -315148
13307 -315148 -328034 -268648 -297606 -266071 -185394 -273831 -248260 -231896 -204286 -154056 -239376
13296 -239376 -224454 -296603 -327295 -224161 -260964 -351290 -279232 -199173 -233355 -324592 -222834
13285 -222834 -193050 -227506 -345990 -329268 -198589 -227077 -248632 -318550 -239259 -228845 -195117
13274 -195117 -250398 -223614 -200886 -340270 -370568 -347102 -314818 -272102 -275535 -358011 -197684
13263 -197684 -229060 -272451 -206581 -259959 -192583 -248312 -138382 -255211 -228046 -193976 -177621
13252 -177621 -244364 -239875 -229648 -171370 -271510 -267251 -238669 -156037 -288191 -229509 -122228
13241 -122228 -287722 -293248 -289821 -242419 -284826 -172548 -212112 -246639 -117007 -275351 -229916
13230 -229916 -188245 -214591 -265537 -301694 -268777 -271485 -288511 -307032 -363191 -211728 -194737
13219 -194737 -238234 -330063 -261175 -298080 -231861 -339233 -237033 -101700 -295950 -217923 -184574
13208 -184574 -302809 -306733 -254647 -311039 -253368 -243381 -221512 -290602 -244352 -242377 -126955 -276106
13196 -276106 -245851 -94147 -203492 -161313 -253817 -120234 -202657 -185843 -242495 -181576 -291420
13185 -291420 -251667 -224001 -224015 -259540 -230566 -234005 -313673 -263771 -250052 -241154 -374625 -187382
13173 -187382 -201479 -155284 -242316 -195018 -213365 -219647 -225474 -279591 -281316 -255101 -159620 -206723
13161 -206723 -308645 -257373 -260543 -245752 -329995 -268187 -208105 -260037 -222630 -351767 -237794
13150 -237794 -282485 -289036 -246779 -149040 -79876 -182186 -217098 -249539 -165243 -263713 -344774
13139 -344774 -188450 -101701 -233678 -402067 -270908 -175884 -247433 -347896 -298526 -215425
13129 -215425 -226511 -281205 -176564 -180117 -299281 -185942 -268756 -202715 -295244 -301755 -175040
13118 -175040 -208867 -320215 -331978 -292103 -298133 -185134 -275918 -184485 -323003 -235157 -290370
13107 -290370 -339595 -172888 -263777 -304950 -172437 -163639 -219338 -318434 -196978 -86976 -280454
13096 -280454 -337876 -333551 -201712 -214156 -228623 -280587 -369561 -312958 -215727 -314027 -238599
13085 -238599 -298981 -324624 -253340 -220346 -175115 -223204 -289609 -276211 -208877 -203014 -240861 -191680
13073 -191680 -189995 -166399 -297639 -252055 -187816 -273311 -182483 -289933 -244615 -240816 -201543
13062 -201543 -302806 -262687 -280173 -204943 -208887 -177740 -245159 -196586 -182107 -222707 -305598
13051 -305598 -371499 -173921 -265229 -282058 -215173 -253441 -294053 -239994 -331323 -259385 -271625
13040 -271625 -300407 -334048 -212122 -143284 -194448 -288596 -244042 -158513 -241620 -407847 -197145
13029 -197145 -196445 -333132 -382883 -304703 -183992 -271842 -264370 -322680 -260234 -260792 -252306 -273148
13017 -273148 -159261 -256110 -317112 -306859 -183488 -258160 -230492 -252595 -255831 -168803 -172035
13006 -172035 -163762 -139600 -324071 -271032 -181131 -378548 -292058 -153536 -182785 -131904 -372646
12995 -372646 -329556 -113113 -282256 -406991 -303655 -310454 -123203 -200302 -303981 -316631
12985 -316631 -85303 -237439 -186202 -317249 -234054 -253636 -237244 -222861 -306662 -377895 -317059
12974 -317059 -211223 -208849 -224097 -269914 -109516 -226626 -194929 -168174 -177670 -198389 -177568
12963 -177568 -129138 -190717 -157255 -290208 -178345 -268208 -310674 -369265 -282956 -157699 -300450
12952 -300450 -256850 -279247 -222213 -223458 -203469 -172408 -227491 -280364 -163814 -289795 -268042
12941 -268042 -254907 -123575 -330888 -328612 -286997 -220018 -376564 -285869 -350392 -305398 -189377
12930 -189377 -274788 -281009 -274275 -276387 -246438 -175514 -205059 -135651 -244961 -284908 -150608 -274254
12918 -274254 -205672 -356833 -170291 -216347 -292184 -297230 -282204 -168558 -315290 -250859 -335725
12907 -335725 -225486 -302474 -153316 -245805 -349642 -98211 -234742 -266547 -399481 -212824
12897 -212824 -232554 -236109 -351207 -254344 -232189 -231295 -203947 -278711 -298957 -278026 -282418 -270966
12885 -270966 -308076 -232847 -308742 -305502 -269683 -250134 -285785 -219162 -196102 -142265 -189743 -283567
12873 -283567 -195662 -209408 -217396 -301011 -280245 -235781 -335145 -234660 -273333 -308456 -194048
12862 -194048 -74231 -380399 -234210 -278004 -187900 -280498 -310452 -142368 -190040 -169635 -276599
12851 -276599 -235753 -271224 -394533 -275470 -331706 -307058 -286244 -234936 -360484 -176986 -295847
12840 -295847 -344599 -345345 -155328 -210978 -255542 -294662 -251866 -170852 -276127 -124378 -201023
12829 -201023 -362039 -295296 -309973 -303513 -357449 -267734 -176467 -289147 -467197 -317010 -141233
12818 -141233 -312292 -299392 -128810 -230661 -273632 -247462 -321372 -310237 -237474 -348349 -296205
12807 -296205 -284034 -325461 -254368 -269039 -335004 -313280 -231224 -344579 -187369 -293968 -148490
12796 -148490 -270308 -225955 -206694 -219937 -221772 -227719 -190969 -249258 -290724 -175756 -201816
12785 -201816 -318938 -229523 -196118 -421187 -217397 -150662 -195434 -300314 -309312 -190284 -77902
12774 -77902 -264212 -239405 -280093 -266075 -77580 -188422 -267798 -252196 -194288 -243075 -250148
12763 -250148 -237448 -144960 -291036 -227525 -202472 -319591 -329281 -373964 -203915 -208342 -400460
12752 -400460 -225723 -228904 -358769 -391325 -237114 -322172 -375845 -287553 -296251 -139864 -222959
12741 -222959 -175974 -258326 -203929 -237985 -206105 -211575 -263027 -232870 -395474 -222737 -228072
12730 -228072 -171399 -369305 -282327 -100160 -239665 -228003 -264153 -157966 -153829 -208128 -212172
12719 -212172 -98721 -217342 -240204 -183070 -215038 -247907 -253530 -107551 -171446 -205384 -193861
12708 -193861 -276470 -254144 -183943 -181415 -158968 -179555 -169914 -138385 -283585 -130906 -191237
12697 -191237 -175242 -230041 -243787 -225725 -266247 -256802 -127167 -204222 -225879 -306126 -157282
12686 -157282 -226992 -254714 -336880 -141077 -229564 -124335 -233372 -247664 -218552 -135718 -218939
12675 -218939 -280039 -292180 -154165 -211720 -254964 -265750 -155534 -239726 -214003 -262950 -257440
12664 -257440 -263224 -195261 -223275 -375631 -327626 -272651 -204870 -189713 -339464 -273679 -256491
12653 -256491 -273285 -229421 -233596 -222048 -257387 -222351 -241941 -262985 -266499 -283077 -317493 -253978
12641 -253978 -290334 -305662 -323734 -240874 -180856 -244991 -306375 -274614 -180375 -201915 -286018
12630 -286018 -222713 -192996 -178065 -205842 -306156 -237741 -187766 -225770 -288584 -296903 -295069 -166138
12618 -166138 -174677 -337405 -245625 -188060 -195151 -180789 -263306 -157419 -213806 -186391 -165217
12607 -165217 -249060 -242295 -304993 -235596 -335115 -307851 -190392 -197260 -294593 -253276 -261381 -351783
12595 -351783 -309576 -271426 -303276 -231851 -204604 -240178 -233760 -184517 -218669 -271310 -303158 -245788
12583 -245788 -259990 -313603 -265361 -193286 -273046 -359722 -171357 -241127 -247800 -184283 -327468
12572 -327468 -272354 -204855 -258957 -227070 -343401 -179937 -225837 -178947 -144025 -310377 -265682
12561 -265682 -138399 -294640 -315731 -317225 -219938 -240139 -416197 -347395 -243666 -311061 -310006
12550 -310006 -279114 -289301 -236398 -294832 -289428 -333760 -171042 -316079 -340423 -230079 -172718
12539 -172718 -279428 -257710 -245436 -244989 -276105 -278551 -169305 -270456 -225652 -331936 -286293
12528 -286293 -237120 -152560 -167194 -203181 -345864 -320711 -241429 -200291 -263716 -248428 -71529
12517 -71529 -210255 -278008 -203430 -238597 -161358 -181522 -301418 -306151 -237803 -178255 -181739 -247722
12505 -247722 -295826 -196662 -204249 -282170 -305592 -260971 -260423 -248826 -224570 -205178 -252063 -181147
12493 -181147 -212103 -280371 -111330 -207369 -262119 -185678 -216488 -263211 -362716 -244099 -168534
12482 -168534 -242224 -272479 -223423 -110776 -163371 -209981 -221479 -305371 -181971 -300135 -223026
12471 -223026 -339531 -196787 -225929 -282170 -307238 -258911 -229074 -199770 -166153 -227408 -315253
12460 -315253 -266792 -128483 -186681 -223034 -209929 -148815 -209146 -318012 -262660 -255997 -186136
12449 -186136 -221356 -288312 -258110 -233578 -253895 -248163 -237210 -143446 -223578 -291381 -286602 -202629
12437 -202629 -256388 -188599 -207943 -173728 -269017 -226303 -305781 -275644 -232653 -239974 -214029 -310433
12425 -310433 -296366 -229012 -249123 -200779 -364283 -308370 -294239 -306678 -345386 -237399 -162198
12414 -162198 -272621 -184584 -328049 -142014 -191222 -232989 -233677 -112889 -228951 -234842 -241319
12403 -241319 -272889 -248676 -185604 -187167 -286269 -313323 -243073 -198693 -186042 -218326 -191672 -191937
12391 -191937 -317485 -198121 -258594 -152683 -151215 -213150 -256778 -215622 -208942 -147842 -249357
12380 -249357 -266544 -279606 -264516 -257263 -287447 -210892 -255684 -272337 -173295 -92745 -283447
12369 -283447 -251424 -235626 -163979 -244603 -288406 -244757 -111470 -319519 -250188 -208373 -331473
12358 -331473 -193369 -197341 -213202 -269584 -276279 -234635 -114587 -196720 -146038 -277272 -163114
12347 -163114 -233927 -199583 -263953 -240701 -173054 -162019 -226361 -238029 -164652 -171032 -276826
12336 -276826 -109615 -137659 -239765 -146571 -270854 -316039 -252539 -269114 -235076 -249045 -266065
12325 -266065 -221612 -278633 -207169 -220065 -179950 -185352 -216725 -130334 -311051 -237923 -262876
12314 -262876 -170828 -326716 -266115 -162338 -232470 -275193 -180860 -262985 -184533 -279791 -239913
12303 -239913 -261529 -227241 -298082 -210312 -204783 -165635 -269701 -252440 -249845 -134131 -270763
12292 -270763 -327317 -135913 -237659 -218989 -247370 -191489 -221823 -264711 -262058 -206192 -250028
12281 -250028 -288487 -225410 -264651 -170522 -325728 -165758 -283343 -366375 -211793 -205627 -168970
12270 -168970 -397819 -184224 -175702 -188947 -293209 -243764 -165469 -203531 -235316 -273830 -166220
12259 -166220 -237193 -203256 -337922 -247455 -280919 -224241 -238355 -245620 -214523 -230660 -219347
12248 -219347 -190481 -188416 -146576 -126621 -174142 -149710 -236530 -183711 -167523 -214094 -277098 -139243
12236 -139243 -187004 -228220 -321968 -194678 -140739 -268637 -290268 -232436 -203779 -379628 -254138
12225 -254138 -243471 -184116 -284992 -269638 -186844 -201991 -220229 -259266 -157909 -269900 -237153
12214 -237153 -283515 -243479 -283893 -255783 -278907 -285839 -192982 -239362 -222032 -171265 -225891 -332867
12202 -332867 -184696 -217272 -234361 -297980 -222401 -206109 -235804 -250381 -195062 -179262 -192973
12191 -192973 -321828 -267649 -217106 -259426 -326077 -237675 -271002 -261747 -243509 -252604 -180725 -228209
12179 -228209 -232199 -311848 -176783 -282812 -236708 -234308 -228085 -179826 -214045 -282143 -304644 -177561
12167 -177561 -309187 -224484 -227698 -227370 -315795 -291321 -203966 -235002 -157567 -249649 -170245 -235445
12155 -235445 -193545 -121487 -130121 -234255 -315628 -249058 -189309 -215288 -295796 -223300 -222832 -220374
12143 -220374 -307873 -308369 -269112 -284520 -198720 -154114 -188955 -262554 -303779 -260078 -149312 -186998
12131 -186998 -308498 -215412 -215667 -167059 -271018 -289419 -243127 -240849 -225371 -258817 -175734 -217475
12119 -217475 -303311 -183363 -226808 -195460 -320576 -226008 -320396 -142898 -201948 -175049 -294634
12108 -294634 -219041 -181641 -199715 -277115 -242722 -183962 -217079 -180871 -323395 -177632 -205335
12097 -205335 -133116 -176822 -235446 -153836 -268028 -224050 -192147 -218757 -280291 -265730 -370530
12086 -370530 -297114 -163529 -337124 -406467 -325495 -135043 -221869 -352764 -199111 -316979
12076 -316979 -206976 -251770 -237066 -206589 -278365 -261270 -241647 -236349 -324827 -222312 -270371
12065 -270371 -236911 -175831 -206318 -153220 -313498 -130945 -250960 -171567 -174728 -245868 -287609
12054 -287609 -246640 -170611 -323116 -224812 -245002 -188565 -257876 -318155 -256811 -216987 -239908
12043 -239908 -219601 -242273 -122275 -237361 -251915 -220279 -215129 -238125 -282685 -344798 -270160
12032 -270160 -123622 -232603 -288335 -175837 -247000 -205494 -277651 -159275 -250684 -261167 -165095
12021 -165095 -222206 -226221 -247157 -207443 -122264 -241402 -228004 -221891 -172276 -266363 -211319 -242279
12009 -242279 -157781 -233585 -263942 -129375 -225236 -160112 -265966 -286910 -230085 -158169 -229884
11998 -229884 -225954 -206717 -204103 -356396 -327743 -116857 -247486 -354573 -273654 -266890 -230235
11987 -230235 -192119 -257646 -294525 -223868 -278815 -323342 -357093 -303382 -144207 -182349 -286312
11976 -286312 -291051 -173198 -94648 -223236 -254062 -267344 -162539 -121144 -191463 -108711 -182008
11965 -182008 -294123 -237343 -250169 -244234 -147747 -297070 -336272 -255027 -248933 -154970 -282814
11954 -282814 -181004 -207327 -188825 -147259 -196664 -197520 -198757 -256308 -263685 -312813 -268315 -189671
11942 -189671 -351927 -346323 -326062 -288466 -292330 -291591 -282778 -271903 -228610 -304845 -293847 -115751
11930 -115751 -177695 -401481 -231297 -242770 -253990 -158958 -194870 -235519 -227983 -277514 -197061
11919 -197061 -200656 -61832 -162189 -217412 -123702 -167239 -207443 -342932 -300761 -253409 -245648
11908 -245648 -246749 -170562 -191050 -151303 -51153 -165184 75050 -116692 -73529 -90536 -197798
11897 -197798 -311517 -278814 -278445 -400240 -303382 -231425 -302630 -316042 -299421 -284631 -222520
11886 -222520 -259525 -308486 -254107 -333999 -268758 -441049 -271873 -349955 -271306 -384707 -335644
11875 -335644 -141590 -162937 -295369 -280258 -112105 -185888 -233785 -244072 -236079 -234849 -346785
11864 -346785 -225823 -354144 -302857 -265442 -207307 -178662 -264696 -199394 -241274 -207346 -265637
11853 -265637 -248239 -264359 -241433 -270677 -288794 -276994 -317854 -326326 -226413 -231182 -271927 -292702
11841 -292702 -309508 -192232 -145884 -254001 -279345 -189022 -193606 -242903 -199272 -255714 -243696
11830 -243696 -226732 -252647 -313890 -210686 -118819 -234961 -241067 -210801 -210807 -249133 -313982 -198643
11818 -198643 -178904 -237960 -197906 -172277 -131926 -246904 -254236 -207379 -171498 -194213 -252550
11807 -252550 -223028 -271312 -178861 -168546 -201353 -399308 -159777 -292692 -236557 -268952 -269501
11796 -269501 -176478 -206441 -251947 -200868 -159130 -114131 -165833 -215883 -277414 -221250 -227497 -302874
11784 -302874 -242765 -115401 -315641 -300239 -292827 -338354 -247188 -309196 -210516 -140366 -137809
11773 -137809 -246819 -221504 -183246 -110543 -130837 -97442 -196355 -142144 -243080 -303077 -248983
11762 -248983 -224522 -279620 -266985 -308202 -340011 -226268 -263874 -222482 -282893 -254906 -181099
11751 -181099 -199662 -188313 -244243 -341652 -415911 -215399 -178208 -226090 -247293 -214549 -314728
11740 -314728 -416105 -331334 -306993 -237676 -284455 -316348 -280351 -228515 -228524 -310568 -250235 -166883
11728 -166883 -261317 -209848 -174239 -179945 -168102 -287990 -254688 -122229 -293510 -97516 -232765
11717 -232765 -249229 -145737 -150530 -215965 -184983 -284625 -333817 -157637 -257270 -401504 -277256
11706 -277256 -274984 -203643 -226315 -253978 -219764 -195421 -215529 -311737 -187717 -206169 -271659
11695 -271659 -258051 -248073 -157850 -204894 -234506 -260979 -157615 -163470 -286245 -292593 -297018 -112150
11683 -112150 -209521 -218734 -119982 -269164 -125197 -195911 -212646 -161160 -95136 -315915 -265533
11672 -265533 -218031 -224537 -102655 -194601 -223716 -197984 -182028 -194377 -283908 -312640 -161568
11661 -161568 -260533 -144749 -273733 -349402 -240897 -195097 -419788 -249723 -155264 -194243
11651 -194243 -153030 -240647 -187404 -143993 -263070 -225821 -196503 -188704 -265131 -184708 -231416
11640 -231416 -307327 -299954 -209169 -289955 -196061 -147853 -257446 -229461 -221183 -223923 -102899 -188839
11628 -188839 -301322 -155439 -191735 -236463 -141448 -185425 -254637 -119372 -146636 -172775 -254283
11617 -254283 -251961 -263012 -155136 -240786 -199128 -144306 -294209 -364305 -173592 -211742 -214937
11606 -214937 -134191 -266086 -141463 -195086 -252620 -288520 -278408 -267036 -221693 -280487 -250376
11595 -250376 -115616 -233405 -275922 -255977 -114409 -198240 -210305 -288677 -251088 -244292 -95942
11584 -95942 -262306 -164232 -213970 -139641 -151204 -290106 -248784 -103692 -257271 -276642 -194646
11573 -194646 -274646 -156393 -286148 -242136 -238163 -193127 -238834 -281821 -267181 -214281 -161113
11562 -161113 -243584 -278168 -213531 -68405 -224612 -298108 -176239 -227603 -316489 -239354 -258932
11551 -258932 -346147 -297272 -189857 -351461 -221258 -238941 -161353 -287278 -318246 -139785
11541 -139785 -111740 -358593 -179695 -192047 -175842 -140859 -283219 -171492 -207402 -193499 -126842
11530 -126842 -319548 -269939 -205205 -178686 -283071 -269396 -217091 -215471 -251286 -229250 -246763
11519 -246763 -208862 -199497 -276654 -176672 -209554 -280325 -288259 -329904 -140205 -250274 -194358
11508 -194358 -294637 -196432 -196386 -321427 -340157 -154934 -144063 -279596 -239911 -148564 -137481
11497 -137481 -349080 -170962 -137559 -228987 -224405 -296817 -242385 -271945 -241250 -75713 -315348
11486 -315348 -302249 -304139 -148417 -247457 -352392 -281514 -240936 -241224 -197250 -228334 -250423 -250848
11474 -250848 -215291 -240044 -288076 -236575 -218837 -213962 -214317 -107361 -216126 -309642 -170145
11463 -170145 -125262 -284612 -288089 -231281 -202480 -307350 -291196 -294054 -214008 -167145 -353047
11452 -353047 -109234 -158334 -253426 -292202 -239190 -169743 -58860 -240537 -307819 -176934 -178718
11441 -178718 -119152 -301758 -221717 -296204 -228288 -175261 -145112 -298113 -179325 -238363 -252481
11430 -252481 -219580 -235178 -153239 -252069 -275364 -148641 -163192 -204470 -215969 -186722 -253434
11419 -253434 -186803 -261837 -327031 -242077 -95022 -245137 -261537 -195127 -113033 -212144 -310875
11408 -310875 -224387 -103929 -262575 -354499 -188791 -171578 -102055 -211538 -200062 -132862 -126151
11397 -126151 -207174 -156714 -184037 -234604 -166806 -255847 -232769 -148287 -209012 -329360 -222397
11386 -222397 -119988 -282925 -170926 -211599 -296698 -180097 -144715 -249013 -265774 -57926
11376 -57926 -80784 -202656 -201818 -186876 -108715 -210517 -279059 -243394 -162574 -127917 -221230 -338302
11364 -338302 -255861 -120612 -221772 -302615 -247322 -111645 -154149 -292275 -206631 -117356 -166726
11353 -166726 -193137 -245789 -98295 -173330 -257255 -262649 -197843 -164309 -135692 -146532 -228668
11342 -228668 -201764 -175461 -251328 -212286 -184822 -173443 -152810 -205445 -231956 -123273 -175357
11331 -175357 -336973 -186921 -178761 -160788 -295985 -312480 -172167 -269551 -241323 -246291 -255648
11320 -255648 -298703 -185051 -203511 -109564 -205563 -261073 -244341 -241307 -239456 -315434 -254434 -227463
11308 -227463 -260052 -235789 -146456 -200802 -156079 -249876 -131726 -114190 -269346 -225356 -140760
11297 -140760 -195673 -172160 -153828 -217047 -261445 -185339 -248927 -247069 -167800 -295590 -277618
11286 -277618 -257753 -209734 -238982 -184770 -247278 -217216 -231785 -171920 -215625 -201072 -176327
11275 -176327 -183402 -151671 -213509 -158524 -227111 -51300 -25438 -143098 -162879 -66131 -105170
11264 -105170 -186711 -240213 -251882 -275669 -194322 -289652 -346947 -249238 -121290 -244484 -251034
11253 -251034 -181106 -222043 -135956 -169448 -187879 -160681 -108240 -173306 -94806 -60295 -282688
11242 -282688 -193773 -252735 -269270 -249699 -302352 -296970 -293702 -301595 -307059 -247666 -207772 -312913
11230 -312913 -233304 -156793 -212542 -95252 -175628 -101593 -167321 -217737 -256641 -202662 -181443
11219 -181443 -320279 -215257 -215010 -252360 -210303 -237152 -204619 -166977 -266563 -324492 -179284
11208 -179284 -159219 -95148 -139583 -92085 -50153 -121357 -251500 -223202 -136524 -148950 -271146
11197 -271146 -172176 -256444 -153511 -250571 -179051 -269929 -177020 -225794 -172914 -254830 -217330
11186 -217330 -214136 -182984 -196640 -231160 -159811 -168661 -113259 -213305 -312558 -159207 -221014
11175 -221014 -205471 -253079 -172514 -242274 -177414 -174942 -207359 -124733 -175093 -259067 -254855 -113069
11163 -113069 -244626 -103409 -244099 -207180 -82588 -152067 -191472 -164164 -155864 -241690 -237349
11152 -237349 -210023 -128528 -205619 -100208 -124060 -167597 -192237 -125267 -176580 -237359 -170554
11141 -170554 -239690 -203857 -132349 -275740 -232111 -139683 -253769 -270704 -145625 -70083 -209483
11130 -209483 -307502 -169695 -163427 -226096 -267422 -268369 -176199 -303222 -217258 -158774 -209810 -200120
11118 -200120 -184735 -256216 -229274 -106012 -138865 -213816 -258506 -196055 -100893 -153439 -163042
11107 -163042 -297005 -198489 -115477 -141697 -283219 -327247 -249010 -163410 -179282 -246390 -189903
11096 -189903 -305933 -148095 -226528 -202803 -259993 -188478 -178212 -148484 -153302 -228746 -135068
11085 -135068 -200517 -67259 -156815 -192384 -263535 -337209 -161071 -258120 -171944 -261982 -90755
11074 -90755 -189248 -258412 -252682 -227108 -114678 -133877 -139760 -224692 -148736 -85959 -128483 -138120
11062 -138120 -184958 -83011 -249397 -96016 -331151 -113282 -240187 -101231 -308481 -142390
11052 -142390 -146581 -153447 -152520 -299122 -200392 -223106 -213075 -195132 -149282 -180250 -220392 -137441
11040 -137441 -142136 -192190 -223623 -155722 -216322 -192713 -185492 -294265 -198064 -176723 -267039 -263418
11028 -263418 -206639 -109989 -184382 -192016 -184470 -161952 -130169 -204576 -170119 -146413 -276890 -194915
11016 -194915 -209309 -159670 -217240 -151458 -159841 -231814 -130174 -206220 -61070 -149792 -222945
11005 -222945 -78142 -232343 -192493 -230894 -167125 -189529 -77001 -172250 -114351 -111484 -239004
10994 -239004 -199746 -89015 -37020 -245783 -109081 -158169 -154317 -140559 -281115 -287295 -185553
10983 -185553 -181642 -204041 -200433 -185897 -202909 -198950 -144758 -61494 -198654 -130562 -77584 -71105
10971 -71105 -95758 -86754 -97680 -217150 -146578 -131981 -150648 -164952 -43909 -219415 -176230
10960 -176230 -265017 -242300 -203115 -219284 -239390 -247660 -142309 -161068 -217678 -304625 -302038 -249557
10948 -249557 -249236 -355551 -273187 -166138 -141639 -149843 -218987 -168300 -96506 -67971 -31272 -103010
10936 -103010 -91760 -205546 -163314 -133852 -237415 -205338 -133781 -235425 -184993 -134145 -140795
10925 -140795 -99658 -158440 -183092 -150045 -144840 -160263 -80527 -154894 -253208 -115644 -133243
10914 -133243 -68173 -30310 -161761 -195494 -134730 -134010 -222930 -213272 -237230 -123825 -184619 -326770
10902 -326770 -235356 -217782 -224867 -88531 -117596 -255048 -134760 -134844 -212658 -204200 -242762 -112460
10890 -112460 -182046 -243958 -259342 -104134 -144351 -193289 -275286 -242010 -228810 -173138 -192732
10879 -192732 -198475 -129573 -50458 -205120 -143924 -151590 -221107 -193331 -109565 -129606 -150902 -199076
10867 -199076 -175105 -64982 -139813 -118908 -170368 -156987 -290808 -226778 -201730 -290312 -137530
10856 -137530 -182290 -113081 -195965 -216496 -247125 -190842 -232956 -143166 -269266 -146711 -157802
10845 -157802 -119590 -215291 -202563 -108771 -207355 -160883 -190175 -107497 -158917 -129753 -132896 -208186
10833 -208186 -109249 -87859 -239402 -186055 -126810 -139710 -120228 -57382 -13649 -71308 -183332
10822 -183332 2687 -127833 -176627 -191359 -106226 -92720 -93756 -280013 -183459 -130496 -77215
10811 -77215 -108686 -211038 -146612 -203707 -148494 -156876 -147974 -76543 -206226 -183968 -79229
10800 -79229 -171755 -146236 -67002 -129637 -164931 -213004 -244702 -126995 -179068 -211534 -120926
10789 -120926 -135284 -197230 -180189 -62275 -206389 -191828 -87350 -156423 -39040 -217028
10779 -217028 -146280 -115737 -129867 -192074 -229698 -41444 -136409 -154928 -204366 -80174 -154890
10768 -154890 -132372 -223060 -189108 -7102 -52492 -65896 -179030 -150265 -229011 -179437 -129686
10757 -129686 -133739 -141846 -206118 -212075 -231936 -138015 -163318 -256303 -108673 -112503 -132869 -196662
10745 -196662 -247841 -142227 -74865 -152638 -141753 -244751 -150537 -91214 -47533 -172134 -111546
10734 -111546 -120922 -51605 -155991 -162772 -162247 -104347 -142128 -208984 -132926 -68505 -114607 -117310
10722 -117310 -117418 -98891 -126410 -141451 -153018 -188818 -63599 -156154 -206403 -170911 -139053 -192814
10710 -192814 -226907 -195315 -134991 -130784 -222578 -189288 -204819 -138533 -226250 -187924 -95735 -151994
10698 -151994 -158968 -153720 -242341 -122052 -116135 -137694 -172969 -80449 -197911 -107642 -149895 -125687
10686 -125687 -174693 -162068 -116101 -134582 -132400 -60015 -39897 -154724 -210426 -107833 -166239
10675 -166239 -98815 -208932 -77813 -137302 -147730 -189520 -211170 -168046 -272678 -197997 -173910
10664 -173910 -209620 -134922 -107568 -148013 -95525 -100992 -184114 -120552 -117139 -198669 -238838 -132879
10652 -132879 -248269 -169405 -196526 -186693 -78446 -158492 -168749 -103839 -79059 -90798 -112393
10641 -112393 -207768 -198066 -197293 -103512 -53008 -77205 -163604 -84366 -145059 -214546 -128861 -103039
10629 -103039 -171810 -157260 -181630 -131935 -161621 -101867 -146381 -213815 -196081 -152634 -207955
10618 -207955 -240816 -229477 -55512 -161617 -294414 -121993 -59511 -228005 -163663 -183952
10608 -183952 -126342 -34186 -182034 -236037 -137860 -41700 -122635 -296485 -238595 -71791 -148250
10597 -148250 -122422 -154819 -185945 -81197 -50288 -133515 -91122 -33470 -65210 -77622 -114965
10586 -114965 -195355 -132565 -90925 -173057 -99868 -123401 -177732 -129043 -187121 21472 -155891
10575 -155891 -173416 -104523 -159898 -103226 -103493 -152792 -126729 -10983 -100169 -166668 -35918
10564 -35918 -109479 -114822 -60056 -268888 -161080 -120448 -215294 -230209 -195640 -91520 -46437
10553 -46437 -148873 -248489 -117924 -116607 -47284 -220883 -79639 -70192 -46196 -92842 -105527
10542 -105527 -137628 -108352 -174695 -21995 -47112 -142506 -148641 -17192 -190848 -165637 -164319
10531 -164319 -236941 -189433 -71244 6641 -120984 -146498 -188082 -107703 -135706 -17775 -116647
10520 -116647 -105527 -89213 -139299 -126349 -177476 -101974 -69808 -146078 -79869 -99890 -173771
10509 -173771 -71538 -115971 -115729 -47401 -190769 -13222 -105104 -203479 -143579 -99892 -72294
10498 -72294 -200747 -119167 -124613 -63135 -174207 -83486 -134272 -218114 -176573 -111026 -115089 -40749
10486 -40749 -186089 -107744 -46057 -112473 -90336 -100395 -166849 -106224 -112776 -147809 -169097 -160884
10474 -160884 -159768 -171769 -134294 -47477 -260754 -127330 -138747 -126240 -164405 -85873 -49523
10463 -49523 -82502 -201828 -15861 -83459 -157275 -108812 -75904 -68969 -225001 -174261 -92595
10452 -92595 -91254 -172039 -148423 -68258 -20451 -160587 -35950 -58731 -144096 -9304 3309
10441 3309 -114231 -189714 -81575 -89574 9691 -135159 -120320 -35816 -86065 -146557 -214712
10430 -214712 -54579 -72364 -191332 -277475 -120871 -42485 -149175 -257947 -118309 -86590
10420 -86590 -75460 -191573 -145245 -124928 19315 -97749 -244418 -122063 -82903 -168502 -113586
10409 -113586 -169881 31543 -141040 -184638 -197970 -158760 -133582 -251850 -126601 -203262 -23485
10398 -23485 -34360 -40121 -120334 -262605 -10527 14233 -103692 -215609 -25158 5154 -176944
10387 -176944 -274922 -114045 -85819 -151696 -99869 -243952 -49482 -101655 -218234 -171940 -164223
10376 -164223 -192160 -179372 -109481 -123438 -58171 -265506 -151718 -151244 -73256 -138083 -154776
10365 -154776 -69115 -115407 -24875 -77168 -128654 -201003 -142234 -92380 -76851 -226327 -148669
10354 -148669 70690 -42860 -223706 -171744 -53257 -89106 -139349 -231965 -154568 -57990 -211193
10343 -211193 -191070 -144057 -19131 -36679 -157166 -122712 3184 -71563 -150326 -97328 -142712
10332 -142712 -164028 -165997 -188057 -156642 -147325 -98494 -156768 -185568 -147013 -198812 -50044 -108406
10320 -108406 -208871 -147193 -124178 -254590 -57788 -148176 -57263 -236395 -91363 -74179
10310 -74179 -45245 2767 -265719 -106520 -126383 -73414 -85415 -105428 -135617 -43958 -170149
10299 -170149 -252355 -130913 -95046 -93026 -144282 -125133 -93857 -48079 -120261 -119616 -81964 -135765
10287 -135765 -15296 -208938 -126657 -131526 -64598 -30559 -213957 -111119 -144161 -75673 -139622
10276 -139622 -113371 -80856 -90124 -94825 -140643 -136932 -187351 -172039 -172303 -93660 -46355 -157220
10264 -157220 -88209 -69163 -213359 -103097 -95005 -107826 -42730 5320 -99464 -105697 -49329
10253 -49329 -54506 -105638 -40488 -82768 -99548 -129254 -114722 -187415 -143354 -81910 -197846 -42520
10241 -42520 -185593 -92484 -109470 -64321 -108392 -88449 -127629 -81390 -78338 -132373 -143108 -65612
10229 -65612 -144630 -27619 -26422 -62387 -114208 -85190 -96276 -111166 -136191 -112221 -140687 -91758
10217 -91758 -160844 -180833 -141894 -64813 -155959 -111605 13919 -79459 -198814 -54513 -65934
10206 -65934 -8873 -66385 -66579 -81180 -48698 -129926 -152379 -102436 -17579 -105819 -252755 -131952
10194 -131952 -27349 -144016 -220348 -162869 -159416 -124326 -143262 -118768 -59560 -162817 -126009
10183 -126009 -165632 -62443 -127787 -126025 -96370 -96938 -180509 -103882 -20784 -99540 -209894 -100763
10171 -100763 8918 -110488 -145287 -15719 -39514 -44619 -174088 -84319 -87609 -93342 -95459
10160 -95459 -79181 -32159 -142793 -106549 -163104 -29297 -79056 -33595 -238821 -43218 -32312
10149 -32312 -159872 -87638 -77747 -66135 -96021 -100970 -135163 -187084 -174485 -89171 -131098 -131232
10137 -131232 -124366 -70390 -25989 -233146 -130772 -48226 -81485 -163268 -155861 -38318 -77999
10126 -77999 -157391 -207650 -42264 -94627 -58134 -75197 -97870 -7199 -161990 -131041 -162902
10115 -162902 -157686 -52885 -137907 -81974 -23284 -41581 -81453 -52462 -123068 -84311 -85862 -151108
10103 -151108 -76268 -66427 -52989 -47563 -129995 -164707 -83138 -107499 -117435 -145921 53271 1048
10091 1048 -44200 -73919 -7545 -43354 -66042 -23439 -108405 -195567 -158483 -44057 -109455 -267380
10079 -267380 -120054 -99908 -75464 -17952 -49500 -131414 -104900 -68389 -122119 -72129 -46144
10068 -46144 -72820 -60572 -26665 -34915 -73987 -10875 40998 -8667 -145611 23865 -148050
10057 -148050 -38188 -93924 -57895 -87843 -118925 -34330 -135596 -122190 -91082 -151801 -81599
10046 -81599 -90290 -48955 -19474 -33264 -96470 -54435 -30653 -106682 45732 -89061 -74647
10035 -74647 -112187 -28522 -115439 -174399 -26434 -43134 -81460 -93924 -70629 -41044 -25560
10024 -25560 -68834 -143935 21340 -59847 32514 -30685 32569 62271 75514 -14610 -48174
10013 -48174 -73630 47553 -19177 -17956 -69752 -40383 -27352 -65664 -28171 43601 -53413 -75285
10001 -75285 -15879 10623 57597 -8748 37886 121261 136225 93234 120305 137578 200190 118270
9989 118270 155451 196906 45354 137575 214591 268445 103937 154039 100144 127243 -13772
9978 -13772 139260 147234 149378 65301 50739 86802 23060 -17354 106788 208562 3003
9967 3003 23519 124474 171165 110905 14503 -18665 81885 107218 -40600 116968 114318
9956 114318 105971 141979 117534 193922 290699 300141 247826 277623 210950 251654 280159 287757
9944 287757 239736 221782 352838 384182 367750 427749 397581 508407 492895 510028 604136
9933 604136 713750 815964 888194 991551 1088021 1326459 1430558 1685390 1887483 2116496
9923 2116496 2376965 2480595 2602802 2768149 2448287 2373394 2233039 1916475 1590244 1336886
9913 1336886 1216557 1085099 908882 802098 725638 704545 687683 667088 583046 493111 417888
9902 417888 550485 492161 528776 500665 378769 440511 485551 466496 371042 505971 547943
9891 547943 453344 476117 543804 488336 573530 488096 476359 511748 580453 652018 782384
9880 782384 744407 741491 754029 915017 853531 956010 847407 976429 1035580 995727 1044649
9869 1044649 1038207 952389 1093825 952399 992458 875513 995349 1004708 972398 1064994 992036
9858 992036 1009235 1231280 1122609 1138739 1206798 1364668 1290061 1208099 1327347 1509592 1547050
9847 1547050 1572556 1744122 1771553 1870947 1867053 1910789 1932307 2022916 2107559 2019051 2017192 2064700
9835 2064700 2115794 2139385 2376953 2467220 2722800 2843908 3010614 3058944 2968858 2992871 2917307
9824 2917307 2735821 2560465 2316325 2039611 1871318 1783621 1724666 1632853 1367325 1419853
9814 1419853 1242780 1316690 1163500 1132628 1026500 1042777 1041036 1013734 879391 874525 802521
9803 802521 774434 691833 721649 705787 721764 647033 598045 713605 626122 656639 617769
9792 617769 634539 727372 601703 562099 521852 499429 539448 554132 406921 517052 637107
9781 637107 444869 548063 495503 536519 432566 389075 540557 502785 444892 364294 522025
9770 522025 430125 459309 380414 484239 421728 329025 493723 393630 370088 339656 458822
9759 458822 474716 369160 325298 509076 500573 491822 465626 457768 528533 395814 435182 438656
9747 438656 444023 426565 365822 316047 267322 464864 276655 245113 214380 365929 266297
9736 266297 221615 261985 319906 229028 164967 250866 325833 271990 318357 202195 406863
9725 406863 318310 309246 279596 263415 313500 226182 246627 280904 223580 238823 187880 169414
9713 169414 233818 240479 229750 223415 282324 214598 248898 311245 175866 335103 224644
9702 224644 337654 57563 195046 202657 367133 151092 114046 271990 286373 135657
9692 135657 283612 192003 211550 233878 209749 282799 318012 194262 248724 221260 272014
9681 272014 157589 83497 240334 276563 271179 148807 133091 76555 210806 81253 225724
9670 225724 257683 107546 264843 130106 258396 140196 258738 275540 74822 148743
9660 148743 275537 326071 171016 215749 186639 316559 184737 222377 365650 266458 192122
9649 192122 179592 258739 163293 287532 173733 270683 351331 311670 273208 304700 333333
9638 333333 357279 391920 326816 381327 290383 256551 155746 280349 262481 250489 285649
9627 285649 249208 173180 159707 304536 273101 221080 212851 122172 223280 167374 216786
9616 216786 217006 184112 303717 206665 187945 147505 213733 214702 333247 163397 149172 140443
9604 140443 196179 194745 177792 200248 167458 200922 159781 166809 192852 247874 138461 173540
9592 173540 188867 201027 201976 202880 242855 207483 106860 97170 118878 134013 185456 195068 227415
9579 227415 137262 178387 165185 112105 170419 288067 244608 239985 252497 270085 176428 172373
9567 172373 145589 236723 264805 261956 273347 281052 263569 283610 270823 172907 194903 229211
9555 229211 202316 306112 260662 318927 260110 213085 231948 249135 286747 215890 372901
9544 372901 355833 437346 348318 294057 348459 434962 240289 365648 448158 369447 419283
9533 419283 344851 403734 373505 392390 494356 461828 501045 466983 565678 510470 545242
9522 545242 617609 551160 546546 471700 620490 633122 679242 556351 682916 658748 664185
9511 664185 587783 576856 684176 662888 686780 749446 669983 700891 845872 752386 876934
9500 876934 863584 888486 900359 1002219 1006187 1105129 989386 1048032 974923 1064106 1089678
9489 1089678 1059694 1138679 1180721 1119371 1185295 1119430 1117424 1121531 1039816 1250744 1173337 1328248
9477 1328248 1151360 1215075 1122001 1174660 1210595 1254823 1107883 1260921 1274377 1306177 1374485
9466 1374485 1263596 1380358 1505198 1509866 1657912 1537143 1819733 1740219 1824385 1933457
9456 1933457 1962869 2033780 2039202 2085813 2141632 2170222 2031371 2157518 2280627 2230115 1993872
9445 1993872 1965796 2138970 2066746 2114957 2005286 2059256 2066478 2199518 2257679 2299440 2181106
9434 2181106 2295103 2345487 2279133 2357735 2413947 2448737 2441894 2510020 2546042 2436417 2427616
9423 2427616 2486001 2467912 2425377 2336001 2450028 2458860 2387926 2428880 2361267 2376010 2402770
9412 2402770 2409458 2380312 2343968 2472856 2419569 2502770 2447060 2358418 2315719 2301578 2282912
9401 2282912 2242384 2201355 2142771 2211556 2087328 1961681 2019781 2055067 1967399 2055288 2036669
9390 2036669 2056098 2085898 2014237 2127491 1969148 2018646 1972124 2149112 1962787 1990580 2034059
9379 2034059 2155846 2026421 2012181 2087451 2092449 2075761 2187196 2115031 2210215 2173616 2323549
9368 2323549 2177952 2299761 2347383 2347802 2416649 2476807 2598450 2517527 2547716 2574631 2673075
9357 2673075 2803520 2724054 2744719 2951594 3015122 3151166 3294142 3390150 3633749 3797635
9347 3797635 4238197 4390980 4818538 5466478 5731654 6278194 6666392 7005431 7066997 7213068
9337 7213068 7129822 7342923 7398853 7434916 7464967 7550663 7744540 7695766 7717716 7783291 7685302
9326 7685302 7660538 7437505 7348228 7413316 7454314 7476221 7599763 7796805 7847306 8019363 8177767
9315 8177767 8511597 8696400 9205835 9677271 10078982 10352209 10793070 10759793 10698136 10697416
9305 10697416 10678163 10607535 10525782 10451431 10157992 9721144 9081951 8533642 8043827 7445710
9295 7445710 6982277 6788559 6575357 6406031 6260156 6027765 5881451 5800708 5694749 5551364
9285 5551364 5476199 5539468 5472951 5549941 5419156 5531809 5691057 5700782 5649730 5757602 5796045
9274 5796045 5751270 5841950 5866923 5882559 5941841 5964344 6062484 6107476 6189244 6193005 6129682 6193424
9262 6193424 6437002 6439699 6487206 6516133 6724428 6823399 6975774 7060002 7127930 7428802 7427072
9251 7427072 7642895 7740496 7814043 8040242 8077033 8277889 8292318 8437590 8500518 8565747 8796872
9240 8796872 8932507 9092721 9148001 9323535 9483292 9620983 9800019 10080122 10099881 10369020
9230 10369020 10650403 10809482 11120437 11335635 11561049 11824312 12048747 12312728 12417271
9221 12417271 12619861 12930521 13224640 13696049 14055982 14455351 14988855 15312213 15733611
9212 15733611 15955394 16250136 16518622 16997847 17323058 17656084 18032957 18489898 18895924
9203 18895924 19377580 19968860 20621434 21108105 21584014 21981777 22730002 23261512 23692490
9194 23692490 24465163 25208947 25971965 26583808 27425397 28468322 29752184 31228209 32960691
9185 32960691 34854743 36825964 38693510 40300111 41956869 43185348 44249189 44981646
9177 44981646 45680887 46230290 46558063 47175447 48033233 48918712 49780550 51185615 52618840
9168 52618840 54231953 56030488 58221392 60539483 63087198 66116806 69567004 73575726
9160 73575726 77905148 82856274 87690993 92694245 97764727 103047348 108727483 115044507
9152 115044507 122140112 129762499 137854742 145451834 152527073 158957176 164987159 170901107
9144 170901107 176544810 182049122 187570606 193386167 199267258 206062554 213990970 223608310
9136 223608310 235891348 252043731 273638364 301647895 337293530 379392871 425010952
9129 425010952 466881651 497393529 510261254 504154897 481138291 446317517 405788701
9122 405788701 364689664 326941357 294756998 269241703 250659920 237813671 229331342
9115 229331342 223051260 217419809 211306112 204755931 197966461 191658212 186045645 181463661
9107 181463661 177229030 172732086 167575629 161475695 154481717 147139135 139708483 133106653
9099 133106653 127148037 122460169 118254266 114610378 110779391 107397886 104075734 100863882
9091 100863882 98313450 96002287 95059074 94815119 95179158 95085863 94413062 92715559 90014976
9082 90014976 86713894 83107603 79401816 75699923 71908712 68118749 64809389 61615384
9074 61615384 58592493 56082580 53800050 51904341 50205051 48728965 47348032 46327004
9066 46327004 45349087 44495566 43546409 42772986 41838218 40667015 39319182 37878780 36498108
9057 36498108 35033717 33442308 32144464 30937006 29934071 28854523 27973248 27247991
9049 27247991 26470285 25476753 24535665 23698660 22625957 21811740 20862997 20031798 19278235
9040 19278235 18690814 18124205 17460485 17037032 16560356 16293477 15701341 15268372 14806836
9031 14806836 14364203 13983474 13432225 13022884 12653048 12356179 11887353 11585569 11170060
9022 11170060 10790192 10425349 10043392 9725826 9426778 9131115 8694364 8519018 8323890
9013 8323890 8024644 7779713 7715846 7608220 7351002 7236320 7059262 6954698 6784498 6657810
9003 6657810 6576065 6265316 6181781 6101583 5960981 5720033 5623198 5480962 5363697 5186221
8993 5186221 5161584 5013817 4910461 4991913 4692286 4769315 4689236 4634560 4457131 4327592
8983 4327592 4476619 4314815 4261909 4118018 4157688 4035170 3957978 3911356 3852167 3646989
8973 3646989 3594312 3502957 3411855 3439653 3164684 3200618 3155207 3063688 3034068 2840190 2967014
8962 2967014 2881512 2863172 2676910 2531836 2643487 2539999 2525697 2440830 2341853 2276538 2235835
8951 2235835 2160119 2247785 2181572 2010219 1988927 2024231 1891590 1712063 1809101 1743822 1714078
8940 1714078 1655076 1565863 1510916 1497298 1440217 1379888 1326744 1367421 1325146 1204359 1166456
8929 1166456 1223829 1249213 1063013 1144451 1076861 911169 1103550 968433 872204 905850 999870
8918 999870 893822 920983 775342 807851 791905 714635 705779 713157 719312 651806 752203 561946
8906 561946 643307 658589 595293 613738 530872 527610 454703 537354 418364 532096 524062 405936
8894 405936 416075 395962 523046 339513 378115 435152 408061 497973 436994 366550 444071
8883 444071 440968 452040 343202 353026 389552 372621 292269 366445 382317 311566 264276 466957
8871 466957 438256 477579 380979 280535 538184 337400 441732 391374 403346 474497 492062
8860 492062 487911 435992 542709 670831 615044 622479 739537 578070 634743 639053 693555
8849 693555 742576 761101 639175 633653 653175 631794 744379 696314 704860 759947 706664 662285
8837 662285 786188 878343 816140 965691 1034650 1021898 1160780 1275726 1350106 1399334 1440457
8826 1440457 1446581 1462550 1385673 1416442 1458292 1340934 1300523 1197410 1120794 1045946 1092005
8815 1092005 959520 993392 1023976 856914 885393 896688 839980 1030996 913662 1056142
8805 1056142 1071211 1086708 1036419 1040096 1060358 1092636 1095441 1011567 1134998 1085353 1027406 942036
8793 942036 974664 834029 881531 802575 728888 693063 760990 976994 542320 548105 568977
8782 568977 541990 518566 504788 588122 437793 509797 396353 595511 470935 399602 532271
8771 532271 349362 421830 325663 329504 180133 253741 332057 373142 241811 269460 239446
8760 239446 214810 191439 131899 246421 214411 170677 105044 176143 182776 166062 144404 125792
8748 125792 214649 171408 145824 151959 188730 223643 45887 2797 117354 128964 39161
8737 39161 124107 8139 -21387 112062 17591 184051 106538 -49308 -37272 10198 -12359
8726 -12359 -23750 79554 -116752 -1186 -5831 10835 -148407 -118088 -110591 -172959 -104859
8715 -104859 -105396 -64573 -143421 -87819 -127184 -59937 -45531 -121732 -67911 -97145 -137780 -106019
8703 -106019 -144302 -169485 -248444 -61412 -180700 -74623 -171949 -154530 -126865 -122498 -275901
8692 -275901 -253022 -188814 -171419 -140825 -179434 -143537 -70351 -170404 -72444 -105926 -105417 -112007
8680 -112007 -155056 -83908 -106481 -91928 -181767 -102817 -119779 -29510 -140437 -142002 -29489
8669 -29489 -68901 -108751 -91659 -154360 -193967 -69757 -64089 -90705 -235340 -161901 -139631 -234392
8657 -234392 -271717 -58305 -69148 -199795 -258453 -211896 -145642 -220344 -274506 -134626 -125210
8646 -125210 -173281 -103145 -255982 -321804 -261374 -215025 -77556 -207955 -300329 -187655 -193848
8635 -193848 -215600 -174354 -214802 -178726 -223994 -156963 -152797 -142594 -184790 -220622 -108855 -139970
8623 -139970 -288784 -260546 -247510 -173061 -169834 -230902 -282926 -220318 -169159 -149694 -131888 -274174
8611 -274174 -250247 -119196 -270880 -315721 -298727 -155191 -276797 -214576 -207625 -206198 -176450
8600 -176450 -305377 -123919 -127852 -148272 -170010 -87481 -129639 -243410 -166700 -278537 -245971
8589 -245971 -202649 -290485 -235088 -220312 -277576 -261734 -152434 -252726 -161410 -288309 -273061
8578 -273061 -140430 -290094 -294454 -289686 -189148 -292689 -210711 -172680 -154719 -339203 -150553
8567 -150553 -129858 -161671 -329170 -292880 -177138 -226157 -227887 -316351 -196831 -249264 -211290
8556 -211290 -271697 -198917 -207361 -273665 -251586 -149148 -161373 -203812 -209930 -313192 -268651 -260592
8544 -260592 -224780 -226758 -268286 -270188 -168352 -155893 -326282 -270235 -199602 -262768 -214124 -255948
8532 -255948 -263791 -260049 -240337 -171850 -277729 -203647 -320943 -131022 -222659 -237616 -302017
8521 -302017 -295447 -225350 -189873 -232119 -218089 -224336 -321728 -169637 -270248 -235938 -167668 -187339
8509 -187339 -242161 -137984 -201275 -282649 -263037 -290258 -185499 -303114 -214928 -266880 -313765
8498 -313765 -276243 -232644 -309575 -258059 -227099 -169137 -207001 -338293 -225018 -156224 -299361
8487 -299361 -296906 -201596 -182880 -222620 -117166 -305920 -256669 -177253 -303657 -244747 -255550
8476 -255550 -275334 -193454 -108897 -315114 -191737 -225809 -254358 -351162 -167832 -193356 -209406
8465 -209406 -263141 -228198 -192939 -193055 -242982 -133126 -236145 -180019 -180556 -172461 -299012 -124356
8453 -124356 -189625 -216711 -199396 -291351 -198645 -279511 -235066 -196076 -202426 -199652 -188626 -190949
8441 -190949 -240120 -231875 -86273 -136795 -212015 -131304 -91546 -154734 -194146 -164992 -153544 -295840
8429 -295840 -288775 -293464 -66811 -163460 -362720 -273567 -200147 -121283 -141288 -273390 -179268
8418 -179268 -116190 -210359 -174482 -143001 -345942 -257963 -152227 -128937 -234942 -331689 -290609
8407 -290609 -133290 -154650 -207943 -246377 -176140 -209330 -123781 -154172 -304321 -254528 -192503
8396 -192503 -218943 -204694 -193488 -305858 -259919 -168487 -150433 -188671 -244356 -221596 -245908
8385 -245908 -362169 -210210 -192037 -219464 -352825 -209467 -201766 -237196 -258217 -237904 -224931
8374 -224931 -180034 -321984 -132968 -246952 -207358 -192780 -147131 -243972 -191388 -185781 -310413
8363 -310413 -135391 -177269 -322236 -235158 -197757 -257144 -206249 -293703 -187458 -231708 -186711
8352 -186711 -224050 -81450 -305128 -161396 -120436 -94098 -129884 -284061 -108418 -247660
8342 -247660 -164705 -211089 -179289 -181395 -93095 -136556 -78952 -139556 -317872 -189639 -170122
8331 -170122 -217512 -208572 -211918 -131911 -127033 -115786 -288044 -112812 -240890 -208471 -244451 -199448
8319 -199448 -279325 -243675 -293299 -207346 -172529 -183008 -85489 -75145 -208908 -234216 -145179
8308 -145179 -232218 -298118 -265801 -248811 -199609 -265800 -338010 -218340 -181047 -201331 -180246
8297 -180246 -178006 -273247 -131644 -129333 -198565 -95307 -168516 -277336 -187866 -105725 -198719
8286 -198719 -286501 -84721 -181861 -123380 -203235 -283865 -239613 -213060 -206230 -97525 -218832
8275 -218832 -264495 -232228 -232729 -278962 -230027 -309540 -194104 -195685 -230814 -178269 -250512 -136612
8263 -136612 -295503 -216824 -95294 -185997 -139684 -234997 -177574 -122825 -201783 -299199 -295185
8252 -295185 -307205 -264174 -146390 -153834 -221695 -258718 -163642 -123500 -144418 -177338 -184351 -161267
8240 -161267 -93466 -181447 -200661 -200052 -152834 -57536 -180887 -253182 -359229 -259658 -225784 -233316
8228 -233316 -228273 -279668 -190938 -230954 -171455 -38623 -304414 -236142 -175948 -155298 -9757
8217 -9757 -89790 -261497 -257149 -122051 -118468 -168296 -157599 -169922 -173766 -170627 -178208 -127697 -259946
8204 -259946 -311979 -110579 -74751 -166767 -204311 -189877 -139986 -95831 -80607 -134215 52502
8193 52502 153972 369877 -417782 -434767 -271817 -182402 -159059 -233360 -257293 -214948 -283632
8182 -283632 -375392 -314770 -360265 -321602 -251400 -383507 -256723 -312689 -199896 -229170 -228324
8171 -228324 -48157 -225009 -199257 -257975 -238801 -351048 -407983 -422540 -346835 -393820 -256189
8160 -256189 -241173 -191189 -156781 -123963 -134396 -175292 -185931 -105296 -148175 -269277 -188220
8149 -188220 12322 -220670 -239465 -243182 -153644 -207227 -174115 -141105 -128907 -172635 18493
8138 18493 -228995 -153957 -173164 -4302 -195763 -161228 -270658 -188745 -189258 -117965 -167644
8127 -167644 -118527 -146992 -150661 -111493 -105769 -106751 -130729 -199272 -189128 -197522 -102624 -171651 -362336
8114 -362336 -135712 -88087 -138949 -244259 -199590 -201414 -68935 -162549 -185158 -57640 -131897
8103 -131897 -170991 -143861 -143888 -178911 -117175 -313397 -214432 -77819 -255529 -326697 -260548 -171265
8091 -171265 -195175 -169158 -250567 -124425 -213577 -87666 -47739 -193481 -93201 -185969 -76865
8080 -76865 -207556 -184982 -133132 -130067 -114075 -229086 -217160 -252251 -169964 -185330 -287815
8069 -287815 -135800 -161127 -203668 -307275 -158241 -208867 -234794 -161049 -151512 -103185 -239934
8058 -239934 -128332 -54186 -78585 -83135 -193124 -283046 -171937 -173263 -139756 -231638 -198222
8047 -198222 3201 -171314 -206863 -237801 -131496 -142189 -211950 -74697 -158561 -86580 -200285
8036 -200285 -83468 -262608 -20245 -172534 -51581 -191813 -164858 -110100 -113293 -168683 -181887
8025 -181887 -125681 -109380 -180705 -199123 -207668 -192890 -136911 -190183 -194261 -133235 -135388 -71868
8013 -71868 -146748 -47118 -104082 -276060 -231399 -169948 -124673 -215837 -340205 -221368 -195386
8002 -195386 -132455 -195423 -109114 -172327 -139609 -201639 -171710 -156961 -254917 -177542 -210945 -154446
7990 -154446 -178274 -11497 -100004 -213676 -240430 -68529 -50732 -212010 -290885 -193417 -143220
7979 -143220 -169867 -176606 -158379 -203781 -119335 -192043 -127470 -140999 -122135 -187091 -137589 -116332
7967 -116332 -98162 -168118 -147118 -154383 -129151 -109438 -177963 -200072 -149091 -75346 -138962 -185227
7955 -185227 -208010 -118082 -209665 -64792 -200189 -250214 -158362 -101787 -118006 -164273 -122811
7944 -122811 -60483 -162976 -84393 -16890 -114091 -143945 -91114 -116032 -168959 -64066 -111335
7933 -111335 -269728 -212111 -189959 -118645 -123009 -115506 -87785 -94543 -86254 -97938 -39003 -74103
7921 -74103 4446 -40810 -38708 48923 31036 -2217 -18659 -24165 56206 -15082 33941 -10913
7909 -10913 53298 -8678 -101372 121821 34155 25618 -38331 -2415 -3811 32578 11902 9051
7897 9051 -125180 -81195 -11593 -112603 -134956 -117303 -78459 -99055 -151341 -100125 -178836 -115503
7885 -115503 -134147 -174356 -96145 26944 -193420 -134190 -83110 -104835 -4910 -146461 -85808
7874 -85808 20902 5288 11510 -156514 -55869 3280 -126397 -47524 -120554 -58464 -115862
7863 -115862 -6537 -110204 -67646 -30377 -13050 -65143 -58816 45758 67885 -78898 -63769
7852 -63769 -91444 31440 -2526 -61834 -325008 -615836 -103270 -232694 -296492 -190086 -84601
7841 -84601 -158986 -244937 -202226 -47795 9936 -107348 -192423 -85184 -82255 -64042 -132983
7830 -132983 -71209 -86744 -114468 -163913 -192948 -59877 -168304 -202747 -253252 -218760 -139220
7819 -139220 -101074 -129917 -92820 -64006 -175080 -106786 -49298 -171674 -78149 -84116 -125375
7808 -125375 -215032 -35861 -83201 -117269 -249049 -66907 -130067 -132068 -206658 -91927 -66069
7797 -66069 -167872 -227004 -127523 -150829 9229 -107934 -107603 -49930 -17263 -87448 -101967 -168049
7785 -168049 -35044 775 -195604 -21385 -82675 -91033 -191192 -97186 -163129 -106665 -108561
7774 -108561 -56796 -69982 -172235 -199352 -112148 -167938 -163175 -91500 -136642 -110188 -79063 -106124
7762 -106124 -75191 -126170 -141233 -163452 -126088 -210907 -143441 -103305 -92184 -89342 -107799 -95239
7750 -95239 -121126 -104497 -125004 -131603 -98292 -80838 -114118 -42663 1704 -52890 -135494 -131990
7738 -131990 -217993 -106733 -51963 -92606 -176533 -52130 -173714 -99985 -89693 -95349 -36802
7727 -36802 -145559 -53194 -83359 -45159 -64095 -40967 -63030 -72790 -117243 -77009 -141280 -110835
7715 -110835 -1663 -124229 -113589 -139623 -184485 -24870 -107712 -133009 -64427 571 -51968
7704 -51968 -56244 -142313 -128156 -53380 -130030 -107078 -76212 -33204 -95006 -109812 -63581 -33537
7692 -33537 -110236 -4043 -30514 -57310 -170401 -104781 -92821 -69567 -164782 -83695 -84344 -116179
7680 -116179 -86089 -122340 -66942 -125238 -102796 -86617 -33332 -81915 -23431 -72193 -132779 27878
7668 27878 -26699 -128051 -78944 -24208 -81254 -170939 -177127 -144096 -177446 -148685 -48603 -18005
7656 -18005 -29322 -87611 -577 -1424 -61356 -105830 8011 -39381 -33349 -44307 -60340 -17630
7644 -17630 -64049 -30207 -108950 -84675 -21227 -124880 -36279 -17419 53946 -130221 59538
7633 59538 2522 14736 -68865 127006 64436 85261 17925 -22064 16138 14968 30909 -15910
7621 -15910 -108503 13413 -96894 -6100 -31361 15741 13104 -56701 25604 71204 -2882 4221
7609 4221 64656 94656 45461 67780 151275 132677 167612 226001 239339 48527 146817 177099
7597 177099 434262 354653 278548 400729 596640 688206 856575 864689 1077802 1341258 1484765
7586 1484765 1502490 1519253 1366839 1434263 1273233 1053083 928049 713602 542081 482520
7576 482520 561423 432756 164965 160689 276692 243708 209357 138943 91127 107713 233397
7565 233397 108803 101659 176019 189278 174002 27425 28270 39795 2869 49544 -22867 -162996
7553 -162996 -22952 18166 -68974 -67250 -61481 46608 15120 -47040 -11166 -24310 15196 -66962
7541 -66962 54051 162925 131668 -26332 -55067 -72092 -70953 -35718 -106219 4313 46953
7530 46953 -6700 -74202 43767 10113 -125657 30147 19463 134404 -47097 28335 57781
7519 57781 149415 95209 -41482 21422 -6490 16938 40703 -17148 -11064 48657 23096 -12716
7507 -12716 37742 -63698 -47347 -29815 -51746 63502 -14352 -135025 58831 213171 85947
7496 85947 131830 -7783 8438 65780 61183 62660 -131927 62075 27305 -27944 -51297 -24412
7484 -24412 -87549 46948 -21579 -18432 -6905 53093 108443 -6512 2919 125309 105272 60431
7472 60431 53624 78893 225452 17816 10108 174229 125912 -16507 81746 146459 98880
7461 98880 19918 -15295 90467 94476 -39552 -20786 15578 22513 127037 74206 29765 162263
7449 162263 89566 88249 147339 121933 139492 66061 83346 35709 -45705 89460 157740 49300
7437 49300 62555 142604 129536 135143 134537 113513 146480 146369 205521 140192 185541 87489 122220
7424 122220 158431 168997 134706 105952 135664 224667 189207 81207 153513 197971 182860
7413 182860 235942 160621 155217 177491 171228 179433 241591 90233 156902 242306 206382 99974
7401 99974 165642 130235 167718 121651 148502 232449 207226 104815 195862 174392 261765 173490
7389 173490 282822 237921 247639 175672 286618 212973 201779 248425 316548 247076 204442
7378 204442 305886 294343 233814 324933 447932 280062 304716 355441 405304 338813 404298
7367 404298 489105 437079 394895 441616 503638 503140 566018 573853 603624 704485 621268 639078
7355 639078 736664 847178 867479 879953 1072989 1143218 1236072 1350646 1492767 1806031 1931629
7344 1931629 2109461 2484176 2835604 3261865 3755778 4461841 5082432 5901204 7006037
7335 7006037 8107800 9209264 9867254 10540951 10539354 10121834 9408722 8624862 7439767
7326 7439767 6413754 5426104 4626170 3863671 3263758 2837961 2396701 2169263 1935950
7317 1935950 1704527 1504889 1356145 1291123 1183335 1112814 1062197 979182 837970 891498
7307 891498 794875 705526 736094 621980 658641 578029 494957 584551 601063 612355 492264
7296 492264 594948 417778 499101 451592 467854 364769 414815 485751 372545 407261 314835
7285 314835 475848 442870 345282 393778 377391 180783 318376 369012 202112 291898 229617
7274 229617 284762 316157 296259 207497 265539 171496 316229 290977 207593 220760 222597 303230
7262 303230 285323 286423 206135 417329 261135 237352 275696 263835 390597 329544 285497
7251 285497 274301 257874 323193 193212 195101 268353 308088 293721 314582 384822 289017 395778
7239 395778 331870 432880 335232 350765 439371 262644 314069 362262 363274 333282 404192
7228 404192 392505 322917 421144 396930 366981 392998 414494 393831 558441 431224 408869
7217 408869 392688 438316 513476 468499 419126 480080 478097 491609 380587 401329 519882
7206 519882 522435 440662 490916 387604 698565 452907 536520 550534 424326 607630 658799
7195 658799 881853 862102 1067848 1258586 1406437 1541784 1612671 1616214 1463683 1325167
7185 1325167 1247571 1237432 905268 804930 725337 712727 514967 508169 439741 464281 512502
7174 512502 410592 567328 487076 446812 436679 565905 696501 557167 483490 583218 853036
7163 853036 668162 577069 814717 829173 755430 800524 769730 763483 690922 672317 570079
7152 570079 711569 602670 575782 605430 544956 576014 633526 461451 539690 434125 481246
7141 481246 490779 442299 363102 345831 382491 259339 236431 335543 307395 245344 353068
7130 353068 361619 267698 334465 378738 304650 455276 330145 343888 374171 390052 443402
7119 443402 337760 198834 339106 343006 419739 310826 279163 399120 408405 332216 319614
7108 319614 355552 406794 367183 368418 436033 374295 349936 292962 384984 305301 301598 183887
7096 183887 393095 227388 258121 221075 262420 325309 304043 415753 386941 357404 456193
7085 456193 430584 507113 268473 337459 421586 485522 325417 343241 460609 448784 451331
7074 451331 342855 437121 375584 532457 409654 436401 460051 544024 565585 557430 640377
7063 640377 596684 644202 606955 669700 584032 612281 747345 796053 812817 814601 883688 793127
7051 793127 806908 840119 850126 713514 726657 770265 766867 747953 696589 754208 705074 730719
7039 730719 667041 662240 802094 616500 644415 695859 702585 714105 872089 917818 881424
7028 881424 889184 841677 868139 908671 890605 860993 832933 881624 871904 910794 925298 935049
7016 935049 923396 987402 1031148 928391 939792 954493 1093418 997634 1140454 1101742 1178862
7005 1178862 1115347 1290962 1268883 1269397 1331610 1377127 1451358 1470595 1722424 1673818 1676588 1798786
6993 1798786 1990947 1862704 2060839 2347354 2406221 2649990 2689022 2898430 3032400 3383317
6983 3383317 3523091 3840200 3796684 3894546 3946964 4106542 4353935 4497793 4701823 5170864
6973 5170864 5530981 6165726 6915168 7993359 9173407 10446388 11320739 12112036 12349689
6964 12349689 12041550 11487436 10804554 10246946 9710049 9169741 8767794 8576165 8416933
6955 8416933 8482408 8647402 8895490 9684768 10624830 12072071 13608399 15280531 16788849
6946 16788849 18013994 18700549 18871623 18361061 17442480 16133018 14734961 13208909 11956087
6937 11956087 10890887 10024374 9425409 9073764 8681135 8530200 8715411 9049187 9423557
6928 9423557 10027663 11086482 12046617 12830371 13194463 13072758 12469664 11663800 10668204
6919 10668204 9542214 8634256 7790850 7124757 6364092 6061099 5761949 5514525 5460739
6910 5460739 5441202 5510152 5701593 5855630 6103674 6492630 6553323 6632800 6462746 6281590
6900 6281590 5834824 5555063 5368721 4791862 4509956 4123538 4080783 3835655 3674410 3518421
6890 3518421 3585473 3516533 3604870 3826712 3886700 4045481 4204145 4197913 4835871 5031010 5340379
6879 5340379 5517691 6054880 6223928 6405101 6343981 6183263 6031013 5593181 5006049 4570030
6869 4570030 4133964 3693985 3518819 3116416 2947239 2665967 2498902 2333170 2249456 2131536
6859 2131536 2062289 2051882 2021864 1882287 1815436 1686801 1704564 1769829 1813035 1675557 1778670
6848 1778670 1665981 1810294 1792338 1827246 1756055 1846023 1906757 1832426 1821724 1628664 1605305
6837 1605305 1593031 1384306 1289085 1298502 1244078 1211977 1190876 1128754 1287579 1099596 1208245
6826 1208245 1184921 1161198 1260893 1250304 1278815 1147652 1108603 1229824 1140476 1111309 1025579
6815 1025579 1082906 946619 946640 950126 915686 948457 1020984 986372 959991 834532 868199 898293
6803 898293 907893 911868 819829 895370 892301 937299 916911 836611 889646 877716 813572 770556
6791 770556 740251 863832 872098 903146 833793 832814 793572 912367 847178 822677 825777 797975
6779 797975 798574 847662 884247 810415 829865 804075 727169 733516 792108 802644 823099 826485
6767 826485 730799 784213 799355 722476 830190 919374 770750 774967 857541 1031535 1104323
6756 1104323 1233858 1210521 1302946 1482131 1278581 1303829 1346165 1233120 1292276 1225129 1134133
6745 1134133 1228537 1221923 1176185 1249113 1221617 1256856 1212266 1166829 1095167 1233358 1156148
6734 1156148 1082339 1087823 1104797 1228672 1089002 1091266 1191422 1280941 1157709 1315558 1209311
6723 1209311 1301201 1102890 1241572 1077517 1089609 1161551 1105846 1165532 1111553 1143827 1213430
6712 1213430 1220734 1328372 1408980 1518011 1739945 1918070 2102204 2359115 2388937 2300689
6702 2300689 2214493 2150872 1994405 1835761 1629059 1658313 1688869 1646388 1533001 1410038
6692 1410038 1621653 1562014 1489642 1653798 1838072 1789804 2029960 2078872 2262548 2403598
6682 2403598 2302082 2233244 2178581 2052561 1824490 1692698 1576847 1470699 1332194 1378281
6672 1378281 1330895 1380615 1312512 1375703 1215453 1321070 1350615 1416185 1400425 1541960 1487165
6661 1487165 1510851 1481766 1387642 1456365 1334444 1350431 1259768 1165318 1197821 1165135 1150910
6650 1150910 1088618 1027177 1199724 1136842 1128284 1040298 1241794 1242709 1127311 1280500 1211298
6639 1211298 1256311 1307457 1335004 1380104 1332619 1299758 1394949 1408257 1550961 1457392 1533126
6628 1533126 1664152 1575937 1761461 1656766 1799854 1920088 2026353 1992179 2039740 2032479
6618 2032479 2133303 2257995 2228468 2318757 2360454 2548536 2605191 2741932 2803262 2812359 2832930
6607 2832930 2732919 2787827 2662775 2687162 2685114 2501190 2475546 2594142 2418413 2393177 2433242
6596 2433242 2257509 2224969 2220350 2057529 2145259 2217359 2064769 2144152 2197552 2221765 2337497
6585 2337497 2134671 2310687 2353875 2493038 2539264 2624032 2682947 2724722 2669053 2640456 2889459
6574 2889459 2873999 2796287 2896410 3084622 3251415 3208806 3382354 3438409 3774237 3894209
6564 3894209 4138391 4290642 4754143 5104753 5611334 6273334 6919225 7982919 9112115
6555 9112115 10124181 11248116 11930800 12692360 13357810 14505606 15579194 16465953 16904078
6546 16904078 16811686 16431759 15628818 14368891 13193723 11865555 11096421 10324477 9872871
6537 9872871 9633871 9787186 10101800 10640490 11078669 11401410 11376262 11324245 11170542 11052402
6527 11052402 11069122 11309816 11563177 11672617 11710708 11446077 10751101 9899528 9138259 8601655
6517 8601655 7885949 7207320 6822165 6645126 6404865 6328971 6335759 6636951 6718590 6894323
6507 6894323 7249006 7746919 8462053 9128631 9870974 10335990 10566078 10357680 9838941 9220943
6497 9220943 8573173 7858865 7152738 6599414 6283547 5928472 5678468 5530688 5385961 5198182
6487 5198182 5090782 5015850 5138274 4952665 5152362 5184264 5186187 5172102 5240232 5195186 5303247
6476 5303247 5328056 5494250 5561546 5915938 5986184 6442716 6878648 7336800 7880937 8347407
6466 8347407 8692982 9076396 9047550 8836365 8761192 8298500 8097731 7712904 7573924 7522920
6456 7522920 7352832 7161430 7336097 7514934 7604634 7765480 8232769 8479579 8647462 9054451
6446 9054451 9326403 9654415 9739504 9880601 10084954 10158248 10378629 10535771 10714874 10943963
6436 10943963 11158510 11246387 11261960 11489323 11474861 11473655 11407606 11507994 11391485 11471814 11679817
6425 11679817 11647441 11741408 11897237 12070645 12180488 12382434 12876775 13567336 14466176 15455134
6415 15455134 16588828 17869904 19003041 19765532 20441348 20608214 20983374 20921155 20883324
6406 20883324 20660158 20357145 20157813 19691028 19431961 19475792 19492794 19431427 19691809 20149949
6396 20149949 20789689 21477148 21973039 22417147 22558350 22772796 22617425 22487214 22255150
6387 22255150 21970763 21881895 21745829 21647032 21740617 21966608 21902910 22104760 22403719 22814936
6377 22814936 23348444 23767026 24238068 24897876 25724170 26542814 27613794 28828016 30439734
6368 30439734 32262961 34490838 37240234 40649870 44973100 50402044 57284257 65563487
6360 65563487 74169907 82648008 90203247 96493219 101774271 106439399 111403157 118053187
6352 118053187 127261978 140027305 156962686 177872238 201060523 223550351 241539416
6345 241539416 251823962 253184456 245632773 231022331 211498872 189719365 167824375
6338 167824375 147328938 128845486 112914951 99169190 87922571 78185129 69941833
6331 69941833 62891069 57075873 52177189 47844037 44187965 41230204 38378507 36194455
6323 36194455 34113014 32238119 30719876 29375141 28081859 26793706 25723169 24776073
6315 24776073 24112746 23332928 22629273 21959218 21299785 20830639 20374647 19816797 19313012
6306 19313012 18921723 18586999 18219365 17914587 17642788 17291710 17112540 16983084 16874304
6297 16874304 16619527 16480799 16346164 16204192 16110405 16052481 15844245 15963234 15920967 16022924
6287 16022924 16074375 16270095 16583537 16921646 17404280 17968745 18733630 19718474 21047148
6278 21047148 22127640 23088273 23734937 23986488 24283748 24279499 24303322 24538636 25001675 25518110
6268 25518110 26250026 27025626 27784931 28045756 28342929 28009462 27698798 27363657 26951097
6259 26951097 26881609 26801269 27268760 27879360 28947182 30219212 32050717 34132378 36747489
6250 36747489 40055116 44029607 48817735 54541857 61084122 67917848 74063064 78672062
6242 78672062 81435406 82087616 80868347 78565654 75760744 73076314 71003341 69900417
6234 69900417 69885541 70986049 73343621 76777652 81300987 86902501 93303398 100450453
6226 100450453 107687087 114344885 119813062 123643263 125446305 125573436 124082489 121219030
6218 121219030 117465608 113118790 108143521 102807317 97405908 92445152 87846128 83805797
6210 83805797 80999037 79426412 79391044 80932151 83858654 88011796 92004551 95194256
6202 95194256 96209072 94635052 90855190 85256121 78602429 71596192 64990222 59140282
6194 59140282 54050612 49452570 45501542 42077975 38933885 36195236 33665046 31490478
6186 31490478 29759398 28218121 26847453 25788586 25119790 24434550 23720728 23169415 22656515
6177 22656515 22277362 21802910 21496535 21332804 20987341 20696473 20362126 19844581 19260476
6168 19260476 18722840 18092500 17423137 16749658 16388658 15942275 15647492 15556803 15493491 15519544
6158 15519544 15540527 15575106 15555621 15712892 15766122 15669797 15599383 15495394 15259393 14916796
6148 14916796 14552815 13897593 13359286 12763779 12097328 11628293 10945725 10553577 10094870
6139 10094870 9709261 9523730 9163105 8857616 8694660 8453217 8343052 8272771 7938709 7882413
6129 7882413 7923411 7751252 7574694 7403573 7129106 6788165 6650404 6502450 6358203 6185898
6119 6185898 6024853 6000589 5788312 5864238 5787691 5809956 5644842 5558569 5651478 5695620 5549056
6108 5549056 5576905 5676577 5668103 5543770 5381255 5136302 5142001 5019259 4971772 4878412 4743146
6097 4743146 4804093 4774023 4748832 4781473 4757959 4947206 4966347 5046450 4914733 4875034 4804496
6086 4804496 4682822 4636334 4656539 4470675 4504626 4580194 4610544 4719534 4749631 4866983 4778753
6075 4778753 4951861 4933865 4929723 4926957 5027708 5185620 5355324 5624022 5678281 6010291 6259968
6064 6259968 6170219 6103612 5960120 5845996 5619942 5552798 5639940 5795706 6267839 6783405
6054 6783405 7537824 8166794 8993313 9396715 9445744 9070387 8568104 7920475 7102494 6474455
6044 6474455 5817258 5459549 4931239 4568649 4257654 4105149 4025815 3801497 3747638 3658916
6034 3658916 3567565 3553898 3656983 3660692 3823570 3924565 3929374 4181004 4263071 4337339 4234260
6023 4234260 4183138 4294652 4280477 4338716 4358139 4457148 4809001 5044645 5209268 5380152
6013 5380152 5518506 5511114 5508348 5620273 5768969 5749893 6047886 6229170 6591061 6889265
6003 6889265 7392953 7669526 8037597 8270235 8168154 7909396 7331671 6702047 6185575 5533130
5993 5533130 5001207 4437113 4155910 3874006 3751580 3561250 3485040 3353128 3373260 3204301
5983 3204301 3126319 2945554 2914467 2687715 2459791 2459501 2337413 2255853 2096461 2007068 2131501
5972 2131501 1979521 2002404 1854439 1903951 1826560 1945815 1783916 1826089 1817084 1924532 1935885
5961 1935885 1827409 1870716 1840113 1839981 1760002 1771755 1857017 1760281 1788510 1728567 1779222 1782067
5949 1782067 1796524 1757642 1851139 1968098 2021507 2055262 2048605 2206076 2110453 2161531 2031080
5938 2031080 1976847 1873171 1862382 1964644 1920520 1853862 1812938 1852900 1891027 1858089 1771370
5927 1771370 1824304 1869813 1901137 2003810 1991664 2087545 2024469 2223169 2229625 2361340 2403683
5916 2403683 2438019 2529961 2690227 2769740 2654439 2723464 2793075 2832959 2632736 2461707 2572368
5905 2572368 2473047 2395308 2406592 2405804 2391642 2323921 2550567 2620748 2701286 2801055 3066057
5894 3066057 3061412 3535791 3678499 3827686 3685920 3677827 3660985 3550555 3562342 3473809 3436531
5883 3436531 3487068 3537537 3567681 3727982 3713349 3646692 3591480 3524666 3403112 3387721 3222395
5872 3222395 3199166 3233011 3347315 3130018 3162802 3061760 3205032 3060520 3092026 3262614
5862 3262614 3566215 3776610 4000003 4282689 4220050 4519483 4456353 4269791 4107047 3864664
5852 3864664 3699110 3540767 3477968 3374391 3244520 3276077 3461280 3583864 3818962 3981377
5842 3981377 4253814 4634673 4825977 5097702 5099011 5163886 5153903 5066821 4854253 4658554 4451755
5831 4451755 4208212 3997920 3764421 3842152 3872218 3982934 4049335 4321287 4547456 5011253
5821 5011253 5387975 5733239 6048723 6167407 6207601 6051676 5765197 5405035 5073220 4867258
5811 4867258 4560245 4501341 4238687 4262293 4166850 4204699 4171805 4076142 4179591 4113055 4513954
5800 4513954 4657411 4796315 4901065 5211299 5364899 5299650 5102749 4987363 4828772 4551733
5790 4551733 4351353 4182375 3998328 3920646 3553185 3718914 3655637 3604469 3732649 3813589
5780 3813589 3794772 3820229 3863716 3870190 3890006 3758550 3663003 3644146 3724407 3783414 3705461
5769 3705461 3674554 3614526 3622868 3558969 3529047 3418642 3499456 3370648 3330017 3418529 3475915
5758 3475915 3521254 3490301 3522760 3584798 3690169 3732665 3806103 3804995 3834690 3749653 3642770
5747 3642770 3699095 3692447 3666739 3654026 3794381 3661349 3602242 3701999 3755325 3819859 3852089
5736 3852089 3899143 4043486 4138873 4177577 4165893 4409028 4305566 4390638 4538790 4562181 4586912
5725 4586912 4665787 4840817 4963494 5002905 4940799 5192373 5387827 5498389 5744268 5732591
5715 5732591 5940354 6092679 6437495 6626370 6957740 7262753 7507780 8101255 8698168 9314789
5705 9314789 10214803 11566161 13097514 14807161 16231378 17359503 17756316 17644620 17043900
5696 17043900 16298038 15651124 14952030 14539284 14215220 13936284 14009694 14095284 14521635 14914875
5686 14914875 15491795 16505491 17674974 19316068 21016311 22978766 24656055 26087204
5678 26087204 26720204 26618181 25895950 24628311 22976033 21327583 19949563 18533676 17501147
5669 17501147 16574491 16102180 15791962 15589840 15533575 15645780 16074022 16708378 17628079 18867511
5659 18867511 20082301 20818186 20948149 20538714 19788829 18751089 17734435 16726557 16041189
5650 16041189 15434519 15060653 14839285 14701658 14945788 15159023 15306482 15619237 15724670
5641 15724670 15848738 15867655 15990665 15894040 15834284 15950017 15962047 16066027 16217417 16669990
5631 16669990 16862008 17344397 17642109 18026399 18170303 18285787 18431417 18409715 18509346 18544400
5621 18544400 18630993 18614973 18912288 19186507 19390602 19741396 20044840 20502652 20916784 21368163
5611 21368163 21868971 22275029 22924491 23403795 24133191 24684834 25494032 26313561 27120637
5602 27120637 27976588 28925487 29936461 31103697 32265611 33471223 34607550 35855931
5594 35855931 36983285 38177812 39529398 40803853 42096670 43729227 45579253 47284052
5586 47284052 49242635 51467599 53864929 56378338 58866786 61611221 64706736 67756208
5578 67756208 71243877 75002282 79122273 83406899 88255081 93578581 99399582 105681257
5570 105681257 112649268 120170652 128465308 137554724 147360166 158085132 169160811 180510615
5562 180510615 191207939 200159191 206850518 210875715 212510266 211634975 209313670 205854724
5554 205854724 201823440 197856618 194002181 190622065 187632227 185158694 183339467 182140241
5546 182140241 181356635 181026877 180944503 181078801 181121954 180602488 179225517 176456135 172733855
5537 172733855 167557450 161094504 154085690 146627969 139167429 131898054 125144890 119051919
5529 119051919 113747890 109252417 106099755 103963105 102911243 103075701 103972843 105188682
5521 105188682 105858915 105459894 103539142 100065378 95116047 89368718 83034776 76737179
5513 76737179 70704320 65199640 60330230 55923078 52339185 49034801 46227253 43804787
5505 43804787 41617193 39756177 38031872 36547312 35290989 34213057 33152793 32338334
5497 32338334 31750885 31125348 30785561 30340259 29793465 29126445 28485866 27595365 26716589
5488 26716589 26018616 25428503 24782120 24223552 23825755 23271251 22757234 22315750 21986168
5479 21986168 21584464 21328496 21267250 21022577 20884510 20932383 20787878 20725276 20748020 20656415
5469 20656415 20721587 20961894 21301568 21675157 22365293 23121713 23775598 24262657 24735338 25117249
5459 25117249 25466143 25576061 25817815 26037527 26017377 25785130 25027200 24194273 23317058 22234859
5449 22234859 21299698 20407468 19587352 19080246 18453507 17818040 17498725 17035618 16850325
5440 16850325 16534043 16257480 16150499 16011834 15728523 15605956 15396833 15089254 15004638 14527119
5430 14527119 14180037 13856333 13436578 13046307 12838873 12638676 12513804 12369490 12147779
5421 12147779 12102589 11855054 11765892 11582232 11444869 11432419 11277770 11020916 10662555 10371958
5411 10371958 9951589 9452359 9029651 8621363 8268255 7851953 7682252 7296470 7075190
5402 7075190 7017294 6787342 6737391 6780950 6648252 6575441 6441986 6286876 6159821 6061305
5392 6061305 5978313 5792006 5794710 5674076 5570507 5386215 5148348 5079650 4947354 4807879
5382 4807879 4689261 4513668 4501631 4431619 4383666 4218451 4179439 4150074 4131650 4164640 4116932
5371 4116932 3999252 4095029 4117224 4108038 4310285 4244008 4257554 4214033 4178586 4227274 4319146
5360 4319146 4280819 4369966 4285071 4203259 3994589 3806162 3527604 3408018 3339208 3118140
5350 3118140 2867262 2817274 2778719 2661929 2559247 2420199 2421649 2392437 2316377 2342998 2292893
5339 2292893 2258708 2163101 2054357 2131940 2174220 2035018 2103203 2080154 2164664 2123199 2089018
5328 2089018 2032497 2182972 2148783 1975109 2000742 1928185 1918115 1802718 1723004 1711025 1685692
5317 1685692 1711292 1540279 1494527 1587472 1498732 1559721 1471670 1399333 1309954 1585829 1463655
5306 1463655 1501696 1537802 1494692 1470952 1463896 1528010 1516584 1484177 1384999 1482634 1575448 1504415
5294 1504415 1517489 1403546 1554043 1570466 1543253 1368687 1476200 1359552 1424320 1330551
5284 1330551 1386824 1344811 1418407 1427329 1334326 1423636 1384834 1456950 1535250 1470667 1418367 1472397
5272 1472397 1493994 1382601 1524489 1309252 1285965 1335561 1333957 1405230 1306205 1280864 1209684
5261 1209684 1321998 1318950 1337528 1356759 1250045 1363328 1321390 1439674 1232241 1476120
5251 1476120 1503159 1343100 1418638 1410112 1284258 1203394 1225210 1084415 1158646 1023158 1017102
5240 1017102 1057340 1108211 974645 1012528 1055419 971603 1205019 1091179 1103129 1071188 1189525
5229 1189525 1056868 1125967 1096834 931500 1003640 897895 1008533 869079 980127 819035
5219 819035 777743 873409 835316 921970 829242 807166 856482 863371 969594 945070 882010 891488
5207 891488 918189 944190 1007858 922293 984763 1189439 1133005 1137092 1094991 1234481 1176616
5196 1176616 1230839 1234665 1332043 1488319 1406979 1574023 1630041 1696676 1811504 2028439 2191727
5185 2191727 2470484 2730544 2961510 3276830 3433090 3672919 3827561 4034670 3973370 4048002
5175 4048002 4077591 4067171 4119956 4127154 4176910 4252548 4245985 4149098 4180479 3938671 3585124
5164 3585124 3390888 3192584 2864593 2641806 2442816 2125529 2104594 1903237 1807785 1624518
5154 1624518 1672253 1661032 1589987 1498426 1561745 1515312 1542704 1613206 1575737 1628633 1705917
5143 1705917 1712392 1929447 2013937 2216747 2482168 2732520 2894746 3040740 3246927 3377974
5133 3377974 3487438 3503173 3436333 3320394 3449534 3473529 3527080 3455270 3450267 3356346 3338069
5122 3338069 3154891 2954537 2871078 2537624 2422608 1988230 1941996 1715551 1636893 1572568
5112 1572568 1415847 1154934 1189211 1089546 1057073 957543 984531 976939 957873 946026 931180
5101 931180 1085114 1114254 1116744 1331945 1375627 1587080 1794713 1999233 1965721 1836718 1775361
5090 1775361 1658963 1586825 1313752 1142922 1001570 789158 827248 831770 724245 735200
5080 735200 572637 657003 587057 623576 582597 566131 602667 580757 622009 533476 606975
5069 606975 543492 586975 608463 634375 747301 781526 824230 914388 1064182 1241092 1455502
5058 1455502 1597467 1935084 2107165 1941747 1917739 1887077 1663187 1506957 1333880 1179751
5048 1179751 1067694 1023221 830908 847373 710023 616972 643815 699914 617083 638913 512983
5037 512983 501973 679172 553046 322204 475638 483064 516719 390563 534178 407716
5027 407716 412333 275527 324546 383975 326402 344195 284684 393344 271440 348019 304776
5016 304776 264913 211011 254637 341423 202550 256306 154872 308692 192385 188312 343653
5005 343653 223593 337327 177111 333964 260987 278847 231325 246196 436483 281455
4995 281455 292557 360916 383876 347347 259792 309230 382908 388912 335153 268349 305637 294898
4983 294898 343552 360170 359846 353283 289197 319759 346317 342606 369868 204860 299350 175701
4971 175701 329708 186896 209678 333973 333063 223191 221036 316376 189320 292744 243243
4960 243243 164505 188790 163765 211722 79834 240755 182733 263438 228380 175487 312151
4949 312151 369995 269968 213843 182764 271880 287286 184418 227687 272796 183705 274337
4938 274337 274907 215052 185714 263797 116888 275132 268273 205847 142529 160321 224133 150902
4926 150902 191961 138111 189327 143445 231787 145234 190368 230118 141905 220781 89465
4915 89465 187746 146169 139436 190261 195555 166365 220774 178325 31316 237439 175765 152226
4903 152226 75040 103607 200981 194318 291016 133495 378878 298685 316422 242489 213058
4892 213058 193008 243440 243689 149847 212840 249661 97214 143718 76150 -31636 61881 46502
4880 46502 64977 232672 126828 128956 26467 159216 132203 104617 73465 6024 179018
4869 179018 32838 107169 86115 78380 105411 132744 70900 63584 36469 29854 99748 42284
4857 42284 50678 108664 92296 182419 65995 121939 4543 143909 77682 39762 156286
4846 156286 69458 115624 37883 63099 103686 98929 55447 -20912 127880 209436 38236
4835 38236 121039 146814 150114 51485 63871 39288 79073 66401 179696 243388 154833 37153
4823 37153 190100 246271 229203 262527 173105 164766 174731 348863 295082 309018 227250 292464
4811 292464 272237 303276 161962 196129 230675 286454 253016 197616 308108 328009 244417
4800 244417 254223 267776 256487 220631 321427 361513 457898 302360 315978 349338 461925
4789 461925 438353 365088 392043 458213 393155 406727 385692 371476 372764 490246 477303 484635
4777 484635 422322 515796 414954 519784 498165 484840 411410 465217 417628 364096 388970
4766 388970 372481 287007 332445 363198 289335 275189 325431 325514 291813 228481 291217 354825
4754 354825 375259 154177 270981 283430 199284 270567 237427 219929 235840 372275 275029
4743 275029 255852 156470 334984 233148 268142 261190 232017 245611 273805 252226 222175
4732 222175 228763 315038 355546 289130 155107 174705 255971 236765 221232 154976 331767
4721 331767 135600 253947 342589 336383 245788 324083 395705 462662 329041 203276 271232
4710 271232 308786 256661 213157 264597 302138 297819 285537 288132 324513 200462 285317 297791
4698 297791 290565 260875 350541 350120 228087 235351 227398 309753 237142 351850 202697 404914
4686 404914 260173 327556 335331 268339 298284 344830 385951 403651 258400 195269 257336
4675 257336 260798 337080 221349 300009 342083 406465 228972 268308 337760 293759 337763
4664 337763 263421 281060 261244 349660 368072 305062 258066 339796 358062 374435 332420 236142
4652 236142 356710 392697 241700 456344 326174 421648 352315 323735 291050 343331 304596
4641 304596 297015 211681 353730 382902 315343 380092 335460 320440 217522 258241 287284
4630 287284 288248 354189 267329 453540 332206 423429 417218 332852 376515 413346 445635 361926
4618 361926 462878 327544 427353 339311 386867 447006 404106 439726 408068 418590 263178
4607 263178 472452 430320 362091 357044 407361 419354 395473 444345 515615 516887 398059 387090
4595 387090 479208 383828 440421 424341 323942 365582 330858 393194 365716 306051 308721 397752
4583 397752 326196 342545 378594 277957 258653 369815 486344 346656 501809 273119
4573 273119 365294 403249 517845 323274 244866 408382 335676 477322 266528 363624 412766
4562 412766 340296 357551 324263 385888 401455 386596 313690 390348 280177 349624 390830
4551 390830 376304 422547 334793 285760 335782 312412 299161 384268 244676 346221 303731
4540 303731 365561 347242 259355 316607 298821 201923 231347 369349 435854 297553 310660
4529 310660 308686 455642 333656 313686 302133 414526 360895 337753 368971 290706 245473
4518 245473 362822 275667 231564 243179 288698 379837 301873 356482 425646 366134 319868
4507 319868 341668 436417 421474 358870 332559 305222 484587 352545 269724 267408 379350
4496 379350 434370 385127 364969 361667 359989 345239 328760 412757 361841 384530 353677 415284
4484 415284 491446 483014 379695 419741 458880 523959 468287 482543 442961 481898 529536 453499
4472 453499 426290 528616 493552 493616 439337 359965 461905 527755 591890 406774 601802
4461 601802 620201 514441 575196 538865 631738 652190 562069 592802 620999 551990 514366
4450 514366 592437 677932 632302 738818 625903 593302 696492 749289 706168 685431 726860
4439 726860 754539 805506 824606 861483 845539 890646 927088 833839 780033 874941 858088 887392
4427 887392 857312 942606 911467 900469 934651 936322 1003737 997668 986606 1023067 1124239 1210573
4415 1210573 1097154 1140396 1269168 1360864 1180798 1154033 1213609 1373254 1396764 1385879 1444848
4404 1444848 1503203 1550887 1562674 1735095 1714535 1792188 1883618 1955241 2039501 2143559 2343904
4393 2343904 2374740 2507761 2693625 2971465 3168642 3572194 3923134 4428122 5269757 6231131
4383 6231131 7229431 8133901 8798630 8946430 8628658 8196314 7700604 7032574 6638800 6323371
4373 6323371 6264357 6288411 6275787 6191051 6275783 6261067 6238038 6287442 6633216 7038782 7836715
4362 7836715 8642353 9401570 9781264 9872546 9658054 8996518 8351676 7600688 6937489 6315013
4352 6315013 5980907 5609187 5268722 5184263 4926098 4937249 4886654 4917872 4996166 5157488
4342 5157488 5302873 5609113 5747950 6116770 6386707 6979803 7338201 7793005 8348839 9068897
4332 9068897 9721035 10509301 11142981 11630418 12001420 11806173 11388846 10625523 9904903 8880363
4322 8880363 8020093 7357315 6569745 5993187 5332183 5040004 4739652 4353247 4065000 3843820
4312 3843820 3638545 3420746 3282039 3194127 3049818 2836060 2889009 2743402 2672238 2475995
4302 2475995 2511002 2364052 2287882 2298727 2229019 2164642 2058931 1926081 1937809 1891406 1907599
4291 1907599 1792004 1684751 1737535 1581638 1543231 1542905 1511487 1553969 1448100 1445317 1519667
4280 1519667 1368731 1397293 1318223 1275959 1191811 1210351 1279071 1142893 1082537 1073889 1105988
4269 1105988 1023338 1020412 1022078 1039936 1110836 950830 1075451 925987 1044010 1002160 919482
4258 919482 928829 892079 888180 899342 821363 817894 841052 825223 739646 708546 767083 723012
4246 723012 788900 793413 711006 807983 769490 730446 687087 761259 767958 729295 653925 649318
4234 649318 657841 612741 609411 567455 460276 447958 510640 531672 633477 550833 546892 526724
4222 526724 568369 606898 655483 476656 618204 587894 743740 566318 585412 544244 557333
4211 557333 568334 416886 520495 430866 541016 473662 493339 476316 523767 479136 467830
4200 467830 471866 378100 557818 433940 487179 524273 426731 439616 510356 458985 441481
4189 441481 385576 400891 336969 449885 349952 409739 303768 388504 458022 352923 306151
4178 306151 464656 470803 423032 394865 477830 353780 425975 363091 451293 415361 386675
4167 386675 328950 322646 352580 269090 318089 353051 349319 320456 288196 373999 427899 377885
4155 377885 283333 292026 291420 307326 384092 330343 286974 203260 313097 309761 307034 179447
4143 179447 310819 244480 203971 271684 212271 272153 267028 308927 233504 278541 378813
4132 378813 370635 415400 440967 327427 344348 461937 447654 416047 321025 286990 347405
4121 347405 329862 275638 239087 278204 239953 235214 277560 339421 179948 273954 378849
4110 378849 396954 333359 365466 513181 375146 358950 376470 411369 440154 326156 462080
4099 462080 397745 415452 349555 341986 407089 328448 328336 430606 353066 348278 446752 425425
4087 425425 518129 432020 427753 481368 453863 511420 367731 448276 540464 568634 477991 389886
4075 389886 540319 432429 489011 516615 608603 640054 563197 596564 608741 786532 803855
4064 803855 738605 835300 778175 953153 920423 990635 827578 941871 861744 851864 885266
4053 885266 957542 791284 886328 893544 877560 983445 945281 1036352 1040599 1174063 1174102 1182784
4041 1182784 1261377 1362581 1487797 1397043 1450718 1559045 1714271 1668778 1637617 1686302 1730434
$$ [...]
##END NTUPLES=NMR SPECTRUM
##END=
