##TITLE=abcd
##JCAMPDX= 6.0         $$ Bruker NMR JCAMP-DX V2.0
##DATA TYPE= NMR SPECTRUM
##DATA CLASS= NTUPLES
##ORIGIN= UXNMR, Bruker Analytische Messtechnik GmbH
##OWNER= root
$$ XWIN-NMR		Version 3.5
$$ Mon Mar 16 18:25:46 2026 Russian Standard Time (UT+4h)  servis@DPX200
##.OBSERVE FREQUENCY= 200.131235884673
##.OBSERVE NUCLEUS= ^1H
##.ACQUISITION MODE= SIMULTANEOUS
##.ACQUISITION SCHEME= undefined
##.AVERAGES= 32
##.DIGITISER RES= 18
##SPECTROMETER/DATA SYSTEM= spect
##.PULSE SEQUENCE= zg
##.SOLVENT NAME= CDCl3
##.SHIFT REFERENCE= (INTERNAL, CDCl3, 0, 16.4885)
##AUDIT TRAIL= $$ (NUMBER, WHEN, WHO, WHERE, WHAT)
$$ ##TITLE= Audit trail, XWIN-NMR		Version 3.5
$$ ##JCAMPDX= 5.01
$$ ##ORIGIN= Bruker BioSpin GmbH
$$ ##OWNER= servis
$$ F:\spectra/data/av/nmr/H1/1/pdata/1/auditp.txt
$$ ##AUDIT TRAIL=  $$ (NUMBER, WHEN, WHO, WHERE, WHAT)
(   1,<2026-03-16 18:22:00.68 +0400>,<servis>,<DPX200>,
      <created by zg, POWCHK disabled, PULCHK disabled
       configuration hash MD5:
       00 E9 B6 7A A2 85 ED C7 34 08 36 98 17 FE 4E 26
       data hash MD5: 32K
       8B 91 1C 86 B5 BF 19 7A C3 9C 83 82 79 55 9A A0>)
(   2,<2026-03-16 18:25:10.67 +0400>,<servis>,<DPX200>,
      <Start of raw data processing
       efp BC_mod = 2 LB = 0.05 FT_mod = 6 PKNL = 1 PHC0 = -259.1951 PHC1 = -0.898437 SI = 16K 
       data hash MD5: 16K
       A9 A1 72 CD 65 DE E2 CF EA 8F DA F8 05 B2 18 94>)
(   3,<2026-03-16 18:25:25.90 +0400>,<servis>,<DPX200>,
      <pk PHC0 = 3 PHC1 = 0 
       data hash MD5: 16K
       24 F2 0E 40 2F E6 60 09 46 7F 70 C6 3F 8F FB 5A>)
$$ ##END=
$$ 
$$ hash MD5
$$ 60 C8 21 AE C4 47 12 36 A4 C9 A7 8F 90 77 65 7F
##$RELAX= 
##$RELAX= 
##$RELAX= 
##$RELAX= 
##$RELAX= 
##$RELAX= 
##$RELAX= 
##$RELAX= 
$$ Bruker specific parameters
$$ --------------------------
##$DU= <F:\spectra>
##$EXPNO= 1
##$NAME= <H1>
##$PROCNO= 1
##$TYPE= <nmr>
##$USER= <av>
##$AMP= (0..31)
100 100 100 100 100 100 100 100 100 100 100 100 100 100 100 100 100 100 
100 100 100 100 100 100 100 100 100 100 100 100 100 100 
##$AQSEQ= 0
##$AQ_mod= 1
##$AUNM= <au_zg>
##$AUTOPOS= <>
##$BF1= 200.13
##$BF2= 200.13
##$BF3= 200.13
##$BF4= 200.13
##$BF5= 500.13
##$BF6= 500.13
##$BF7= 500.13
##$BF8= 500.13
##$BYTORDA= 1
##$CFDGTYP= 0
##$CFRGTYP= 5
##$CHEMSTR= <none>
##$CNST= (0..31)
1 1 145 1 1 1 1 1 1 1 1 1 1 1 1 1 1 1 1 1 1 1 1 1 1 1 1 1 1 1 1 1 
##$CPDPRG= <>
##$CPDPRG1= <>
##$CPDPRG2= <>
##$CPDPRG3= <>
##$CPDPRG4= <mlev>
##$CPDPRG5= <mlev>
##$CPDPRG6= <mlev>
##$CPDPRG7= <mlev>
##$CPDPRG8= <mlev>
##$CPDPRGB= <>
##$CPDPRGT= <>
##$D= (0..31)
0 2 0 0 0 0 0 0 0 0.06 0 0 0 0 0 0 0.0002 0 0 0 0 0 0 0 0 0 0 0 0 0 0 
0 
##$DATE= 1773670920
##$DBL= (0..7)
120 120 120 120 120 120 120 120 
##$DBP= (0..7)
150 150 150 150 150 150 150 150 
##$DBP07= 0
##$DBPNAM0= <>
##$DBPNAM1= <>
##$DBPNAM2= <>
##$DBPNAM3= <>
##$DBPNAM4= <>
##$DBPNAM5= <>
##$DBPNAM6= <>
##$DBPNAM7= <>
##$DBPOAL= (0..7)
0.5 0.5 0.5 0.5 0.5 0.5 0.5 0.5 
##$DBPOFFS= (0..7)
0 0 0 0 0 0 0 0 
##$DE= 6
##$DECBNUC= <off>
##$DECIM= 32
$$ [...]
##$SUBNAM4= <"">
##$SUBNAM5= <"">
##$SUBNAM6= <"">
##$SUBNAM7= <"">
##$SUBNAM8= <"">
##$SUBNAM9= <"">
##$SW= 20.6817932712277
##$SWIBOX= (0..15)
0 0 3 0 0 0 0 0 0 0 0 0 0 0 0 0 
##$SW_h= 4139.07284768212
##$TD= 32768
##$TD0= 1
##$TE= 0
##$TE2= 300
##$TE3= 300
##$TEG= 300
##$TL= (0..7)
0 120 120 120 120 120 120 120 
##$TP= (0..7)
150 150 150 150 150 150 150 150 
##$TP07= 0
##$TPNAME0= <>
##$TPNAME1= <>
##$TPNAME2= <>
##$TPNAME3= <>
##$TPNAME4= <>
##$TPNAME5= <>
##$TPNAME6= <>
##$TPNAME7= <>
##$TPOAL= (0..7)
0.5 0.5 0.5 0.5 0.5 0.5 0.5 0.5 
##$TPOFFS= (0..7)
0 0 0 0 0 0 0 0 
##$TUNHIN= 0
##$TUNHOUT= 0
##$TUNXOUT= 0
##$USERA1= <user>
##$USERA2= <user>
##$USERA3= <user>
##$USERA4= <user>
##$USERA5= <user>
##$V9= 5
##$VALIST= <valist>
##$VCLIST= <CCCCCCCCCCCCCCC>
##$VD= 0
##$VDLIST= <DDDDDDDDDDDDDDD>
##$VPLIST= <PPPPPPPPPPPPPPP>
##$VTLIST= <TTTTTTTTTTTTTTT>
##$WBST= 1024
##$WBSW= 30
##$XGAIN= (0..3)
0 0 0 0 
##$XL= 0
##$YL= 0
##$YMAX_a= 471512
##$YMIN_a= -282906
##$ZGOPTNS= <>
##$ZL1= 120
##$ZL2= 120
##$ZL3= 120
##$ZL4= 120
##$ABSF1= 0
##$ABSF2= 0
##$ABSG= 0
##$ABSL= 0
##$ALPHA= 0
##$AQORDER= 0
##$ASSFAC= 0
##$ASSFACI= 0
##$ASSFACX= 0
##$ASSWID= 0
##$AUNMP= <proc_1d>
##$AZFE= 0.1
##$AZFW= 0.1
##$BCFW= 0
##$BC_mod= 2
##$BYTORDP= 0
##$COROFFS= 0
##$CY= 18.4799938201904
##$DATMOD= 1
##$DC= 0
##$DFILT= <>
##$DTYPP= 0
##$F1P= 9.9274215381318
##$F2P= -0.165520771350173
##$FCOR= 1
##$FTSIZE= 16384
##$FT_mod= 6
##$GAMMA= 0
##$GB= 0
##$INTBC= 1
##$INTSCL= 4.127829e-11
##$ISEN= 128
##$LB= 0.05
##$LEV0= 0
##$LPBIN= 0
##$MAXI= 10000
##$MC2= 0
##$MEAN= 0
##$ME_mod= 0
##$MI= 50
##$NCOEF= 0
##$NC_proc= -6
##$NLEV= 6
##$NOISF1= 3.799351
##$NOISF2= 2.8
##$NSP= 0
##$NTH_PI= 0
##$NZP= 0
##$OFFSET= 16.48848
##$PC= 4
##$PHC0= -256.1951
##$PHC1= -0.898437
##$PH_mod= 1
##$PKNL= yes
##$PPARMOD= 0
##$PSCAL= 4
##$PSIGN= 0
##$REVERSE= no
##$SF= 200.130005582386
##$SI= 16384
##$SIGF1= 3
##$SIGF2= 2
##$SINO= 400
##$SIOLD= 16384
##$SREGLST= <1H.CDCl3>
##$SSB= 0
##$STSI= 16384
##$STSR= 0
##$SW_p= 4139.07284768211
##$SYMM= 0
##$S_DEV= 0
##$TDeff= 32768
##$TDoff= 0
##$TI= <>
##$TILT= no
##$TM1= 0
##$TM2= 0
##$TOPLEV= 0
##$USERP1= <user>
##$USERP2= <user>
##$USERP3= <user>
##$USERP4= <user>
##$USERP5= <user>
##$WDW= 1
##$XDIM= 16384
##$YMAX_p= 311185773
##$YMIN_p= -950390
$$ End of Bruker specific parameters
$$ ---------------------------------
##NTUPLES= NMR SPECTRUM
##VAR_NAME=  FREQUENCY,     SPECTRUM/REAL,   SPECTRUM/IMAG
##SYMBOL=    X,             R,               I
##VAR_TYPE=  INDEPENDENT,   DEPENDENT,       DEPENDENT
##VAR_FORM=  AFFN,          ASDF,            ASDF
##VAR_DIM=   16384,         16384,           16384
##UNITS=     HZ,            ARBITRARY UNITS, ARBITRARY UNITS
##FACTOR=    0.252644378177508, 1,           1
##FIRST=     3299.83951724647, 0,            0
##LAST=      -839.233330435636, 0,           0
##MIN=       -839.233330435636, -950390,     0
##MAX=       3299.83951724647, 311185773,    0
$$ Real data points
##PAGE= N=1
##DATA TABLE= (X++(R..R)), XYDATA
$$ [...]
14379 -362890 -455147 -314309 -473451 -244604 -413025 -638139 -642328 -544051 -549970 -350002 -431093
14368 -431093 -450597 -492065 -533509 -509016 -617218 -484835 -632144 -251428 -483588 -597197
14358 -597197 -586369 -676681 -359580 -427582 -359511 -528387 -431172 -463548 -701932 -582766 -435664
14347 -435664 -448373 -453212 -374508 -360233 -421528 -529937 -373860 -501091 -333203 -236712 -496406
14336 -496406 -348925 -505204 -541477 -395364 -554981 -515180 -398577 -402818 -644836 -497464
14326 -497464 -486592 -518865 -477190 -573646 -539947 -372454 -336346 -522387 -475341 -388233 -414715
14315 -414715 -387675 -657328 -358313 -603368 -360928 -415741 -610659 -467195 -414151 -553190
14305 -553190 -494698 -300578 -603626 -546503 -507178 -330670 -598731 -563793 -421078 -476470
14295 -476470 -460584 -463892 -495089 -317532 -428770 -473142 -534112 -591702 -638868 -559712 -404289
14284 -404289 -296462 -488736 -394880 -280391 -542090 -618165 -387903 -637766 -544904 -175960
14274 -175960 -648138 -418296 -464270 -364733 -590791 -544909 -596728 -368811 -592074 -442057
14264 -442057 -381354 -479635 -435995 -540347 -502153 -520784 -579862 -430928 -431049 -537033 -407922
14253 -407922 -546705 -626327 -642017 -472810 -447230 -495723 -456194 -398656 -540748 -491124 -385351
14242 -385351 -380896 -465154 -391426 -350725 -447095 -446345 -479671 -486129 -561242 -351108 -527380 -652376
14230 -652376 -390642 -485928 -522758 -350217 -569955 -599128 -494942 -337157 -442639 -439054
14220 -439054 -414364 -404845 -364062 -386462 -583749 -425829 -717575 -515076 -574713 -387140 -385168
14209 -385168 -670161 -353213 -344323 -420466 -572797 -470320 -502922 -394635 -561300 -436380
14199 -436380 -580174 -454802 -350851 -574791 -618395 -473302 -500603 -570192 -387633 -475626
14189 -475626 -505856 -392815 -250150 -351483 -517879 -657455 -646118 -431772 -576409 -366235
14179 -366235 -543402 -342524 -494964 -568040 -597094 -628099 -392475 -546881 -530121 -614472
14169 -614472 -523513 -378405 -464767 -542586 -369678 -290212 -539808 -432327 -586344 -482096
14159 -482096 -470394 -570292 -357892 -562116 -568024 -423870 -230344 -530095 -552376 -346121
14149 -346121 -617154 -653862 -440000 -510117 -616036 -615037 -400698 -728915 -324948 -421306 -702769
14138 -702769 -446704 -479950 -544222 -523038 -333351 -534662 -516774 -381550 -357003 -659707
14128 -659707 -623491 -622019 -446754 -198729 -371693 -461146 -473457 -565101 -410342 -419973 -353388
14117 -353388 -380769 -420637 -282421 -484383 -433333 -389116 -553044 -375411 -576348 -539232
14107 -539232 -468980 -449476 -477875 -452835 -535839 -539971 -604012 -706933 -489918 -673874 -390824
14096 -390824 -557070 -558040 -300905 -518930 -430221 -534655 -298185 -528716 -544334 -572749 -489625
14085 -489625 -589497 -381968 -590658 -443154 -284720 -475587 -395465 -578674 -594770 -471694
14075 -471694 -582226 -448963 -541415 -405716 -501228 -723803 -560431 -535435 -351716 -429870
14065 -429870 -581636 -350698 -573165 -272637 -513941 -499404 -784057 -439335 -674196 -392853
14055 -392853 -521419 -568101 -394089 -377543 -641405 -378776 -484045 -456882 -564190 -419603
14045 -419603 -458708 -553793 -542765 -554578 -559400 -530207 -636684 -634285 -630508 -448666 -531647 -412301
14033 -412301 -629860 -602489 -493984 -407238 -521467 -570419 -627395 -421977 -462880 -497349 -372804
14022 -372804 -416923 -360004 -462177 -414068 -586893 -492635 -519673 -648868 -462402 -643853
14012 -643853 -544626 -501890 -643074 -438387 -607320 -340606 -507597 -500362 -630687 -414540
14002 -414540 -672260 -493847 -319223 -444223 -509120 -437008 -403090 -492633 -575867 -499151 -592025
13991 -592025 -638396 -378187 -414891 -556863 -470011 -540685 -557564 -668069 -516344 -657755
13981 -657755 -290709 -588521 -488507 -460766 -543316 -665686 -474484 -601173 -372332 -573579
13971 -573579 -435122 -469210 -406870 -564067 -553586 -482261 -352565 -394603 -482667 -415887 -601196
13960 -601196 -488651 -287633 -551562 -511109 -535357 -517781 -432785 -465447 -529058 -502877 -401840
13949 -401840 -404256 -709356 -554995 -477061 -400813 -521781 -320161 -440037 -511778 -582419 -473082
13938 -473082 -380196 -427106 -416615 -500724 -504009 -635021 -460291 -651213 -419229 -428993 -384207
13927 -384207 -461267 -548122 -633108 -527283 -415588 -593103 -544618 -537379 -498146 -578622 -486650
13916 -486650 -361161 -453655 -388622 -466980 -707671 -448488 -564056 -552282 -685058 -581634
13906 -581634 -487622 -396567 -349436 -449003 -487775 -698591 -421157 -486310 -416435 -551570 -388779
13895 -388779 -500412 -526732 -464877 -343598 -347738 -601758 -484519 -464406 -598499 -555709 -498225
13884 -498225 -341608 -554567 -383281 -418387 -615677 -683801 -394220 -448462 -656920 -298873
13874 -298873 -407920 -295583 -313359 -610118 -487757 -451887 -562284 -714082 -383523 -477855
13864 -477855 -515192 -545022 -441718 -424664 -403146 -342514 -490392 -488197 -454849 -504888 -714549
13853 -714549 -631928 -455235 -426685 -393617 -372720 -570373 -344741 -324962 -571319 -446038
13843 -446038 -605660 -720563 -548448 -518748 -645737 -516532 -572199 -579630 -409621 -405290 -414997
13832 -414997 -489781 -614128 -531630 -529996 -525963 -477598 -580725 -463229 -418760 -542165 -389266
13821 -389266 -595809 -575207 -378205 -407851 -483769 -407350 -533458 -482346 -327976 -398520 -663386
13810 -663386 -418462 -593966 -421527 -418645 -447612 -509234 -458857 -466970 -528965 -484925 -415143
13799 -415143 -437898 -340737 -468959 -392002 -611023 -447482 -405961 -226759 -534960 -506343
13789 -506343 -521232 -455544 -520064 -395915 -281907 -517658 -422893 -464153 -590698 -427671
13779 -427671 -335195 -404170 -453434 -610531 -588018 -371036 -399281 -544637 -524974 -446023 -483576
13768 -483576 -503224 -477228 -458886 -447523 -463787 -627499 -523039 -693330 -438262 -515150 -375476
13757 -375476 -536524 -593281 -645913 -478204 -511579 -480056 -531524 -516484 -578395 -727960 -573318
13746 -573318 -452085 -356904 -657202 -569245 -483932 -550497 -313026 -519234 -496084 -335492
13736 -335492 -445132 -521850 -347358 -539900 -534658 -410474 -374406 -385886 -378083 -497329 -443282
13725 -443282 -535316 -489944 -510035 -539058 -507928 -564681 -538261 -437106 -604766 -493835 -681866
13714 -681866 -578089 -540573 -640372 -473449 -490968 -504340 -372726 -505548 -562292 -490337 -323146
13703 -323146 -541570 -407597 -503292 -458049 -400809 -585568 -550365 -616200 -538442 -478204 -585688
13692 -585688 -518014 -721571 -451886 -473231 -670421 -416496 -306881 -426946 -565585 -490105
13682 -490105 -535497 -563790 -561468 -559920 -666009 -301794 -599412 -461107 -587373 -524747 -614464
13671 -614464 -453320 -433302 -558847 -647179 -567986 -459852 -630909 -514799 -589403 -424788
13661 -424788 -522147 -371321 -570504 -503358 -429724 -390916 -517610 -569862 -532423 -634772 -414003
13650 -414003 -373421 -657270 -531462 -677792 -720936 -660784 -563313 -548101 -425684 -326268 -538601
13639 -538601 -571598 -537974 -573611 -351851 -548300 -588768 -536114 -606102 -501476 -500776 -523938
13628 -523938 -489715 -574182 -565627 -445292 -487870 -410849 -556684 -328526 -518719 -537673 -694164
13617 -694164 -530406 -569213 -378032 -464049 -594717 -521216 -616232 -300270 -547726 -709062
13607 -709062 -388724 -454494 -381464 -440790 -613416 -497224 -596100 -578805 -594941 -370553 -580497
13596 -580497 -574700 -386713 -736361 -561399 -505105 -573388 -648727 -571004 -395143 -536882 -517882
13585 -517882 -386021 -500297 -525819 -394306 -262023 -474579 -447340 -617115 -543115 -617681
13575 -617681 -622829 -323978 -559989 -613442 -302859 -446970 -316366 -501325 -514440 -560774
13565 -560774 -588088 -503550 -447934 -756510 -440170 -496299 -541080 -357336 -651033 -581132 -508118
13554 -508118 -516634 -516667 -603804 -550740 -478512 -627745 -507549 -581879 -520303 -406689 -489252 -438707
13542 -438707 -370881 -547236 -571270 -500358 -648142 -216241 -345381 -508684 -230412 -414373
13532 -414373 -452220 -340529 -434264 -411835 -472800 -634409 -403643 -627890 -606297 -388202
13522 -388202 -434632 -520814 -428398 -665034 -451711 -553708 -473396 -542768 -530364 -529568 -482145
13511 -482145 -567058 -360374 -594243 -436262 -405561 -281232 -410707 -375158 -425539 -522819
13501 -522819 -441485 -405402 -452885 -470965 -503237 -451100 -483224 -545652 -635181 -583664 -527091
13490 -527091 -470931 -530460 -563224 -435702 -561124 -347091 -334010 -461041 -651703 -586092
13480 -586092 -478663 -452118 -623720 -427867 -458196 -463173 -533716 -506152 -580380 -567518 -596723
13469 -596723 -678300 -546559 -614956 -585726 -495464 -580381 -493363 -507858 -726714 -693950 -481327
13458 -481327 -432321 -424246 -474250 -481595 -514665 -478737 -280103 -325663 -470439 -515603 -495291
13447 -495291 -512612 -448996 -549118 -368223 -409268 -414029 -501749 -378060 -356443 -381934 -438468
13436 -438468 -543590 -472372 -560251 -389189 -444991 -436436 -635829 -470682 -562927 -505222 -782705
13425 -782705 -536836 -554295 -548782 -587707 -625929 -599548 -546115 -578206 -448063 -615797 -469049
13414 -469049 -426434 -391196 -632538 -399645 -573672 -445279 -567063 -516882 -447861 -347974
13404 -347974 -365253 -643176 -458879 -657877 -487771 -647827 -459412 -443683 -606431 -624903
13394 -624903 -479096 -693255 -294940 -689505 -365578 -389965 -450396 -434698 -597927 -476724
13384 -476724 -405573 -481750 -334304 -502526 -619350 -484081 -646661 -447431 -484735 -482623
13374 -482623 -511740 -484271 -331471 -488310 -623794 -510320 -380277 -699964 -459755 -522011
13364 -522011 -452130 -560496 -501645 -464299 -693478 -389649 -392342 -500556 -401418 -391950 -384549
13353 -384549 -489450 -420398 -668755 -187451 -558325 -521169 -548895 -487255 -546111 -608845 -429873
13342 -429873 -532366 -415589 -461840 -334206 -501673 -496654 -617103 -430624 -590021 -406571
13332 -406571 -403992 -520938 -555950 -488794 -473393 -471531 -658935 -489958 -378349 -562007 -576114
13321 -576114 -422160 -559548 -647795 -519170 -338385 -320500 -424118 -472049 -437374 -591109
13311 -591109 -451597 -381820 -479574 -550578 -710071 -581411 -318241 -362197 -542482 -433756
13301 -433756 -570105 -389080 -449543 -484320 -662118 -601857 -665341 -495202 -711059 -548104
13291 -548104 -468721 -472778 -352992 -274712 -570235 -637365 -567903 -491033 -623602 -543864 -380914
13280 -380914 -464589 -421432 -340007 -490212 -458111 -540520 -521317 -302798 -423133 -485502 -442482
13269 -442482 -420294 -661551 -534416 -477226 -678431 -456152 -252889 -425198 -462616 -478190
13259 -478190 -740819 -475467 -561097 -365298 -448874 -588871 -387092 -565671 -495020 -544045
13249 -544045 -498764 -713754 -604043 -578297 -509481 -586227 -529720 -447658 -363313 -551031 -711145
13238 -711145 -400362 -459108 -528291 -412672 -483214 -391682 -419638 -482179 -449201 -517940 -595138
13227 -595138 -530006 -584018 -337899 -492206 -377516 -351688 -483612 -309044 -487434 -462816
13217 -462816 -499736 -381891 -674492 -464736 -442532 -416129 -440448 -631041 -439662 -586114
13207 -586114 -571395 -515704 -681910 -540927 -533489 -469505 -432150 -573949 -603894 -589646 -398883
13196 -398883 -580661 -452417 -592255 -618627 -377307 -633040 -419796 -625799 -358677 -482847
13186 -482847 -417950 -329440 -502101 -517112 -633399 -624445 -530112 -473109 -512169 -568493 -332149
13175 -332149 -452651 -589075 -585184 -449652 -482037 -529959 -596824 -433235 -466880 -564545 -694490
13164 -694490 -591156 -474010 -525263 -572070 -644347 -419953 -353834 -377502 -325623 -365203 -650647
13153 -650647 -546070 -598794 -296962 -313183 -410458 -452315 -288537 -521207 -603014 -414425
13143 -414425 -582441 -506069 -715400 -422328 -483261 -491709 -466573 -434504 -633569 -361961 -518267
13132 -518267 -584221 -530128 -606735 -657302 -432492 -463929 -474236 -385184 -515697 -670961 -744213
13121 -744213 -634808 -430541 -480470 -530935 -502856 -587175 -725557 -524277 -412908 -379913
13111 -379913 -512649 -572127 -400278 -505932 -470959 -597602 -568120 -345846 -379421 -363945
13101 -363945 -617725 -595372 -498893 -383323 -549743 -422844 -514764 -635254 -486954 -600178
13091 -600178 -528075 -547998 -456640 -520690 -560943 -572185 -414713 -685343 -429869 -492828 -527519
13080 -527519 -561917 -440622 -504109 -538608 -548572 -506085 -606352 -444276 -570618 -383592 -485128
13069 -485128 -430237 -361199 -393974 -632639 -471008 -174541 -532474 -615483 -532261 -459047 -449127
13058 -449127 -473781 -357609 -519614 -531732 -521334 -500557 -414958 -511017 -537504 -277885 -619474
13047 -619474 -437863 -508826 -281140 -495983 -469346 -384924 -499673 -609731 -432447 -454572
13037 -454572 -397466 -584310 -665091 -523639 -419209 -590109 -601349 -591299 -471847 -561492
13027 -561492 -598100 -533059 -590641 -588312 -504776 -537278 -558993 -577500 -416221 -555927 -491030
13016 -491030 -607796 -524867 -423937 -391994 -523026 -587756 -524513 -527919 -402117 -456477 -636751
13005 -636751 -571269 -703370 -505053 -623841 -430189 -384602 -413478 -423200 -295989 -447261
12995 -447261 -615543 -516480 -325785 -494833 -491138 -544364 -415583 -515972 -289658 -491106
12985 -491106 -499563 -572084 -178692 -580518 -687074 -776612 -393350 -487465 -732934 -535872
12975 -535872 -554130 -746518 -464933 -514222 -488717 -406878 -487788 -573918 -522840 -442443 -563476
12964 -563476 -592679 -509926 -520542 -559773 -629057 -512663 -426694 -400828 -751058 -621108 -648087
12953 -648087 -501520 -438205 -315582 -403429 -616577 -527110 -541763 -324144 -571672 -509040
12943 -509040 -644580 -511391 -438706 -445463 -480652 -367475 -525761 -470625 -608850 -625327 -695031
12932 -695031 -384618 -448424 -417057 -624647 -373861 -470523 -332504 -465946 -447002 -539956
12922 -539956 -625609 -582560 -563895 -557099 -546039 -338127 -558108 -612216 -640351 -573136 -347881
12911 -347881 -448793 -575072 -512551 -522486 -442664 -451761 -583183 -387030 -589886 -315373 -479922
12900 -479922 -512962 -447608 -544457 -586788 -508471 -553612 -517638 -571074 -569422 -558743 -501992 -309099
12888 -309099 -476408 -422067 -563992 -572736 -309237 -559242 -592222 -445242 -446001 -705427 -335003
12877 -335003 -535024 -484359 -616665 -416247 -393305 -345243 -596061 -524140 -375615 -596349
12867 -596349 -634947 -392461 -458602 -487018 -577029 -481017 -547380 -407910 -610916 -581102 -503911
12856 -503911 -539712 -432524 -521101 -510479 -357508 -432859 -566495 -316219 -560411 -465866
12846 -465866 -465980 -571436 -584350 -523110 -576495 -558448 -689788 -703558 -483348 -541931 -541442 -537021
12834 -537021 -663511 -455810 -567202 -530972 -499375 -622032 -289800 -505526 -600511 -613554
12824 -613554 -509139 -559385 -496867 -589055 -446971 -534181 -517383 -585117 -440628 -445647 -646578
12813 -646578 -422974 -470696 -522305 -499051 -607489 -541739 -307913 -403431 -470776 -555495 -542204
12802 -542204 -437149 -301776 -585980 -309758 -629130 -455920 -421593 -433541 -646604 -587869
12792 -587869 -304745 -696567 -501163 -565405 -592594 -389878 -563718 -252431 -629338 -592109
12782 -592109 -669645 -606242 -456757 -457459 -489730 -511206 -650946 -558579 -415707 -509401 -663052
12771 -663052 -562319 -571014 -483217 -464627 -600198 -478042 -759152 -323956 -486526 -559640
12761 -559640 -600397 -677365 -627186 -612747 -548473 -441954 -456477 -527447 -612994 -405556 -575670
12750 -575670 -488729 -610521 -549705 -504012 -579027 -351662 -500507 -458743 -512318 -472742 -699385
12739 -699385 -523620 -592200 -606136 -484632 -515125 -521889 -437713 -579494 -466439 -534046 -457300
12728 -457300 -533281 -396572 -609731 -482769 -524034 -635827 -647610 -576362 -524391 -535168 -561245
12717 -561245 -522780 -527633 -463944 -399944 -663904 -548621 -483959 -436734 -473232 -355883 -336581
12706 -336581 -453295 -463279 -357484 -385229 -373773 -372221 -510705 -567224 -608929 -479726 -599817
12695 -599817 -453433 -462685 -437998 -490986 -348656 -536461 -414251 -457128 -361623 -524486 -405020
12684 -405020 -408974 -579808 -505217 -489811 -442786 -592875 -403422 -607568 -470720 -576953
12674 -576953 -515623 -416901 -571662 -731274 -609614 -423703 -631446 -491978 -391123 -343127
12664 -343127 -371944 -690129 -577889 -643198 -635638 -364917 -656054 -408523 -469645 -388253 -527615
12653 -527615 -492242 -383786 -450557 -523734 -624887 -537060 -552018 -425092 -605382 -612382 -507933
12642 -507933 -490331 -385051 -441697 -418568 -313714 -610154 -556908 -528576 -545573 -550017 -411916
12631 -411916 -424562 -534932 -450168 -540655 -518204 -490853 -511769 -653929 -600980 -658669 -562763
12620 -562763 -429402 -633166 -637810 -569973 -495253 -629432 -632930 -689149 -679803 -519381 -378907
12609 -378907 -558503 -473268 -405692 -521045 -466989 -576940 -536263 -542272 -539960 -659864 -537763
12598 -537763 -318876 -706844 -492134 -563126 -445557 -438383 -499634 -599745 -514252 -608306 -569799
12587 -569799 -540518 -410538 -605929 -466139 -471109 -498869 -427460 -582714 -550281 -610376 -555142
12576 -555142 -734637 -379796 -501164 -489608 -427130 -459642 -530120 -450611 -467166 -557902 -391572
12565 -391572 -519122 -542891 -453233 -422541 -557687 -513661 -613733 -466365 -545093 -558186 -657207
12554 -657207 -495552 -477579 -514472 -646228 -403584 -470372 -586462 -578521 -540325 -549931 -503318
12543 -503318 -347121 -465339 -477442 -636099 -516159 -674660 -603842 -486949 -554205 -457798
12533 -457798 -501527 -650094 -425173 -585084 -450837 -642588 -655277 -379676 -597123 -452454
12523 -452454 -648310 -606836 -623335 -723677 -460496 -494698 -477929 -655098 -503286 -553718
12513 -553718 -507168 -537319 -567374 -553936 -453806 -400237 -628417 -543661 -539085 -713240 -512123
12502 -512123 -575173 -543694 -542358 -709282 -543788 -482341 -697909 -486552 -482894 -664352 -632533
12491 -632533 -650295 -430540 -546959 -472221 -583607 -554675 -513520 -536010 -517834 -640092 -655882
12480 -655882 -594121 -570250 -671213 -515673 -583517 -491984 -394212 -513274 -518219 -337387 -486161
12469 -486161 -556329 -608266 -549887 -423110 -612516 -706436 -532138 -792361 -536352 -311699
12459 -311699 -537821 -476897 -635643 -445864 -590447 -388085 -595907 -571448 -651156 -582907
12449 -582907 -525720 -502888 -725709 -470826 -343527 -638829 -548010 -488856 -512565 -327405
12439 -327405 -426158 -512429 -514332 -438010 -390375 -538063 -549076 -619449 -541229 -438284 -528184
12428 -528184 -436462 -476534 -486385 -511115 -500607 -320652 -401008 -491840 -539015 -444440 -429342
12417 -429342 -683964 -502091 -459675 -373448 -579132 -433772 -540940 -248201 -557215 -640877
12407 -640877 -638394 -638688 -369554 -560621 -615639 -562406 -646193 -595154 -479115 -619826 -536607
12396 -536607 -610586 -541456 -387214 -335353 -571305 -483170 -374378 -370000 -431043 -548035 -656229
12385 -656229 -491801 -479730 -694159 -540458 -503266 -481752 -497293 -500433 -630663 -554373 -539473
12374 -539473 -660476 -695442 -531990 -618626 -512496 -393522 -566344 -317066 -564345 -615174
12364 -615174 -636399 -608392 -687654 -535525 -433792 -539806 -462381 -420578 -474684 -587944 -454599
12353 -454599 -510654 -500674 -630400 -504294 -547586 -480229 -545499 -640528 -671066 -428349 -600882
12342 -600882 -489068 -581179 -441451 -545534 -462359 -662367 -684926 -605364 -528841 -670911
12332 -670911 -501054 -533994 -585149 -334277 -543586 -520406 -537827 -474538 -447040 -377176 -569004
12321 -569004 -489134 -577871 -638293 -728580 -576409 -502501 -562907 -522072 -537088 -677148 -553706
12310 -553706 -522853 -652234 -552563 -574991 -470227 -602361 -628393 -573307 -309754 -507312
12300 -507312 -543436 -539404 -446628 -575967 -597594 -570590 -598456 -739822 -492634 -501994 -603870
12289 -603870 -377467 -557643 -697331 -484154 -608118 -471671 -740693 -544413 -540484 -435210
12279 -435210 -560180 -434689 -579835 -368301 -374415 -554322 -469269 -665861 -581694 -504591
12269 -504591 -542454 -554092 -641192 -541943 -604696 -512153 -631077 -532954 -653589 -461334 -543167
12258 -543167 -549891 -530992 -636823 -710224 -600520 -560298 -540233 -684290 -473707 -697430 -342202
12247 -342202 -454201 -456232 -726595 -562108 -635712 -588102 -745379 -264095 -528792 -465358
12237 -465358 -302916 -418788 -553353 -317176 -476450 -444483 -497601 -412784 -531061 -553508
12227 -553508 -388145 -431731 -614196 -479839 -508095 -672019 -644446 -677683 -477427 -622779
12217 -622779 -671291 -390662 -529279 -527558 -501278 -601036 -640119 -575168 -644013 -673842 -421941
12206 -421941 -320380 -613970 -493736 -558601 -570475 -520812 -514104 -581339 -623410 -572845 -598160
12195 -598160 -537993 -487521 -361541 -585092 -623834 -473564 -574029 -630357 -462712 -586417
12185 -586417 -618755 -642645 -485903 -506802 -538207 -515283 -649683 -442351 -700400 -538687
12175 -538687 -627061 -643138 -653264 -452438 -497546 -455917 -457459 -342483 -717939 -700960 -721104
12164 -721104 -509985 -633012 -540802 -504408 -530085 -580775 -501084 -593960 -412064 -478793 -520380
12153 -520380 -578771 -675212 -409431 -820204 -512241 -605836 -348571 -594387 -561993 -560169 -822981
12142 -822981 -627991 -497577 -265566 -461588 -455412 -545174 -409867 -498644 -687605 -387539
12132 -387539 -549402 -440698 -501308 -542256 -382688 -441278 -525305 -483532 -635664 -609046 -514905
12121 -514905 -526739 -718104 -511155 -448457 -589364 -630931 -432708 -487708 -608130 -441351
12111 -441351 -660330 -509412 -471865 -568650 -527423 -608518 -682436 -399973 -600168 -531166 -582905
12100 -582905 -585550 -601100 -519162 -457896 -485350 -542632 -463701 -733628 -510830 -526791 -473625
12089 -473625 -452300 -358993 -544102 -565952 -611872 -597071 -555589 -468480 -461434 -411438 -628698
12078 -628698 -660313 -529754 -525758 -470299 -554348 -507176 -462344 -599274 -455860 -308763 -517414
12067 -517414 -475221 -407487 -737042 -536419 -797490 -540461 -525561 -400044 -483259 -630592
12057 -630592 -389860 -456068 -597542 -426870 -339371 -505564 -491024 -433208 -623970 -576690
12047 -576690 -407557 -416450 -498119 -383978 -453898 -703164 -438615 -477260 -429109 -546571 -351363
12036 -351363 -648934 -734308 -666918 -499976 -500456 -463911 -435958 -377618 -496161 -424110 -419264
12025 -419264 -392924 -470075 -572025 -593214 -540606 -517541 -465697 -339476 -611705 -407282 -598396
12014 -598396 -463303 -386646 -483757 -616059 -616432 -643696 -417494 -361320 -545800 -584273 -634176
12003 -634176 -540757 -539793 -446690 -466525 -554502 -604057 -663013 -521424 -442487 -617446 -493777
11992 -493777 -452718 -573587 -343319 -413001 -629423 -388159 -535386 -544521 -721712 -719206 -455803
11981 -455803 -667828 -503312 -390034 -511007 -574744 -694608 -575601 -600659 -620387 -549252
11971 -549252 -541470 -583239 -626811 -561304 -605784 -670269 -600266 -619567 -695038 -590007 -579943
11960 -579943 -536052 -466006 -580490 -680077 -514030 -592876 -521517 -606989 -639576 -689844 -509186
11949 -509186 -406415 -589764 -411485 -481605 -521826 -640829 -348436 -597338 -545649 -534644
11939 -534644 -575131 -504365 -608759 -387419 -566945 -473519 -558386 -577346 -570135 -580850 -523223
11928 -523223 -627578 -426529 -734087 -586006 -390943 -597949 -544492 -544913 -615541 -522907 -542788
11917 -542788 -520939 -733916 -707100 -369559 -558484 -505160 -393020 -465855 -410447 -532533
11907 -532533 -710188 -459731 -435938 -460839 -541000 -695620 -601111 -575833 -528358 -360477 -574456
11896 -574456 -387025 -476522 -414516 -287652 -483669 -673184 -680768 -496912 -536710 -637310
11886 -637310 -557824 -635973 -437767 -519771 -722129 -589599 -525155 -496787 -541980 -476642 -541957
11875 -541957 -598760 -546178 -576801 -447055 -522604 -497231 -632999 -330764 -580874 -595703 -695242
11864 -695242 -647360 -558810 -782625 -722879 -427140 -468788 -686653 -528155 -682545 -611819
11854 -611819 -547005 -651445 -390304 -435516 -455543 -514697 -474004 -333801 -512855 -398127
11844 -398127 -383176 -663233 -425511 -636600 -381869 -468173 -502568 -465608 -602425 -652447
11834 -652447 -587571 -546491 -650204 -540618 -518617 -539517 -385382 -686043 -699204 -473146
11824 -473146 -527094 -612770 -739524 -650244 -637799 -576692 -656373 -640318 -576428 -342517 -650925
11813 -650925 -623761 -550003 -508586 -381360 -472651 -399999 -499758 -416822 -307274 -377168 -505888
11802 -505888 -499451 -333171 -370356 -458966 -511614 -634660 -667747 -402832 -593017 -573664 -618507
11791 -618507 -555953 -433180 -727833 -651710 -486482 -770914 -689033 -596815 -683757 -514597
11781 -514597 -588094 -561163 -466927 -608599 -476590 -429644 -415617 -625319 -670551 -477367 -470041
11770 -470041 -449455 -507149 -371475 -601130 -567068 -457589 -484142 -500913 -541283 -622386 -512396
11759 -512396 -500408 -474346 -572373 -547776 -533817 -586411 -609586 -398660 -587919 -381604 -374932
11748 -374932 -547631 -438287 -579695 -523215 -555433 -642976 -606264 -437040 -473813 -432625 -467764
11737 -467764 -607006 -532701 -475687 -467201 -615737 -449768 -540893 -513603 -738225 -601035 -525369
11726 -525369 -370394 -491381 -523410 -740802 -548490 -382678 -716174 -567499 -571247 -423285
11716 -423285 -463223 -495836 -723908 -580313 -606725 -372431 -575731 -480360 -550782 -360606
11706 -360606 -676477 -437943 -532629 -515800 -435214 -507339 -438941 -399170 -657324 -625766 -518444
11695 -518444 -432014 -345050 -640183 -397626 -564605 -573317 -667666 -473116 -545312 -734436 -460808
11684 -460808 -674940 -591560 -671494 -528625 -424882 -663576 -509608 -379952 -602858 -568260
11674 -568260 -579383 -718817 -553588 -518453 -641251 -787129 -546676 -641634 -677739 -604500
11664 -604500 -437119 -472710 -562554 -457828 -345651 -551250 -529689 -611667 -510592 -392634
11654 -392634 -502897 -586174 -689125 -609661 -646711 -565660 -702576 -587333 -542084 -516660 -601046
11643 -601046 -651468 -577362 -518662 -565073 -462792 -633457 -619523 -572316 -557664 -560967 -486648
11632 -486648 -574681 -396882 -528746 -675707 -547707 -487604 -665696 -687389 -476235 -433421
11622 -433421 -397150 -759552 -315310 -594283 -478916 -643332 -712068 -645807 -685533 -684394 -563240
11611 -563240 -700212 -499031 -575585 -420465 -608864 -637622 -354045 -481279 -501709 -640700
11601 -640700 -473472 -629410 -614414 -540070 -685640 -691186 -508277 -621230 -628769 -499002 -630231
11590 -630231 -546353 -564779 -501930 -438680 -531602 -620638 -411337 -634043 -592783 -496300 -637302
11579 -637302 -709761 -678253 -624323 -625629 -608484 -658204 -657741 -590270 -536240 -465853 -503664 -467014
11567 -467014 -528934 -622506 -364864 -422802 -603014 -549384 -444482 -594722 -475866 -376065
11557 -376065 -435908 -385258 -395633 -725724 -625617 -538262 -628641 -615880 -498179 -344456 -512186
11546 -512186 -416489 -561783 -475996 -596222 -698919 -649512 -499625 -622546 -470647 -567276
11536 -567276 -683404 -491532 -575793 -798690 -640585 -564449 -517407 -511013 -612168 -468831
11526 -468831 -682159 -421727 -643730 -611434 -679049 -589234 -699659 -596399 -609341 -576928
11516 -576928 -423212 -609636 -553836 -454145 -495337 -430708 -595693 -422474 -593231 -466382
11506 -466382 -678817 -595599 -714764 -592153 -521512 -537259 -563386 -562305 -444658 -595580 -371502
11495 -371502 -543971 -403831 -433137 -613288 -399356 -763029 -719005 -617983 -370105 -647395
11485 -647395 -619004 -556611 -583252 -471177 -488693 -423511 -614890 -758642 -768042 -801623 -653260
11474 -653260 -738261 -508491 -524259 -568200 -638308 -502617 -525111 -566145 -480378 -356621 -616369
11463 -616369 -503677 -644178 -413587 -703171 -576938 -453477 -560665 -469487 -500409 -731778
11453 -731778 -395117 -618981 -317007 -377228 -592976 -420644 -550790 -653802 -492338 -651613
11443 -651613 -622220 -644218 -799199 -657294 -579735 -532367 -498038 -498993 -766085 -489994 -596783
11432 -596783 -516632 -429365 -461413 -551894 -489487 -436654 -615623 -574184 -402037 -530954 -523121
11421 -523121 -595376 -595037 -588314 -601645 -413872 -679205 -580451 -579175 -431987 -586091 -426502
11410 -426502 -381411 -561631 -503560 -361462 -585968 -541677 -491607 -488195 -650060 -643090 -369430
11399 -369430 -741397 -577923 -352922 -602807 -546616 -659730 -629853 -599964 -490594 -580049
11389 -580049 -460313 -521980 -520990 -466611 -460280 -714747 -466634 -535626 -588252 -346296 -652255
11378 -652255 -717334 -544453 -494077 -586839 -448452 -657723 -476609 -634957 -532796 -574119
11368 -574119 -554947 -504707 -634860 -644648 -533637 -506830 -634550 -533119 -357401 -559405
11358 -559405 -440565 -380200 -679386 -464103 -573214 -472840 -498762 -434127 -671995 -506395
11348 -506395 -425378 -605816 -683429 -609665 -546447 -433515 -607701 -517127 -586114 -634386 -524538
11337 -524538 -483676 -553660 -542189 -569029 -696690 -610442 -479161 -488645 -567776 -681594 -546844
11326 -546844 -540750 -616981 -347848 -467560 -529031 -415267 -676258 -437503 -577889 -632462
11316 -632462 -623259 -469460 -478298 -627365 -663174 -713122 -578766 -594777 -505589 -419973 -510232
11305 -510232 -435660 -402080 -632471 -459438 -523960 -510073 -354078 -459873 -368444 -535167
11295 -535167 -613830 -399305 -538383 -456022 -475175 -579396 -547188 -612646 -524198 -483269 -518693
11284 -518693 -607875 -469866 -653939 -588802 -727383 -315903 -593382 -335146 -420940 -680474
11274 -680474 -363520 -400670 -557846 -526624 -478000 -597019 -567039 -478131 -446673 -490277 -454013
11263 -454013 -622594 -474970 -537533 -554860 -537135 -635951 -468938 -562934 -463008 -485352 -637083
11252 -637083 -583267 -682686 -354489 -561939 -427105 -540019 -320081 -386689 -464050 -487893
11242 -487893 -323165 -578976 -453103 -494798 -469038 -535968 -541288 -485710 -615523 -739480 -467725
11231 -467725 -469428 -545290 -504012 -504777 -502650 -416763 -661804 -631946 -505539 -421819 -569322 -762081
11219 -762081 -638613 -670808 -509754 -520493 -567577 -786977 -605366 -515622 -455814 -273755
11209 -273755 -286104 -520703 -476726 -446273 -575817 -674322 -517211 -599381 -527318 -450388 -590955
11198 -590955 -697788 -474578 -571405 -605854 -674101 -421507 -649896 -557215 -401775 -465200
11188 -465200 -582751 -584360 -515043 -583345 -560403 -538808 -618181 -539338 -626646 -494972 -706567
11177 -706567 -442565 -489758 -553472 -427460 -630721 -445374 -627976 -614210 -569068 -673874
11167 -673874 -598280 -614903 -677663 -520416 -771200 -730045 -775674 -499287 -487809 -550145 -616966
11156 -616966 -461297 -417860 -468881 -376658 -484053 -520182 -658384 -506953 -630555 -552885
11146 -552885 -455197 -594177 -530666 -548588 -521348 -476257 -696278 -727673 -542450 -516721 -465843
11135 -465843 -662867 -595555 -580514 -349756 -571401 -632714 -490319 -551818 -501439 -639266
11125 -639266 -510490 -472151 -474927 -714824 -389044 -491959 -745019 -651977 -539576 -710281
11115 -710281 -629261 -623538 -424735 -682803 -530551 -441549 -600911 -391760 -587980 -569527
11105 -569527 -596893 -727982 -429831 -623204 -419423 -641056 -586399 -660654 -491803 -527971
11095 -527971 -405415 -503164 -607549 -390000 -710508 -623072 -616680 -555229 -518078 -576173 -448941
11084 -448941 -646835 -632919 -525324 -576466 -486999 -491667 -442984 -490374 -611637 -451340 -650448
11073 -650448 -638271 -543508 -578568 -713448 -516010 -549111 -429387 -587387 -489638 -629947
11063 -629947 -538742 -492116 -649332 -414077 -370861 -576417 -571646 -416243 -344593 -477197 -661620
11052 -661620 -509246 -626140 -617795 -409638 -415252 -582658 -529831 -498748 -728772 -554071 -327938
11041 -327938 -384207 -492116 -387779 -197947 -372426 -618053 -432753 -469734 -604542 -484491
11031 -484491 -469421 -532102 -519825 -586043 -482393 -453565 -606555 -379091 -475630 -341664 -561094
11020 -561094 -548475 -669090 -714586 -495973 -565944 -704407 -698649 -602076 -509801 -688541 -533333
11009 -533333 -455915 -553399 -653425 -578372 -663775 -503559 -546661 -610681 -590793 -739171 -460493
10998 -460493 -394398 -512247 -540349 -659328 -401563 -450859 -590265 -508821 -430932 -459565 -403200
10987 -403200 -569793 -784671 -592452 -739713 -623106 -622640 -473996 -672687 -373803 -339392
10977 -339392 -613296 -543576 -316906 -323096 -524378 -619513 -459066 -444223 -511550 -538188 -594580
10966 -594580 -681922 -759690 -533581 -551596 -649707 -731674 -505550 -699573 -473321 -526279 -466741
10955 -466741 -497135 -534162 -715414 -373646 -504437 -510256 -326476 -720867 -337600 -547654
10945 -547654 -521859 -657666 -573332 -614840 -602491 -586367 -577312 -608582 -680028 -771662 -583822
10934 -583822 -523291 -621321 -505061 -338096 -425410 -462230 -239144 -673189 -451481 -500134
10924 -500134 -607248 -619556 -505042 -592479 -369868 -594810 -390252 -399712 -603465 -426194
10914 -426194 -532141 -621609 -468976 -671065 -668523 -497663 -497996 -611727 -323957 -663023 -433847
10903 -433847 -522707 -523175 -464371 -540410 -567622 -765268 -506887 -540921 -523368 -591143 -707750
10892 -707750 -606944 -376241 -476774 -422129 -492559 -626007 -520860 -568428 -503650 -644785
10882 -644785 -498064 -497153 -615863 -558074 -521954 -416889 -464941 -534676 -517885 -522587 -576987
10871 -576987 -397398 -651359 -457717 -470073 -384916 -457562 -341633 -457942 -468638 -529186
10861 -529186 -677260 -681092 -632232 -734895 -725336 -757187 -766896 -672409 -747743 -789574 -569701
10850 -569701 -721743 -486150 -652469 -711691 -571419 -678366 -388567 -645674 -299099 -553199
10840 -553199 -384633 -485159 -370183 -380167 -770452 -552309 -711894 -477060 -477284 -478663 -666988
10829 -666988 -484461 -582032 -709754 -394162 -636673 -779817 -699787 -628856 -723546 -574238
10819 -574238 -600017 -453945 -423853 -540724 -421254 -549632 -725367 -472430 -554790 -376594
10809 -376594 -426103 -394354 -352452 -466812 -619744 -320680 -533193 -354569 -477535 -550205
10799 -550205 -403014 -262653 -648733 -464476 -574627 -628792 -690819 -575736 -815972 -755715
10789 -755715 -559598 -595836 -566424 -839346 -711283 -578059 -595202 -578302 -544528 -573366 -521643
10778 -521643 -531514 -366138 -290099 -533127 -459724 -326604 -457395 -327892 -459145 -373284
10768 -373284 -366490 -452517 -524541 -531975 -645038 -501355 -413680 -602226 -548398 -383452 -598883
10757 -598883 -508604 -642064 -450381 -545090 -359802 -433208 -562038 -561867 -725540 -445188 -404186
10746 -404186 -451821 -510985 -553666 -421940 -376457 -447712 -570024 -676693 -623204 -606804 -685768
10735 -685768 -563061 -674948 -499121 -643068 -554986 -448452 -497814 -392505 -565469 -580766
10725 -580766 -303974 -469759 -579025 -695700 -537075 -592128 -494797 -463921 -579183 -467577
10715 -467577 -532518 -561705 -754315 -611505 -507270 -506201 -559465 -640432 -658642 -633637 -429133
10704 -429133 -607294 -549328 -622903 -454975 -498454 -320741 -511921 -440358 -446419 -562458 -557476
10693 -557476 -532646 -489049 -464525 -512154 -617977 -456752 -525867 -665788 -396517 -606784
10683 -606784 -573447 -642174 -619996 -480711 -559942 -470320 -579122 -465984 -662958 -644753 -570990
10672 -570990 -634330 -619448 -544944 -617966 -424781 -665680 -599050 -702489 -682230 -411857 -592501
10661 -592501 -581349 -477097 -354825 -611595 -565582 -372739 -564106 -404394 -564170 -410436
10651 -410436 -536402 -600612 -441243 -341260 -549976 -514056 -694211 -453794 -561325 -536087
10641 -536087 -686190 -484900 -525772 -482102 -588496 -740816 -410452 -515486 -655559 -530017
10631 -530017 -718184 -535084 -698013 -621037 -540043 -443022 -470076 -451007 -397515 -414359 -428836
10620 -428836 -425574 -589983 -589647 -598454 -646959 -524085 -497227 -796025 -432079 -394457 -592425
10609 -592425 -627122 -466414 -595457 -613607 -544436 -394372 -586059 -563957 -465559 -608040
10599 -608040 -494740 -470168 -520275 -485071 -731794 -499041 -495029 -556181 -497991 -554684 -505958
10588 -505958 -620273 -434894 -442448 -592033 -587626 -568692 -530213 -585467 -404631 -518639 -571014
10577 -571014 -631654 -302928 -373101 -425425 -207910 -406516 -537792 -547030 -505891 -338666 -627314
10566 -627314 -730807 -498661 -497250 -543849 -550006 -513940 -423522 -335468 -359049 -568068 -339307
10555 -339307 -469321 -609490 -455014 -574167 -529807 -610265 -458325 -594669 -721419 -645238
10545 -645238 -739676 -463838 -716983 -721484 -655444 -542977 -679283 -545890 -596175 -462062
10535 -462062 -646140 -429999 -488434 -377805 -545510 -332859 -639073 -662236 -461578 -589897
10525 -589897 -570020 -402212 -587613 -433139 -487153 -546281 -602188 -398251 -438880 -449924 -613228
10514 -613228 -617651 -511534 -671976 -620319 -622934 -443159 -741453 -518985 -528617 -368816 -418141
10503 -418141 -411502 -461646 -628202 -505271 -463118 -526869 -567301 -414430 -493809 -489527 -547917
10492 -547917 -582761 -508709 -578353 -586464 -578512 -380654 -397102 -536457 -450729 -539570 -485914
10481 -485914 -535196 -743436 -566247 -649707 -548103 -564253 -479343 -421892 -521055 -592514 -432504
10470 -432504 -557294 -529776 -421038 -566868 -332101 -518093 -614392 -664459 -474180 -649593
10460 -649593 -543222 -393888 -502218 -645136 -552649 -589077 -451222 -400376 -458377 -492308
10450 -492308 -469680 -677601 -719058 -579844 -590237 -563806 -575771 -483658 -514760 -585642 -589783
10439 -589783 -452976 -413433 -448510 -487898 -574641 -621569 -628101 -553671 -651395 -464725 -458056
10428 -458056 -662482 -399258 -714642 -286434 -687594 -465868 -662528 -858980 -651395 -536654
10418 -536654 -407082 -741983 -433395 -646232 -713299 -500714 -560293 -432289 -554066 -451154
10408 -451154 -716259 -478939 -620139 -632241 -526968 -586839 -544538 -518733 -419486 -505150 -506797
10397 -506797 -524177 -761694 -572411 -712097 -630878 -502711 -508675 -642217 -494101 -506987
10387 -506987 -414411 -472988 -511222 -368999 -425113 -575477 -602445 -624106 -680333 -519679 -522594
10376 -522594 -566947 -619580 -518800 -626683 -539091 -623202 -803454 -753667 -377134 -535712
10366 -535712 -665445 -399616 -516138 -693989 -538470 -383476 -599905 -689937 -457730 -499764
10356 -499764 -636143 -571067 -525509 -645040 -596825 -548160 -615901 -619966 -537319 -659402 -541818
10345 -541818 -744280 -808314 -546632 -644428 -547885 -641913 -561480 -633116 -492311 -416626 -602971
10334 -602971 -604200 -721870 -652267 -478067 -527094 -678872 -854438 -772580 -507997 -678761
10324 -678761 -578561 -808027 -372672 -607538 -567132 -807317 -581194 -617776 -650990 -630229
10314 -630229 -700551 -485976 -540855 -691674 -613102 -548061 -653892 -678243 -698754 -369352 -544552
10303 -544552 -412428 -434242 -660178 -674284 -743127 -609262 -729821 -737315 -390055 -414572 -601889
10292 -601889 -457182 -507128 -483864 -490907 -498404 -536309 -675139 -443042 -595153 -689754 -579277
10281 -579277 -349996 -553585 -647790 -613942 -753083 -683395 -521560 -719281 -660348 -878322
10271 -878322 -575399 -651454 -619787 -759925 -679580 -538689 -503272 -554458 -553877 -568404 -435266
10260 -435266 -560481 -635649 -623219 -548227 -784331 -599446 -399151 -536537 -598660 -508468
10250 -508468 -575834 -800699 -589484 -585052 -750526 -503081 -584917 -408172 -539991 -658808
10240 -658808 -505067 -575546 -479355 -620748 -590244 -633708 -392647 -610811 -681423 -631464 -434476
10229 -434476 -663914 -791257 -537366 -585385 -550326 -629436 -324912 -503316 -602516 -672870
10219 -672870 -608746 -551819 -665634 -627072 -580893 -674224 -452968 -790704 -543474 -496064 -520788
10208 -520788 -536327 -578087 -487637 -639306 -693508 -334918 -434269 -589659 -631257 -824884 -463616
10197 -463616 -727766 -843992 -650013 -383193 -599942 -400214 -568131 -598127 -644294 -657673
10187 -657673 -766485 -800204 -454083 -553265 -515015 -755177 -580429 -577743 -641681 -658525 -541567
10176 -541567 -618254 -656774 -590431 -587288 -485110 -786672 -599429 -479535 -574936 -456891 -353815
10165 -353815 -488125 -603402 -578405 -678986 -708634 -695213 -834159 -741705 -597624 -562463
10155 -562463 -569681 -577767 -569717 -668919 -567178 -607772 -735594 -552395 -568443 -645588 -664798
10144 -664798 -629741 -723999 -538897 -774676 -479801 -863664 -702827 -609747 -498562 -565097
10134 -565097 -812676 -692626 -622795 -775030 -714401 -889880 -778206 -432381 -663244 -561922
10124 -561922 -566065 -735300 -406374 -590377 -710616 -591845 -745417 -729348 -782222 -545056
10114 -545056 -679924 -593995 -580344 -656411 -474448 -648993 -397810 -591231 -532325 -607925
10104 -607925 -408139 -495509 -714275 -697336 -519195 -330748 -630409 -524151 -525930 -718380
10094 -718380 -614215 -741412 -742534 -508079 -866818 -698934 -753785 -535684 -586928 -716328
10084 -716328 -631782 -722365 -569938 -699344 -812139 -669406 -527220 -469101 -504500 -402444
10074 -402444 -369952 -524019 -414832 -635956 -711107 -841489 -519846 -739266 -659932 -597751
10064 -597751 -795189 -487659 -668901 -637041 -591274 -569115 -654852 -600007 -589453 -541771 -669139
10053 -669139 -567479 -702410 -480082 -511066 -757248 -705502 -517762 -397931 -631352 -526895
10043 -526895 -543481 -711912 -483706 -515513 -512589 -495548 -562866 -626052 -498017 -540069 -496759
10032 -496759 -457815 -642030 -678556 -575193 -635339 -541975 -651950 -341494 -533312 -592823
10022 -592823 -695842 -770210 -580519 -592366 -481037 -637798 -584600 -576450 -621271 -564617 -513034
10011 -513034 -618362 -567528 -694165 -309603 -512162 -537364 -371155 -428864 -535368 -526448
10001 -526448 -448603 -367110 -310965 -301140 -349571 -436888 -262850 -27407 -224269 -197494 -11266
9990 -11266 17354 -269113 -173480 -240842 -45993 -191873 -406712 -71792 -229747 -285930 -338086
9979 -338086 -344096 -266133 -341243 -392912 -451931 -373952 -438555 -392611 -520736 -437862 -286370
9968 -286370 -355684 -623709 -416645 -298917 -453868 -472430 -464951 -320686 -273163 -259356 -273994
9957 -273994 -208869 -92639 -235346 -194869 -28976 -323923 -100591 184144 4406 10408
9947 10408 107020 25608 373269 165445 517828 834288 1137445 1477180 2140695 3171474
9937 3171474 4454899 5838147 6728832 7326452 7169479 6062011 4941194 3762585 2958767
9928 2958767 2029393 1462693 1069117 638667 594342 309041 -20376 71544 81010 -46922
9918 -46922 124454 -131650 -117670 20636 -212708 -284985 -217210 -216561 -364027 -385995 -342243
9907 -342243 -280753 -399269 -423524 -215762 -288722 -454704 -272272 -419609 -472169 -367745
9897 -367745 -266976 -306406 -338454 -346060 -360183 -347247 -289506 -449427 -163031 -287312 -392429
9886 -392429 -292415 -392697 -266558 -311859 -239687 32250 -253742 -204989 -67627 33826
9876 33826 -69475 178369 -194987 -269216 20558 -117693 1449 -59788 25265 42405 -113344
9865 -113344 158242 197866 106087 266013 514363 352998 489615 654157 671264 1079119
9855 1079119 1488674 1768924 2277214 3169607 4401150 5309183 6118735 5895372 5202474
9846 5202474 4800909 3720589 2976388 2110396 1769004 1558630 1247565 1117831 1223302
9837 1223302 841123 823983 547344 607450 301856 422055 243516 239084 350777 99753
9827 99753 -43295 15249 169844 -5095 172258 138554 -257744 27636 57129 249027
9817 249027 139971 127062 176231 94731 381934 30436 -27518 -101645 -82349 -128320 -259599
9806 -259599 -428061 -132959 -202820 -77988 -236120 -374557 -344554 -214692 -330973 -401081
9796 -401081 -319534 -316306 -284955 -481754 -418205 -454643 -347155 -464167 -170420 -317854 -339120
9785 -339120 -256355 -399563 -332421 -323323 -183515 -251080 -307810 -189057 -432910 -402106 -367850
9774 -367850 -302041 -306382 -177193 -323868 -324361 -412442 -434897 -369301 -492569 -232198 -246417
9763 -246417 -434272 -615655 -595054 -411995 -571789 -361137 -167741 -330480 -229097 -233641
9753 -233641 -339552 -136527 -278935 -365838 -36745 -359297 -405969 -295687 -264062 -353587
9743 -353587 -527128 -313102 -409523 -348651 -494223 -503635 -588178 -540077 -493999 -714763 -429844
9732 -429844 -353255 -274045 -539908 -403920 -440992 -152611 -275146 -290992 -213550 -172594 -159137
9721 -159137 -281756 -188520 -445495 -120633 -178776 -200167 -193646 -214077 -187752 -516800 -328548
9710 -328548 -184141 -316235 -327623 -373632 -208632 -233099 -368601 -455219 -501229 -701493 -579568
9699 -579568 -467819 -467292 -475059 -498493 -672571 -558996 -646698 -641240 -398463 -478868 -530399 -394961
9687 -394961 -520431 -488537 -597150 -497521 -348138 -367191 -336254 -429359 -533173 -393031 -458825
9676 -458825 -532654 -360382 -398802 -452777 -706600 -389752 -611609 -734352 -591874 -650553
9666 -650553 -645714 -568180 -561062 -535721 -672853 -671914 -369112 -721422 -713897 -387367 -625344 -455279
9654 -455279 -493734 -370151 -566220 -419971 -347046 -400066 -517151 -527548 -470194 -425483 -436169
9643 -436169 -341674 -528799 -439213 -238872 -254473 -413621 -440282 -409326 -246672 -528538 -705908
9632 -705908 -340941 -532234 -589006 -458790 -450785 -602765 -523313 -471924 -610524 -420896 -250503
9621 -250503 -515627 -487967 -340448 -595846 -504575 -648823 -640328 -676803 -611475 -604560 -745027
9610 -745027 -507667 -560411 -450620 -589037 -691054 -725569 -513190 -628861 -687388 -431427
9600 -431427 -760544 -676665 -587296 -551648 -713960 -428307 -679770 -559833 -662628 -542104
9590 -542104 -657635 -512838 -847745 -620343 -689700 -584791 -751793 -640773 -950390 -692694
9580 -692694 -695316 -553618 -700013 -747779 -656559 -660429 -542494 -481754 -535513 -821122 -597926
9569 -597926 -570597 -602565 -746231 -643493 -622732 -772195 -698324 -770042 -421920 -462507 -572488
9558 -572488 -542211 -615896 -538482 -516299 -483363 -574084 -506080 -666412 -422963 -581137 -607292
9547 -607292 -617325 -471562 -541736 -564897 -431032 -506141 -347311 -379948 -294574 -489969 -414583
9536 -414583 -93374 -187933 -187481 -274799 -412013 -164764 -298484 -406292 -465532 -245217 -212370
9525 -212370 -25422 -251457 -141013 -45792 -28097 251111 201224 341043 245271 196691 382806
9514 382806 337263 373149 452584 674926 337750 425621 522766 549136 612355 473068 713224
9503 713224 791582 813038 898478 851581 1119374 1159417 1133780 1087902 772677 668829 804818
9492 804818 656351 618173 849223 811854 733248 755583 815613 829721 857002 894154 757452
9481 757452 863557 616206 791670 985660 1217924 1100188 1085153 1034786 999750 1079368
9471 1079368 1100359 1138780 958915 994154 1026759 1046995 828796 813282 614958 626580 866511
9460 866511 630323 806786 760416 758177 733495 663484 678828 719069 792744 832182 757610
9449 757610 868725 760150 940197 836471 926960 983250 1044607 1051087 1102406 1180221 1188496
9438 1188496 1171102 1127075 952706 1081962 1083424 996368 1089306 1148584 1033820 1039900 1043229
9427 1043229 852684 900483 807422 925196 936216 848553 977828 792086 934563 1014107
9417 1014107 1043325 958477 887175 776249 563770 1002312 942927 734053 753953 800959 693173
9406 693173 864926 904430 730525 787855 775557 831271 654217 688671 931747 873644 846038
9395 846038 808735 787195 755342 807238 846606 777597 821332 922832 812163 592091 1201181
9384 1201181 983386 902468 1074132 816181 981640 835882 931795 857173 879172 1090150
9374 1090150 1092461 1182351 990917 1175981 1199482 1379489 1278728 1423171 1636878 1752947
9364 1752947 1628228 1722632 1621632 1942675 1843729 1635547 1741323 1744214 1860046 1968353
9354 1968353 2123545 2371222 2278130 2701578 2607297 2843139 3175267 3236462 3720338 4080248
9344 4080248 4465197 5405938 6638171 8347027 10133664 11024837 11144500 10690109 10003967
9335 10003967 9528748 9361292 9460152 10393102 11124245 11576644 11690342 11754778 11644260 11251482
9325 11251482 10562001 10141288 9842518 9765135 9675072 9701215 9712859 9939337 10169686 10260054
9315 10260054 10296603 10425338 10662868 11426726 12629931 14597666 16492325 17823474 17363508
9306 17363508 16362538 15103213 14759770 15392973 16707266 17716767 16928010 15195454 12732114
9297 12732114 10682786 9197359 8074113 7498647 6974107 6719196 6627781 6740763 6589455
9288 6589455 6196087 6085441 5916656 5867040 5780380 5706275 5713912 5625399 5871156 5852867 5902344
9277 5902344 6105376 6263537 6215580 6530180 6396917 6435689 6295153 6610926 6505722 6684153
9267 6684153 6819288 6955805 7145365 7168225 7341165 7562124 7643367 7804433 7942565 8414317
9257 8414317 8523205 8746219 8644474 9004556 9006353 9313543 9252635 9642178 9969908 10402512
9247 10402512 10621461 11067622 11472613 11690126 11463163 11946380 12044111 12114474 12545714 12891077
9237 12891077 13031661 13277797 13878685 14477055 14986432 15504848 16394050 17099411 17606699
9228 17606699 18497115 19189129 19850053 20639210 21100094 21842632 22594040 23122854 24218710
9219 24218710 25554713 27213188 29006821 31303105 33528165 35664366 37678077 39719858
9211 39719858 41287828 43077303 44653920 46392433 47705703 49451648 51362047 53902289
9203 53902289 57450676 61739788 66140608 70204137 72702125 74000881 74849166 75603818
9195 75603818 76945921 78656754 81225470 85302099 91731610 100169843 111054018 123311834
9187 123311834 134608445 142802861 148024784 153588955 161807211 171842819 180701216 187224507
9179 187224507 192357261 198061865 206216311 216225521 226461239 233630938 235973992 236819572
9171 236819572 239989799 243733287 244658501 240998287 233472634 225226991 219987084 219316469
9163 219316469 222549375 230807115 245453279 265668872 286458133 302106781 310196801
9156 310196801 311185773 302944250 285304203 262166402 240921417 225172055 214222461
9149 214222461 206098179 200513228 196551207 194468809 193140304 191180078 190434176 193311177
9141 193311177 200190072 207654801 211673654 211090760 209791515 210503791 214362089 222369714
9133 222369714 234170337 246738768 257688313 264847100 269977918 272945372 271302649 264632935
9125 264632935 254241335 242208924 229210525 217818186 207437090 198948485 190179788
9118 190179788 179126172 165475569 152691328 141896880 133643117 127744167 123804310
9111 123804310 121242670 118817112 115209541 111852304 109057452 107252642 105865778 103921173
9103 103921173 101047945 97400176 93144871 88021305 82855611 78372726 75260928 73306207
9095 73306207 72429080 71200022 70180411 70437053 72364159 75496429 82119067 93697683
9087 93697683 107794847 120427874 116774301 98671356 81464602 69378445 60231530
9080 60231530 53202619 48348522 45889426 43672896 42369950 41372501 40598174 39488591
9072 39488591 38375075 37746387 37032753 36879603 36294682 35295572 33673272 32017606 30097428
9063 30097428 28372986 26859679 25801649 24792808 24063906 23139740 22489631 21758109 20946083
9054 20946083 20249685 20017057 19526318 19346986 18718578 18128248 17764752 16826471 16113191
9045 16113191 15424063 14705874 14108397 13955617 13482240 13511567 13331245 13320161 12961966 12843409
9035 12843409 12435799 12010765 11772954 11142518 10745785 10312965 10014590 9490256 9146603
9026 9146603 8418330 7836276 7734265 7367319 6991302 7088203 6941519 6815926 6566790 6514157
9016 6514157 6417733 6277955 6128845 6078207 5890717 5670563 5583864 5709606 5845502 5602852
9006 5602852 5800653 5865870 5705031 5843662 5878131 5986281 6405636 6962118 7422890 7982036
8996 7982036 8295760 8779730 8389556 8062120 7576042 7088539 6863966 6778797 6805900 6978250
8986 6978250 7181231 7344347 7368199 7294252 6939591 6712780 6679159 6349814 6323439 6196773
8976 6196773 5902253 5605621 5561772 5147035 5096603 4956681 5043126 5035107 5297703 5780944
8966 5780944 6021722 5879868 5575176 5430106 5273286 5102865 5083011 5053630 4968978 4905046
8956 4905046 4430458 4033697 3713440 3502625 2956827 3014131 2787157 2678492 2676272 2436792
8946 2436792 2402279 2561131 2266100 2360569 2417141 2012303 2181424 1989841 2177296 2165198
8936 2165198 1860727 1887578 1898927 1865744 1980343 1686664 1971253 1835155 1787278 1701472
8926 1701472 1749193 1926280 1611494 1723919 1635539 1639726 1686085 1478358 1375954 1683556
8916 1683556 1481742 1526015 1342962 1323243 1418128 1380950 1375260 1291219 1443948 1293199 1339606
8905 1339606 1407712 1342862 1184004 1371534 1392012 1524547 1539955 1409326 1338902 1514261
8895 1514261 1419297 1469307 1329316 1358906 1545580 1415859 1557940 1712619 1583837 1736936
8885 1736936 1812978 1607302 1856320 1671941 1757979 1711801 1572696 1790005 1703639 1646378
8875 1646378 1592349 1581905 1784902 1686870 1715969 1676206 1793539 1697905 1754355 1821218 1813275
8864 1813275 1723474 1829458 1790543 1912774 1951813 1688201 1715975 1849676 1761695 1825851 1935425
8853 1935425 1809969 1810412 1833443 1859474 1830499 1890942 1791534 1755620 1740219 1756769 1681919 1777115
8841 1777115 1789678 1808850 1984845 1907701 1838346 1826920 2054968 1946929 1998841 1672887 1773046
8830 1773046 1733208 1836676 1826537 1863334 1781577 1574528 1618925 1525978 1647183 1686446 1644786
8819 1644786 1721062 1680592 1861869 1600143 1590722 1611021 1476418 1518237 1376884 1290587 1453475
8808 1453475 1551426 1348931 1388658 1470973 1534750 1529847 1479764 1411323 1373608 1200068 1298904
8797 1298904 1414414 1177754 1185576 1167854 952593 1202063 990063 1154194 1261897 1117737
8787 1117737 1044197 1039495 1248450 1393418 1026711 1062075 930514 964575 923470 1026820 891533
8776 891533 949818 1119732 845932 838787 806538 859116 713227 746924 611854 446937 707841
8765 707841 931475 786696 588666 857670 692247 775043 830001 694736 549807 634352
8755 634352 613520 644819 644187 642015 572590 747784 588483 685434 388199 508636 465603
8744 465603 329582 404710 453407 380831 451226 635121 570710 643114 346309 576469 338911
8733 338911 482024 490299 537528 357590 531081 485130 489747 521683 448949 263148 225300
8722 225300 472755 412872 478328 176636 279675 182440 255100 201147 155661 99660 359024
8711 359024 465601 335176 180612 285211 345089 411727 257967 469561 173731 289284
8701 289284 406155 118513 230347 237334 268137 -94262 57762 258197 285478 166929
8691 166929 317890 379907 346434 302670 276282 328738 248328 339722 268159 402351 308740
8680 308740 376943 394311 173907 331521 165635 250456 220143 178565 440855 503912 512596
8669 512596 575614 331071 312130 455965 133564 306158 327723 159467 248034 101190
8659 101190 214737 220384 159724 284511 38431 133061 94561 82645 357127 156560 549474
8648 549474 140653 517244 323543 350525 152040 385407 254428 155830 173018 112823
8638 112823 137540 186090 135344 343644 251568 128720 44422 178952 169893 407689 193073
8627 193073 189013 46220 186181 99268 -31275 59334 174097 129052 126688 101664 -16323
8616 -16323 157523 -52365 277560 118629 193168 -64578 -34726 -96450 223871 51749
8606 51749 46110 104461 193924 91328 11536 203572 102759 175998 105609 133875 146056
8595 146056 -18612 147686 2329 17939 -55987 -134858 -139030 124489 20503 56633 -40517
8584 -40517 58166 -82709 151525 40441 -94407 -22907 -23962 3908 -1889 -11994 -139433
8573 -139433 -1255 57346 22501 -7898 -103131 98119 58180 204113 199974 -49017 43454
8562 43454 -45971 -3449 -57383 97613 6028 -69842 27413 19239 51383 170170 237155 22678
8550 22678 173502 -57685 193005 109170 83965 -243 -40594 12978 66226 40886 47822
8539 47822 -87105 225891 -16527 252473 -128543 3623 -103053 52945 46418 -179537
8529 -179537 212049 -17137 133393 -60358 -61953 89343 103121 50658 -125434 -120600 9160
8518 9160 -95581 -76667 -46627 -1733 6802 -75008 -70274 -110631 182426 -87222 -106751 43326
8506 43326 -9057 -175596 -166439 -3240 -126096 -77921 -123106 139119 -137465 -84365 78558
8495 78558 -243420 -25150 34195 -142898 2542 2030 144067 51032 -63177 53547 183672
8484 183672 -51301 151348 -51873 10990 68674 -82662 64409 95901 -161740 22106
8474 22106 162697 -64899 -97079 -121574 35397 -8847 -128423 -92669 45149 -192354 59337
8463 59337 -96792 -52985 -144903 -65975 -33425 -62418 -150868 92266 -95705 -80045 87283
8452 87283 30272 165385 -78221 -75867 19841 -166049 12871 -69482 -140564 -107868 -195515
8441 -195515 113007 126567 -99901 23077 102550 113415 -83118 -712 -244608 -65475
8431 -65475 -228524 -32677 104421 15103 -153800 -68859 15566 -91314 -140405 -85772 112604
8420 112604 -74179 -107596 -187491 2138 -115935 64374 167146 -33299 1044 -59280
8410 -59280 -143924 -130022 5348 5299 81681 40163 -165347 116836 -84641 -175704 19853
8399 19853 -63732 -1290 -106501 -29981 -35207 -57336 -1049 -154022 -282390 -110638 -69079
8388 -69079 -101476 -306456 -157520 -256945 -54989 -187684 -188102 -113776 -127676 -156474 -294260
8377 -294260 3490 -92311 -145498 -38810 113472 -121807 -141305 -31977 171257 -69957
8367 -69957 1459 -109070 17985 -128828 -79385 -34418 5408 -118764 -108208 -38999 -123709
8356 -123709 -41012 -30932 -1400 -126610 105429 -168924 -173799 -26852 -174445 -277014 -331518
8345 -331518 -376703 -167307 -233858 -293885 -299950 -328296 -318925 -205016 -106918 -154502 9877
8334 9877 -31231 -149502 24128 -83451 -26078 86407 13023 -141513 19660 -128622 -123863
8323 -123863 -155091 -92520 -163369 -62195 -13464 -96162 -66147 -133905 -3563 -167893 -12705
8312 -12705 -121665 -118 -131110 -193705 -61417 -28062 -74973 45871 -63161 -114877 -250094
8301 -250094 -119097 -89556 -212906 -55683 25729 -177886 -168998 19650 -73668 -15489 -317630
8290 -317630 -42235 -166672 2224 3496 -159757 82664 115768 -148459 -272439 -347299
8280 -347299 -117355 -139776 -331990 -120133 -267545 -217979 -156376 -62556 -347361 -97903
8270 -97903 -82129 -162942 -150895 -64344 -94352 -120704 -146476 -86806 -125112 48123 -60631
8259 -60631 -159920 10500 -118817 -70554 -71304 -86298 -130057 -255421 -51719 -10299 -95602
8248 -95602 59341 -182366 -257752 -155683 -84178 -83899 -33556 -9497 -224377 -82779 -181543
8237 -181543 16459 -225281 -189608 -209958 -195782 -132882 -52163 -122864 -127214 -248650 -97078
8226 -97078 -301479 119367 -43504 56146 -240805 56446 -236018 -135635 -213945 -44753
8216 -44753 -199720 -138530 -147451 -199641 -88971 -162216 -124742 -206377 -117314 -213004 -102579
8205 -102579 -256560 -56196 -374510 -79528 -131703 -279940 -81574 -69640 -268682 -52028
8195 -52028 -226409 -233808 -227722 1991007 -241506 -68635 2093 -343199 -306145 -128074 -118640
8184 -118640 -274399 59755 -80245 126721 54743 90540 53978 -127813 -98430 -99196 -7404
8173 -7404 -136527 -49806 -38216 -3546 -136550 -85731 3433 -185003 -130815 -76563 -162878
8162 -162878 -252962 -82021 -103152 -244109 -364077 -172574 -230285 -303634 -211029 -246325 -105354
8151 -105354 -99837 -355416 -201286 -241674 -199205 162041 -283918 -17415 -371186 -196325
8141 -196325 13343 -33226 -91105 -58445 -48594 -116468 -145212 -252071 18540 32312 -194015
8130 -194015 -260496 -228462 -16868 -184985 -37129 -364328 45342 -322296 -127241 -379262
8120 -379262 -57140 -164161 -85891 -153439 -125747 -204308 -190464 -145473 -108460 -228079 -172568
8109 -172568 -176521 61123 35039 -225895 -424703 -130669 -317574 -62498 -144595 18309
8099 18309 -281982 -33756 -182899 -197471 -131174 -245659 -89811 -78345 -293456 -127514
8089 -127514 -264020 -300720 -223859 -277513 -364041 -213759 -239256 -27726 -244384 -253683 -91190
8078 -91190 -55097 31908 -95730 -128623 -19109 -142228 -180142 -98485 126199 -137403 49404
8067 49404 -746 -140399 36651 -100824 -205530 -172894 -156529 -92214 -46191 -177719 -73288
8056 -73288 43550 -169901 -216368 -211233 -388749 -245053 -255185 -102772 -247690 -225915 -201457
8045 -201457 -297860 -156791 -291925 -260066 -231114 -171394 -226694 -106916 -157480 -115732 -145586
8034 -145586 -304946 -226761 -227751 -297700 -86091 -206453 -302870 -70377 -11487 -21095 -155501
8023 -155501 -75852 -361 -125770 -74809 45110 -121102 -196242 6113 -31068 -171827 -178181
8012 -178181 -137419 -113954 -136062 32826 14234 13381 -189647 45199 6430 -178957 -151611
8001 -151611 -118769 -195955 -171792 -228003 -339246 -282013 -29152 -497525 -133301 18430 -202750
7990 -202750 -120707 -220210 -98630 -59269 -132685 -319912 -129059 -235550 -55303 -151802 -148138
7979 -148138 -152252 -74862 -52510 -128708 -133038 -82471 83814 -36711 -95697 95319 -44815
7968 -44815 -28313 1897 -262049 -55535 -186610 -223350 -274413 9170 -165659 -40336 -69500
7957 -69500 81519 -31278 -111593 -282293 -228046 -72405 -255927 -111285 -114565 -173986 -284539
7946 -284539 -73485 -166894 -96657 -230296 -21717 -185065 -27439 -253493 -181899 42534
7936 42534 -38533 -187243 -51158 -128431 -53561 74728 -30272 -124265 -102261 -32517 -70665
7925 -70665 14483 10462 -103643 -170070 167584 36103 54668 130273 304671 242990 316338
7914 316338 399683 531246 330346 350326 379523 41193 44203 176211 218430 213573 179995
7903 179995 81591 132232 -73756 -172381 95895 -130095 -195983 -49653 -135146 -96156 -26253
7892 -26253 -137030 -145651 96083 62146 21230 -154062 -65656 -62727 202511 69500 -38150
7881 -38150 -125296 -5414 120337 -72645 200060 168329 451515 108957 99902 2082 165412
7870 165412 238005 27423 154980 136712 37332 261247 227864 249740 -86786 3570 -164374
7859 -164374 45152 142069 73015 -47623 787759 286616 -178902 -380806 -357832 -100230
7849 -100230 -229967 -83529 -86223 -226579 -205029 -284145 -249690 -158732 -12356 -59808 -233643
7838 -233643 -232891 19973 -245148 -58714 -164201 -264711 -271281 -140167 -112876 -164580 -139899
7827 -139899 31615 -105381 -371141 -48379 -126259 -234444 -196905 -134901 -333900 -121407
7817 -121407 -317927 -237410 -157817 24696 -133129 -56459 -333706 -220036 -224268 -183224 -158025
7806 -158025 -220290 -489472 -232439 -26768 -98259 -164922 -246944 -174630 -90314 -160400 -226687
7795 -226687 -71960 -99613 -357506 989 -65626 -84239 -277002 -146071 -11071 -104452
7785 -104452 -141024 -106405 -156785 -181225 -147333 -254067 -293487 -208491 -276626 -194657 -260249
7774 -260249 -145608 -6780 -121450 -289455 -15009 49468 -157074 -187314 -266569 -95685
7764 -95685 13302 -215731 88090 25819 -84768 -67681 -220799 -108514 -32800 -109270 -226485
7753 -226485 -103084 -87611 -126746 -71974 -388660 -203043 -177363 -124493 -158375 -7173 199192
7742 199192 -100627 -64503 -37066 -185897 -243175 -106935 -223700 -112320 -85163 -198289
7732 -198289 -82102 -31204 -218632 -151004 -295323 -257867 -32625 -165072 252835 -223241
7722 -223241 -296128 -128675 -84742 -57517 -306977 -160297 -119000 60597 -138258 -326404
7712 -326404 -39614 -52497 -255266 -89547 39183 -150842 -182566 97505 -357382 21757
7702 21757 -144704 -93009 -47240 -84669 -128419 -158646 19341 -171051 -106476 -82158 -53697
7691 -53697 67772 -188506 -41286 51068 21417 -206171 -275386 -147596 -78487 -32924 -50799
7680 -50799 -5704 -136819 -220101 -125124 -121081 -121413 -34279 67658 -35650 -102482 -193831 -33340
7668 -33340 112768 -209710 -187693 93360 -145112 72831 6720 191815 101165 82501 233439
7657 233439 -30342 2319 -25120 -109857 53216 235849 58567 14720 172486 289973
7647 289973 214682 174613 194884 309550 323573 86661 252036 240928 273001 356117 293666
7636 293666 450772 493564 607638 513659 627201 612899 691990 768442 696696 734184 780605
7625 780605 672098 667860 783338 945231 972056 1053061 1037270 1022843 1041733 1231281 1134927
7614 1134927 1412072 1521780 1709028 2041897 2128339 2586050 2819813 3449354 3921655 4570284
7604 4570284 6197837 8761199 12220713 16565932 20031344 22607992 23134102 20864721
7596 20864721 17392726 13722765 10734643 7968855 6066109 4959735 3863151 3444696
7588 3444696 3101058 2932183 2808477 2362638 2155120 1688655 1319273 1292965 977377 1039955
7578 1039955 620293 956265 810615 727743 800902 840022 576867 577359 540438 393505 474423
7567 474423 285970 371940 241317 396785 292052 347954 250258 370252 171842 299267
7557 299267 266215 400250 283298 174404 190866 256802 218261 80948 2723 271996 23334
7546 23334 132048 118417 96874 -660 87677 216985 75193 86060 57419 81540 -144915
7535 -144915 -123896 27761 -127261 -95041 -101591 82718 46048 -182885 -68386 -35603 161822
7524 161822 117102 -13431 -90394 130856 -133649 -111040 31440 -8428 439 81652 134535
7513 134535 -28148 49918 -76642 24039 14044 -74838 -63266 108495 -136523 -146410 -204330
7502 -204330 314375 -32498 -26892 -31837 20823 -155662 -59071 -9581 -28522 -55656 158494
7491 158494 292905 -76034 -129883 15325 32563 59547 78750 -43335 -35928 -208116 49152
7480 49152 8364 -62889 -164076 -194107 25457 -212325 -20125 79098 36984 -19288 136832
7469 136832 226592 -142086 12048 27441 210776 50992 17092 12466 -92131 -55505 -73472
7458 -73472 -193307 -43844 -33689 -86033 -285641 -205265 -153658 -91991 -100731 -25221 -84286
7447 -84286 -84138 59035 -92462 97560 54326 -60693 -11853 -112958 -73679 110395 197690
7436 197690 49344 7661 -106847 -136592 -105189 -164849 37050 -140986 40288 -92909
7426 -92909 -166760 161782 -166832 -77183 -217641 81696 76792 194311 32656 21463 20148
7415 20148 179709 44791 -96557 15830 85393 -117615 -47204 170355 -40891 43691
7405 43691 39199 -11697 57094 65851 43500 134007 150158 137236 46497 57517 67851 -38568
7393 -38568 82075 -53512 60806 98962 39596 5406 6913 212548 11802 135659 324226
7382 324226 329100 207067 233372 292613 162612 136814 314928 290729 294547 236954 383316
7371 383316 386203 321014 231898 275545 577780 587584 525997 496104 595289 556816 593319 613898
7359 613898 592790 657429 879954 912393 1111138 1060591 1229516 1177960 1404171 1472534 1731245
7348 1731245 1816277 2436145 2651715 3212320 3236190 3483750 3459282 3547303 3464925 3959676
7338 3959676 4746238 6008434 7888329 11203040 15127295 19683008 23483786 25701781
7330 25701781 25425238 22823999 18995817 15066348 11479692 8586140 6570448 4827536
7322 4827536 3841439 2969843 2532511 2179436 1764334 1683253 1494025 1300922 1214297 1034002
7312 1034002 1071327 948103 815778 794900 699577 901127 802373 732535 797822 558111 649461
7301 649461 532653 455237 779989 569383 470913 553753 596670 489847 519732 281599 405970
7290 405970 395296 262241 271992 301189 545899 219505 250802 343368 209339 290275 407828
7279 407828 469093 313442 265567 426095 453632 422477 500355 446993 263650 608564 719245
7268 719245 560131 735948 588497 557892 713862 617412 736273 710017 644011 872424
7258 872424 771923 560395 747614 688785 836975 683993 881852 802956 764990 784366
7248 784366 906487 1037947 917235 920295 744461 993614 952236 821311 861489 845954 782833
7237 782833 821934 828334 768911 938170 880074 959891 1164710 1008796 1134437 1212445 1432640
7226 1432640 1448285 1653306 1729645 1838589 1870350 2246034 2414107 2842309 2916861 3502551
7216 3502551 4209152 5491418 7271709 10030626 13367805 16458602 19018379 19678189 18413219
7207 18413219 16000405 13027887 10291409 7955990 6138764 5072194 4018012 3249708
7199 3249708 2950197 2458353 2646233 2419526 2437351 2755681 2762545 2778088 2936415 2735169
7189 2735169 2671055 2357033 2212702 1999799 1954846 2137924 1956400 2234235 2031180 2133247
7179 2133247 2335995 2265898 2464423 2861411 3066547 3323094 3504788 4053303 4608061 5272859
7169 5272859 6351266 7661581 9508197 11412610 13442301 15031941 16223670 16621113
7161 16621113 16387803 15250406 13917895 12284009 10561130 8968838 7630446 6293563
7153 6293563 5226163 4686928 3925586 3629877 3033443 2882295 2752266 2594061 2644607 2531263
7143 2531263 2370818 2473674 2653204 2643711 3083362 3142177 3688626 3660048 3555551 3538774
7133 3538774 3319148 2884587 2779295 2481663 2083923 1934885 1587365 1727581 1493268 1532646
7123 1532646 1269053 1152048 1463306 1410915 1330328 1410460 1554455 1522575 1495979 1449242 1522277
7112 1522277 1576468 1966341 2282380 2729460 3018602 2979613 2841527 2376791 2351978 1898596
7102 1898596 1876300 1725804 1601860 1515588 1646758 1768668 1642856 1628846 1769825 1841761
7092 1841761 2237073 2476248 2754463 3373021 4220247 4573660 5103098 4838548 4382644 3864327
7082 3864327 3410464 2940989 2870675 2763480 2658162 2572712 2629794 2777651 2723998 2810864
7072 2810864 3065876 3128621 3611759 3772994 4277038 4932907 5692668 6539946 6988185 7468795
7062 7468795 8390345 9419601 10849312 12038429 13166450 14008882 13722321 13140226 11789126
7053 11789126 10472038 8965972 7547797 6349595 5357682 4660997 4096867 3556961 3295904
7044 3295904 3085637 2768200 2452261 2323491 2335654 2439017 2152867 2383613 2450193 2623965
7034 2623965 2519844 2895410 3011849 3357612 3387167 3499575 3186995 3184120 3179052 2800558
7024 2800558 2442237 2306157 2142486 1986127 1881353 1586630 1584578 1711776 1533013 1387120
7014 1387120 1758467 1546297 1625453 1483585 1846322 1568111 1625420 1720347 1677674 1770985
7004 1770985 2007388 2208849 2333892 2504736 2464341 2559096 2552731 2595312 2458908 2372530 2707969
6993 2707969 2809984 2667518 2777925 3128249 3492473 3762468 3900506 3894320 4241183 4555406
6983 4555406 4595052 4735864 4733719 5220568 5322863 5524619 5760851 5793824 6478975 7622624
6973 7622624 9249307 12108807 14585505 15797696 15090223 13004895 11219486 9893742
6965 9893742 9124507 8519399 8243960 7943939 7847498 7325158 7216376 7208999 7634327 8245475
6955 8245475 9217463 10962037 13633302 17007505 20192640 22221000 23345335 22636300 21605785
6946 21605785 20100307 18353806 17403560 17190117 17310410 17573404 17389133 16806604 15613120
6937 15613120 14260245 12913332 11596803 10730906 10022087 10281181 11484134 13756941 16032246
6928 16032246 16823251 15585317 12931840 10587781 8887233 7643561 6655206 5716149 5263591
6919 5263591 4490888 4281030 3850474 3498175 3268574 3078626 3113323 2887095 3013300 2847092
6909 2847092 3008780 2881993 2826543 2914242 2772171 2909353 3243417 3306024 3495557 3833970
6899 3833970 4046983 4030863 4564631 5049385 5624006 6968126 8555062 10885953 13153665
6890 13153665 15144238 16537051 16777916 15903068 14410944 12405565 10093107 8112797
6882 8112797 6745922 5533142 4442938 4089417 3345296 3153119 2878326 2580042 2481203
6873 2481203 2422000 2596256 2374679 2418489 2334864 2511476 2380922 2521034 2498587 2446239
6863 2446239 2378091 2553091 2700458 2536988 2555127 2574772 2948240 2827454 3139990 2970089
6853 2970089 3227270 3599983 3888047 4466175 5275129 6321838 7927412 9761128 11059306
6844 11059306 11428783 10963215 9801520 8025402 6637817 5481790 4614863 3807354 3680153
6835 3680153 3207746 3115740 3151595 3382865 3466051 3384058 3505376 3717698 3607452 3742966
6825 3742966 3385702 3238499 2793787 2793601 2652390 2696595 2681734 2912654 3364445 3593835
6815 3593835 3574270 3375274 3304480 3039756 2964091 2709074 2638745 2665600 2587479 2634017 2721119
6804 2721119 2542669 2877437 2699415 2906852 2590603 2339638 2268702 2022533 1760253 1850666
6794 1850666 1772332 1778159 1749604 1709652 1830905 1785602 1978233 1958553 2134671 2218872 2334378
6783 2334378 2353544 2371575 2356017 2669078 3224890 3808446 4181742 4145777 3640730 3131848
6773 3131848 2677268 2376699 2116423 2099916 2226050 2100386 1857522 2018627 1791137 1858910
6763 1858910 2070929 2031386 1996831 1956769 2344593 2538488 3379807 4184764 5101143 5244421
6753 5244421 4856412 4382546 4534988 5107856 5140163 5417722 5396176 5714311 5635957 4968547
6743 4968547 4445867 4221813 4204617 4335206 4448942 4050180 3648277 3071175 2807437 2731433
6733 2731433 2640649 2675545 2497578 2592559 2646367 2793495 2630969 2953359 2755799 2770826
6723 2770826 2792607 3112868 3087632 3049285 3384634 3384279 3699988 4233190 4958769 5618882 5979034
6712 5979034 5780867 5158601 4701116 4184285 3857004 3891124 4045369 4324462 4348856 4460992
6702 4460992 4424291 4342906 4220242 4010205 4290335 4718920 4706614 4714499 4995953 4991117 5003713
6691 5003713 4940177 4927240 4948202 4824536 4798378 5017751 5106233 5300932 5504743 5498097 5692974
6680 5692974 5468961 5349328 5450702 5510852 5574819 5657196 5955663 5855217 6053597 6295609
6670 6295609 6202201 6462925 6553419 6934532 7219918 7302590 7587960 8078710 8210234 8543043
6660 8543043 8716101 9103195 9440431 9759948 10333562 10739129 10938717 11707888 12480470 13535768
6650 13535768 15505385 19172083 23997804 28873412 32733049 33004605 30841204 26959075
6642 26959075 23518559 21220082 20289400 20456079 21484620 23287697 24387753 24378885 23337483
6633 23337483 21765823 20731238 19995057 20201469 20815350 22151833 23206391 23881406 23492769
6624 23492769 22726344 22176945 21866190 21396185 20474969 19738752 19328908 19105461 19040184 18950757
6614 18950757 19187201 19915407 20006663 20613510 21051836 21366593 22365442 23457686 24872125
6605 24872125 26150046 26226238 25720149 24492399 23916112 23331564 22790405 22434145 22202559
6596 22202559 22204464 22371302 22568024 22745477 22746470 22937468 23059426 23444510 23621371 23753084
6586 23753084 23990454 24104077 24251787 24752932 24676010 25095299 25276337 25597684 25790478 26280735
6576 26280735 26543016 26872508 27321101 28101825 28548821 29229994 30204777 30707437 31155521
6567 31155521 31496491 31798030 32277391 32685614 33398284 34278959 35054057 36347135 37816159
6558 37816159 40487566 44462338 49089137 53151571 55163311 54558701 53099873 53039812 54263486
6549 54263486 58502099 65317127 73801440 80898391 82690302 79312069 73441579 68256684
6541 68256684 64858995 63008936 62070925 62105149 63603729 66469802 70331779 74860117 78308049
6532 78308049 80423368 81308789 81059515 81500740 82842638 86592909 91738191 98037573 102810428
6523 102810428 103592664 102598042 101943136 102428520 103300077 104264991 105720953 107573510 108759935
6514 108759935 110182599 111212619 112090583 112495642 112262744 111982226 111296606 110436088 109889758
6505 109889758 109790612 110387484 110522887 108637490 104473021 97860503 91479758 85245350 80016638
6496 80016638 75403812 71299647 67365032 63771428 60489990 57639551 54834601 52298697
6488 52298697 49885000 47683064 45609406 43940327 42333205 41007899 39726219 38762547
6480 38762547 37375298 36443141 35728216 35057750 34653141 34555261 34780189 35148735 35925048
6471 35925048 37356180 38995269 40102222 40839259 41459865 42569016 43850433 44660247 43984500
6462 43984500 42373795 39847219 38044522 36558661 35733977 35266637 35426523 36014119 37272859
6453 37272859 39101357 40914169 42791774 45279578 47874163 50149672 51374466 51873516
6445 51873516 52054402 52357021 52806100 53429298 54577773 56170043 58632344 61938567 65788182
6436 65788182 70120115 75095064 80419112 85971883 93631714 103281045 115867958 132296302
6428 132296302 154483151 182874482 215102443 245281651 263936133 264038608 244554881
6421 244554881 213522193 178901187 147793496 121810413 101906170 87391067 77777902
6414 77777902 72198344 68692343 66012938 62595561 58375094 53160316 48333334 44137767
6406 44137767 41146976 39358687 38124821 37416523 36973093 36615398 35816988 35002732 34002550
6397 34002550 33516025 33792106 34372494 35490787 36071458 35915151 35081842 34008732 32500765
6388 32500765 30981830 30265906 30554355 30637748 30667212 29847533 28725352 27152554 25489430
6379 25489430 24188676 23151436 22555364 21674491 21377897 21398448 21795823 22019099 22314158
6370 22314158 22379068 22803937 23251247 24289608 26250919 30132141 37646178 48163572 60910327
6361 60910327 70544976 73580686 69561635 61607238 52692873 44432987 37553307 32779870
6353 32779870 29666005 28392580 27408305 27046844 26985847 27087690 26941855 27797862 29170154
6344 29170154 31207731 33358903 34892230 35463321 34579581 32849623 30538866 28377565
6336 28377565 26174763 24468108 22760843 21202013 19994108 19344626 19352620 19407362 19679148
6327 19679148 19978369 20299161 20137539 20234553 19978713 19907296 20333843 20978518 22045863 23263726
6317 23263726 24586915 25933861 27183668 28331501 29293049 29812247 29551535 28871754 27807036
6308 27807036 26692530 25816175 25176480 24916064 25445480 26038226 26666197 27995684 29199333
6299 29199333 30966356 33243766 36184607 40036088 45076389 51377888 59254976 67668408
6291 67668408 75572651 80732382 81513712 79363651 74730936 70239446 66057611 63373322
6283 63373322 62122226 62104595 64368209 69071698 75725703 84957533 95023873 104381041
6275 104381041 110890588 113513251 113106264 112065106 110814131 108731049 105700041 101932510
6267 101932510 98046618 94957000 92113723 88452585 84158960 79036279 73709910 68863338
6259 68863338 64903574 61634946 60055343 60185324 62134631 66180371 72009167 79170066
6251 79170066 85552579 88827874 87608043 81943839 74112512 65992567 58426906 51450277
6243 51450277 45144046 40299530 36934158 34209472 32509835 30567277 28355714 26056153
6235 26056153 24274044 23238351 22245116 22074739 21822049 22308743 22154819 22911610 24195601
6226 24195601 26674595 30395566 34433337 37348678 38329584 36767845 33918112 30833891
6218 30833891 28713284 27374506 26849929 27006391 28526340 30896914 33982001 36725480
6210 36725480 39297294 42084717 46098819 51821867 58233906 63825588 65603406 62525465
6202 62525465 55769257 48089974 41643186 37103888 34013663 31744343 29823871 28691787
6194 28691787 28946182 29946072 30416346 29595674 27307978 25030430 22847128 21052560 19325577
6185 19325577 17729995 16525034 15411500 14655238 14007150 13782180 13412282 13427443 13458170
6176 13458170 13753103 14365444 15102343 16304107 17406773 18319184 18689198 18306478 17616757
6167 17616757 16817837 15800965 14721934 13595631 12932768 12614600 12723285 13128766 13770096
6158 13770096 14269488 14452883 14074237 13541503 13632762 13950572 14818632 15630451 16433392 17017965
6148 17017965 17571143 17542981 17021235 15735230 14351548 13255554 12374494 11667868 11263621
6139 11263621 10726450 10486135 10265007 10359665 10433429 10731508 11338615 11804461 12336476 12706771
6129 12706771 12720616 12489890 12123628 11805435 11570735 10945961 10781068 10600721 10205199 10053058
6119 10053058 10178154 10152696 10460804 11080345 12234442 13628895 14789359 16180558 16802034
6110 16802034 17008380 16566506 15653577 14277540 12856515 11567254 10442931 9791269 9296811
6101 9296811 8938557 9023074 9018661 9030513 8744762 8849886 8773570 8742049 8560874 8410266 8783421
6090 8783421 8898914 9215984 8895429 8718009 8122035 7547190 6857326 6334996 5791910 5773211
6080 5773211 5391583 5392278 5632666 6092523 6955549 7193564 7282428 6511844 6162771 5676088
6070 5676088 5245100 5350296 5446835 5459340 6102260 6282325 6338776 6409677 6239889 6081370
6060 6081370 5861182 6147431 6337423 6504677 7494920 8764630 11248092 14615682 18848644
6051 18848644 22334526 23596841 22308337 19352579 16461881 14636213 13984268 13917744 13988937
6042 13988937 13810536 12749445 11518572 10503127 9557369 8300794 7467827 6666601 5915345
6033 5915345 5714668 5553988 5459933 5553577 5820035 6184881 6734759 7398447 7949784 8617078
6023 8617078 9259014 9777578 9845873 9779488 8833751 7874882 7504697 7075474 7394506 7779608
6013 7779608 8315865 8776254 8785879 8590936 7783495 7508797 7366283 7490199 8063977 8831671
6003 8831671 10650766 12995398 15577030 18015064 18783616 17609193 14764131 11868393
5995 11868393 9485814 7855366 6545977 5930717 5192098 4974494 4493603 4032704 3928853
5986 3928853 3735045 3594055 3639712 3288515 3490405 3294294 3173292 3013169 3060230 3137080
5976 3137080 2918869 2828126 2999702 2789423 2799744 2762492 3130573 2909909 3025118 3013907
5966 3013907 3080154 3083996 2937825 2855485 2955744 3060116 2844186 2814533 2900460 2755573 2972691
5955 2972691 2911357 3293540 3317307 3582669 3853652 4750163 5571232 6622902 7733667 8254346
5945 8254346 7987547 7233803 6139674 5824740 5158488 4622066 4108182 3994470 3889830
5936 3889830 3897006 3932239 4032304 4069863 4557358 5004783 5611825 6698868 7812837 9236003
5926 9236003 10583589 11364746 10960588 9671673 8119433 6712709 5750786 4937976 4363259
5917 4363259 4219114 3798486 3646220 3439836 3532524 3583998 3437096 3734340 3892370 4498615
5907 4498615 4988621 5563621 6191141 6461886 6195870 5525518 4618568 4025142 3198445 3113250
5897 3113250 2991363 2839129 2799606 2710049 2579515 2597487 2610703 2923905 2779354 2789123 2696331
5886 2696331 2737031 3180615 3541665 4008361 4499156 5192804 5831179 5817502 5312081 4756616
5876 4756616 4402987 3841115 3744993 3338910 3357593 3209958 3351119 3122212 3192668 3311889
5866 3311889 3372134 3246637 3594388 3758440 4640190 5527088 6556183 7704037 8504671
5857 8504671 8854596 8080408 7231484 6332076 5510311 4928063 4500694 4417973 4265015 4399165
5847 4399165 4299201 4581445 4818147 5506413 6380614 7312018 8372888 8442490 8615331 8672893
5837 8672893 8591735 8359963 7834699 7301520 6313578 5454364 5272521 5391673 5047721 5111005
5827 5111005 5344184 5969332 6788953 8509667 10243504 12029518 13025140 13691479 13541154
5818 13541154 13191694 11735460 10399929 8692977 7590993 6836275 6516776 6362979 6008327
5809 6008327 6378191 6889659 7357910 8052231 9045496 9483175 10576951 10923425 10860769 10618154
5799 10618154 10283735 10034011 9600825 9178251 8389340 7360825 6401441 5678622 4822924
5790 4822924 4538449 4531700 4630134 4585591 5399515 6245852 7135690 7469821 7233025 6105325
5780 6105325 5328967 4775397 4287376 3793665 3523325 3234520 3080643 3106844 3042083 2886970
5770 2886970 2965764 2846776 2912770 2497483 2684489 2573841 2635877 2526021 2647529 2492940
5760 2492940 2644678 2436117 2451954 2562612 2623231 2735770 2802599 2734320 2842637 2707767
5750 2707767 2544374 2371166 2406300 2298484 2471861 2304679 2374662 2559663 2337121 2501405
5740 2501405 2309622 2547353 2549563 2705484 2793392 2929136 3257877 3591401 3612991 3640184
5730 3640184 3398964 3520690 3340080 3276236 3312345 3313380 3456964 3782973 3654551 3646540 3759752
5719 3759752 3614809 3827745 4098704 4215769 4247633 4527163 4513799 4880139 5307414 5452884
5709 5452884 6231877 7088164 9199051 12132808 16345847 19981735 20923879 18141579 14761693
5700 14761693 12349518 10836412 9584022 9294979 8864882 8686051 8448617 8061872 8337470
5691 8337470 9046092 9406745 10846812 12845676 16290258 19875430 23590812 26154704 28374661
5682 28374661 29413551 27587405 24670953 21155263 17703290 14998159 13349621 12320681
5674 12320681 12067367 12267608 12577397 12820305 12880059 12095552 11592531 11189749 11064211 11992206
5664 11992206 14321093 17584275 20477210 21048198 18516113 15284702 13073498 11318580
5656 11318580 9976380 9246141 8772240 8656563 8436857 8431214 8491600 8488774 8801280 9154982
5646 9154982 9822320 10469811 11362351 12665296 14409216 16071844 16831842 17420715 17097296
5637 17097296 16342705 15715785 15186831 15077268 15158208 15882254 16490527 17647403 18710456
5628 18710456 20297485 21971573 23495909 24129979 24469942 24499512 24531723 24977989 25644662
5619 25644662 26466638 28320571 30502888 33164756 36833098 41570374 47727376 54999694
5611 54999694 63415176 71662083 77680481 80352510 78953315 75006095 70026337 65508377
5603 65508377 61529166 59306605 58674222 59523630 62010392 65497093 69938314 74365256
5595 74365256 78850486 82612507 85023297 87349415 89678890 92174914 94060669 94837458
5587 94837458 93582494 91303469 88567845 85028807 81356660 77262668 72877056 67896618
5579 67896618 62731836 57740592 53943826 51047892 49877718 49958518 51912429 55540398
5571 55540398 59862909 64273253 66689830 65571364 60825235 54173571 46699535 39898266
5563 39898266 33884182 28555243 24436627 20919351 18377039 16154109 14640726 13215384
5555 13215384 12175263 11291642 10500487 9659802 9263111 8796096 8489286 8244306 7852135
5546 7852135 7741607 7458574 7361248 7700625 7534647 7345915 7079179 6818908 6862227 6417150
5536 6417150 6283782 6166110 6372559 6198881 6409594 6524857 6432542 6859434 7266606 8060975
5526 8060975 8880277 9991402 10515832 10243334 9229675 8224699 7599136 6994498 6686440
5517 6686440 6358200 6441204 6545676 6652228 6609031 6693797 6718658 6753098 7169912 7410259
5507 7410259 7734111 8003774 8650274 9303446 10452086 11874325 13083552 14886303 16705583
5498 16705583 18730282 21193202 23431772 25575626 26449201 26129955 23787668 20477589
5490 20477589 17079843 14477307 12985433 11811891 11564506 11254574 10812621 9590346 8350141
5481 8350141 7232394 6667797 6187642 5650066 5441506 5108073 4797819 4871424 4799698 4552897
5471 4552897 4427141 4427561 4400503 4651511 5006530 5607632 6389426 7694276 8566092 8863679
5461 8863679 8453342 7621236 7105785 7203756 7848911 9263754 11039609 11885882 11560409
5452 11560409 10533870 9508561 8364662 7720485 7155842 6639939 6269362 6018662 5866940
5443 5866940 5446447 5439572 5169663 5343026 5081364 5182764 4990345 5159231 5505955 5777375
5433 5777375 5956917 6327290 6382093 6795192 6974607 7055100 7123085 7594154 7968140 8399502
5423 8399502 8509179 7980018 7375281 6747571 6408067 5702593 5468849 5226191 4939319 4788398
5413 4788398 4853209 5064593 4871207 4691195 4288610 4031420 3754863 3501324 3355920 3093707
5403 3093707 3124623 3121819 3266401 3307071 3683362 3629147 3700780 3515332 3067544 3002398 2913772
5392 2913772 2527544 2582842 2304567 2419047 2394403 2076257 2020586 1948245 2000843 2050180 2088861
5381 2088861 2157655 1992089 2236596 2469541 2351940 2441748 2304786 2202584 2153963 2165818
5371 2165818 1925421 1926395 2031407 1779441 2088463 1944593 1792350 1734661 1664903 1820715
5361 1820715 1847765 2067409 2040836 2378392 2223044 2084210 1716467 1542776 1518334 1458509
5351 1458509 1407275 1568191 1564779 1283350 1334087 1174178 1420540 1237319 1277122 1254831 1289787
5340 1289787 1366504 1519823 1341333 1458947 1492160 1429056 1686183 1514831 1440870 1358723
5330 1358723 1399038 1650778 1608549 1723499 1552655 1488572 1517512 1523098 1168412 1557315 1393210
5319 1393210 1464949 1361151 1504141 1644542 1498649 1541107 1554763 1658606 1624474 1593996
5309 1593996 1571832 1450595 1398104 1322019 1477595 1445886 1491335 1449726 1619322 1552529 1787468
5298 1787468 1763634 1822612 1720293 1736485 1740393 1682124 1568368 1401442 1429650 1207831 1409998
5287 1409998 1469424 1320044 1379459 1307843 1368280 1314474 1325465 1492889 1586779 1559045 1651769
5276 1651769 1505122 1309253 1232531 1092387 985783 881398 1142852 976143 1031368 1036389
5266 1036389 1070050 1039128 1225401 1114357 1296723 1206552 829659 1201685 1200927 1126625 1141300
5255 1141300 905585 1162449 889803 1097899 1038447 935465 1113078 1179224 1335488 1097500
5245 1097500 974729 1259907 1050025 1207439 966412 1143777 994706 1198584 1200734 1314211
5235 1314211 1356990 1412775 1366982 1414662 1287437 1107564 1062678 963973 996867 949848 737600
5224 737600 886701 669967 832420 1015518 985907 1049050 974882 934456 1066035 1057109 693783
5213 693783 1019330 860728 1070605 1106257 1058289 1071148 1070085 1201174 1142503 1185693 1351292
5202 1351292 1456441 1310086 1566238 1732362 1743815 1946712 1740363 1786485 1904360 1930374
5192 1930374 2156773 2263281 2368517 2466370 2611101 2905971 3319601 3897924 4892469 5916154
5182 5916154 7043290 7838289 8140309 8319728 8723078 9083135 9244372 8346596 8154224
5173 8154224 7893895 8449879 8919278 9475568 8954416 8645918 8550480 8262240 7905961 7126443
5163 7126443 6071306 4794803 4247625 3542724 3237113 2747088 2451944 2533572 2417846
5154 2417846 2427055 2315485 2356973 2057890 1985900 1969513 2044810 2085400 2004362 2178414 2273541
5143 2273541 2599282 2891954 3177726 3959305 4832308 5813345 6574981 6957653 7097271 7477679
5133 7477679 7680494 7869579 7552779 7186792 6882290 6719862 7188666 7376692 7495978 7318002
5123 7318002 7048860 6927775 6653180 6161776 5377240 4738876 3807658 3210194 2862391 2363608
5113 2363608 2291872 1937397 1933008 2074220 1903713 2031473 2372046 3046579 3639531 4425948
5103 4425948 4744339 4320907 3529430 2853565 2197071 2055331 1514711 1331719 1145558 920250
5093 920250 1040148 746254 907544 905579 905174 568415 964967 873516 675133 593291 593698
5082 593698 507817 524594 629201 674111 753259 508531 531092 788322 473870 372039 584342
5071 584342 444376 558192 599784 540030 634795 479595 550794 472896 468538 380679 431853
5060 431853 505433 520900 460377 454788 638527 341070 424491 726773 616435 550138 799227
5049 799227 567308 531127 594938 660089 565780 382218 385458 581162 560078 487825 552469
5038 552469 413476 455812 603234 675001 539847 556147 408217 448190 596686 512434 417391
5027 417391 608549 570092 568851 544423 366643 426076 304106 220159 393893 391163 436104
5016 436104 317739 394017 202314 570867 401165 448419 198951 284020 361743 615379
5006 615379 272226 466606 319640 246761 331276 344890 486775 729302 719746 761947 554683
4995 554683 783035 770972 545084 587331 473698 456759 438353 457787 599809 469341 705856
4984 705856 660871 509376 688607 539175 435073 694462 540721 527989 583622 313275
4974 313275 524781 514673 629881 729590 578423 503961 512597 373180 352177 501565 565496
4963 565496 384911 448927 562189 628248 879381 801919 800647 1436876 1569212 1755729 1290647
4952 1290647 1021965 886425 775519 707879 606593 716145 453778 514742 427466 546863
4942 546863 520591 439688 427289 622708 492035 365169 551467 463881 484547 612038 474236
4931 474236 460599 343199 374780 496975 806522 365790 292937 377841 404641 411511 277787
4920 277787 459129 386616 385256 364183 507753 268002 270101 494726 358402 537815 326359
4909 326359 281664 448223 257237 318769 613406 362254 478731 537261 424197 175496
4899 175496 475010 415586 383226 414149 176616 294873 394475 334275 350558 256387 289025
4888 289025 231957 303740 325892 347386 530815 318398 285525 267329 235824 362429 388783
4877 388783 249361 171752 326670 338116 440019 374941 356007 116008 205676 222501 66245
4866 66245 202928 257112 205246 358831 400949 206963 416587 258853 281012 200695 292129
4855 292129 400240 263096 285285 220726 423708 393162 375410 283358 370280 356063 544725
4844 544725 392944 457972 610131 549709 758469 597378 751206 519172 447665 407864
4834 407864 605972 323058 348700 357645 462758 521610 385406 400287 162322 266140 458418
4823 458418 264238 502483 359943 499858 312373 336846 284539 468613 226881 424284
4813 424284 538270 260412 515447 470902 282167 241769 568964 522081 528239 452159 421092
4802 421092 475906 525936 263131 536034 294687 587177 358348 355165 509504 372877
4792 372877 526123 472606 567858 444773 476443 503419 247898 405317 524748 421362
4782 421362 300294 460078 452051 394837 513690 404538 649943 433405 411748 458674 597555
4771 597555 344213 488275 362460 426949 507179 388242 378526 381819 486618 590151 665014
4760 665014 309954 248520 483507 478896 464286 254689 524409 384080 408722 346339 383117
4749 383117 290819 444190 456220 381477 404936 487084 371811 503367 474708 351584 355194
4738 355194 210639 428786 326950 405153 357075 551732 537625 413904 464978 381943 428551
4727 428551 468486 487135 448337 376913 443615 490571 445478 473613 600907 427834 378963
4716 378963 458695 570430 377699 439111 625705 461067 319799 567209 638245 586858
4706 586858 386380 619273 548480 469835 455255 483543 298476 628609 349630 468588
4696 468588 417639 587718 455474 678717 345818 430996 527342 577977 492906 451396 616178
4685 616178 437197 646755 639861 291106 396424 380471 340127 420321 583176 444040 492560
4674 492560 489222 379226 577420 649634 620595 523510 476801 474388 584140 577196 666838 661569
4662 661569 588185 539128 438196 595072 524334 612454 639556 777048 520919 524315 689293
4651 689293 457539 518809 522497 441286 654452 557976 728727 632695 612150 489022 528398
4640 528398 490930 452248 506887 586905 542329 721889 564046 590678 650377 392188 559256
4629 559256 481654 554237 749685 483523 619078 606710 715317 621792 733939 615030
4619 615030 692909 749303 694304 699885 705894 477178 857744 785011 666469 613210 524579
4608 524579 480374 700223 708041 704366 792268 787111 753405 786221 930748 980513 732515 809263
4596 809263 807069 687844 614381 826754 773658 764961 820011 845596 621105 880152 651740
4585 651740 678331 690623 802953 674796 684248 731684 734925 859881 815642 767401 635637
4574 635637 742562 790390 792467 774858 837127 817846 721181 637595 827302 759701 807832
4563 807832 767628 571016 641768 834897 787534 878940 829444 868240 703391 621603 887594
4552 887594 794993 832247 954996 913332 688896 1002705 721070 797459 954114 884135 942650
4541 942650 926061 974349 1036219 1040849 877288 787967 872857 815603 860470 854950 781156 689430
4529 689430 778017 853620 773181 826085 766564 823303 732497 811261 730415 807483 744284 775969
4517 775969 796810 855808 750972 842358 674310 832076 798649 705850 757718 752830 698434
4506 698434 759337 563539 613011 839501 926175 540646 666566 923046 1014270 738092
4496 738092 714888 891854 577565 844764 729853 847090 812339 761722 1036596 943767
4486 943767 744317 767329 1029711 812619 785176 794283 723052 686107 760410 816158 829087
4475 829087 781200 900625 819049 847130 778813 782676 790158 596959 828672 787747 953833
4464 953833 911073 935997 916797 821804 953754 868614 734534 911828 799680 981854 924187
4453 924187 816372 755195 920490 782354 1072819 1020598 923121 998020 939948 1166768 1005888
4442 1005888 1110019 1042762 1116166 1120544 976936 1131410 1086521 1308104 1077161 1091307 1113145
4431 1113145 1070822 994835 1020313 1135352 1149830 1356263 1194124 1263572 1158085 1437613
4421 1437613 1221000 1210093 1196226 1278869 1416378 1500547 1320105 1305485 1436396 1458972 1342735
4410 1342735 1411776 1462785 1428448 1570668 1585902 1646258 1883237 1780426 1796820 1891774 1687151
4399 1687151 1753533 1942121 1914820 1980740 1913238 2067846 2127134 2296659 2254998 2232606 2367103
4388 2367103 2469042 2560523 2728299 2708915 3202409 3978459 4998708 6257557 6756144 6465708
4378 6465708 5486153 5171066 3998036 3814471 3499275 3510592 3368131 3337817 3700872 3420776
4368 3420776 3336380 3759012 3644386 3776375 3919266 4421123 4850552 6149467 7262692
4359 7262692 8077748 7832319 7050412 6128082 5382292 4999465 4716704 4762966 4629792 4787015
4349 4787015 4825855 4836883 4828754 4947954 5087093 5293455 5336169 5619094 5810217 6238313
4339 6238313 6449062 6721190 7389679 7771290 8463957 9319111 10292778 11390026 12785966
4330 12785966 14056488 15337809 16748045 17704061 18114475 17721614 16635418 14994100 13060499
4321 13060499 11619084 10243859 9300904 8354932 7459113 6942574 6342774 5850992 5586127
4312 5586127 5134009 5010350 4768841 4748808 4345036 3957385 4144568 3897481 3934402 3841251
4302 3841251 3880980 3537990 3402806 3253617 3173788 3112764 3098434 2890905 2872556 2722575
4292 2722575 2715230 2564378 2412206 2673613 2369031 2208822 2101894 2122042 2020928 1995690
4282 1995690 1963875 1800284 1867393 1726241 1776930 1683546 1748696 1758887 1820108 1497705 1634416
4271 1634416 1650981 1460947 1417725 1471005 1580337 1494428 1387697 1491990 1373721 1265365
4261 1265365 1406705 1421398 1254119 1326627 1245972 1284260 1299516 1066896 1290767 1153545
4251 1153545 1073885 1386509 1106112 1290376 1331389 1080027 1224193 955157 935579 951506
4241 951506 1069573 892663 1022711 1151568 908210 1035989 1121577 1206649 995540 1128979
4231 1128979 1046307 928490 1142568 872158 1094234 1064240 774585 883785 848100 1079528
4221 1079528 871232 746923 764028 1128799 805593 950022 804144 1029065 694699 598594
4211 598594 1037615 888667 954931 799275 806325 774880 1005813 1009681 792499 718932 740087
4200 740087 856623 846451 842472 775020 571683 806393 729679 665044 623449 742882 666047
4189 666047 644061 668884 726337 706935 701657 505356 575999 644415 641319 841799 752507 799476
4177 799476 726667 772450 647327 597923 692678 810196 686562 728259 734815 682240 763685
$$ [...]
##END NTUPLES=NMR SPECTRUM
##END=
