##TITLE=abcd
##JCAMPDX= 6.0         $$ Bruker NMR JCAMP-DX V2.0
##DATA TYPE= NMR SPECTRUM
##DATA CLASS= NTUPLES
##ORIGIN= UXNMR, Bruker Analytische Messtechnik GmbH
##OWNER= root
$$ XWIN-NMR		Version 3.5
$$ Thu Jul  9 19:02:30 2026 Russian Standard Time (UT+4h)  servis@DPX200
##.OBSERVE FREQUENCY= 200.131235884673
##.OBSERVE NUCLEUS= ^1H
##.ACQUISITION MODE= SIMULTANEOUS
##.ACQUISITION SCHEME= undefined
##.AVERAGES= 32
##.DIGITISER RES= 18
##SPECTROMETER/DATA SYSTEM= spect
##.PULSE SEQUENCE= zg
##.SOLVENT NAME= CDCl3
##.SHIFT REFERENCE= (INTERNAL, CDCl3, 0, 16.4885)
##AUDIT TRAIL= $$ (NUMBER, WHEN, WHO, WHERE, WHAT)
$$ ##TITLE= Audit trail, XWIN-NMR		Version 3.5
$$ ##JCAMPDX= 5.01
$$ ##ORIGIN= Bruker BioSpin GmbH
$$ ##OWNER= servis
$$ F:\spectra/data/av/nmr/H1/1/pdata/1/auditp.txt
$$ ##AUDIT TRAIL=  $$ (NUMBER, WHEN, WHO, WHERE, WHAT)
(   1,<2026-07-09 19:01:42.60 +0400>,<servis>,<DPX200>,
      <created by zg, POWCHK disabled, PULCHK disabled
       configuration hash MD5:
       00 E9 B6 7A A2 85 ED C7 34 08 36 98 17 FE 4E 26
       data hash MD5: 32K
       0B AB 30 46 6D 75 46 92 B4 39 11 7C CC 89 9D CD>)
(   2,<2026-07-09 19:02:09.29 +0400>,<servis>,<DPX200>,
      <Start of raw data processing
       efp BC_mod = 2 LB = 0.05 FT_mod = 6 PKNL = 1 PHC0 = -415.39 PHC1 = 3.101563 SI = 16K 
       data hash MD5: 16K
       AB 37 18 7F 0B B5 D8 6F 28 30 9D B3 82 DC E6 44>)
$$ ##END=
$$ 
$$ hash MD5
$$ 3F B7 08 30 FB 08 72 A2 67 01 FB 19 BA E5 0F 3E
##$RELAX= 
##$RELAX= 
##$RELAX= 
##$RELAX= 
##$RELAX= 
##$RELAX= 
##$RELAX= 
##$RELAX= 
$$ Bruker specific parameters
$$ --------------------------
##$DU= <F:\spectra>
##$EXPNO= 1
##$NAME= <H1>
##$PROCNO= 1
##$TYPE= <nmr>
##$USER= <av>
##$AMP= (0..31)
100 100 100 100 100 100 100 100 100 100 100 100 100 100 100 100 100 100 
100 100 100 100 100 100 100 100 100 100 100 100 100 100 
##$AQSEQ= 0
##$AQ_mod= 1
##$AUNM= <au_zg>
##$AUTOPOS= <>
##$BF1= 200.13
##$BF2= 200.13
##$BF3= 200.13
##$BF4= 200.13
##$BF5= 500.13
##$BF6= 500.13
##$BF7= 500.13
##$BF8= 500.13
##$BYTORDA= 1
##$CFDGTYP= 0
##$CFRGTYP= 5
##$CHEMSTR= <none>
##$CNST= (0..31)
1 1 145 1 1 1 1 1 1 1 1 1 1 1 1 1 1 1 1 1 1 1 1 1 1 1 1 1 1 1 1 1 
##$CPDPRG= <>
##$CPDPRG1= <>
##$CPDPRG2= <>
##$CPDPRG3= <>
##$CPDPRG4= <mlev>
##$CPDPRG5= <mlev>
##$CPDPRG6= <mlev>
##$CPDPRG7= <mlev>
##$CPDPRG8= <mlev>
##$CPDPRGB= <>
##$CPDPRGT= <>
##$D= (0..31)
0 2 0 0 0 0 0 0 0 0.06 0 0 0 0 0 0 0.0002 0 0 0 0 0 0 0 0 0 0 0 0 0 0 
0 
##$DATE= 1783609302
##$DBL= (0..7)
120 120 120 120 120 120 120 120 
##$DBP= (0..7)
150 150 150 150 150 150 150 150 
##$DBP07= 0
##$DBPNAM0= <>
##$DBPNAM1= <>
##$DBPNAM2= <>
##$DBPNAM3= <>
##$DBPNAM4= <>
##$DBPNAM5= <>
##$DBPNAM6= <>
##$DBPNAM7= <>
##$DBPOAL= (0..7)
0.5 0.5 0.5 0.5 0.5 0.5 0.5 0.5 
##$DBPOFFS= (0..7)
0 0 0 0 0 0 0 0 
##$DE= 6
##$DECBNUC= <off>
##$DECIM= 32
##$DECNUC= <off>
##$DECSTAT= 4
##$DIGMOD= 1
##$DIGTYP= 9
##$DL= (0..7)
0 120 120 120 120 120 120 120 
##$DP= (0..7)
150 150 150 150 150 150 150 150 
##$DP07= 0
##$DPNAME0= <>
$$ [...]
##$SUBNAM4= <"">
##$SUBNAM5= <"">
##$SUBNAM6= <"">
##$SUBNAM7= <"">
##$SUBNAM8= <"">
##$SUBNAM9= <"">
##$SW= 20.6817932712277
##$SWIBOX= (0..15)
0 0 3 0 0 0 0 0 0 0 0 0 0 0 0 0 
##$SW_h= 4139.07284768212
##$TD= 32768
##$TD0= 1
##$TE= 0
##$TE2= 300
##$TE3= 300
##$TEG= 300
##$TL= (0..7)
0 120 120 120 120 120 120 120 
##$TP= (0..7)
150 150 150 150 150 150 150 150 
##$TP07= 0
##$TPNAME0= <>
##$TPNAME1= <>
##$TPNAME2= <>
##$TPNAME3= <>
##$TPNAME4= <>
##$TPNAME5= <>
##$TPNAME6= <>
##$TPNAME7= <>
##$TPOAL= (0..7)
0.5 0.5 0.5 0.5 0.5 0.5 0.5 0.5 
##$TPOFFS= (0..7)
0 0 0 0 0 0 0 0 
##$TUNHIN= 0
##$TUNHOUT= 0
##$TUNXOUT= 0
##$USERA1= <user>
##$USERA2= <user>
##$USERA3= <user>
##$USERA4= <user>
##$USERA5= <user>
##$V9= 5
##$VALIST= <valist>
##$VCLIST= <CCCCCCCCCCCCCCC>
##$VD= 0
##$VDLIST= <DDDDDDDDDDDDDDD>
##$VPLIST= <PPPPPPPPPPPPPPP>
##$VTLIST= <TTTTTTTTTTTTTTT>
##$WBST= 1024
##$WBSW= 30
##$XGAIN= (0..3)
0 0 0 0 
##$XL= 0
##$YL= 0
##$YMAX_a= 616165
##$YMIN_a= -930383
##$ZGOPTNS= <>
##$ZL1= 120
##$ZL2= 120
##$ZL3= 120
##$ZL4= 120
##$ABSF1= 0
##$ABSF2= 0
##$ABSG= 0
##$ABSL= 0
##$ALPHA= 0
##$AQORDER= 0
##$ASSFAC= 0
##$ASSFACI= 0
##$ASSFACX= 0
##$ASSWID= 0
##$AUNMP= <proc_1d>
##$AZFE= 0.1
##$AZFW= 0.1
##$BCFW= 0
##$BC_mod= 2
##$BYTORDP= 0
##$COROFFS= 0
##$CY= 18.4799938201904
##$DATMOD= 1
##$DC= 0
##$DFILT= <>
##$DTYPP= 0
##$F1P= 9.9274215381318
##$F2P= -0.165520771350173
##$FCOR= 1
##$FTSIZE= 16384
##$FT_mod= 6
##$GAMMA= 0
##$GB= 0
##$INTBC= 1
##$INTSCL= 4.127829e-11
##$ISEN= 128
##$LB= 0.05
##$LEV0= 0
##$LPBIN= 0
##$MAXI= 10000
##$MC2= 0
##$MEAN= 0
##$ME_mod= 0
##$MI= 50
##$NCOEF= 0
##$NC_proc= -4
##$NLEV= 6
##$NOISF1= 3.799351
##$NOISF2= 2.8
##$NSP= 0
##$NTH_PI= 0
##$NZP= 0
##$OFFSET= 16.48848
##$PC= 4
##$PHC0= -415.39
##$PHC1= 3.101563
##$PH_mod= 1
##$PKNL= yes
##$PPARMOD= 0
##$PSCAL= 4
##$PSIGN= 0
##$REVERSE= no
##$SF= 200.130005582386
##$SI= 16384
##$SIGF1= 3
##$SIGF2= 2
##$SINO= 400
##$SIOLD= 16384
##$SREGLST= <1H.CDCl3>
##$SSB= 0
##$STSI= 16384
##$STSR= 0
##$SW_p= 4139.07284768211
##$SYMM= 0
##$S_DEV= 0
##$TDeff= 32768
##$TDoff= 0
##$TI= <>
##$TILT= no
##$TM1= 0
##$TM2= 0
##$TOPLEV= 0
##$USERP1= <user>
##$USERP2= <user>
##$USERP3= <user>
##$USERP4= <user>
##$USERP5= <user>
##$WDW= 1
##$XDIM= 16384
##$YMAX_p= 307876070
##$YMIN_p= -326894
$$ End of Bruker specific parameters
$$ ---------------------------------
##NTUPLES= NMR SPECTRUM
##VAR_NAME=  FREQUENCY,     SPECTRUM/REAL,   SPECTRUM/IMAG
##SYMBOL=    X,             R,               I
##VAR_TYPE=  INDEPENDENT,   DEPENDENT,       DEPENDENT
##VAR_FORM=  AFFN,          ASDF,            ASDF
##VAR_DIM=   16384,         16384,           16384
##UNITS=     HZ,            ARBITRARY UNITS, ARBITRARY UNITS
##FACTOR=    0.252644378177508, 1,           1
##FIRST=     3299.83951724647, 0,            0
##LAST=      -839.233330435636, 0,           0
##MIN=       -839.233330435636, -326894,     0
##MAX=       3299.83951724647, 307876070,    0
$$ Real data points
##PAGE= N=1
##DATA TABLE= (X++(R..R)), XYDATA
$$ [...]
9537B37960j8694l9742m44k7118m8546M8625R604P082j10880M5177Q502O5227
$$ 237960 219266 179524 179080 151962 103416 152041 161645 168727 57847 103024 111526 176753
9525A76753l1222j065N4536l0717Q7675j21301O9846Q8849k7276r1131M8947N6289
$$ 176753 145531 144466 199002 168285 255960 134659 204505 293354 266078 174947 223894 280183
9513B80183L4847K5308k9229N1078J4247J0637M1790q1975L6737k3872L0296m2858
$$ 280183 315030 340338 311109 362187 376434 387071 428861 346886 383623 359751 390047 347189
9501C47189P1087J4332L2168K3352K1651P1445J3602m431J6907R488q4766l2987
$$ 347189 418276 432608 464776 488128 509779 581224 594826 590395 607302 616790 532024 499037
9489D99037N804n1541K5538N3754k2516O1706m7449l8189Q3949k265M8348q8366
$$ 499037 504841 453300 478838 532592 510076 571782 524333 486144 570093 567828 616176 527810
9477E27810O8341p348p893K3841n7277Q019P1833j804o5443Q7227J00273l9448
$$ 527810 596151 588803 580910 604751 547474 555493 627326 625522 560079 647306 747579 708131
9465G08131q2263J8550O0133k8099J5431P3667P5482m5721j24798N2567L47m3751
$$ 708131 625868 644418 704551 676452 691883 765550 841032 795311 670513 723080 723427 679676
9453F79676k0797P2396P312L4542J41064n0162L0625l3457M4644j9319l7633J38947
$$ 679676 658879 731275 738587 773129 914193 864031 894656 861199 905843 886524 848891 987838
9441I87838o8498N2200j03713N5929j1430J27914k1032O7613L2239o6587j9849
$$ 987838 919340 971540 867827 923756 912326 1040240 1019208 1086821 1119060 1052473 1032624
9430A032624j0317k3987n7639m0225M2370J5590K6639P0800O3085J5651q894P1971
$$ 1032624 1022307 998320 940681 900456 942826 958416 985055 1055855 1118940 1134591 1125697 1197668
9418A197668N8111j04568N3455K0570j9046j23539J24800q9885J462n9055N2431
$$ 1197668 1255779 1151211 1204666 1225236 1206190 1082651 1207451 1117566 1119028 1059973 1112404
9407A112404K5729l8069R5314n0923J7021l1052L1317l0267P8894q5639O0498
$$ 1112404 1138133 1100064 1195378 1144455 1161476 1130424 1161741 1131474 1210368 1124729 1185227
9396A185227j00407K6887r2602R553k6573J5242N437n1524J637r476l4830j0518
$$ 1185227 1084820 1111707 1019105 1028658 1002085 1017327 1022764 971240 972877 963401 928571 918053
9384I18053n5158l4792r753k0279j3579k7578k5826P3172j22097J06561J0801
$$ 918053 862895 828103 818350 798071 784492 756914 731088 804260 682163 788724 799525
9373G99525L4063j3531l42K6783m1693j2350N3418r171M0422J59101J22020J28729
$$ 799525 833588 820057 819715 846498 804805 792455 845873 836702 877124 1036225 1158245 1286974
9361A286974J47130J30055J88968J16049r698N8080N5787R006R1202J00541J02760
$$ 1286974 1434104 1564159 1753127 1869176 1859478 1917558 1973345 1982351 2073553 2174094 2276854
9350B276854q2014p8565j06950n4237j06110o2845k2793m2810q4619j2021K0953
$$ 2276854 2194840 2116275 2009325 1955088 1848978 1786133 1763340 1720530 1635911 1623890 1644843
9339A644843O394K9072o3638k145J03041Q7271Q6813J52029J43031J45409J75539
$$ 1644843 1651237 1680309 1616671 1614526 1717567 1804838 1891651 2043680 2186711 2332120 2507659
9328B507659J46720K26866J36936L2631k232N5789L182l6518m0949o6058j89122
$$ 2507659 2654379 2881245 3018181 3050812 3048580 3104369 3107551 3071033 3030084 2964026 2774904
9317B774904k99873k23329j65096j07929j17430o8668p1459O211n8143J27369
$$ 2774904 2475031 2251702 2086606 1978677 1861247 1792579 1721120 1727331 1669188 1796557
9307A796557r7800p576R556n5210l710j8513J512J9521M2317j41m8180O7787j15674
$$ 1796557 1698757 1691181 1700737 1645527 1641817 1623304 1624816 1644337 1686654 1686513 1638333 1706120 1590446
9294A590446K6072k1179j4804l0735N7086n4015P4646R8934K6576O7496J04589
$$ 1590446 1616518 1595339 1580535 1549800 1606886 1552871 1627517 1726451 1753027 1820523 1925112
9283A925112p9779P735o095p3009J17961L1617L5158J8841r405p606N9320l189
$$ 1925112 1845333 1853068 1846973 1773964 1891925 1923542 1958700 1977541 1968136 1960530 2019850 2016661
9271B016661O3816J06907m877Q8742r368N9935l2632K2914J7019o8769N6940m1461
$$ 2016661 2080477 2187384 2182507 2271249 2261881 2321816 2289184 2312098 2329117 2260348 2317288 2275827
9259B275827L7291J11027J1479P6060R1897M8659J28651O3404J22717m8668P2799
$$ 2275827 2313118 2424145 2435624 2511684 2603581 2652240 2780891 2844295 2967012 2918344 2991143
9248B991143M9146K1137k0273K531N5083p717J20676N0615R2391j094J00958L5694
$$ 2991143 3040289 3061426 3041153 3043684 3098767 3091050 3211726 3262341 3354732 3353638 3454596 3490290
9236C490290O8502K7839J67714M3876M9042J53993K3657O790p18j0781P0291O8603
$$ 3490290 3558792 3586631 3754345 3798221 3847263 4001256 4024913 4031703 4030985 4020204 4090495 4159098
9224D159098K8255J47762R8489K9136L7889J35837j5048L3931J38927P8367Q3267
$$ 4159098 4187353 4335115 4433604 4462740 4500629 4636466 4621418 4655349 4794276 4872643 4955910
9213D955910J55793J47207J00072J07860J95709K22907J89060K6476K04664r334
$$ 4955910 5111703 5258910 5358982 5466842 5662551 5885458 6074518 6100994 6305658 6296324
9203F296324J30950J38935J02196J65175K37447J23067J86705J33729J57779M4266
$$ 6296324 6427274 6566209 6668405 6833580 7071027 7194094 7380799 7514528 7672307 7716573
9193G716573m687R1413K5352J53149P0470N4834K24421J68162K56683L44008M26971
$$ 7716573 7711886 7803299 7828651 7981800 8052270 8107104 8331525 8499687 8756370 9100378 9527349
9182I527349N12667P04338R61613J089340J072720Q36182Q63662Q39333R39979
$$ 9527349 10040016 10744354 11705967 12795307 13868027 14704209 15567871 16407204 17347183
9173A7347183R27469R80369P38629L38166k39301m58513n34856m54927l13906
$$ 17347183 18274652 19255021 19993650 20331816 20092515 19634002 19099146 18644219 18330313
9164A8330313P6981m1888r5318j07518L553M8060K88865N82337Q06106J131703
$$ 18330313 18407294 18365406 18270088 18162570 18166123 18214183 18503048 19085385 19891491 21023194
9154B1023194J380242J527023J872615J933320K323899L041048L631298L997437
$$ 21023194 22403436 23930459 25803074 27736394 30060293 33101341 36732639 40730076
9146D0730076L000976J771750J178657J423311K147488K462017J975581J264215
$$ 40730076 43731052 45502802 46681459 48104770 50252258 52714275 54689856 55954071
9138E5954071J329731K457091L510815L623498K115293L82762n60174o68152K59475
$$ 55954071 57283802 59740893 63251708 66875206 68990499 69373261 68813087 68144935 68404410
9129F8404410J980081L896019N717920P744729J0076413J2347148J5320160K0024286
$$ 68404410 70384491 74280510 79998430 87743159 97819572 110166720 125486880 145511166
9121A45511166K6268390L1096166L0364372K3956143J4563971Q219335K586602
$$ 145511166 171779556 202875722 233240094 257196237 271760208 279979543 282566145
9114B82566145m121979j1425854j8433288k3306690k5080621k3026372j7948916
$$ 282566145 278444166 267018312 248585024 225278334 200197713 177171341 159222425
9107A59222425j2729694r523787q444845p790917o359817n030141m792243m861811
$$ 159222425 146492731 136968944 128524099 120733182 114373365 109343224 104550981 99689170
9099I9689170m998938n428606n525401m992871m208060l281424k060773q79901
$$ 99689170 94690232 89261626 83736225 78743354 74535294 71253870 69193097 68313196
9091F8313196j84014M22713L11576R16581J661859J192238j070348k147645l530708
$$ 68313196 68129182 68551895 68863471 69780052 71441911 72634149 71563801 69416156 65885448
9082F5885448m399731m191249l859220l318215k755406j885569r16654J50524
$$ 65885448 61485717 57294468 53435248 50117033 47361627 45476058 44559404 44709928
9074D4709928k4588p50277k171403l079201l613816l453598l010566k345268j853004
$$ 44709928 44685340 43935063 41763660 38684459 35070643 31617045 28606479 26261211 24408207
9065B4408207j375704r78095o80180n41843n20593n61475m49230l29864p0796
$$ 24408207 23032503 22054408 21374228 20832385 20311792 19750317 19301087 18971223 18900427
9056A8900427n4168p5277o0326j09696n1343n1484l24224o26897q85823j048664
$$ 18900427 18846259 18770982 18710656 18600960 18549617 18498133 18173909 17547012 16661189 15612525
9046A5612525r66755r08892m81968k80220j62521m43050m18278n75724o86611
$$ 15612525 14645770 13736878 13254910 12974690 12812169 12369119 11950841 11375117 10688506
9037A0688506o88319n26517m54307m79277l85306k77647k12600j64424k53486
$$ 10688506 10000187 9473670 9019363 8540086 8154780 7877133 7664533 7500109 7246623
9028G246623k10838j35286k67468j01678k77958j78964k32569j87977k20350j20550
$$ 7246623 7035785 6900499 6633031 6531353 6253395 6074431 5841862 5653885 5433535 5312985
9018E312985k22805j26051k23236r2049j18059r4490j50498p3702j32278r3199
$$ 5312985 5090180 4964129 4740893 4648844 4530785 4436295 4285797 4212095 4079817 3986618
9008C986618j21565o2869q7526j01668o4130j62250j59494j6576j54064k1178
$$ 3986618 3865053 3802184 3714658 3612990 3548860 3386610 3227116 3210540 3056476 3035298
8998C035298l4915j10611p0674p3792j13423k8107q7097m2624J3885j24401j6879
$$ 3035298 3000383 2889772 2819098 2745306 2631883 2603776 2516679 2474055 2487940 2363539 2346660
8987B346660j15197r7956j12051m788k6050l0131m3937o693j09509k3867r162
$$ 2346660 2231463 2133507 2021456 2016668 1990618 1960487 1916550 1909857 1800348 1776481 1767319
8976A767319m1358j4521K541r3380N8808j17652Q442m6669p0447l0917m3271j12446
$$ 1767319 1725961 1711440 1713981 1620601 1679409 1561757 1570199 1523530 1453083 1422166 1378895 1266449
8964A266449M4924p3936k6836l3095K6436p8859L7128r7602M4088O872r1872k2716
$$ 1266449 1311373 1237437 1210601 1177506 1203942 1125083 1162211 1064609 1108697 1115569 1023697 1000981
8952A000981j119m7738l6344q1578M6145j2688k2236K0244j22983M2251m8590
$$ 1000981 999862 952124 915780 834202 880347 867659 845423 865667 742684 784935 736345
8941G36345l9234n1620j6322M014k1177o1245M2883K5830l1919K1467j5078l4970
$$ 736345 697111 645491 629169 633183 612006 550761 593644 619474 587555 609022 593944 558974
8929E58974M1166j08949O1657q6737M0594n2314l8769r259K0755o720O954n8384
$$ 558974 600140 491191 552848 466111 506705 454391 415622 406363 427118 420398 427352 368968
8917C68968l1203K129q713m8877J9870k2438N8963J1626p3336L0666m6279k5292
$$ 368968 337765 339894 331181 282304 302174 279736 338699 350325 276989 307655 261376 236084
8905B36084J08623p2411m0233n2775K218M3199j17734Q0348r2665J2592L2628
$$ 236084 344707 272296 232063 179288 181506 224705 106971 187319 94654 107246 139874
8894A39874N5781l6246N7206l1914k4247p636J3649K7854j0066m8788K327n0607
$$ 139874 195655 159409 216615 184701 160454 152818 166467 194321 184255 135467 137794 87187
8882H7187j0441J6991m9658L4803J410q2886M6322J5000m3753L7469M724k920
$$ 87187 76746 93737 44079 78882 80292 -2594 43728 58728 14975 52444 57168 54248
8870E4248J9013K637m0892Q5738m7275K3492r224J9008J6156m6128M134q0219
$$ 54248 73261 75898 35006 120744 73469 96961 87737 106745 122901 76773 80907 688
8858F88R1288p9859R9494j26759P3811Q326J01219K1199O8431k2402M1715j02650
$$ 688 91976 12117 111611 -15148 58663 66989 168208 189407 257838 235436 277151 174501
8846A74501J20544p2144J57833p2262l8755m7508p7704j638N7085k5832J5342
$$ 174501 295045 222901 380734 308472 269717 222209 144505 142867 199952 174120 189462
8835A89462m4790m4330M7228J794K9816j3800J9020M7162K1625n693P0631O7009
$$ 189462 144672 100342 147570 149364 179180 165380 184400 231562 253187 247494 318125 385134
8823C85134K9258R839R5227O6545Q9331j28546J28440J4317K928n8186K2504M136
$$ 385134 414392 424231 519458 586003 675334 546788 675228 689545 692473 634287 656791 660927
8811F60927L8178k4979O7266p306m1544n940j2026j54439p6212P4153j35574k3577
$$ 660927 699105 674126 741392 734086 692542 686602 674576 520137 443925 518078 382504 358927
8799C58927K1542k8612n1807R807N2900M4216M3890J0484O2390L3305J0550j3103
$$ 358927 380469 351857 300050 309857 362757 406973 450863 461347 523737 557042 567592 554489
8787E54489l5798M5385M3594M3514n5950l652k6639j13370j1155J6944j14087
$$ 554489 518691 564076 607670 651184 595234 591582 564943 451573 440418 457362 343275
8776C43275M4502j5083p6138q705J05683k2990j00000R956k6430l4141J8318K0642
$$ 343275 387777 372694 296556 287851 393534 370544 270544 280500 254070 219929 238247 258889
8764B58889l3416J3333p9217O2002o9887L8502m8807J0341o1323J417J5477J2430
$$ 258889 225473 238806 159589 221591 151704 190206 141399 151740 90417 91834 107311 119741
8752A19741m5885r20r9948L497R132N142k382k2120K3384k1321N1599K4622R867
$$ 119741 73856 72936 -27012 -23515 -14383 -9241 -11623 -33743 -10359 -31680 19919 44541 54408
8739E4408J670j0706l8699J6097K6835j2840r9089Q7487o9601O7344p8694j0477
$$ 54408 56078 45372 6673 22770 49605 36765 -62324 25163 -44438 22906 -55788 -66265
8727f6265L1136n4069k4846Q7587J7689o6831l9961j2799N537j6380K6086K9800
$$ -66265 -35129 -89198 -114044 -26457 -8768 -75599 -115560 -128359 -122822 -139202 -113116 -83316
8715h3316O3271r9093J60M9898k583p9745P5540m5697l772m3270J02897n0386
$$ -83316 -20045 -119138 -118978 -69080 -71663 -151408 -75868 -121565 -125337 -168607 -65710 -116096
8703a16096J2973j6194J1111j8092m611l0166L8873l4159N5019p4756J3626k0830
$$ -116096 -103123 -119317 -108206 -126298 -130909 -161075 -122202 -156361 -101342 -176098 -162472 -183302
8691a83302j2095J00893j09276Q6285J9272J0998n5520k2964J998R601j8916K4337
$$ -183302 -195397 -94504 -203780 -117495 -98223 -87225 -142745 -165709 -163711 -154110 -173026 -148689
8679a48689j7480L7200m6324J151K4766L8970K6113k0944j4982M0873K0939O2491
$$ -148689 -166169 -128969 -175293 -174142 -149376 -110406 -84293 -105237 -120219 -79346 -58407 4084
8667D084j59678K5029j1229N2099l0101l076R992m06r1861R335j9353Q9013L2596
$$ 4084 -155594 -130565 -141794 -89695 -119796 -122872 -112880 -113286 -205147 -195812 -215165 -126152 -93556
8654i3556j30307J11496m7990j4300Q0156n358N2192k0070n2653J0110M2298n5259
$$ -93556 -223863 -112367 -160357 -174657 -94501 -99859 -47667 -67737 -120390 -110280 -67982 -123241
8642a23241N300m2884k7801M7749n5826j2481K0876J7397j1200M8951m4420M2574
$$ -123241 -117941 -160825 -188626 -140877 -196703 -209184 -188308 -170911 -182111 -133160 -177580 -135006
8630a35006J4565L7641p2130l5484P0476J4679N26l5128p5556R1254M678k5272
$$ -135006 -120441 -82800 -154930 -190414 -119938 -105259 -104733 -139861 -215417 -124163 -119485 -144757
8618a44757o847L7142j7279O1098r3316k333N1457o939k4690j8922M0347l4355
$$ -144757 -151604 -114462 -131741 -70643 -163959 -166292 -114835 -121774 -146464 -165386 -125039 -159394
8606a59394j4475M4906J9091m002N5125m6266K6153K2735k2212p7876M6991j6300
$$ -159394 -173869 -128963 -109872 -113874 -58749 -105015 -78862 -56127 -78339 -156215 -109224 -125524
8594a25524K6115l575j13812N2005N0523q344o8683J20464q0924J871Q2149l018
$$ -125524 -99409 -102984 -216796 -164791 -114268 -122612 -191295 -70831 -151755 -149884 -67735 -70753
8582g0753j3359o1358M9694P366p7537O4003N6368n7090K801p903J9654r3240
$$ -70753 -84112 -145470 -95776 -88410 -165947 -101944 -45576 -102666 -99865 -107768 -88114 -181354
8570a81354M1756L6896o1054n678j434K2252o73Q362j6615l1523P866K096M0208
$$ -181354 -139598 -102702 -163756 -169434 -170868 -148616 -149289 -140927 -157542 -189065 -181199 -179103 -138895
8557a38895L2514j3908J8785J6998J0554n5067j1945L9557n2915L5354m9752P6247
$$ -138895 -106381 -120289 -101504 -84506 -73952 -129019 -140964 -101407 -154322 -118968 -168720 -92473
8545i2473j7787r8583J24562q0659M9388N3086l9342n5331j255m6158P5824p2868
$$ -92473 -110260 -208843 -84281 -164940 -115552 -62466 -101808 -157139 -158394 -204552 -128728 -201596
8533b01596k0846K20056j9398j15849L9478o827L7983n6608K403K5104o9267O1873
$$ -201596 -222442 -2386 -21784 -137633 -98155 -104982 -66999 -123607 -121204 -96100 -165367 -103494
8521a03494l1633N660k9407J9801K3335J1325k1153L4494q150K472N385p8287
$$ -103494 -135127 -129467 -158874 -139073 -115738 -104413 -125566 -91072 -99222 -96750 -91365 -169652
8509a69652M5235l1554k0659K7991J129K0126l4155M9816N138o492o1930J31027
$$ -169652 -124417 -155971 -176630 -148639 -147510 -127384 -161539 -111723 -106585 -113077 -175007 -43980
8497d3980j02130O0057j9387K2225j6440k9651j4880M0139k6440J9489K5163N674
$$ -43980 -146110 -86053 -105440 -83215 -99655 -129306 -144186 -104047 -130487 -110998 -85835 -80161
8485h0161n0294Q269l9274J7586R318l1664J7840m409K1189j1776j0844l2203
$$ -80161 -130455 -122186 -161460 -143874 -134556 -166220 -148380 -152789 -131600 -143376 -154220 -186423
8473a86423K9642j1772K2187Q989J3051l18L2724l7712N1611k6734J1270m0391
$$ -186423 -156781 -168553 -146366 -137377 -124326 -124644 -91920 -129632 -78021 -104755 -93485 -133876
8461a33876L4065m8747k2543l152J7159K3418J7431l4354O7110k4130m6126J9836
$$ -133876 -99811 -148558 -171101 -174253 -157094 -133676 -116245 -150599 -83489 -107619 -153745 -133909
8449a33909j0441m3401J09690q9018l5528L0123P6982l1728j9081k4169L2386
$$ -133909 -144350 -187751 -78061 -167079 -202607 -172484 -95502 -127230 -146311 -170480 -138094
8438a38094n435J2275Q9712J2096m5232k5979l7535J4741M5304O449J8922p0877
$$ -138094 -143529 -131254 -41542 -29446 -74678 -100657 -138192 -123451 -78147 -71698 -52776 -123653
8426a23653P8394n9577J7033p214p1293P9480p3852M7619M4732k093l7249P7154
$$ -123653 -45259 -104836 -87803 -95017 -166310 -86830 -160682 -113063 -68331 -70424 -107673 -30519
8414c0519k1576P215M7487N40J5716p2725K978l4661j3395L4441m1208O3627r1389
$$ -30519 -52095 -44880 2607 3147 18863 -53862 -50884 -85545 -98940 -64499 -105707 -42080 -133469
8401a33469N547K2184R1653r6725j744j5876J19318l0735m0569L7666K3400N7769
$$ -133469 -127922 -105738 -14085 -110810 -112554 -128430 -9112 -39847 -80416 -42750 -19350 38419
8389C8419K878m6284k6168m4506L9524m6469K599l0598P9179j6469n2259K4473
$$ 38419 41297 -4987 -31155 -75661 -36137 -82606 -80007 -110605 -31426 -47895 -100154 -75681
8377g5681m5839O5396k2173k9667P7144j10959J01558K0687o4534Q3098m2827
$$ -75681 -121520 -56124 -78297 -107964 -30820 -141779 -40221 -19534 -84068 -970 -43797
8366d3797n5084L6378J9605j01883P4365r41m9883j7399P4552j0409k6364j1498
$$ -43797 -98881 -62503 -42898 -144781 -70416 -71357 -121240 -138639 -64087 -74496 -100860 -112358
8354a12358O9034k4476K6296n2622K0781M2445j16337m620O5151k1517L152Q1574
$$ -112358 -43324 -67800 -41504 -94126 -73345 -30900 -147237 -151857 -86706 -108223 -105071 -23497
8342b3497n0562L0175J4748p5654J6828j7695N2646J001j31259N4464N1843m6631
$$ -23497 -74059 -43884 -29136 -104790 -87962 -105657 -53011 -52010 -183269 -128805 -76962 -123593
8330a23593k9432Q9725q2815N6827m9685N7597j4626M6463P987n9201N1078q1795
$$ -123593 -153025 -63300 -146115 -89288 -138973 -81376 -96002 -49539 -41552 -100753 -49675 -131470
8318a31470J8642L8011n0833J3997N8999r2702J16365n2139K4482k0791n9210
$$ -131470 -112828 -74817 -125650 -111653 -52654 -145356 -28991 -81130 -56648 -77439 -136649
8307a36649R2856m2892q0135j43k2267L5015N6707m2968N2905n0726L2161k1328
$$ -136649 -43793 -86685 -166820 -166963 -189230 -154215 -97508 -140476 -87571 -138297 -106136 -127464
8295a27464J6501O2410n8545M4187o1513N9856m3323K9184j0447j3353n7240m6767
$$ -127464 -110963 -48553 -107098 -62911 -124424 -64568 -107891 -78707 -89154 -102507 -159747 -206514
8283b06514P9652L5239p3113k846K8157M250L3742o9983O8581j4634K8660l4934
$$ -206514 -126862 -91623 -164736 -167582 -139425 -135175 -101433 -171416 -102835 -117469 -88809 -123743
8271a23743J9665k3966N3715n1849o604L6634K8963j5358n4861k268L1007j04140
$$ -123743 -104078 -128044 -74329 -126178 -132782 -96148 -67185 -82543 -137404 -139672 -108665 -212805
8259b12805K5350j6282L6220j3054J14867j42613O0966N96j1700k5951K1452J38575
$$ -212805 -187455 -203737 -167517 -180571 -65704 -208317 -147351 -146755 -158455 -184406 -162954 -24379
8247b4379p2939Q562p5858N3249r430L2216o1853O2049j05570J07174k7824m5187
$$ -24379 -97318 -88756 -164614 -111365 -120795 -88579 -150432 -88383 -193953 -86779 -114603 -159790
8235a59790o1205P6058J6700k3382L9461m4288O8164p3809o104o674n4959P9205
$$ -159790 -220995 -144937 -128237 -151619 -112158 -156446 -88282 -162091 -168195 -174869 -229828 -150623
8223a50623j4529N034r3466J07120p0436O638J4455q221j4475J6860O2920l4445
$$ -150623 -165152 -160118 -253584 -146464 -216900 -210262 -195807 -204028 -218503 -201643 -138723 -173168
8211a73168n795N0582o9201K3068K9671m2905P4314l4461J4580m310P72j9150
$$ -173168 -178963 -128381 -197582 -174514 -144843 -187748 -113434 -147895 -133315 -137625 -136853 -156003
8199a56003M2371J9651j6404N423k2948N5930j37849l2570J19670m7720J08983
$$ -156003 -113632 -93981 -110385 -104962 -127910 -71980 -209829 -242399 -122729 -170449 -61466
8188f1466j11444R618J31204m4596n5930J8362l6573K9993l756j7291J7623j6135
$$ -61466 -172910 -163292 -32088 -76684 -132614 -114252 -150825 -120832 -124588 -141879 -124256 -140391
8176a40391L4742K7855m1286k3383M1409r717Q1549n1238J820l3048N2738n1171
$$ -140391 -105649 -77794 -119080 -142463 -101054 -110771 -29222 -80460 -78640 -111688 -58950 -110121
8164a10121n478K6278M3320o3187l0867N1297l9572l8998Q527O5077q1048P1769
$$ -110121 -115599 -89321 -46001 -109188 -140055 -88758 -128330 -167328 -158801 -93724 -174772 -103003
8152a03003K6342p1500N5841N0144o6020L4932l6238J1135K8203k4645L6360N159
$$ -103003 -76661 -148161 -92320 -42176 -108196 -73264 -109502 -98367 -70164 -94809 -58449 -53290
8140e3290o9964J8507J751k0671j7441M3688q7091P7525m2349P2795o9318K3706
$$ -53290 -123254 -104747 -102996 -123667 -141108 -97420 -184511 -106986 -149335 -76540 -145858 -122152
8128a22152R340L7223l476p798l1318M2702o518J214L336J2348L2410m9631n0179
$$ -122152 -112812 -75589 -79065 -86863 -118181 -75479 -81997 -80783 -77447 -65099 -32689 -82320 -132499
8115a32499O145O4353p4196K2123m9056L9119J3488o9402Q9136m0356j3433J17506
$$ -132499 -126354 -62001 -136197 -114074 -163130 -124011 -110523 -179925 -90789 -131145 -144578 -27072
8103b7072k3666k2472K0664Q578r7314L3649L4077L5161o5249K6496J453L3355
$$ -27072 -50738 -73210 -52546 -43968 -141282 -107633 -73556 -38395 -103644 -77148 -75695 -42340
8091d2340o1299K4925o0347J0988O957J6348p025m6035P1549m1091L2502j8403
$$ -42340 -103639 -78714 -139061 -128073 -121116 -104768 -111793 -157828 -86279 -127370 -94868 -113271
8079a13271k2643J7240M9727p2117P3961n2383K9285K3027p0815M1084l0670k1050
$$ -113271 -135914 -118674 -68947 -141064 -67103 -119486 -90201 -67174 -137989 -96905 -127575 -148625
8067a48625N5758J4541q911o606J9368k8195l6954L8451j7017m5740N1491j8258
$$ -148625 -92867 -78326 -87237 -93843 -74475 -102670 -139624 -101173 -118190 -163930 -112439 -130697
8055a30697K5453j7731K9341L8549q9659M3654K3553N7982q9370J6954l4659N0
$$ -130697 -105244 -122975 -93634 -55085 -144744 -101090 -77537 -19555 -108925 -91971 -126630 -126580
8043a26580j9396M3327k1468M4475j5710L3402q7265j0087O5673j4543l8031r176
$$ -126580 -145976 -102649 -124117 -79642 -95352 -61950 -149215 -159302 -93629 -108172 -146203 -155379
8031a55379K9201J0552M9771n7060L685K2341j5989j9341j2583l193O8016k2507
$$ -155379 -126178 -115626 -65855 -122915 -119230 -96889 -112878 -132219 -144802 -147995 -79979 -102486
8019a02486o060O0851k5964J4540o3557j241K5352k9271M1542n5740j4771J0441
$$ -102486 -108546 -47695 -73659 -59119 -122676 -123917 -98565 -127836 -86294 -142034 -156805 -146364
8007a46364O7891l6800J966K0223K6142j934N438n0318K614J3030J3917n3315
$$ -146364 -78473 -115273 -113307 -93084 -66942 -68876 -63438 -113756 -111142 -98112 -84195 -137510
7995a37510K6678l2315n433K9882l2952P5298m7654j0984N1599j0558n6891L3508
$$ -137510 -110832 -143147 -148580 -118698 -151650 -76352 -124006 -134990 -83391 -93949 -150840 -117332
7983a17332j1283M7155k0481N6537m3690m4334M0712M9667n3267M4492j5251j2726
$$ -117332 -128615 -81460 -101941 -45404 -89094 -133428 -92716 -43049 -96316 -51824 -67075 -79801
7971g9801K1044l1059k3079N0684K2094l0250r1126N0214J8542n2603N2432k419
$$ -79801 -58757 -89816 -112895 -62211 -40117 -70367 -161493 -111279 -92737 -145340 -92908 -95327
7959i5327j9614p128O1270k2384L691l5596K1706m5239O2015o426J9630q3502
$$ -95327 -114941 -122069 -60799 -83183 -79492 -115088 -93382 -138621 -76606 -83032 -63402 -146904
7947a46904l0256K2500L1647K2905k5229M6553N311N772n0426O7496l7698K7181
$$ -146904 -177160 -154660 -123013 -100108 -125337 -78784 -73473 -67701 -118127 -50631 -88329 -61148
7935f1148m50m9019j7973k8784M1344M85l3918R7037k9641K5404Kj9732l9700
$$ -61148 -61598 -110617 -128590 -157374 -116030 -115545 -149463 -52426 -82067 -56663 -56661 -76393 -116093
7922a16093K8620l0565K9655p964O316o7138K3041J04661l2271n777N4008o8471
$$ -116093 -87473 -118038 -88383 -96347 -90031 -157169 -134128 -29467 -61738 -67515 -13507 -81978
7910h1978k4527N0743k9698q0063Q5348k8637m3717L6460R013M2254r3953J46816
$$ -81978 -106505 -55762 -85460 -165523 -80175 -108812 -152529 -116069 -107056 -64802 -158755 -11939
7898a1939j08260M5511Q005q957M2800j2059p1800M3172l6457K989M3559j9955
$$ -11939 -120199 -74688 -66683 -75640 -32840 -44899 -116699 -73527 -109984 -106995 -63436 -83391
7886h3391k6051r84P0235r95o5477K4293l4536l1956J24759j28385K7858J09339
$$ -83391 -109442 -110426 -40191 -41186 -106663 -82370 -116906 -148862 -24103 -152488 -124630 -15291
7874a5291l5778l2265l3362P7324L2819n0669o0224N2332j3121q091r716l0057
$$ -15291 -51069 -83334 -116696 -39372 -6553 -57222 -117446 -65114 -78235 -86326 -96042 -126099
7862a26099Q1293J6652j1943k9333k7718O914j7126L7920r842J23463L45776n76180
$$ -126099 -44806 -28154 -40097 -69430 -97148 -90234 -107360 -69440 -79282 44181 389957 -186223
7850a86223J16169j0744n8649N2742k903k2519J9878k9633j46L0755k6487l4361
$$ -186223 -70054 -80798 -139447 -86705 -89608 -112127 -92249 -121882 -122028 -91273 -117760 -152121
7838a52121L3140J308L6445p180J3922k4374K8258N1028j17650Q8576q996r310
$$ -152121 -118981 -117673 -81228 -88408 -74486 -98860 -70602 -19574 -137224 -48648 -57644 -66954
7826f6954m5279o937K2075P0527R414r3475J3180J17m7164O4533m4779N5651n2164
$$ -66954 -112233 -119170 -97095 -26568 -17154 -110629 -97449 -97332 -144496 -79963 -124742 -69091 -121255
7813a21255n5136L9396L7470K6149j2120J6263l30m483M1758j29288J06588j8117
$$ -121255 -176391 -136995 -99525 -73376 -85496 -69233 -69563 -74046 -32288 -161576 -54988 -73105
7801g3105j2492k1879K5392J8968o8602j7656K8536M8900n8485L9940M457J5889
$$ -73105 -85597 -107476 -82084 -63116 -131718 -149374 -120838 -71938 -130423 -90483 -86026 -70137
7789g0137M7677j08943O2180k6832K4921o8211k2917Q647N1622k9250M6842l3701
$$ -70137 -22460 -131403 -69223 -96055 -71134 -139345 -162262 -153615 -101993 -131243 -84401 -118102
7777a18102M3145N3723r5586k7036K1622M3015k7432k4681N0633l4532M3471m5892
$$ -118102 -74957 -21234 -116820 -143856 -122234 -79219 -106651 -131332 -80699 -115231 -71760 -117652
7765a17652n3311M5239L2999m6145J6574N277O1409p1260O1644q1317O6105n799
$$ -117652 -170963 -125724 -92725 -138870 -122296 -117019 -55610 -126870 -65226 -146543 -80438 -86237
7753h6237o4065O1136p6472J19334p2200R5436l1097K4602p1066L9071j7855o6488
$$ -86237 -150302 -89166 -165638 -46304 -118504 -23068 -54165 -29563 -100629 -61558 -79413 -145901
7741a45901O0206M499l500K0324m3284k7614M6735J8047k6831m6743K3826Q0098
$$ -145901 -85695 -81196 -84696 -64372 -107656 -135270 -88535 -70488 -97319 -144062 -120236 -40138
7729d0138k2137k416J0020Q2481j42157K785p153N5562q3380P9470o3094Q9350
$$ -40138 -62275 -64691 -54671 27810 -114347 -111562 -118715 -63153 -146533 -67063 -130157 -40807
7717d0807o3283N2795o944m0982P6911j1956m1840p1520L8806j2337l6599L0316
$$ -40807 -104090 -51295 -58239 -99221 -22310 -34266 -76106 -147626 -108820 -121157 -157756 -127440
7705a27440O3935K4734m2683N0856l5406k8276m8935P236l3816Q2312M9024k5510
$$ -127440 -63505 -38771 -81454 -30598 -66004 -94280 -143215 -135979 -169795 -87483 -38459 -63969
7693f3969L3941l2204k2616l3193O7726l7167k586L1545k7472p843M6875j07319
$$ -63969 -30028 -62232 -84848 -118041 -50315 -87482 -90068 -58523 -85995 -93838 -46963 -154282
7681a54282J30121q3232M1930o367p9079J12470q8532M5302K8643M2458m6583
$$ -154282 -24161 -107393 -65463 -71830 -150909 -38439 -126971 -81669 -53026 -10568 -57151
7670e7151J5843K1421o1763L3723o5651Q212k8557M0880L3349n8067o964J18033
$$ -57151 -41308 -19887 -81650 -47927 -113578 -105366 -133923 -93043 -59694 -117761 -124725 -6692
7658f692q898n1075m5799J9383J249K759j440K7909o659J8833L8442k555j5835
$$ -6692 -15590 -66665 -112464 -93081 -91832 -89073 -90513 -62604 -69263 -50430 -11988 -14543 -30378
7645c0378o7832M8044J9797q5040J21688k3883j0087r5025P7819l9087j5104M5487
$$ -30378 -98210 -50166 -30369 -115409 6279 -17604 -27691 -122716 -44897 -83984 -99088 -53601
7633e3601j6763k1256j3710M8323l0280K8145K5783K3412j7066L5022l9540R621
$$ -53601 -70364 -91620 -105330 -57007 -87287 -59142 -33359 -9947 -27013 8009 -31531 -21910
7621b1910o2601K0564J909M640j755L6996p7174N9649n4801o4784P1894L6393
$$ -21910 -84511 -63947 -62038 -57398 -59153 -22157 -99331 -39682 -94483 -159267 -87373 -50980
7609e0980L9114l9020j8410L673j0009M3085n5490N510N328j8789K1863r7485
$$ -50980 -11866 -50886 -69296 -65623 -75632 -32547 -88037 -82527 -77199 -95988 -74125 -171610
7597a71610Q4466k6553O5603J9092k637n0104J296J0294j5492j982K7603l2740
$$ -171610 -87144 -113697 -48094 -29002 -31639 -81743 -80447 -70153 -85645 -87627 -60024 -92764
7585i2764N3134L0769m311o0543j2050Q2833n266o1976R003Q2514l5735p2705
$$ -92764 -39630 -8861 -13172 -73715 -85765 -2932 -8198 -70174 -61171 21343 -14392 -87097
7573h7097O3453J022m6286J01028n2766j13163p853N0221O103L5306j7523Q0699
$$ -87097 -23644 -22622 -68908 32120 -20646 -133809 -141662 -91441 -85338 -50032 -67555 13144
7561A3144r3510k0049K1200P5691j7870o4480K8377m611p2565O4296O6396L8414
$$ 13144 -80366 -100415 -79215 -3524 -21394 -85874 -57497 -62108 -134673 -70377 -3981 34433
7549C4433q8327K1616J0632o5852M0991l1513k8679j627N9239n6234l5526K8794
$$ 34433 -53894 -32278 -21646 -87498 -46507 -78020 -106699 -108326 -49087 -105321 -140847 -112053
7537a12053O4475M2419o5613K6215M9029p4023l74O476O5152m7983M2550l2184
$$ -112053 -47578 -5159 -70772 -44557 4472 -69551 -69925 -63449 1703 -46280 -3730 -35914
7525c5914j5540l392O3329R259L3845j355J0280k5194M9749j3637M4056N8936
$$ -35914 -51454 -54846 8483 17742 51587 50232 60512 35318 85067 71430 115486 174422
7513A74422J598M017J17480o0951l3072o1744l0601K8649r9967L1642o0574L9661
$$ 174422 176020 180037 297517 236566 203494 141750 111149 139798 39831 71473 10899 50560
7501E0560o8927j1687J3270P4529j12837K0918n839m5591P7361k5461j1374R592
$$ 50560 -18367 -30054 -16784 57745 -55092 -34174 -40013 -85604 -8243 -33704 -45078 -35486
7489c5486M5313l8713K1940k9759J5116K6212k9077j9627j1906k841K0507o3301
$$ -35486 9827 -28886 -6946 -36705 -21589 4623 -24454 -44081 -55987 -58828 -38321 -101622
7477a01622K4496P8061k7569L7082l0025j4445n2880N1272j1787M5507n521l8970
$$ -101622 -77126 935 -26634 10448 -19577 -34022 -86902 -35630 -47417 -1910 -7431 -46401
7465d6401J7176p1134M1870n6738P9338m9229l659P8272q0304P4611k2245N7398
$$ -46401 -29225 -100359 -58489 -115227 -35889 -85118 -88777 -10505 -90809 -16198 -38443 18955
7453A8955p8487L1113L3242k24l3512p172j2114J928m0825P4350j8207O761j0472
$$ 18955 -59532 -28419 4823 4599 -28913 -36085 -48199 -46271 -87096 -12746 -30953 -24192 -34664
7440c4664n8681M3567k0650q9937R4372J7760j0899L5357L5998M6566k0580m6056
$$ -34664 -93345 -49778 -70428 -160365 -65993 -48233 -59132 -23775 12223 58789 38209 -7847
7428g847q702o6639J45296k0196l542p9551J82289j22205k9724J0878N2568m715
$$ -7847 -16549 -83188 62108 41912 38370 -41181 141108 18903 -10821 57 52625 47910
7416D7910j09539N3154L6892n4297M3886N7905r5056J06467j0382K2752o2553
$$ 47910 -61629 -8475 28417 -25880 18006 75911 -19145 87322 76940 99692 37139
7405C7139K0605j3330j00997K5726K1961N7250q184n1562j3867J27904j33656
$$ 37139 57744 44414 -56583 -30857 -8896 48354 40170 -11392 -25259 102645 -31011
7394c1011P9924l0814j0112n395l4122Q3546K7930R599o9198K1695j3424l1085
$$ -31011 48913 18099 7987 2592 -31530 52016 79946 89545 20347 42042 28618 -2467
7382b467N7411p023j3514l0053k4390l8325Q4533L5153N6698n1691k3631N2543
$$ -2467 54944 47921 34407 4354 -20036 -58361 26172 61325 118023 66332 42701 95244
7370I5244M6498n3677q1454M3228k8719N1065l0519J26347m4807k0719L3108M5136
$$ 95244 141742 88065 6611 49839 21120 72185 41666 168013 123206 102487 135595 180731
7358A80731K629O5666R2888P6051O6228P1834K04249K38921L84165L76746M24495
$$ 180731 183360 249026 341914 417965 484193 556027 760276 999197 1383362 1760108 2184603
7347B184603M52668K52277J60216j57601l55046l44836k88764l85693j94966k34527
$$ 2184603 2637271 2889548 3049764 2892163 2537117 2192281 1903517 1517824 1322858 1088331
7337A088331j66288k07896m2884j62077n8885o6761p9996p6026L4268p0375J1823
$$ 1088331 922043 714147 671263 509186 450301 383540 303544 227518 261786 191411 203234
7326B03234J8202o0663j06871J9074O5621J4965o1397k0378L8934r563p5877Q2091
$$ 203234 221436 160773 53902 72976 138597 153562 92165 71787 110721 101158 25281 107372
7314A07372j7754j7108l1352J7464j7538l1835M7510o6222M2300j3212P5823M8290
$$ 107372 89618 72510 41158 58622 41084 9249 56759 -9463 32837 19625 95448 143738
7302A43738p1674l2189L0081r607m2119m470k178L058j09897M1361K5172N1133
$$ 143738 72064 39875 69956 60349 18230 13760 11582 14640 -95257 -53896 -28724 22409
7290B2409o5018M2061N9302j15660L9452P2827l2430L8270o4761n909o3706R8508
$$ 22409 -42609 -548 58754 -56906 -17454 55373 22943 61213 -3548 -9457 -73163 25345
7278B5345L763N212j8177K1566j18030N2200m1074R8794n890P667j12039O4379
$$ 25345 29108 34320 16143 37709 -80321 -28121 -69195 29599 23709 31376 -80663 -16284
7266a6284O2712k4980p2698o107N5608L2362n2122M527M8450J8332m9315n7865
$$ -16284 46428 21448 -51250 -57357 -1749 30613 -21509 -16982 31468 49800 485 -57380
7254e7380J12923L160k393j12748L8815J1286L292l7248n5024M5609k4498K0436
$$ -57380 55543 58703 56310 -56438 -17623 -6337 -3045 -40293 -95317 -49708 -74206 -53770
7242e3770N3889N6588n2029r0158O2432J501N3114j07153R5147Q368m9981q167
$$ -53770 119 56707 4678 -85480 -23048 -21547 31567 -75586 19561 27929 -22052 -30219
7230c0219J5861P5751j0488l2854J541k3913Q0797M1425j07331n8314l73K2825
$$ -30219 -14358 61393 50905 18051 19592 -4321 76476 117901 10570 -47744 -48117 -25292
7218b5292n3039R8854j659L144n8657N0517L670K4656M561k2593Q28k7616j4050
$$ -25292 -78331 20523 18864 22008 -36649 13868 17538 42194 46755 24162 24990 -2626 -16676
7205a6676k5212M8926l8113k3416k0429m1407J75475j4281l1556m736j7132O4802
$$ -16676 -41888 7038 -31075 -54491 -74920 -116327 59148 44867 13311 8575 -8557 56245
7193E6245L0079p2646k0581k4603q983J361o5691N8009K1884n1356K8757J15168
$$ 56245 86324 13678 -6903 -31506 -40489 -39128 -104819 -46810 -24926 -76282 -47525 67643
7181F7643J3090M338j6292J9163p6253k5749p4445J03683n3059O7686m5061N1335
$$ 67643 80733 85071 68779 87942 11689 -14060 -88505 15178 -37881 29805 -15256 36079
7169C6079K1726n4701P6829J1946m0756O5048O372N5354n1729Q6677k604P560
$$ 36079 57805 3104 79933 91879 51123 116171 122543 177897 126168 212845 210241 217801
7157B17801L9178j711K8845l9782o3509M3721o088M4875j2509N1838k4900K991
$$ 217801 256979 255268 284113 244331 180822 224543 218455 263330 250821 302659 277759 280750
7145B80750Q7132n4972q2662l144p4967l1182J6649k5469K4761q0466Q4051k1830
$$ 280750 367882 312910 230248 227104 152137 120955 137604 112135 136896 56430 140481 118651
7133A18651q1773j2847O0322O2747j44193N9995k1297m8212r9384J44851p402
$$ 118651 36878 24031 84353 147100 2907 62902 41605 -6607 -105991 38860 31458
7122C1458M662K2600J8679n5665J3717k9607R508n8711J26507k7721k0334P2325
$$ 31458 36120 58720 77399 21734 35451 5844 15352 -43359 83148 55427 35093 107418
7110A07418k4175p5410N6997l0877N3329k5707l3750J485K6710j0246l384j01535
$$ 107418 83243 7833 64830 33953 87282 61575 27825 29310 56020 45774 42390 -59145
7098e9145J09414o0575M5988m8809O2158L7505l9351M2010j1048K8352N2198J2369
$$ -59145 50269 -10306 35682 -13127 49031 86536 47185 89195 78147 106499 158697 171066
7086A71066j32694J9167r1417P4938q3121J8890J5606L0189M4708J4511P879K6632
$$ 171066 38372 57539 -33878 41060 -42061 -23171 -7565 22624 67332 81843 89722 116354
7074A16354K6115n4546n4480K4949J9847l0612K3575J7970Q289q470o7436J21232
$$ 116354 142469 87923 33443 58392 78239 47627 71202 89172 97461 88991 21555 142787
7062A42787j02734K9609j6937n5048R4303J6210j4185p7724Q1962j3767O3057
$$ 142787 40053 69662 52725 -2323 91980 108190 94005 16281 98243 84476 147533
7051A47533m0866l834k6371n895J6211j9617L7843L3405n3225O8849j3393L5536
$$ 147533 106667 102833 76462 70567 86778 67161 105004 138409 85184 154033 140640 176176
7039A76176j7796J8458m2813J100o1733J37313q599L5387J26560p5173M256J4026
$$ 176176 158380 176838 134025 135125 73392 210705 202106 237493 364053 288880 293136 307162
7027C07162K4187p4240l193n6285L8145j15058L3658k7927N0487M2086j4678l4405
$$ 307162 331349 257109 253916 197631 235776 120718 154376 126449 176936 219022 204344 169939
7015A69939L7869j5716P2165K891l4990l4583R6270k0924j1264L482l9301Q7615
$$ 169939 207808 192092 264257 267148 232158 197575 293845 272921 261657 265139 225838 313453
7003C13453j09671R3032M2183j05831K1691L241L9757r8586J30417N02r298q830
$$ 313453 203782 296814 338997 233166 254857 258098 297855 199269 329686 330188 320890 312060
6991C12060j9367R4388J6722L8693p0766R6840N202N8334o8760J15954N2516J07564
$$ 312060 292693 387081 403803 442496 371730 468570 473772 532106 463346 579300 631816 739380
6979G39380R194J03828L3476j847M2890n5782K178O8274J53300K80J96646J22429
$$ 739380 748574 852402 885878 884031 926921 871139 873317 941591 1094891 1095171 1291817 1414246
6967A414246K47266K88697O04055P34435O86142N55458P8190j1116l92587m54929
$$ 1414246 1661512 1950209 2554264 3288699 3974841 4530299 4608489 4597373 4204786 3749857
6957C749857m54385l44223k59030j63703j00254p9119m1554j52945q2884l6809
$$ 3749857 3295472 2951249 2692219 2528516 2428262 2349143 2307589 2154644 2071760 2034951
6947B034951k2835J8409J29474Q3227K10021L54864N47808P67697J186413J599209
$$ 2034951 2012116 2030525 2159999 2243226 2453247 2808111 3355919 4123616 5310029 6909238
6937F909238J378058Q10888k3734n62542r64831j067613j065458q23727p25350
$$ 6909238 8287296 9098184 9074450 8511908 7547077 6479464 5414006 4590279 3864929
6928C864929m79352l90193l23717j91401k41370p8570j49602n664N397k370k288
$$ 3864929 3385577 2995384 2671667 2480266 2238896 2160326 2010724 2005060 2010457 2008087 2005799
6917B005799J22026J16110K75894M30191O21628P96894N37643K30066j97862n18582
$$ 2005799 2127825 2243935 2519829 2950020 3571648 4368542 4906185 5136251 4938389 4419807
6907D419807n02012n43602n66126m80859k34563l27603k67868k24941l3217j97208
$$ 4419807 3917795 3374193 2808067 2327208 2092645 1765042 1497174 1272233 1239016 1041808
6897A041808L7j21964j04050r2760J5662K6480l3938n1071L5395j0452j40540
$$ 1041808 1041845 919881 815831 723071 738733 765213 731275 680204 715599 705147 564607
6886E64607J52284O7222j8134p626M7122m2764m6067k7694p1889j0554o1792m6596
$$ 564607 716891 784113 765979 758353 805475 762711 716644 688950 617061 606507 544715 498119
6874D98119q457N6599l7432n4625K7162l9414M0915o5345P0833j0921k8573j5694
$$ 498119 489662 546261 508829 454204 481366 441952 482867 417522 488355 477434 448861 433167
6862D33167N1577l0186J8255r192J18968j68925Q1395j9588n7253O460m1268j3084
$$ 433167 484744 454558 472813 463621 582589 413664 495059 475471 418218 424678 383410 370326
6850C70326r621O3575K5770l6052j11059M5315K1187J2966o2121m601J5409J03853
$$ 370326 360705 424280 450050 413998 302939 348254 369441 382407 320286 315685 331094 434947
6838D34947L5382m4140M2048j1757K736j70646N7967M1924p767l2212q2767q510
$$ 434947 470329 426189 468237 456480 459216 288570 346537 388461 380694 348482 265715 257205
6826B57205k4476L8330o450Q5831K9322n4149j8195N9996k0135N465J9745p3882
$$ 257205 232729 271059 264609 350440 379762 325613 307418 367414 347279 352744 372489 298607
6814B98607R6317J2610n059k4859O5843Q0823q3158K4248J11442K0206L5130n4102
$$ 298607 394924 407534 402475 377616 443459 524282 441124 465372 576814 597020 632150 578048
6802E78048q1424j291m2693n0951l8746k7J999k1337l0351P9023j6800K458M9114
$$ 578048 496624 495333 452640 401689 362943 362916 364915 343578 313227 392250 375450 377908 427022
6789D27022L0803N3935o3301l886k4785L7318j62113k287m7061J19397l4763n4460
$$ 427022 457825 511760 448459 444573 419788 457106 294993 292706 245645 365042 330279 275819
6777B75819k2408K2026O0314m8992L5744q4292J48508K3840Q6928L8546R8933
$$ 275819 253411 275437 335751 286759 322503 238211 386719 410559 497487 536033 634966
6766F34966J33303L336k5565L7306m7773j29103k6536o4372q3800q4618O1257
$$ 634966 768269 771605 746040 783346 735573 606470 579934 515562 431762 347144 408401
6755D08401m999m8948n6599Q9804R562l2198P8755n0242O9492M1704J57110L2847
$$ 408401 403402 354454 297855 387659 397221 365023 443778 393536 463028 504732 661842 694689
6743F94689J57563O2489j02691J7149L6940N6856m257R5171o216O6897n5021Q3001
$$ 694689 852252 914741 812050 829199 866139 922995 918738 1013909 1007693 1074590 1019569 1102570
6731A102570j38227K2859q6639M5429n0561L7540r9346l2705j19239R099J0880
$$ 1102570 964343 987202 900563 945992 895431 932971 833625 800920 681681 690780 701660
6720G01660q5347K8275J6594L1561o6777j0070R756k6408o785P2602M5792J22458
$$ 701660 616313 644588 661182 692743 625966 615896 625652 599244 592459 665061 710853 833311
6708H33311R1698K01974O1624J30824R2028q307P0301o7490p0452j04703n5049
$$ 833311 925009 1126983 1188607 1319431 1411459 1403152 1473453 1405963 1335511 1230808 1175759
6697A175759l9184j05543n3989m7535j224J109P8917k0487L9424o6307j0555J4775
$$ 1175759 1136575 1031032 977043 929508 928284 929393 1008310 987823 1027247 960940 950385 965160
6685I65160Q324J02597R9251M879L1467N3624j14395l8998j3404j06643j04341
$$ 965160 973484 1076081 1175332 1180211 1211678 1265302 1150907 1111909 1098505 991862 887521
6674H87521J2142L572o685l4043j7216o9568L64J26764k5689Q5837o2662J05177
$$ 887521 899663 903235 896550 862507 845291 775723 776087 902851 877162 962999 900337 1005514
6662A005514n889l7294K2887k7844M3291P8225K233n573N2755j09834J6914J7428
$$ 1005514 999625 962331 985218 957374 1000665 1078890 1081123 1075550 1128305 1018471 1035385 1052813
6650A052813l3484n8222J82646P1899r605Q1078Q7381M7812k9406K1246k485Q6562
$$ 1052813 1019329 961107 1143753 1215652 1206047 1287125 1374506 1422318 1392912 1414158 1411673 1498235
6638A498235o2010J5950r1392k3494n3849p6358k196j29293R6553m7704k0195
$$ 1498235 1436225 1452175 1360783 1337289 1283440 1207082 1204886 1075593 1172146 1124442 1104247
6627A104247L1969n2479O0808M4148M6806M2574j7513K5885m6131m9728o1898
$$ 1104247 1136216 1083737 1144545 1188693 1235499 1278073 1260560 1286445 1240314 1190586 1128688
6616A128688j05096j4744o3316k3439O3744j0410p0470M3366n2430r0029O9361
$$ 1128688 1023592 1008848 945532 922093 985837 975427 904957 948323 895893 805864 875225
6605H75225P0154P1832J4851J28955J02638J1385N7328N4750P0786J20617P8098
$$ 875225 945379 1017211 1032062 1161017 1263655 1275040 1332368 1387118 1457904 1578521 1656619
6594A656619J95036J98552J70940O9983j04395l1717j34487j65014k10751o5485
$$ 1656619 1851655 2050207 2221147 2291130 2186735 2155018 2020531 1855517 1644766 1579281
6584A579281j87015j48092m3952q7281K3511J0346J6821k1079J619p432n0174
$$ 1579281 1392266 1244174 1200222 1112941 1136452 1146798 1163619 1142540 1144159 1136727 1086553
6573A086553O8402n5665O6452k1892l1806k4403P1631m2640K2098J8064r900l1774
$$ 1086553 1154955 1099290 1165742 1143850 1112044 1087641 1159272 1116632 1138730 1156794 1146894 1115120
6561A115120N5561q8m3145K8827o6969R197J0914J28746o8336K8771O6708P0790
$$ 1115120 1170681 1170593 1127448 1156275 1089306 1098503 1109417 1238163 1169827 1198598 1265306 1336096
6549A336096o1161M3432o2364l5344P2986k3343L40j9938N7672p6024j3914J3691
$$ 1336096 1274935 1318367 1256003 1220659 1293645 1270302 1270642 1250704 1308376 1232352 1218438 1232129
6537A232129J7559l7364J5698J5679k8435M6017J5609M6063o0674R9123L9979
$$ 1232129 1249688 1212324 1228022 1243701 1215266 1261283 1276892 1322955 1262281 1361404 1401383
6526A401383K3262L3434j0573Q535p684Q5387r8180J8505J1797P420j04835p739
$$ 1401383 1424645 1458079 1447506 1456041 1448357 1533744 1435564 1454069 1465866 1473286 1368451 1360712
6514A360712L9777L3439p0952M3129j6084N943Q3486p3967Q5257k1528J4168m0424
$$ 1360712 1400489 1433928 1362976 1406105 1390021 1395964 1479450 1405483 1490740 1469212 1483380 1442956
6502A442956M3781k705N9383J345R268k2198l1187n439q3694R2284J7023o184
$$ 1442956 1486737 1484032 1543415 1544760 1554028 1531830 1500643 1495204 1411510 1503794 1520817 1514633
6490A514633L3740n2223o5761j0209l2670P7597L3783K834Q5058j12422J18906
$$ 1514633 1548373 1496150 1430389 1420180 1387510 1465107 1498890 1501724 1586782 1474360 1593266
6479A593266K58o960n722R4375K8043m6637M6064P8116N325n17P9533K8663R4587
$$ 1593266 1593524 1586564 1580842 1675217 1703260 1656623 1702687 1780803 1786128 1785611 1865144 1893807 1988394
6466A988394P346L1179P7697q874L6290m9859O0456Q6286L3028K1058K2025Q2587
$$ 1988394 1995740 2026919 2104616 2095742 2132032 2082173 2142629 2228915 2261943 2283001 2305026 2387613
6454B387613K1801J5879Q2551J2028O5897J38509N7890J34150L3761J68881j9455
$$ 2387613 2409414 2425293 2507844 2519872 2585769 2724278 2782168 2916318 2950079 3118960 3099505
6443C099505J7340J13324o9665n6957K5643J13896n0149L9586j8041M9411n830
$$ 3099505 3116845 3230169 3160504 3103547 3129190 3243086 3192937 3232523 3214482 3263893 3258063
6432C258063J13877K2093O0654N1562J54504O4055N5150O6784J04534R2396J21385
$$ 3258063 3371940 3394033 3454687 3506249 3660753 3724808 3779958 3846742 3951276 4043672 4165057
6421D165057J41381K02099J30867J04817J68893K25520L18788K99127K35507L38917
$$ 4165057 4306438 4508537 4639404 4744221 4913114 5138634 5457422 5756549 5992056 6330973
6411F330973J40426J86889J65443K31265J48227R1667J05992J3660p9989n5621
$$ 6330973 6471399 6658288 6823731 7054996 7203223 7294890 7400882 7414542 7334553 7278932
6401G278932n0499o6936r7068K6185Q9634R1891K42295K56018K45610J25667J75050
$$ 7278932 7228433 7161497 7064429 7090614 7180248 7272139 7514434 7770452 8016062 8141729 8316779
6390H316779K24028K00381J63116J16926K78226J49625K69876K76786L71916K80696
$$ 8316779 8540807 8741188 8904304 9021230 9299456 9449081 9718957 9995743 10367659 10648355
6380A0648355N59399N66400O57191P23471R31187R31535J111574J222742J683866
$$ 10648355 11207754 11774154 12431345 13154816 14086003 15017538 16129112 17351854 19035720
6371A9035720K127737K978823M207460O788200J0326152J3170651J2125896O882987
$$ 19035720 21163457 24142280 28349740 35137940 45464092 58634743 70760639 77643626
6363G7643626J012048l618926o694223p396373o766301n818571m657298l440425
$$ 77643626 78655674 75036748 68342525 60946152 54179851 48361280 43703982 40263557
6355D0263557k074854o18251N99526J805494L403690N390039P224785R113087
$$ 40263557 38188703 37570452 38169978 39975472 43379162 48769201 55993986 65107073
6347F5107073J1307517J3195985J3385778J1461730P719358K940040j297006m424293
$$ 65107073 76414590 89610575 102996353 114458083 122177441 125117481 123820475 119396182
6339A19396182n960528o622663o285254n018997k981360P4234M947297J2923256
$$ 119396182 113435654 106812991 100527737 95508740 92527380 92601614 97548911 110472167
6331A10472167K5133778L8802638M6946522M3913149L0558435J2049381m072464
$$ 110472167 135605945 174408583 221355105 265268254 295826689 307876070 303803606
6324C03803606j4951633k1674539k6616541k9992695l0743624k9262666k5875767
$$ 303803606 288851973 267177434 240560893 210568198 179824574 150561908 124686141
6317A24686141k1370856j7030603j3585736j0920824q602103o588833n015191
$$ 124686141 103315285 86284682 72698946 61778122 53176019 46587186 41571995
6310D1571995l981886l114984k652518k174783j855835j556952j403709j086552
$$ 41571995 37590109 34475125 31822607 29647824 27791989 26235037 24831328 23744776
6302B3744776r61454p43817q22088p35490m99967m80072m71360m60051n77809
$$ 23744776 22783322 22039505 21217417 20481927 19981960 19501888 19030528 18570477 17992668
6293A7992668o32388p45818o75062o63399o46491m91250m98715l59827k41814
$$ 17992668 17360280 16614462 15939400 15276001 14629510 14138260 13639545 13279718 13037904
6284A3037904k79818k32924k36322k68795k59935j80476l15777k40465k35657
$$ 13037904 12758086 12525162 12288840 12020045 11760110 11579634 11263857 11023392 10787735
6275A0787735k21071k83924m23614k58529l11470l52405k63101l05145k60415
$$ 10787735 10566664 10282740 9859126 9600597 9289127 8936722 8673621 8368476 8108061
6266H108061k56506j82865j88721j94425j78731n7958j04067k8701K0499M0311
$$ 8108061 7851555 7668690 7479969 7285544 7106813 7048855 6944788 6916087 6936586 6976897
6256F976897J6291P512j10854q6364l06611j96009k76665j88489j93364k3232
$$ 6976897 6993188 7000700 6889846 6803482 6496871 6300862 6024197 5835708 5642344 5619112
6246E619112r5832M9165J44380J65607L22142J46670O9267J16690k67800j75018
$$ 5619112 5523280 5572445 5716825 5882432 6204574 6351244 6420511 6537201 6269401 6094383
6236F094383l59398l09306k49147k42938j95555j67858j5626n3107o2634o7683
$$ 6094383 5734985 5425679 5176532 4933594 4738039 4570181 4554555 4501448 4438814 4371131
6226D371131j13644j86785j46784j07866j81020j30163q8906p4787n8924j153
$$ 4371131 4257487 4070702 3923918 3816052 3635032 3504869 3415963 3341176 3282252 3281099
6216C281099K3045j75734m1216J10196j49191J3643J9048p0915l3551q2059n2555
$$ 3281099 3304144 3128410 3087194 3197390 3048199 3061842 3080890 3009975 2976424 2894365 2841810
6205B841810j29488L2315p3023j22170k6435p4283j8119o1017m3713j1745m6379
$$ 2841810 2712322 2744637 2671614 2549444 2523009 2448726 2430607 2369590 2325877 2314132 2267753
6194B267753j1237J7810L8776j05514M9109J543r4676N0083L122O2770m8789M5287
$$ 2267753 2256516 2274326 2313102 2207588 2256697 2258240 2163564 2213647 2216769 2279539 2230750 2276037
6182B276037j2683k0618j08004k8194m4466o0730l4711K7521p1129l3398o1446
$$ 2276037 2263354 2242736 2134732 2106538 2062072 2001342 1966631 1994152 1923023 1889625 1828179
6171A828179N0290m0334n8149O2251L0860l4465Q5870L7326J24671R1793J29587
$$ 1828179 1878469 1838135 1779986 1842237 1873097 1838632 1924502 1961828 2086499 2178292 2307879
6160B307879J84510J44535J75916Q8243O4662J71317Q5196m0197R0555q8266j05327
$$ 2307879 2492389 2636924 2812840 2901083 2965745 3137062 3222258 3182061 3272616 3184350 3079023
6149C079023j62533j47530p5780q4841O3190Q2867P4322J55770M9162j05916m7914
$$ 3079023 2916490 2768960 2693180 2608339 2671529 2754396 2828718 2984488 3033650 2927734 2879820
6138B879820r3969j89880j59595k06966j18760n7661j52298q1347M0505j26657
$$ 2879820 2785851 2595971 2436376 2229410 2110650 2052989 1900691 1819344 1859849 1733192
6128A733192M1644j30494q1N8603k7303L5329o4165J04111n260j9621l490n24
$$ 1733192 1774836 1644342 1644261 1702864 1675561 1710890 1646725 1750836 1745576 1725955 1722465 1721941
6116A721941j22156p323j23329j3179k3147j25763J182p7849j888M7266K6055
$$ 1721941 1599785 1592462 1469133 1455954 1432807 1307044 1308226 1230377 1228489 1275755 1301810
6105A301810K0066K4861K9210m6676j5707n0535n6575m654J9196o265k6180K889
$$ 1301810 1321876 1346737 1375947 1329271 1313564 1263029 1206454 1201800 1220996 1214731 1188551 1191440
6093A191440P7415l2964M1123L5723p1903M3516M0086J0541J2774P6508N8678
$$ 1191440 1268855 1235891 1277014 1312737 1240834 1284350 1324436 1334977 1347751 1424259 1482937
6082A482937N8319j586M6902q0383j9366o5972p1938p598o5849J7656L7926N2562
$$ 1482937 1541256 1539670 1586572 1506189 1486823 1420851 1348913 1341315 1275466 1293122 1331048 1383610
6070A383610m236M0600K2746Q5439N6624J21851K19071K01494L60290K13578K40740
$$ 1383610 1379374 1419974 1442720 1528159 1584783 1706634 1925705 2127199 2487489 2701067 2941807
6059B941807N4184j02032k07757j98436j60335j88939j64576k01986q3359r4315
$$ 2941807 2995991 2893959 2686202 2487766 2327431 2138492 1973916 1771930 1688571 1594256
6049A594256j3737q6303J560K496Q5771k4350k7595J04711Q6472j19156O7701
$$ 1594256 1580519 1494216 1495776 1498272 1584043 1559693 1532098 1636809 1723281 1604125 1671826
6038A671826k465r9940m3705p0444j9749j58594M5157j7725o060L7037N4195L2677
$$ 1671826 1669361 1569421 1525716 1455272 1435523 1276929 1322086 1304361 1298301 1335338 1389533 1422210
6026A422210k7318M8245M9129l773l785k9232l1956P2676p598r1698O6247q8643
$$ 1422210 1394892 1443137 1492266 1488493 1484708 1455476 1423520 1496196 1488598 1396900 1463147 1374504
6014A374504n486k2577O3304j00846o1574R8859k515n1435l6645K3973O5391m0084
$$ 1374504 1369018 1346441 1409745 1308899 1247325 1346184 1343669 1292234 1255589 1279562 1344953 1304869
6002A304869J4193P7030K4715O9126k0980k8335n0399O7981L3609k8691l8754
$$ 1304869 1319062 1396092 1420807 1489933 1468953 1440618 1390219 1458200 1491809 1463118 1424364
5991A424364k3817O0735j39386P434N6961O7927o5650J13809j2895k7993l2813
$$ 1424364 1400547 1461282 1321896 1329330 1386291 1454218 1388568 1502377 1489482 1461489 1428676
5980A428676L620O6782o7689j226L0622O9557L3970P0054j2776p3820O8558L721
$$ 1428676 1432296 1499078 1431389 1430163 1460785 1530342 1564312 1634366 1621590 1547770 1616328 1620049
5968A620049P223k0748P116L0349P7327j5995N1706J40849P0723l5000Q9942J16867
$$ 1620049 1627272 1606524 1613640 1643989 1721316 1705321 1757027 1897876 1968599 1933599 2023541 2140408
5956B140408Q9892J72987J78792K52190K09506K43098J59628K6204p3271j43828
$$ 2140408 2230300 2403287 2582079 2834269 3043775 3286873 3446501 3472705 3399434 3255606
5946C255606k04534k70523j43347j20297o8005j90696k070j22274M2613m7465
$$ 3255606 3051072 2780549 2637202 2516905 2448900 2258204 2256134 2133860 2176473 2129008
5936B129008K2734j5158J09652l4696J07529K012K1458n2695O3939j27197P9002
$$ 2129008 2151742 2136584 2246236 2211540 2319069 2321081 2342539 2289844 2353783 2226586 2305588
5925B305588O7467p9453L74K0665K4146M7204R194J06030j01027R5535L2618j9265
$$ 2305588 2373055 2293602 2293976 2314641 2338787 2385991 2395185 2501215 2400188 2495723 2528341 2509076
5913B509076R9962J23909K2324P1457L8744J47142K5475J41408K6840R2001M2230
$$ 2509076 2609038 2732947 2755271 2826728 2865472 3012614 3038089 3179497 3206337 3298338 3340568
5902C340568J47387J7644J37029J89520J82958K27954J29068P5574o6946p3491
$$ 3340568 3487955 3505599 3642628 3832148 4015106 4243060 4372128 4447702 4380756 4307265
5892D307265r1166j51252k0836p8808r6489o385Q6254n6365J34648R1671L2573
$$ 4307265 4216099 4064847 4044011 3965203 3868714 3862329 3948583 3892218 4026866 4118537 4151110
5881D151110R5117q7959k2841P3622L5164l776k2441J1585o2157J16978j4432
$$ 4151110 4246227 4158268 4135427 4209049 4244213 4240437 4217996 4229581 4167424 4284402 4269970
5870D269970o774J08071K8529Q8374N8973k0495J64773O8994Q1228Q3609J31949
$$ 4269970 4263196 4371267 4399796 4488170 4547143 4526648 4691421 4760415 4841643 4925252 5057201
5859E057201J6054R0855Q4979k7444M0430R8714Q5425p9089J59377j7089K7529
$$ 5057201 5073255 5164110 5249089 5221645 5262075 5360789 5446214 5367125 5526502 5509413 5536942
5848E536942J84162P8737N9494k3459J53588O6886O8000Q1038J27274O8910R3176
$$ 5536942 5721104 5799841 5859335 5835876 5989464 6056350 6124350 6205388 6332662 6401572 6494748
5837F494748J13431N2492R9111O9668J70261J02650J45025R6486J60031J37090
$$ 6494748 6608179 6660671 6759782 6829450 6999711 7102361 7247386 7343872 7503903 7640993
5827G640993K24920N6976J39598J73739O8947J27893J84974K20698P9853K16497
$$ 7640993 7865913 7922889 8062487 8236226 8305173 8433066 8618040 8838738 8918591 9135088
5817I135088J04376K10597J86920J44763K07355K64250J71830K48137K39983K77472
$$ 9135088 9239464 9450061 9636981 9781744 9989099 10253349 10425179 10673316 10913299 11190771
5807A1190771K22960K36675K62009K97369K34122K46998K84682K49037L43952
$$ 11190771 11413731 11650406 11912415 12209784 12443906 12690904 12975586 13224623 13568575
5798A3568575L14800K81059K88403K76756L25633L26367M28795K95480M09561
$$ 13568575 13883375 14164434 14452837 14729593 15055226 15381593 15810388 16105868 16515429
5789A6515429M20642L52978M35483M04336L42850L89903M45474L80510M22406
$$ 16515429 16936071 17289049 17724532 18128868 18471718 18861621 19307095 19687605 20110011
5780B0110011M12309M81187M03698N91421M40662N64360N43494N13532N72769
$$ 20110011 20522320 21003507 21407205 21998626 22439288 23003648 23547142 24060674 24633443
5771B4633443N57060O48736O38333N71536O18906N95814O09277O35894N77210
$$ 24633443 25190503 25839239 26477572 27049108 27668014 28263828 28873105 29508999 30086209
5762C0086209O29730P17651O92865O30574O34400P83672O19807O90421O18567
$$ 30086209 30715939 31433590 32126455 32757029 33391429 34175101 34794908 35485329 36103896
5753C6103896O40127O05270M80867M50925O15691L65777L95772N10003L22131
$$ 36103896 36744023 37349293 37830160 38281085 38896776 39262553 39658325 40168328 40490459
5744D0490459L88725K81715K54331K58250Q7202O7402N1597j5001j13663j09852
$$ 40490459 40879184 41160899 41415230 41673480 41760682 41828084 41879681 41864680 41751017 41641165
5734D1641165k09263l37944k68266k90382m58555m40134l92594m65690n05256
$$ 41641165 41431902 41093958 40825692 40535310 40076755 39636621 39244027 38778337 38273081
5725C8273081n10317n39468n33003n16483m15096l89188n06540n74587o47069
$$ 38273081 37762764 37223296 36690293 36173810 35758714 35369526 34862986 34288399 33641330
5716C3641330p55095p11941p79769o90125o83032n89508o44187m92566o13134
$$ 33641330 32886235 32174294 31394525 30704400 30021368 29431860 28787673 28295107 27681973
5707B7681973n47160o39470n15263n56612m93843l18571k98815k72968m39336
$$ 27681973 27134813 26495343 25980080 25423468 24929625 24611054 24312239 24039271 23599935
5698B3599935m15566n20467n31742n51062m44169m43933m00863l41960l60085
$$ 23599935 23184369 22663902 22132160 21581098 21136929 20692996 20292133 19950173 19590088
5689A9590088k89926l24267k96808k58339k51167l15048k20014k38730k64841
$$ 19590088 19300162 18975895 18679087 18420748 18169581 17854533 17634519 17395789 17130948
5680A7130948l47508k25990j51752k29084q1803j98556j46405k14798L277j63874
$$ 17130948 16783440 16557450 16405698 16176614 16094811 15896255 15749850 15535052 15538329 15374455
5670A5374455j55735j09405o8695O8059j08263N9835n2341L5304P1305L4212J49276
$$ 15374455 15218720 15109315 15040620 15108679 15000416 15060251 15007910 15043214 15114519 15148731 15298007
5659A5298007J45695K66565L04021M04986N77090N23827Q12062Q29975J027069
$$ 15298007 15443702 15710267 16014288 16419274 16996364 17520191 18332253 19162228 20189297
5650B0189297J413364J866183K401408L687981N592879Q686365J0980512J0403306
$$ 20189297 21602661 23468844 25870252 29558233 35151112 43837477 54817989 65221295
5642F5221295O252596J133761l110587n800590o457266n734141m799796l864903
$$ 65221295 71473891 72607652 69497065 63696475 57239209 51505068 46705272 42840369
5634D2840369l234895k489932j520033p79621o8628M32203J147979K109757L709272
$$ 42840369 39605474 37115542 35595509 34815888 34747260 35179463 36327442 38437199 42146471
5625D2146471N887525Q440917J0797798J2509083J2797573R886185M645413l99243
$$ 42146471 48033996 56474913 67272711 79781794 92579367 102465552 107110965 106711722
5617A06711722m315127p694732r648983j0112959r714173q698256o965882n359291
$$ 106711722 102396595 94701863 85052880 74939921 65225748 56527492 49561610 44202319
5609D4202319l875049k713090j733662p46588L0077P45856J213353J873573L028006
$$ 44202319 40327270 37614180 35880518 35133930 35164007 35909863 37123216 38996789 42024795
5600D2024795N590871Q914875J0873193Q580666K977115k432842o691121q805491
$$ 42024795 47615666 56530541 67403734 75984400 78961515 76528673 69837552 61032061
5592F1032061r035935p928126o926703n785000m651822l594427k722609k016758
$$ 61032061 51996126 44068000 37141297 31356297 26704475 23110048 20387439 18370681
5584A8370681j560799j381057j017147r06337o99440n60308n88241n92396m33723
$$ 18370681 16809882 15428825 14411678 13505341 12805901 12245593 11657352 11064956 10631233
5575A0631233m53164m11681m43793k36457k95631l20848k13817k24727j84252
$$ 10631233 10178069 9766388 9322595 9086138 8790507 8469659 8255842 8031115 7846863
5566G846863j77482j33923k19700k09853j36263j50706j21755k61507n4651j66457
$$ 7846863 7669381 7535458 7315758 7105905 6969642 6818936 6697181 6435674 6381023 6214566
5556F214566j28173j22190r2067r7119q925j60246J0424m0442j66028m4186L4676
$$ 6214566 6086393 5964203 5872136 5775017 5766092 5605846 5616270 5575828 5409800 5365614 5400290
5545E400290j7851r0299P1479r3720M4107p1145J06272R247M9483M4167J12054
$$ 5400290 5382439 5292140 5363619 5269899 5314006 5242861 5349133 5358380 5407863 5452030 5564084
5534E564084J80582K59006N90429P03031P45018L67387K9477l07846n01897o56434
$$ 5564084 5744666 6003672 6594101 7297132 8042150 8409537 8439014 8131168 7629271 6972837
5524F972837o01598m87320m60649k40215k28754r4515k21608L5214P0728N4446
$$ 6972837 6371239 5883919 5423270 5183055 4954301 4859786 4638178 4673392 4744120 4798566
5514D798566N7802J98567K23486J35444J92853J67658L30338L81195P18542J113161
$$ 4798566 4856368 5054935 5278421 5413865 5606718 5774376 6104714 6485909 7204451 8317612
5504H317612J646316J541257J110249J46213n55168j097276j284197j275015r30242
$$ 8317612 9963928 11505185 12615434 12761647 12206479 11109203 9825006 8549991 7619749
5495G619749p98625o48755n05608l94581j64309j87266j80041m6748m6964m9354
$$ 7619749 6821124 6172369 5666761 5272180 5107871 4920605 4740564 4693816 4646852 4597498
5485D597498k1061J08591j2254R9928L774J03026L00925N33948P77638P83813
$$ 4597498 4576437 4685028 4672774 4772702 4776476 4879502 5180427 5714375 6492013 7275826
5475G275826N62006Q8932l38582n92241p23153p50637n49890n19035m28339l34512
$$ 7275826 7837832 7926764 7588182 6995941 6272788 5522151 4972261 4453226 4024887 3690375
5465C690375l02634r4358j45385k5582l9623P8515n6675M9301m0158K2328j01282
$$ 3690375 3387741 3293383 3147998 3122416 3082793 3161308 3104633 3153934 3113776 3136104 3034822
5454C034822k8725j7219n7342j937m5465P8135J38204L9383J63931J72805p833
$$ 3034822 3006097 2988878 2931536 2929599 2884134 2962269 3100473 3139856 3303787 3476592 3468759
5443C468759k467N697q1820o1412k05618p5856j31107p8205j26028K3523K3039
$$ 3468759 3466292 3471989 3390169 3328757 3123139 3047283 2916176 2837971 2711943 2735466 2758505
5432B758505m2584r6349j6122p7275O3829j4759J6349R3242J22697J88095O2613
$$ 2758505 2715921 2619572 2603450 2526175 2590004 2575245 2591594 2684836 2807533 2995628 3058241
5421C058241J73906Q0815Q8068j10524j04643r553q5911m4210m3429j38764p5941
$$ 3058241 3232147 3312962 3401030 3290506 3185863 3176310 3090399 3046189 3002760 2863996 2788055
5410B788055l0806q0722K4926M2504L0609r4559o9003R2203L092q890M7808j0969
$$ 2788055 2757249 2676527 2701453 2743957 2774566 2680007 2611004 2703207 2706299 2697409 2745217 2734248
5398B734248l11L0398j08195o4185k02257m3630k03592j04082j62440j500j42494
$$ 2734248 2733937 2764335 2656140 2591955 2389698 2346068 2142476 2038394 1875954 1874454 1731960
5387A731960o3690m1797J0925J32539k7027L0694N9526N7058R6301Q9130J11181
$$ 1731960 1668270 1626473 1637398 1769937 1742910 1773604 1833130 1890188 1986489 2075619 2186800
5376B186800J31364q0461n1261L3495j45100j0897m8989p1405q9745j6341p5359
$$ 2186800 2318164 2237703 2186442 2219937 2074837 2063940 2014951 1943546 1853801 1837460 1762101
5365A762101n9865j66349j0795r5431p4103J7262j06705J14700j1095j0908P8560
$$ 1762101 1702236 1535887 1525092 1429661 1355558 1372820 1266115 1380815 1369720 1358812 1437372
5354A437372J13703M49K3868L772n6009O0298r547L5805L3308J32629p3145m5188
$$ 1437372 1551075 1551524 1575392 1579164 1523155 1583453 1573906 1609711 1643019 1775648 1702503 1657315
5342A657315q8183j31682k8455l1814j65762l7744n3639r2304k6573Q473L1436
$$ 1657315 1569132 1437450 1408995 1377181 1211419 1173675 1120036 1027732 1001159 1009632 1041068
5331A041068l0436L4666O4l1056m1455j2734q2609P60k2980k8257K6737j20862
$$ 1041068 1010632 1045298 1045362 1014306 972851 960117 877508 878268 855288 827031 853768 732906
5319G32906o9901n479L5617M0804p8805o7842n9121M4712k0386K1311o666k361
$$ 732906 663005 657526 693143 733947 655142 587300 528179 572891 552505 573816 567150 564789
5307E64789k1148k0595N1269r8141Q8020j0660p4316O9286M4073q2076p82o4939
$$ 564789 543641 523046 574315 476174 564194 553534 479218 548504 592577 510501 509719 444780
5295D44780O2424J3183K7696j2647N9507k4853j60428L2246R401L9317r4946M0373
$$ 444780 507204 520387 548083 535436 594943 570090 409662 441908 451309 490626 395680 436053
5283D36053j1557m270j0025l478J1949p881o17j842l6937j2728M3432n3216L9916
$$ 436053 424496 420226 410201 406723 418672 410791 410174 408332 371395 358667 402099 348883 388799
5270C88799J6372q4112R0401p1403M5033K1899k7053L7655P006p2356N8298l9175
$$ 388799 405171 321059 411460 340057 385090 406989 379936 417591 424597 352241 410539 371364
5258C71364m4230K5890m2552M8435o6319r346j9849j6789L0689L6639P636k0817
$$ 371364 327134 353024 310472 358907 292588 283242 263393 246604 277293 313932 321568 300751
5246C00751K0931l9304Q4020q7078O9087n8433K8018r3429J09721j4763j9479
$$ 300751 321682 282378 366398 279320 348407 289974 317992 224563 334284 319521 300042
5235C00042J4140k6763M7436p7421N1359k5400L075N752o27n3770L9975j2923
$$ 300042 314182 287419 334855 257434 308793 283393 286468 292220 291593 237823 277798 264875
5223B64875O9048j28379l2683R4136J5030L0089m2889r881L124J7047q6595J04152
$$ 264875 333923 205544 172861 266997 282027 312116 269227 259346 262470 279517 192922 297074
5211B97074j12710j3338K4525p124N9934j0450j0361m832M5320o1489L7727k6506
$$ 297074 184364 171026 195551 188427 248361 237911 227550 222718 268038 206549 244276 217770
5199B17770r019L1907l2162l420n382J15158r3015K1803j15565P5815K49J07134
$$ 217770 208751 240658 208496 205076 199694 314852 221837 243640 128075 203890 204139 311273
5187C11273q4850J1371m302o4877L0733N4790Q8554q5751Q6028j03685J6759l5217
$$ 311273 226423 237794 233492 168615 199348 254138 342692 256941 342969 239284 256043 220826
5175B20826L9894k2253M6114k8505n7464J332J144P7246j06398N7608J9018M8101
$$ 220826 260720 238467 284581 256076 198612 199944 201088 278334 171936 229544 248562 296663
5163B96663p3374m4098N3497P856m0785l8081K9865l063j4037m1758N7131P989
$$ 296663 223289 179191 232688 240544 199759 161678 191543 188480 174443 132685 189816 197805
5151A97805L0519q991n6551M6371k6182o385J6956L5747l1542k2718j3845O9920
$$ 197805 228324 219333 162782 209153 182971 176586 193542 229289 197747 175029 161184 231104
5139B31104m843k9355p68O6639q322k6030n7607M265K8209J4121l4910j9046N097
$$ 231104 226261 196906 196138 262777 254455 228425 170818 175083 203292 217413 182503 163457 168554
5126A68554K3209J8085k8755O0270k6707k0705M4093m6686O8091K4763q4082m312
$$ 168554 191763 209848 181093 241363 214656 193951 238044 191358 259449 284212 200130 195818
5114A95818R704O2068n4546O9197j5145K9519l223L2265l9796N3812K9890K6386
$$ 195818 205522 267590 213044 282241 267096 296615 293392 325657 285861 339673 369563 395949
5102C95949J77307J11630R2054O3292K9234L4334j03589p8234n6518j44469L268
$$ 395949 573256 684886 776940 840232 869466 903800 800211 721977 665459 520990 524258
5091E24258j0995q7632k2263j11329R2971N6539m2675k3039m0460j5290Q034k2646
$$ 524258 513263 425631 403368 292039 385010 441549 398874 375835 335375 320085 328119 305473
5079C05473l8203J16171P6861J2421m8217K3111o5721M1675j8763n5814M7423
$$ 305473 267270 383441 460302 472723 424506 447617 381896 423571 404808 348994 396417
5068C96417P2139o5345j046P3716n6504J60722l6334L5348O2424J42218L2573
$$ 396417 468556 403211 402165 475881 419377 580099 543765 579113 641537 783755 816328
5057H16328O4085J96140Q8186M2624J53030j626j01659p7738p9601j12332o8826
$$ 816328 880413 1076553 1164739 1207363 1360393 1358767 1257108 1179370 1099769 987437 918611
5046I18611p3215k4824j22687O9167M322p4199K0817m091o4903L730j32541J12894
$$ 918611 845396 820572 697885 767052 771374 697175 717992 713901 648998 652728 520187 633081
5034F33081m0359P8819l6747O5593l663K130L5117n5148O5119k0746o788M4076
$$ 633081 592722 671541 634794 700387 696724 698854 733971 678823 743942 723196 716408 760484
5022G60484o9946M990j7951L9932k0483P1837o418J06921R085K6936M4753L5750
$$ 760484 690538 695528 677577 717509 697026 768863 762445 869366 878451 905387 950140 985890
5010I85890n5938m6478M680K3783l5587p5359O4996l6319p0205j5752j9327M1723
$$ 985890 929952 883474 888154 911937 876350 800991 865987 829668 759463 743711 724384 766107
4998G66107L8775n6249K9566q616K2247L777N1491O0693q2643O3703K0183N0032
$$ 766107 804882 748633 778199 769583 791830 795607 847098 907791 825148 888851 909034 959066
4986I59066k7467J15730m777L881P6744k46k5229N591O7125k6074k4127j8318
$$ 959066 931599 1047329 1042552 1046433 1123177 1122931 1097702 1103293 1170418 1144344 1120217 1101899
4974A101899j307p6403l4235O1167P7163R1071j25573J47279O2686R1607l1678
$$ 1101899 1100592 1024189 989954 1051121 1128284 1219355 1093782 1241061 1303747 1395354 1363676
4963A363676Q0721N0345R8187l7071L6767m2791l4608j1001k02081M0174j21100
$$ 1363676 1444397 1494742 1592929 1555858 1592625 1549834 1515226 1504225 1302144 1342318 1221218
4952A221218kq5547K7106L8069k7853M9923n0280O9417Q5585J4851j4905O3964
$$ 1221218 1221216 1135669 1162775 1200844 1172991 1222914 1172634 1242051 1327636 1342487 1327582 1391546
4940A391546J41187p9337N779k3171K750J3736n0438K0425K2133l7087M0301o7003
$$ 1391546 1532733 1453396 1459175 1436004 1438754 1452490 1402052 1422477 1444610 1407523 1447824 1380821
4928A380821q203p9030k5389n6964l6118L8985o0142J25376o939J12108l1855
$$ 1380821 1372618 1293588 1268199 1211235 1175117 1214102 1153960 1279336 1272397 1384505 1352650
4917A352650R2742L9421J44831Q4309n4903M322j6993K2393j23302J315p7532
$$ 1352650 1445392 1484813 1629644 1713953 1659050 1663372 1646379 1668772 1545470 1546785 1469253
4906A469253k5903n8520L699l47j3596M8104k6491P0484Q2920Q1305J1649J34419
$$ 1469253 1443350 1384830 1388529 1388182 1374586 1422690 1396199 1466683 1549603 1630908 1642557 1776976
4894A776976l0630Q7963N6325J03243J31993K67713J49399J90946O1779q4220
$$ 1776976 1746346 1834309 1890634 1993877 2125870 2393583 2542982 2733928 2795707 2711487
4884B711487j03729k79372q7833j17210j57491p4998L2959R6611q7176P4904N6997
$$ 2711487 2607758 2328386 2240553 2123343 1965852 1890854 1923813 2020424 1933248 2008152 2065149
4873B065149Q1798K4388K9238M490J98976M3319J66751K98932L86135O63708Q80868
$$ 2065149 2146947 2171335 2200573 2205063 2404039 2447358 2614109 2913041 3299176 3962884 4843752
4862D843752Q70860N95567L21706k38307l61570n97956n63064n37836m41146l26907
$$ 4843752 5714612 6310179 6631885 6393578 6032008 5434052 4870988 4333152 3892006 3565099
4852C565099j34511j90477p5457j3526j6507M3750p1774M0101J4174J21427L2403
$$ 3565099 3430588 3240111 3164654 3151128 3134621 3178371 3106597 3146698 3160872 3282299 3314702
4841C314702K06122L70865M68711Q17982J229435J304365R24130M70230j51482
$$ 3314702 3520824 3891689 4360400 5178382 6407817 7712182 8636312 9106542 8955060
4832H955060n21561q31368q03682p88925n94432n37527l72406l76278j05893n3263
$$ 8955060 8433499 7602131 6798449 6009524 5415092 4877565 4505159 4128881 4022988 3969725
4822C969725k06390o9983j10801m3676l1177m9080J26019J70009R7084L15793
$$ 3969725 3763335 3693352 3582551 3538875 3507698 3458618 3584637 3754646 3851730 4167523
4812D167523L93812O71810Q91435N15352L46387M9311k85742n05883n43523m48719
$$ 4167523 4561335 5233145 6124580 6639932 6986319 7035630 6749888 6244005 5700482 5251763
4802E251763m10455l58333l26962k10774j06702j17842j85047n9425j29688o7088
$$ 5251763 4841308 4482975 4156013 3945239 3838537 3720695 3535648 3476223 3346535 3279447
4792C279447n3345k6881l854K5487j29283P5875Q1975J42805J98526J72553J64355
$$ 3279447 3226102 3199221 3195367 3220854 3091571 3167446 3249421 3392226 3590752 3763305 3927660
4781C927660l5821P4272r2703p8637r2087J3360j4868j6301o5994k3842J1419
$$ 3927660 3891839 3966111 3873408 3794771 3702684 3716044 3701176 3684875 3618881 3595039 3606458
4770C606458j0090p0639P821P1135N1256L5366m2759O8813P1605P2561O3401N5853
$$ 3606458 3596368 3525729 3533550 3604685 3655941 3691307 3648548 3717361 3788966 3861527 3924928 3980781
4758C980781N0856J28147J05966P2895J65857J10851J47152J13805K14750J72994
$$ 3980781 4031637 4159784 4265750 4338645 4504502 4615353 4762505 4876310 5091060 5264054
4748E264054K36166L46902L11371M18627N51138N10702P33556R89519J516754
$$ 5264054 5500220 5847122 6158493 6577120 7128258 7638960 8372516 9362035 10878789
4739A0878789K214802K979018L399154K672691J209580L5337j008532j476213
$$ 10878789 13093591 16072609 19471763 22144454 23354034 23389371 22380839 20904626
4731B0904626j426304j276166r18809o35541m34956j68376q8338L06500Q46706
$$ 20904626 19478322 18202156 17283347 16647806 16212850 16044474 15956136 16262636 17109342
4722A7109342J270652K027557L251699M565702N525585N850427O083696N746162
$$ 17109342 18379994 20407551 23659250 28224952 33750537 39600964 45684660 51430822
4714E1430822M439836K477560J29370j833861l411243m419283m609822m411406
$$ 51430822 55870658 58348218 58477588 56643727 53232484 48813201 44203379 39791973
4706C9791973l849229l068764k002458r74586M7298J068104K256089L399458M196101
$$ 39791973 35942744 32873980 30871522 29896936 29944234 31012338 33268427 36667885 40863986
4697D0863986M792458N634720N981443N709327M646262L791259K363255K85176
$$ 40863986 45656444 51291164 57272607 62981934 67628196 71419455 73782710 74067886
4689G4067886j603948l398461m977141o026021o188921n796282n046976m213760
$$ 74067886 72463938 69065477 64088336 58062315 51873394 46077112 41030136 36816376
4681C6816376l426869k386303j312304j94752Q61940J939694K655530L343364
$$ 36816376 33389507 31003204 29690900 29496148 30358088 32297782 34953312 38296676
4673C8296676M066285M287951L877392K889145J528105k25966k179986l928286
$$ 38296676 42362961 46650912 50528304 53417449 54945554 54719588 52539602 48611316
4665D8611316n052262n331681n236262m507311l771570l037471k226161j497696
$$ 48611316 43559054 38227373 32991111 28483800 24712230 21674759 19448598 17950902
4657A7950902j042096q52236m81725l28249N621N37386J154067J826868K012531
$$ 17950902 16908806 16056570 15574845 15246596 15252217 15789603 16943670 18770538 20783069
4648B0783069J234756J4950j075277j952543k186529k121275j965152j564820
$$ 20783069 22017825 22032775 20957498 19004955 16818426 14697151 12731999 11167179
4640A1167179j311213j108381q38491p04339n23635m60639l19686l44893k08853
$$ 11167179 9855966 8747585 7909094 7204755 6681120 6220481 5900795 5555902 5347049
4631E347049k83391k19934k36600j38372j44736j76132j10040j33362r0177j60195
$$ 5347049 5063658 4843724 4607124 4468752 4324016 4147884 4037844 3904482 3814305 3654110
4621C654110l0025o4504j57373p1537n9259j29415o1493o7823m5154j14330n28
$$ 3654110 3624085 3559581 3402208 3330671 3271412 3141997 3080504 3012681 2967527 2853197 2852669
4610B852669J5031j18706o4098l1630q1918L912p7692j5798o3987k9117r9944
$$ 2852669 2867700 2748994 2684896 2653266 2571348 2575260 2497568 2481770 2417783 2388666 2288722
4599B288722m3080q5590l0839p4527J0422k1530q2106m9367j2872j4625P597r9709
$$ 2288722 2245642 2160052 2129213 2054686 2065108 2043578 1961472 1912105 1899233 1884608 1892205 1792496
4587A792496k1542m4499k6417k1291q1143P4099m5345J751l2941l3346q9796L3777
$$ 1792496 1770954 1726455 1700038 1678747 1597604 1671703 1626358 1628109 1595168 1561822 1472026 1505803
4575A505803m0251J8210o2644m8971k5888r1976K1546n4696K1897q0938o4200
$$ 1505803 1465552 1483762 1421118 1372147 1346259 1254283 1275829 1221133 1243030 1162092 1097892
4564A097892M5743l5064n3751j4936k7883O491j0513N6845L6791n7817m8551k6301
$$ 1097892 1143635 1108571 1054820 1039884 1012001 1018492 1007979 1064824 1101615 1043798 995247 968946
4552I68946N448Q9142j1714p5906n2010O705r7442M8373j29345N8645q9913M1840
$$ 968946 974394 1063536 1051822 975916 923906 930611 833169 881542 752197 810842 720929 762769
4540G62769j33617M5565l9986m7465K2913j466j4495m0466M1870q5005R4458p0873
$$ 762769 629152 674717 634731 587266 610179 608713 594218 553752 595622 510617 605075 534202
4528E34202P4834k4888J2408k5197l4025K9230n3170L8770o5591j2814p3189N9145
$$ 534202 609036 584148 596556 571359 537334 566564 513394 552164 486573 473759 400570 459715
4516D59715O793p199M2707j146r1814L9809p2892j1332L8455o8114J02406n6595
$$ 459715 466508 459309 502016 500870 409056 448865 375973 364641 403096 334982 437388 380793
4504C80793l1677O1559R0714p7827N4706K5944k0787K847l0247Q4453o0647L0532
$$ 380793 349116 410675 501389 423562 478268 504212 483425 486272 456025 540478 479831 510363
4492E10363o7068J30890j10514J32319L8263L8681P7649N4328K5888M6397K4202
$$ 510363 443295 574185 463671 595990 634253 672934 750583 804911 830799 877196 901398
4481I01398k1583o9955L7892r44k0489K4751M6482J47977M76j1618L9531M8908
$$ 901398 879815 809860 847752 846808 826319 851070 897552 1045529 1046005 1034387 1073918 1122826
4469A122826o0347L2776m7453R622J05550l839O0014K599o6426l8622o3631l9130
$$ 1122826 1062479 1095255 1047802 1057424 1162974 1159135 1219149 1221748 1155322 1116700 1053069 1013939
4457A013939j30980n0373r5178k4642M021M6574o380k1612R7202o1222P0527l3607
$$ 1013939 882959 832586 737408 712766 716787 763361 756981 735369 832571 771349 841876 808269
4445H08269R3836K3614n3980O6232n9894J8486M8926o1531O749M784M0335M2375
$$ 808269 902105 925719 871739 937971 878077 896563 945489 883958 890707 895491 935826 978201
4433I78201k3945J16591N1323O840J41149J22858N1139L32925L56292L78751L87436
$$ 978201 954256 1070847 1122170 1129010 1270159 1393017 1444156 1777081 2133373 2512124 2899560
4422B899560J34849j39327j64197k52599l07256k80459j06217k34335j92710j33077
$$ 2899560 3034409 2895082 2730885 2478286 2171030 1890571 1784354 1550019 1357309 1224232
4412A224232r2077k7259L6616k717L6442p7315R5743J21224J37484J60156L41578
$$ 1224232 1132155 1104896 1141512 1138795 1175237 1097922 1193665 1314889 1452373 1612529 1954107
4401A954107L63361K67071N7644k10052j89536k64639k80007k38303j37714k47650
$$ 1954107 2317468 2584539 2642183 2432131 2242595 1977956 1697949 1459646 1321932 1074282
4391A074282j23469p1206n3758j77953O1947q5316L3626P379k6621J0185M4028
$$ 1074282 950813 879607 825849 647896 709843 624527 658153 665532 638911 649096 693124
4380F93124m6451k7095l9636P5127m4579K3632M0949O1765n9390m1944M8342j4553
$$ 693124 646673 619578 579942 655069 610490 634122 675071 736836 677446 635502 683844 669291
4368F69291L4105N0582P9002q0682L8924m4313K4927l0203J28467k4438j23192
$$ 669291 703396 753978 832980 752298 791222 746909 771836 741633 870100 845662 722470
4357G22470P3854J5550L7867k1830o7467L2396K9629k8551L9892N7296K8639O6177
$$ 722470 796324 811874 849741 827911 760444 792840 822469 793918 833810 891106 919745 985922
4345I85922o9393P5887n045Q8216J9044Q2568P6337J09211Q496J01151P0193J95110
$$ 985922 916529 992416 987371 1075587 1094631 1177199 1253536 1362747 1371243 1472394 1542587 1737697
4333A737697L8540J57958K96435J99681L07391M26237O03387N36458L98660j0831
$$ 1737697 1776237 1934195 2230630 2430311 2737702 3163939 3767326 4303784 4702444 4691613
4323D691613j42215m16826n37897n02156m16804l04331l15985k05633k32239j36558
$$ 4691613 4549398 4132572 3594675 3092519 2675715 2371384 2055399 1849766 1617527 1480969
4313A480969j30592q9645m6083o5263n5262N298j72002Q5069j6863m319j37216
$$ 1480969 1350377 1260732 1214649 1149386 1094124 1099422 927420 1012489 995626 991307 854091
4302H54091L6225k7942n8417o959O1166j01466L7332j4476M9326p7429J6330j13094
$$ 854091 890316 862374 803957 796998 858164 756698 794030 779554 828880 751451 767781 654687
4290F54687n7704j0769n3947n0454O9211o0770J6630m0450k4539p1059J24007
$$ 654687 596983 586214 532267 481813 551024 490254 506884 466434 441895 370836 494843
4279D94843n3648j9007K6033l4541Q7605m3968J000m4911N4048M303N667L08P3944
$$ 494843 441195 422188 448221 413680 501285 457317 458317 413406 467454 471757 477424 477732 551676
4266E51676j3043j09362O3328J29989K2484p249k1851k6059M8532L8721l8287
$$ 551676 538633 429271 492599 622588 645072 637823 615972 589913 638445 677166 638879
4255F38879K7602J0380N5809J248Q3269o71j4040j02972J9113o4125K0687k1309
$$ 638879 666481 676861 732670 733918 817187 816516 802476 699504 718617 654492 675179 653870
4243F53870k4286N4942j01906O1970o5332J4218M897o7885l6142J0938m3543l8410
$$ 653870 629584 684526 582620 644590 579258 593476 598373 530488 494346 505284 461741 423331
4231D23331j9511l3860n5286l0457N2320j10489K7655K1922j431j8546N4768J7769
$$ 423331 403820 369960 314674 284217 336537 226048 253703 275625 274194 255648 310416 328185
4219C28185J3699n8100r501n135l8768K0799J2525o0617L7837n1899R4356M5949
$$ 328185 341884 283784 274283 269148 230380 251179 263704 203087 240924 189025 283381 329330
4207C29330J9875k9849P9778n5428M4904p7154N1952j3300N7812j3425j3480j9190
$$ 329330 349205 319356 399134 343706 388610 311456 363408 350108 407920 394495 381015 361825
4195C61825M7132J0079o1683K6274k5433M3854q2428k0027l004o49j7988o2690
$$ 361825 408957 419036 357353 383627 358194 402048 319620 299593 296589 295940 277952 215262
4183B15262M4247J5153r7987L9892p619l953l1715l2820K8847p682o8939J9558
$$ 215262 259509 274662 176675 216567 208948 204995 173280 140460 169307 161625 92686 112244
4171A12244n4711J21932p8381k6226l5307L9529J18843q9483j2580j7400m235
$$ 112244 57533 179465 101084 74858 39551 79080 197923 108440 95860 78460 74225
4160G4225l9067O67J8432R6342j01726J2511j0057P830m0802j2720K647N0437
$$ 74225 35158 35825 54257 150599 48873 61384 51327 59157 18355 5635 8282 58719
4148E8719j8655k3262K5369o0831R1888l7320J9931m4012K9602L2369J4429q0568
$$ 58719 40064 16802 42171 -18660 73228 35908 55839 11827 41429 73798 88227 7659
4136G659j2352J01677p6082M3291j08975J37219j19065j0831M8650J4681l0469
$$ 7659 -4693 96984 20902 64193 -44782 92437 -26628 -37459 11191 25872 -4597
4125d597j06111Q5310l7902Q9938p049L5159k6053J4281n1030n9165R6710J6323
$$ -4597 -110708 -25398 -63300 26638 19589 54748 28695 42976 -8054 -67219 29491 45814
4113D5814p070p046m1647J06131J8221j09966k1759J9637M0560l5143q892K6915
$$ 45814 38744 31698 -9949 96182 114403 4437 -17322 2315 42875 7732 -1160 25755
4101B5755K8106L604j59810J18916o587k4255K6106J5963n2878L7840O2523r0492
$$ 25755 53861 57465 -102345 16571 9984 -14271 11835 27798 -25080 12760 75283 -15209
4089a5209N3130N1803M2891o9809M5253m9313k5600L4702m5304m4343Q3033o2600
$$ -15209 37921 89724 132615 62806 108059 58746 33146 67848 22544 -21799 61234 -1366
4077a366K6373M9080m3003j8099n821M4466k3848k1145K4871o4R2326l0630K755
$$ -1366 25007 74087 31084 12985 7164 51630 27782 6637 31508 31444 123770 93140 95895
4064I5895l9365P9145k0487O1142o6740N058p653P1915p1918J7611K3206k4158
$$ 95895 56530 135675 115188 176330 109590 114648 106995 178910 106992 124603 147809 123651
4052A23651M7565l2817k91n1754K6865k5149J14707m6229O0344l3023K6760J6865
$$ 123651 171216 138399 138108 86354 113219 88070 202777 156548 216892 183869 210629 227494
4040B27494n6435J04243j4778k3774P454J5903L1781m4086L9730L9351Q4119k6810
$$ 227494 171059 275302 260524 236750 244204 260107 291888 247802 287532 326883 411002 384192
4028C84192L5317l0721q0411J7357J0085o7352l2843k3726L8889k8885l8244P396
$$ 384192 419509 388788 308377 325734 335819 268467 235624 211898 250787 221902 183658 191054
4016A91054K371J34783n2688L1054q117L0471k2468K7558j01253P1929N9915o1136
$$ 191054 193425 328208 275520 306574 298457 328928 306460 334018 232765 304694 364609 303473
4004C03473L9943j15651J16350m9621o0927r607N3630q8896K965l7056j1493O2277
$$ 303473 343416 227765 344115 294494 233567 223960 277590 188694 191659 154603 143110 205387
3992B05387o1357K1914J2811J4124l2585l8623N8217m5767N4757j717k2282k3544
$$ 205387 144030 165944 178755 192879 160294 121671 179888 134121 188878 187161 164879 141335
3980A41335n0225L9451l403j20656N5096j9665n224k8208N1096l9997k0266k0300
$$ 141335 91110 130561 127158 6502 61598 41933 36709 8501 59597 19600 -666 -20966
3968b0966L2517M4722m9912N2187j07116P4722L72L9779n4047Q213N295q6755
$$ -20966 11551 56273 6361 58548 -48568 26154 26526 66305 12258 20471 25766 -60989
3956f0989L5769N1590m1226j9593j9884Q994n1958N2349K6195k8726l4494L0197
$$ -60989 -25220 26370 -14856 -34449 -54333 -45339 -97297 -44948 -18753 -47479 -81973 -51776
3944e1776L3574m9699M7604Q055m0268N0258q0054N0721L335L2062p8264J0462
$$ -51776 -18202 -67901 -20297 -12242 -52510 -2252 -82306 -31585 -28250 3812 -74452 -63990
3932f3990O071K1133n2425L702N8604q4139K6803L2366n1037P2293j36148M5330
$$ -63990 -57919 -36786 -89211 -85509 -26905 -111044 -84241 -51875 -102912 -30619 -166767 -121437
3920a21437p12O0803J6623j5961j3163j1693L9773L1669o6130M0299J5940o2609
$$ -121437 -122149 -61346 -44723 -60684 -73847 -85540 -45767 -14098 -80228 -39929 -23989 -86598
3908h6598k4355L8190J7922m0061l8585R7591m8083n855j0038K0926p5234K9280
$$ -86598 -110953 -72763 -54841 -94902 -133487 -35896 -83979 -89834 -99872 -78946 -154180 -124900
3896a24900L6290m4434j0242J00246n9105L52L7184l6815K9429l572o4713K977
$$ -124900 -88610 -133044 -143286 -43040 -102145 -101793 -64609 -101424 -71995 -75567 -140280 -137303
3884a37303O7328n2491L4454k7335o297P849j0567J8784j4017n8223L9485m7152
$$ -137303 -69975 -122466 -88012 -115347 -121644 -113795 -124362 -105578 -119595 -177818 -138333 -185485
3872a85485Q5607j469O6173r015m8539K5907l8867K7708j4512L3479j4801N136
$$ -185485 -99878 -101347 -35174 -44189 -92728 -66821 -105688 -77980 -92492 -59013 -73814 -68678
3860f8678l6677j2754n495K5802l2196k6476K2521o520J385K918m556J3051N8223
$$ -68678 -105355 -118109 -123604 -97802 -129998 -156474 -133953 -140473 -139088 -136170 -140726 -127675 -69452
3847f9452J7179j5696l5076l15m4691O0865o1654J7683M6785P3665j24965k1203
$$ -69452 -52273 -67969 -103045 -103360 -148051 -87186 -148840 -131157 -84372 -10707 -135672 -156875
3835a56875P3990j0629m8124M8207K5352l6744J1546k2780j7602N5821q0681R7423
$$ -156875 -82885 -93514 -141638 -93431 -68079 -104823 -93277 -116057 -133659 -77838 -158519 -61096
3823f1096l8172K8294n7799N8438p8333k4126N056L6956J5679L2385o3544N7362
$$ -61096 -99268 -70974 -128773 -70335 -148668 -172794 -167738 -130782 -115103 -82718 -146262 -88900
3811h8900k7323M7956p3380L6256l2324J812Q0145n4311j4925O2172r6197K1021
$$ -88900 -116223 -68267 -141647 -105391 -137715 -135903 -55758 -110069 -124994 -62822 -159019 -137998
3799a37998J5417N011K5184n2550l7597M2037J1976l4440K2868M8589q313m5598
$$ -137998 -122581 -117570 -92386 -144936 -182533 -140496 -128520 -162960 -140092 -91503 -99816 -145414
3787a45414J1402L5732K4292m1147L4993m5050M4921k0147M1309n7588L7628o9522
$$ -145414 -134012 -98280 -73988 -115135 -80142 -125192 -80271 -100418 -59109 -116697 -79069 -148591
3775a48591n6738n538N1307j7111L070M3597l7630O2610J6267l2865k2056L4107
$$ -148591 -205329 -210867 -159560 -176671 -173601 -130004 -167634 -105024 -88757 -121622 -143678 -109571
3763a09571J3158o2544N7623M06K8234k3715q1323Q5155J9639j5400J3927m8000
$$ -109571 -96413 -158957 -101334 -100928 -72694 -96409 -177732 -92577 -72938 -88338 -74411 -122411
3751a22411K4657j8115J9655k6980m188l8097j1248P6934o6040j225M8999m1913
$$ -122411 -97754 -115869 -96214 -123194 -127382 -165479 -176727 -99793 -165833 -167058 -118059 -159972
3739a59972K1568M5192l9229P7249N4904p2453j8581j6572J8817j7600L6305r1178
$$ -159972 -138404 -93212 -132441 -55192 -288 -72741 -91322 -107894 -89077 -106677 -70372 -161550
3727a61550J5280O692K6941l4995Q92N7509L621p5569l0260O3311q121n3903J7226
$$ -161550 -146270 -139578 -112637 -147632 -146740 -89231 -85610 -161179 -191439 -128128 -136249 -190152 -172926
3714a72926J2826K3719J1902L2318J72M0740n1952j7528M3202l0168J8365k247
$$ -172926 -160100 -136381 -124479 -92161 -91989 -51249 -103201 -120729 -77527 -107695 -89330 -91577
3702i1577M0014o1499j12939P0701m2169K0813L4397n201L0499m2703p649O1088
$$ -91577 -51563 -113062 -226001 -155300 -197469 -176656 -142259 -147460 -116961 -159664 -167313 -106225
3690a06225k1719N330N0914L2383q0669k4555l451K6616j2383K7501J0660J1678
$$ -106225 -127944 -122614 -71700 -39317 -119986 -144541 -147992 -121376 -133759 -106258 -95598 -83920
3678h3920m3272J4748o0960J3582N939J7025p7345Q0057n3723M1571O290M6307
$$ -83920 -127192 -112444 -173404 -159822 -153883 -136858 -214203 -134146 -187869 -146298 -140008 -93701
3666i3701l7304k1050N9948r243n1692O6522r17M539o9954Q4417q0119l8878J4777
$$ -93701 -131005 -152055 -92107 -101350 -153042 -86520 -87437 -82898 -152852 -68435 -148554 -187432 -172655
3653a72655L2730l3120L9048K3248j4600l103L7354o3910j821J6246n5413N6671
$$ -172655 -139925 -173045 -133997 -110749 -125349 -128452 -91098 -155008 -156829 -140583 -195996 -139325
3641a39325J3732l5879j1049K8092P7336l7257k0370j5944j5138K460K0119N569
$$ -139325 -125593 -161472 -172521 -144429 -67093 -104350 -124720 -140664 -155802 -153342 -133223 -127654
3629a27654m867j4013k6372Q2779l5462J1987q8172R6787m1982j9615Q7218j2056
$$ -127654 -132521 -146534 -172906 -90127 -125589 -113602 -201774 -104987 -146969 -166584 -79366 -91422
3617i1422o7967N1640j7732j6168J2284K5928o2386j2226L7167j2661R9658p5749
$$ -91422 -159389 -107749 -125481 -141649 -129365 -103437 -165823 -178049 -140882 -153543 -53885 -129634
3605a29634q911o6865J13937j6519O2307o9741R6193m6944j37425N5179R143p138
$$ -129634 -138545 -205410 -91473 -107992 -45685 -115426 -19233 -66177 -203602 -148423 -139280 -146418
3593a46418k9690O0818k9113p5632J50622r3177Q220j7662J37022j13208L3527
$$ -146418 -176108 -115290 -144403 -220035 -69413 -162590 -154370 -172032 -35010 -148218 -114691
3582a14691k7066K1458k6839m1067J9020N765j3620Q9201M932k2592o90n1383
$$ -114691 -141757 -120299 -147138 -188205 -169185 -163420 -177040 -87839 -82907 -105499 -106189 -157572
3570a57572P2580p7404P9845m8483K0037r4894L3266o6664J9126O0377M294O2368
$$ -157572 -84992 -162396 -82551 -131034 -110997 -205891 -172625 -239289 -220163 -159786 -155492 -93124
3558i3124j6515Q902J0525J8748m0156k8508J82L978M4156j13423J38445q8725
$$ -93124 -109639 -100737 -90212 -71464 -111620 -140128 -139946 -135968 -91812 -205235 -66790 -155515
3546a55515J1300P2951k4163J6127L7682K1042k3831k5480J4025n8279k3939j1872
$$ -155515 -144215 -71264 -95427 -79300 -41618 -20576 -44407 -69887 -55862 -114141 -138080 -149952
3534a49952J0924Q2854m2301O6224l8556o976j3848j4634l2898n1119P9244q2159
$$ -149952 -139028 -56174 -98475 -32251 -70807 -77783 -91631 -106265 -139163 -190282 -111038 -193197
3522a93197M2571p9880K2885O191R5901l1201J6496L2842l6213k5505m4472P605
$$ -193197 -150626 -230506 -207621 -201430 -105529 -136730 -120234 -87392 -123605 -149110 -193582 -185977
3510a85977L5729m4688P2k7502Q1907m8977J05013m8612m103L0459j094j1705
$$ -185977 -150248 -194936 -194864 -222366 -140459 -189436 -84423 -133035 -137138 -106679 -107773 -119478
3498a19478M0340J3546N2130q3919o3516K3529M0535j6214j5267M4838m6100L3463
$$ -119478 -79138 -65592 -13462 -97381 -160897 -137368 -96833 -113047 -128314 -83476 -129576 -96113
3486i6113J3789k6887j03226J20503m4710K7126m1967P0119m31l8990m8972J7935
$$ -96113 -82324 -109211 -212437 -91934 -136644 -109518 -151485 -81366 -81797 -120787 -169759 -151824
3474a51824M1446j2132J7200K2172o803k0995o7931M8832J9683R604l2619P8648
$$ -151824 -110378 -122510 -105310 -83138 -89941 -110936 -178867 -130035 -110352 -100748 -133367 -54719
3462e4719k9767k4647m2030m8621M3479k938J9966k939k3236J5251M3722m8681
$$ -54719 -84486 -109133 -151163 -199784 -156305 -159243 -139277 -142216 -165452 -150201 -106479 -155160
3450a55160L8497P162L5607l2392o7964Q497R1918j8660j5160n063l4085K1286
$$ -155160 -116663 -109501 -73894 -106286 -174250 -165753 -73835 -92495 -107655 -112718 -146803 -125517
3438a25517L3338k2266j0744l4962L8173K1671J0933p0138L0564L584M937J101
$$ -125517 -92179 -114445 -125189 -160151 -121978 -100307 -89374 -159512 -128948 -125364 -120427 -119326
3426a19326J3155K9450k2336l2296N25L9649l2021K8825M633l523p5461J9819
$$ -119326 -106171 -76721 -99057 -131353 -130828 -91179 -123200 -94375 -89742 -93265 -168726 -148907
3414a48907K8297M8460r0146J8305J335L6182j4712M4061l4224r5134J10138j4138
$$ -148907 -120610 -72150 -162296 -143991 -142656 -106474 -121186 -77125 -111349 -206483 -96345 -110483
3402a10483j0664l8698P5978J1125k329j2610N3742l7176N6098K1177k2688L3752
$$ -110483 -121147 -159845 -83867 -72742 -75071 -87681 -33939 -71115 -15017 6160 -16528 17224
3390A7224J571J6582p7477p2117M9602j1136o695m5914k2497k0448N7777L2429
$$ 17224 18795 35377 -42100 -114217 -64615 -75751 -82446 -128360 -150857 -171305 -113528 -81099
3378h1099J7796n6604P1931m8139n132l1598l8900P7393j3621q244l8347L8053
$$ -81099 -63303 -119907 -47976 -96115 -101247 -132845 -171745 -94352 -107973 -116217 -154564 -116511
3366a16511J959L3504l7164J7249j0757k53m4530Q5960o7452K1176P082o5422
$$ -116511 -114552 -81048 -118212 -100963 -111720 -111973 -156503 -70543 -137995 -116819 -109737 -175159
3354a75159O2500M3613n1807n002N7335k8708k7764O065O4200R845n2606J89l2767
$$ -175159 -112659 -69046 -120853 -125855 -68520 -97228 -124992 -118927 -54727 -44882 -97488 -97299 -130066
3341a30066L2489K3687K9382k2131Q7016K140R9163K5693J29699Q1113k8284r0612
$$ -130066 -97577 -73890 -44508 -66639 20377 22517 121680 147373 277072 358185 329901 239289
3329B39289l6435o1821r0953p1396o6814Q389k2096N6936m6587M33k470K0330
$$ 239289 202854 141033 50080 -21316 -88130 -79741 -101837 -44901 -91488 -91055 -93525 -73195
3317g3195l9967k8543K0827J3111M8343p3787P049q695M4884m3418k3182M7528
$$ -73195 -113162 -141705 -120878 -107767 -59424 -133211 -126162 -134857 -89973 -133391 -156573 -109045
3305a09045m2137Q7577n2124M8773o3528j5416m7527L4016N8916m1257J3670m9765
$$ -109045 -151182 -63605 -115729 -66956 -130484 -145900 -193427 -159411 -100495 -141752 -128082 -177847
3293a77847J9935O5775o7801m963N9277k0675M4506n0458J0201q375P061m235
$$ -177847 -157912 -92137 -159938 -164901 -105624 -126299 -81793 -132251 -122050 -130425 -123364 -127599
3281a27599J7202P971J9724p249m6533R341l3807M7862l7295K3243m853j4246
$$ -127599 -110397 -102426 -82702 -89951 -136484 -127143 -160950 -113088 -150383 -127140 -131993 -146239
3269a46239K1000j7704O0855R368k4971m2973N6413M7947l7074n4597k8796L6025
$$ -146239 -125239 -142943 -82088 -72720 -97691 -140664 -84251 -36304 -73378 -127975 -156771 -120746
3257a20746m543o9893o302l096J08962j4043o283m6240j6798N1599k5555m1566
$$ -120746 -125289 -195182 -201484 -204580 -95618 -109661 -115944 -162184 -178982 -127383 -152938 -194504
3245a94504R5534J1002j3658p0977O4664m5939L7782m9714O6163q513o4218N4353
$$ -194504 -98970 -87968 -101626 -172603 -107939 -153878 -116096 -165810 -99647 -108160 -172378 -118025
3233a18025K7555j5530l0951k0938N0247k228m2323k7153P1419R175n3044r58
$$ -118025 -90470 -106000 -136951 -157889 -107642 -109870 -152193 -179346 -107927 -98752 -151796 -152754
$$ [...]
##END NTUPLES=NMR SPECTRUM
##END=
