##TITLE=abcd
##JCAMPDX= 6.0         $$ Bruker NMR JCAMP-DX V2.0
##DATA TYPE= NMR SPECTRUM
##DATA CLASS= NTUPLES
##ORIGIN= UXNMR, Bruker Analytische Messtechnik GmbH
##OWNER= root
$$ XWIN-NMR		Version 3.5
$$ Tue Jul 14 17:29:16 2026 Russian Standard Time (UT+4h)  servis@DPX200
##.OBSERVE FREQUENCY= 200.131235884673
##.OBSERVE NUCLEUS= ^1H
##.ACQUISITION MODE= SIMULTANEOUS
##.ACQUISITION SCHEME= undefined
##.AVERAGES= 32
##.DIGITISER RES= 18
##SPECTROMETER/DATA SYSTEM= spect
##.PULSE SEQUENCE= zg
##.SOLVENT NAME= CDCl3
##.SHIFT REFERENCE= (INTERNAL, CDCl3, 0, 16.4885)
##AUDIT TRAIL= $$ (NUMBER, WHEN, WHO, WHERE, WHAT)
$$ ##TITLE= Audit trail, XWIN-NMR		Version 3.5
$$ ##JCAMPDX= 5.01
$$ ##ORIGIN= Bruker BioSpin GmbH
$$ ##OWNER= servis
$$ F:\spectra/data/av/nmr/H1/1/pdata/1/auditp.txt
$$ ##AUDIT TRAIL=  $$ (NUMBER, WHEN, WHO, WHERE, WHAT)
(   1,<2026-07-14 17:23:59.92 +0400>,<servis>,<DPX200>,
      <created by zg, POWCHK disabled, PULCHK disabled
       configuration hash MD5:
       00 E9 B6 7A A2 85 ED C7 34 08 36 98 17 FE 4E 26
       data hash MD5: 32K
       E6 93 5C E7 A2 D8 10 BC 12 06 05 AA 9E 45 C1 84>)
(   2,<2026-07-14 17:28:50.78 +0400>,<servis>,<DPX200>,
      <Start of raw data processing
       efp BC_mod = 2 LB = 0.05 FT_mod = 6 PKNL = 1 PHC0 = -415.39 PHC1 = 3.101563 SI = 16K 
       data hash MD5: 16K
       4B C5 D5 86 A8 78 54 D0 11 F6 CA 38 29 0D FF A5>)
$$ ##END=
$$ 
$$ hash MD5
$$ C0 B5 DF A6 DE 02 F6 E2 48 6E 43 1A 47 AF 73 D4
##$RELAX= 
##$RELAX= 
##$RELAX= 
##$RELAX= 
##$RELAX= 
##$RELAX= 
##$RELAX= 
##$RELAX= 
$$ Bruker specific parameters
$$ --------------------------
##$DU= <F:\spectra>
##$EXPNO= 1
##$NAME= <H1>
##$PROCNO= 1
##$TYPE= <nmr>
##$USER= <av>
##$AMP= (0..31)
100 100 100 100 100 100 100 100 100 100 100 100 100 100 100 100 100 100 
100 100 100 100 100 100 100 100 100 100 100 100 100 100 
##$AQSEQ= 0
##$AQ_mod= 1
##$AUNM= <au_zg>
##$AUTOPOS= <>
##$BF1= 200.13
##$BF2= 200.13
##$BF3= 200.13
##$BF4= 200.13
##$BF5= 500.13
##$BF6= 500.13
##$BF7= 500.13
##$BF8= 500.13
##$BYTORDA= 1
##$CFDGTYP= 0
##$CFRGTYP= 5
##$CHEMSTR= <none>
##$CNST= (0..31)
1 1 145 1 1 1 1 1 1 1 1 1 1 1 1 1 1 1 1 1 1 1 1 1 1 1 1 1 1 1 1 1 
##$CPDPRG= <>
##$CPDPRG1= <>
##$CPDPRG2= <>
##$CPDPRG3= <>
##$CPDPRG4= <mlev>
##$CPDPRG5= <mlev>
##$CPDPRG6= <mlev>
##$CPDPRG7= <mlev>
##$CPDPRG8= <mlev>
##$CPDPRGB= <>
##$CPDPRGT= <>
##$D= (0..31)
0 2 0 0 0 0 0 0 0 0.06 0 0 0 0 0 0 0.0002 0 0 0 0 0 0 0 0 0 0 0 0 0 0 
0 
##$DATE= 1784035439
##$DBL= (0..7)
120 120 120 120 120 120 120 120 
##$DBP= (0..7)
150 150 150 150 150 150 150 150 
##$DBP07= 0
##$DBPNAM0= <>
##$DBPNAM1= <>
##$DBPNAM2= <>
##$DBPNAM3= <>
##$DBPNAM4= <>
##$DBPNAM5= <>
##$DBPNAM6= <>
##$DBPNAM7= <>
##$DBPOAL= (0..7)
0.5 0.5 0.5 0.5 0.5 0.5 0.5 0.5 
##$DBPOFFS= (0..7)
0 0 0 0 0 0 0 0 
##$DE= 6
##$DECBNUC= <off>
##$DECIM= 32
##$DECNUC= <off>
##$DECSTAT= 4
##$DIGMOD= 1
##$DIGTYP= 9
##$DL= (0..7)
0 120 120 120 120 120 120 120 
##$DP= (0..7)
150 150 150 150 150 150 150 150 
##$DP07= 0
##$DPNAME0= <>
$$ [...]
##$SUBNAM4= <"">
##$SUBNAM5= <"">
##$SUBNAM6= <"">
##$SUBNAM7= <"">
##$SUBNAM8= <"">
##$SUBNAM9= <"">
##$SW= 20.6817932712277
##$SWIBOX= (0..15)
0 0 3 0 0 0 0 0 0 0 0 0 0 0 0 0 
##$SW_h= 4139.07284768212
##$TD= 32768
##$TD0= 1
##$TE= 0
##$TE2= 300
##$TE3= 300
##$TEG= 300
##$TL= (0..7)
0 120 120 120 120 120 120 120 
##$TP= (0..7)
150 150 150 150 150 150 150 150 
##$TP07= 0
##$TPNAME0= <>
##$TPNAME1= <>
##$TPNAME2= <>
##$TPNAME3= <>
##$TPNAME4= <>
##$TPNAME5= <>
##$TPNAME6= <>
##$TPNAME7= <>
##$TPOAL= (0..7)
0.5 0.5 0.5 0.5 0.5 0.5 0.5 0.5 
##$TPOFFS= (0..7)
0 0 0 0 0 0 0 0 
##$TUNHIN= 0
##$TUNHOUT= 0
##$TUNXOUT= 0
##$USERA1= <user>
##$USERA2= <user>
##$USERA3= <user>
##$USERA4= <user>
##$USERA5= <user>
##$V9= 5
##$VALIST= <valist>
##$VCLIST= <CCCCCCCCCCCCCCC>
##$VD= 0
##$VDLIST= <DDDDDDDDDDDDDDD>
##$VPLIST= <PPPPPPPPPPPPPPP>
##$VTLIST= <TTTTTTTTTTTTTTT>
##$WBST= 1024
##$WBSW= 30
##$XGAIN= (0..3)
0 0 0 0 
##$XL= 0
##$YL= 0
##$YMAX_a= 401817
##$YMIN_a= -600563
##$ZGOPTNS= <>
##$ZL1= 120
##$ZL2= 120
##$ZL3= 120
##$ZL4= 120
##$ABSF1= 0
##$ABSF2= 0
##$ABSG= 0
##$ABSL= 0
##$ALPHA= 0
##$AQORDER= 0
##$ASSFAC= 0
##$ASSFACI= 0
##$ASSFACX= 0
##$ASSWID= 0
##$AUNMP= <proc_1d>
##$AZFE= 0.1
##$AZFW= 0.1
##$BCFW= 0
##$BC_mod= 2
##$BYTORDP= 0
##$COROFFS= 0
##$CY= 18.4799938201904
##$DATMOD= 1
##$DC= 0
##$DFILT= <>
##$DTYPP= 0
##$F1P= 9.9274215381318
##$F2P= -0.165520771350173
##$FCOR= 1
##$FTSIZE= 16384
##$FT_mod= 6
##$GAMMA= 0
##$GB= 0
##$INTBC= 1
##$INTSCL= 4.127829e-11
##$ISEN= 128
##$LB= 0.05
##$LEV0= 0
##$LPBIN= 0
##$MAXI= 10000
##$MC2= 0
##$MEAN= 0
##$ME_mod= 0
##$MI= 50
##$NCOEF= 0
##$NC_proc= -5
##$NLEV= 6
##$NOISF1= 3.799351
##$NOISF2= 2.8
##$NSP= 0
##$NTH_PI= 0
##$NZP= 0
##$OFFSET= 16.48848
##$PC= 4
##$PHC0= -415.39
##$PHC1= 3.101563
##$PH_mod= 1
##$PKNL= yes
##$PPARMOD= 0
##$PSCAL= 4
##$PSIGN= 0
##$REVERSE= no
##$SF= 200.130005582386
##$SI= 16384
##$SIGF1= 3
##$SIGF2= 2
##$SINO= 400
##$SIOLD= 16384
##$SREGLST= <1H.CDCl3>
##$SSB= 0
##$STSI= 16384
##$STSR= 0
##$SW_p= 4139.07284768211
##$SYMM= 0
##$S_DEV= 0
##$TDeff= 32768
##$TDoff= 0
##$TI= <>
##$TILT= no
##$TM1= 0
##$TM2= 0
##$TOPLEV= 0
##$USERP1= <user>
##$USERP2= <user>
##$USERP3= <user>
##$USERP4= <user>
##$USERP5= <user>
##$WDW= 1
##$XDIM= 16384
##$YMAX_p= 532968529
##$YMIN_p= -441936
$$ End of Bruker specific parameters
$$ ---------------------------------
##NTUPLES= NMR SPECTRUM
##VAR_NAME=  FREQUENCY,     SPECTRUM/REAL,   SPECTRUM/IMAG
##SYMBOL=    X,             R,               I
##VAR_TYPE=  INDEPENDENT,   DEPENDENT,       DEPENDENT
##VAR_FORM=  AFFN,          ASDF,            ASDF
##VAR_DIM=   16384,         16384,           16384
##UNITS=     HZ,            ARBITRARY UNITS, ARBITRARY UNITS
##FACTOR=    0.252644378177508, 1,           1
##FIRST=     3299.83951724647, 0,            0
##LAST=      -839.233330435636, 0,           0
##MIN=       -839.233330435636, -441936,     0
##MAX=       3299.83951724647, 532968529,    0
$$ Real data points
##PAGE= N=1
##DATA TABLE= (X++(R..R)), XYDATA
$$ [...]
$$ plain form
12295 -179396 -118932 -120341 -245773 -142566 -111186 -18018 -59216 -191003 -205098 -239358 -80764
12284 -80764 -226478 -234703 4969 -229733 -155946 -302044 -93768 -197049 -332594 -219622
12274 -219622 -129616 -172278 -194672 -120776 -161551 -58391 -166905 -132295 -84781 -191425 -89989
12263 -89989 -186643 -196168 -239469 -174194 -226597 -63078 -126710 -84652 -132798 -223441 -163958 -184451
12251 -184451 -148638 -167757 -233106 -275758 -146620 -78961 -117537 -147589 -286585 -239958 -86514
12240 -86514 -61882 -54458 -183709 -221026 -101624 -126049 -204778 -134281 -10157 -180007 -122563
12229 -122563 -174330 -193787 -150914 -195348 -182264 -292663 -77526 -210539 -129911 -125619 -232716
12218 -232716 -111832 -146157 -28397 -158997 -108820 -90681 -41956 -228987 -69218 -176296
$$ packed form
12295a79396O0464j409j25432J03207L1380R3168m1198j31787j4095l4260J58594
12284h0764j45714q225K39672k34702P3787j46098K08276j03281j35545J12972
12274b19622R0006m2662k2394P3896m0775J03160j08514L4610M7514j06644J01436
12263h9989r6654r525m3301O5275n2403J63519o3632M2058m8146r0643N9483k0493
12251a84451L5813j9119o5349m2652J29138O7659l8576l0052j38996M6627J53444
12240h6514K4632P424j29251l7317J19402k4425p8729P0497J24124j69850N7444
12229a22563n1767j9457M2873m4434J3084j10399K15137j33013Q0628M292j07097
12218b32716J20884l4325J17760j30600N0177J8139M8725j87031J59769j07078
$$ plain form
12208 -176296 -114104 -214994 -173065 -57660 -216784 -245636 -175529 -244405 -43705 -120572 -167182
12197 -167182 -227490 -150876 -233556 -106300 -227174 -87629 -148642 -109159 -141965 -175018 -41680
12186 -41680 -187725 -180643 -121580 -174383 -254946 -144146 -74723 -87647 -174333 -121716 -153127
12175 -153127 -128356 -248422 -81084 -87186 -66465 -192341 -295868 -46863 -179891 -301694
12165 -301694 -118824 -163774 -82907 -48086 -149875 -165221 -181897 -153993 -242254 -218313 -235874
12154 -235874 -86060 -208908 -250332 -93795 -135702 -127132 -189569 -156463 -34444 -181544 -233159
12143 -233159 -165765 2123 -120090 -233709 -171835 -129226 -188369 -213416 -169273 -55505 -76509
12132 -76509 -299176 -132007 -78395 -249188 -237703 -140229 -177718 -240150 -254640 -234195 -146995
$$ packed form
12208a76296O2192j00890M1929J15405j59124k8852P0107o8876K00700p6867m6610
12197a67182o0308P6614q2680J27256j20874J39545o1013L9483l2806l3053J33338
12186d1680j46045P082N9063n2803q0563J10800O9423j2924q6686N2617l1411
12175a53127K4771j20066J67338o102K0721j25876j03527K49005j33028j21803
12165c01694J82870m4950Q0867L4821j01789j5346j6676K7904q8261K3941j7561
12154b35874J49814j22848m1424J56537m1907Q570o2437L3106J22019j47100n1615
12143b33159O7394J67888j22213j13619O1874M2609n9143k5047M4143J13768k1004
12132g6509k22667J67169N3612j70793J1485R7474l7489o2432j4490K0445Q7200
$$ plain form
12121 -146995 -70224 -186384 -153422 -206549 -50451 -233222 -219581 -251724 -170220 -175780 -94668
12110 -94668 -73676 -198157 -241941 -204597 -139116 -93699 -148444 -40182 -163878 -142711 -173773
12099 -173773 -136015 -231335 -143898 -108414 -212835 -188363 -122680 -221944 -120961 -194972 -56934
12088 -56934 -196539 -190421 -184499 -136301 -233229 -106633 -189130 -137689 -114339 -138745 16383
12077 16383 -115443 -50430 -312439 -122505 -199070 -200638 -121749 -186535 -83845 -117302 -192479
12066 -192479 -32982 -138223 21435 -184382 -14811 -81807 -173462 -91026 -226227 -133114
12056 -133114 -129009 -233429 -131180 -161382 -37306 -152399 -248572 -109839 -155152 -80891 -126086
12045 -126086 -311096 -88638 -108472 -69901 -93819 -175897 -59324 -111799 -13094 -17507 -47867
$$ packed form
12121a46995P6771j16160L2962n3127J56098j82771J3641l2143Q1504n560Q1112
12110i4668K0992j24481m3784L7344O5481M5417n4745J08262j23696K1167l1062
12099a73773L7758r5320Q7437L5484j04421K4472O5683r9264J00983p4011J38038
12088e6934j39605O118N922M8198r6928J26596q2497N1441K3350k4406J55128
12077A6383j31826O5013k62009J89934p6565j568P8889o4786J02690l3457p5177
12066a92479J59497j05241J59658k05817J69571o6996r1655Q2436j35201R3113
12056a33114M105j04420J02249l0202J24076j15093r6173J38733m5313P4261m5195
12045a26086j85010K22458j9834L8571k3918q2078J16573n2475R8705m413l0360
$$ plain form
12034 -47867 -301746 -198268 -137352 -223672 -281316 -193780 -151480 -168106 -112961 -127317 -211036
12023 -211036 -256598 -294642 -95170 -236029 -144920 -184635 -195237 -127685 -142317 -35063 -149936
12012 -149936 -11193 -182417 -277334 -104251 -149369 -72923 -89502 -138558 -135697 -188157 -150770
12001 -150770 -189929 -102818 -227957 -141657 -92701 -16627 -101966 -98735 -227885 -171249 -207904
11990 -207904 -260218 -51891 -238819 -49454 -202974 13243 -139645 -263565 -156164 -264280
11980 -264280 -30186 -128179 -219321 -170832 -258806 -40449 -121034 -107828 -166693 -79268 -128477
11969 -128477 -4057 -86177 -168143 -270669 -105364 -257906 -20880 -84692 -158303 -88685
11959 -88685 -161588 -145570 -291134 -228284 -141136 -157977 -138510 -158541 -102918 -125572 -241172
$$ packed form
12034d7867k53879J03478O0916q6320n7644Q7536M2300j6626N5145j4356q3719
12023b11036m5562l8044J99472j40859R1109l9715j0602O7552j4632J07254j14873
12012a49936J38743j71224r4917J73083m5118P6446j6579m9056K861n2460L7387
12001a50770l9159Q7111j25139Q6300M8956P6074q5339L231j29150N6636l6655
11990b07904n2314K08327j86928J89365j53520K16217j52888j23920J07401j08116
11980b64280K34094r7993r1142M8489q7974K18357q0585J3206n8865Q7425m9209
11969a28477J24420q2120q1966j02526J65305j52542K37026o3812p3611O9618
11959h8685p2903J6018j45564O2850Q7148j6841J9467k0031N5623k2654j15600
$$ plain form
11948 -241172 -250514 -246299 -75355 -251754 -193091 -195696 -44901 -160206 -134897 -84881 -92484
11937 -92484 -113035 -222109 -168140 -132086 -89388 -160988 -84560 37497 23439 -3165 -66760
11926 -66760 -69802 -111234 -239716 -60791 -28053 11511 -109689 -153422 98135 -835 -154710
11915 -154710 -64234 -152402 -6628 -206230 -110526 -181466 -152015 -310409 -172138 -159340 -89164
11904 -89164 -246638 -145480 -194886 -235381 -132672 -85193 -224312 -170670 -182313 -162567 -248391
11893 -248391 -152700 -257709 -337201 -150852 -185967 -121559 -131467 -111004 -79443 -15749 -82842
11882 -82842 -160952 -245729 -155911 -336317 -186342 -182882 -125121 -97079 -193791 -197243 -327155
11871 -327155 -144750 -134706 -132879 -35211 -187418 -268894 -254023 -197156 -96454 -115339 -131769
$$ packed form
11948b41172r342M215J70944j76399N8663k605J50795j15305K5309N0016p603
11937i2484k0551j09074N3969L6054M2698p1600P6428J22057j4058k6604o3595
11926f6760l042m1432j28482J78925L2738L9564j21200m3733K51557r8970j53875
11915a54710R0476q8168J45774j99602R5704p0940K9451j58394J38271J2798P0176
11904h9164j57474J01158m9406m0495J02709M7479j39119N3642j1643J9746q5824
11893b48391R5691j05009p9492J86349l5115O4408r908K0463L1561O3694o7093
11882h2842p8110q4777Q9818j80406J49975L460N7761K8042r6712l452j29912
11871c27155J82405J0044J827R7668j52207q1476J4871N6867J00702j8885j6430
$$ plain form
11860 -131769 -189691 -118402 -194975 -157084 -22656 -176261 -181777 -195796 -249544 -89272 -108140
11849 -108140 -113428 -121760 -181841 -125063 -111086 -30049 -71573 -14053 -58583 -78324 -100896 -134035
11837 -134035 -118472 -108797 -69945 -190090 -217250 -206614 -101286 -104554 -209822 28562 -135800
11826 -135800 -85866 -131590 -153610 -219066 -120938 -109526 -170236 -121475 -127059 -179719 -128114 -157959
11814 -157959 -146397 -201880 -99231 -174817 -105845 -154648 -205381 -165547 -155223 -216444 -236744
11803 -236744 -74587 -131481 -204883 -175752 -100055 -142557 -155617 -243671 -240820 -118931 -117958 -205110
11791 -205110 -182786 -201956 -78422 -119122 -305878 -130035 -128017 -190777 -151251 -38961 18752
11780 18752 -141548 -195915 -32031 -187302 -19804 -174345 -113966 -199613 -145894 -234364 -304892
$$ packed form
11860a31769n7922P1289p6573L7891J34428j53605n516j4019n3748J60272j8868
11849a08140n288q332o0081N6778J3977Q1037m1524N7520m4530j9741k2572l3139
11837a34035J5563R675L8852j20145k7160J0636J05328l268j05268K38384j64362
11826a35800M9934m5724k2020o5456R8128J1412o0710M8761n584n2660N1605k9845
11814a57959J1562n5483J02649p5586O8972m8803n0733L9834J0324o1221k0300
11803b36744J62157n6894p3402K9131P5697m2502j3060q8054K851J21889R73q7152
11791b05110K2324j9170J23534m0700j86756J75843K018o2760L9526J12290N7713
11780A8752j60300n4367J63884j55271J67498j54541O0379q5647N3719q8470p0528
$$ plain form
11769 -304892 -83024 -268498 -109442 -156441 -112021 -122933 -174436 -103069 -92166 -110894 -177742
11758 -177742 -190130 -42977 -150771 -140747 -199938 647 -76718 -171514 -227848 -166044 -46244
11747 -46244 -98376 -103645 -237560 -113118 -160649 -267507 -183804 -106082 -190907 -120139 -26514
11736 -26514 -387 -157870 -157979 -125175 -65629 -243765 -157035 -335237 -93828 -160954 -60756
11725 -60756 -127339 -203150 -152123 -142518 -113881 -127296 -90324 -94236 -149869 -62183 -108404 -172990
11713 -172990 -178634 -81371 -82211 -134237 -208101 -118432 -45461 -157621 -72896 -150165 -164121 -168060
11701 -168060 -286940 -163856 -76443 -254464 -103751 -180401 -183514 -76795 -145137 -166477 -61968
11690 -61968 -165212 -126894 -137637 -134906 -125144 -204313 -70639 -82411 -192789 -105051 -72493
$$ packed form
11769c04892K21868j85474J59056m6999M4420j0912n1503P1367J0903j8728o6848
11758a77742j2388J47153j07794J0024n9191K00585p7365r4796n6334O1804J19800
11747d6244n2132n269j33915J24442m7531j06858Q3703P7722q4825P0768R3625
11736b6514K6127j57483j09L2804N9546j78136Q6730j78202K41409o7126J00198
11725f0756o6583p5811N1027R605K8637j3415L6972l912n5633Q7686m6221o4586
11713a72990n644R7263q40n2026p3864Q9669P2971j12160Q4725p7269j3956l939
11701a68060j18880J23084Q7413j78021J50713p6650l113J06719o8342k1340J04509
11690f1968j03244L8318j0743K731R762p9169J33674j1772j10378Q7738L2558
$$ plain form
11679 -72493 -8931 -87546 -191346 -127117 -154746 -134420 -232115 -102304 -173580 -146744 -228744
11668 -228744 -124333 -152280 -86098 -155084 -68914 -128717 -190496 -211218 -276940 -194062 -30322
11657 -30322 -70680 -207320 -249410 -202685 -167585 -113950 -122339 -167862 -300730 -180874 -235874
11646 -235874 -73873 -31083 -235270 -98258 -178314 -84127 -194704 -100875 -166936 -65563
11636 -65563 -8286 -174806 -54969 -206615 -76345 -182275 -247290 -144581 -281721 -172251
11626 -172251 -174170 -193569 -36586 -125979 -214042 -91983 -235252 -151705 -164585 -202367 -85453
11615 -85453 -102866 -116672 -270757 -82429 -48888 79034 -190310 -208509 -67245 -178722
11605 -178722 -123711 -192987 -131461 -125561 -183927 -63620 -113595 -61157 -125017 -186905 -168895
$$ packed form
11679g2493O3562p8615j03800O4229k7629K0326r7695J29811p1276K6836q2000
11668b28744J04411k7947O6182o8986Q6170n9803o1779k0722o5722Q2878J63740
11657c0322m0358j36640m2090M6725L5100N3635q389m5523j32868J19856n5000
11646b35874J62001M2790k04187J37012q0056R4187j10577R3829o6061J01373
11636f5563N7277j66520J19837j51646J30270j05930o5015J02709j37140J09470
11626a72251j919j9399J56983q9393q8063J22059j43269Q3547j2880l7782J16914
11615h5453j7413j3806j54085J88328L3541J27922k69344j8199J41264j11477
11605a78722N5011o9276O1526N900n8366J20307m9975N2438o3860o1888J8010
$$ plain form
11594 -168895 -148687 -158708 -152466 -220390 -76450 -73785 -71695 -214423 -235665 -82918 -76448 -155814
11582 -155814 -169169 -108637 -200852 -78334 -84207 -251836 -100971 -178724 -64331 -110636 -147907
11571 -147907 -36713 -170965 -83998 -103204 -151854 -139321 -36235 3046 -153259 -68632 -95460
11560 -95460 -89340 -159697 -195836 -72359 -108128 -178994 -152368 -220099 -124957 -116246 -187930 -84711
11548 -84711 -157332 -75057 -209540 -204033 -138510 -212451 -50008 -144031 -215726 -68161 -139184
11537 -139184 -61214 -121018 -206500 -235536 -46806 -130027 -139621 -111828 -97715 -160108 -148226
11526 -148226 -107014 -51026 -151813 -171999 -110749 -41937 -47958 -221847 -120494 -147393 -68207
11515 -68207 -83011 -43831 -177180 -230678 60176 -77819 -223228 -136714 -216602 -106873 -68151
$$ packed form
11594a68895K0208j0021O242o7924J43940K665K090j42728k1242J52747O470p9366
11582a55814j3355O0532r2215J22518n873j67629J50865p7753J14393m6305l7271
11571a47907J11194j34252Q6967j9206m8650J2533J03086L9281j56305Q4627k6828
11560i5460O120p0357l6139J23477l5769p0866K6626o7731R5142Q711p1684J03219
11548h4711p2621Q2275j34483N507O5523p3941J62443r4023p1695J47565p1023
11537a39184P7970n9804q5482k9036J88730q3221r594K7793J4113o2393J1882
11526a48226M1212N5988j00787k0186O1250O8812o021j73889J01353k6899P9186
11515f8207j4804L9180j33349n3498K90854j37995j45409Q6514p9888J09729L8722
$$ plain form
11504 -68151 -193130 -191563 -239089 -49002 -186977 -192396 -201519 -183805 -200683 -209632 -99861 -143439
11492 -143439 -163660 -123814 15169 -38952 65078 -90151 -71522 -235505 -69508 -140484
11482 -140484 -145802 -200638 -154584 -18436 -56286 -116007 -152079 -41411 -112349 -92678 -170068
11471 -170068 -235831 -113715 -83412 -157054 -101639 -116069 -146277 -85083 -172942 -131707 -154739
11460 -154739 63858 -109579 -120993 -73622 -106976 -105905 -226089 -74244 -157987 -52722 -185809
11449 -185809 -271699 -36157 -284779 -28944 9234 -240902 -129324 -282757 -49164 -159575
11439 -159575 -170089 -67584 -28296 -127942 -217368 -169290 -90445 -95564 -92845 -165516 -45105
11428 -45105 -207492 -55026 -204476 -258355 14216 -135303 -156539 -154284 -159913 -113919 -147316
$$ packed form
11504f8151j24979J567m7526J90087j37975n419r123J7714j6878q949J09771m3578
11492a43439k0221L9846J38983n4121J04030j55229J8629j63983J65997p0976
11482a40484n318n4836M6054J36148l7850n9721l6072J10668p0938J9671p7390
11471a70068o5763J22116L0303p3642N5415j4430l0208O1194q7859M1235k3032
11460a54739K18597j73437j1414M7371l3354J071j20184J51845q3743J05265j33087
11449a85809q5890K35542k48622K55835L8178k50136J11578j53433K33593j10411
11439a59575j0514J02505L9288r9646q9426M8078P8845n119K719p2671J20411
11428d5105j62387J52466j49450n3879K72571j49519k1236K255n629M5994l3397
$$ plain form
11417 -147316 -239652 -69973 -130475 -84611 -142676 -138208 -163667 -201155 -266903 -156096 -8843
11406 -8843 -54575 -68940 -172124 -150052 -93619 -170677 -132705 -196464 -167793 -174972 -267220 -194809
11394 -194809 -155299 -198803 -120228 -208680 -67312 -90279 -87358 -95980 -141297 -57616 -106393 -215251
11382 -215251 -29909 -240609 -226561 -19375 -25194 -85511 -82267 -217118 -6485 -2205 -70600
11371 -70600 -77930 -141685 -63774 -133199 -129853 -85863 -47704 -98764 -75904 -28384 -271431 -140215
11359 -140215 -274618 -9651 -36857 -74068 -155884 -149537 -99342 -163296 -28623 -88958 -121321
11348 -121321 -230035 -75865 -135646 -93480 -208702 -124611 -130117 -62655 -86158 -102593 -119605
11337 -119605 -191203 -164332 -93357 -66516 -37705 -143781 -158208 -107441 -39564 -103332 -111870
$$ packed form
11417a47316r2336J69679o0502M5864n8065M468k5459l7488o5748J10807J47253
11406h843m5732j4365j03184K2072N6433p7058L7972o3759K8671p179r2248P2411
11394a94809L9510m3504P8575q8452J41368k2967K921q622m5317Q3681m8777j08858
11382b15251J85342k10700J4048K07186n819o0317L244j34851K10633M280o8395
11371g0600p330o3755P7911o9425L346M3990L8159n1060K2860M7520k43047J31216
11359a40215j34403K64967k7206l7211q1816O347N0195o3954J34673o0335l2363
11348a21321j08714J54170n9781M2166j15222Q4091n506O7462k3503j6435j7012
11337a19605p1598K6871P0975K6841K8811j06076j4427N0767O7877o3768q538
$$ plain form
11326 -111870 -143201 -73579 16396 -157844 -30407 -162705 -45830 -148039 -124957 -78718
11316 -78718 -82668 -76704 -130549 8681 -6616 -107712 -121044 -32854 -36579 -42232 -138711 -75133
11304 -75133 -175457 -91614 -73336 -188665 -49325 -144800 -145820 -66212 -85836 19170 -183317
11293 -183317 -65343 -103706 -78684 -129194 -69309 -60162 -15209 -115254 28188 -45222 91552
11282 91552 -75730 79515 89985 52320 208906 217919 140338 144353 114712 176858 69534
11271 69534 -15611 13411 -19562 -43117 17589 -40695 -227701 -106765 -23501 -149 -13002
11260 -13002 -40107 -11971 -95695 -207162 -53499 -103971 2539 -79428 -107818 -16535 -132062
11249 -132062 -218268 -179544 -157238 -14039 -124576 -241932 -176510 -109047 -87867 -45999 -172706
$$ packed form
11326a11870l1331O9622Q9975j74240J27437j32298J16875j02209K3082M6239
11316g8718l950N964n3845J39230j5297j01096j3332Q8190l725n653r6479O3578
11304g5133j00324Q3843J8278j15329J39340r5475j020P9608j9624J05006k02487
11293a83317J17974l8363K5022n0510N9885R147M4953j00045J43442p3410J36774
11282I1552j67282J55245J0470l7665J56586R013p7581M015k9641O2146j07324
11271F9534q5145K9022l2973k3555O0706n8284j87006J20936Q3264K3352j2853
11260a3002k7105K8136q3724j11467J53663n0472J06510q1967k8390R1283j15527
11249a32062q6206L8724K2306J43199j10537j17356O5422O7463K1180M1868j26707
$$ plain form
11238 -172706 20192 -81157 -117620 -84936 -150161 -80404 -89106 -146150 -24560 -129507 -186910
11227 -186910 -57374 -56940 -114780 -45719 -134622 -171980 -166534 -124684 42358 -43007 -192731
11216 -192731 -13986 -193834 -31987 -19835 -148894 -65231 -158664 -71031 23830 -268881
11206 -268881 -80429 -199248 -12189 -103126 -78260 -82051 26567 -69525 -165505 -7441 -115131
11195 -115131 -27086 -176365 -169335 -64758 -144127 -93083 -208937 -175856 -38756 -91574 -89879
11184 -89879 -150712 -186761 -171972 -64553 -53478 -73120 -180720 -75959 -101625 -153498 -5699
11173 -5699 -152961 -33787 -57069 -223169 -172573 -95107 -85056 -192546 -22438 -204659 -114230
11162 -114230 -170968 -176497 -92349 -53437 -129950 -99554 -118245 -237554 -118394 -17802 -8387
$$ packed form
11238a72706J92898j01349l6463L2684o5225O9757q702n7044J21590j04947n7403
11227a86910J29536M34n7840O9061q8903l7358N446M1850J67042q5365j49724
11216a92731J78745j79848J61847J2152j29059Q3663r3433Q7633R4861k92711
11206b68881J88452j18819J87059r0937K4866l791J08618r6092r5980J58064j07690
11195a15131Q8045j49279P030J04577p9369N1044j15854L3081J37100n2818J695
11184h9879o0833l6049J4789J07419J1075j9642j07600J04761k5666n1873J47799
11173e699j47262J19174k3282j66100N0596P7466J0051j07490J70108j82221R0429
11162a14230n6738n529Q4148L8912p6513L0396j8691j19309J19160J00592R415
$$ plain form
11151 -8387 -40420 -208262 -126083 -168528 -83426 -33491 -56821 -179224 -81891 -215664 -175337
11140 -175337 -84550 -148108 -56548 -39658 -55929 -127048 -109930 -68535 -37034 -6339 -112586
11129 -112586 -75942 -163748 -73954 -103606 -137190 -109921 -40730 -65974 -42930 -72200 -31930
11118 -31930 -114501 -39184 -95762 -109273 -7010 -152779 -22979 -82634 7872 -188080 -168576
11107 -168576 -217233 -236287 -205587 -148672 -88782 -166407 -193410 -85721 -70083 -143426 -12965
11096 -12965 -138661 -99452 -185677 -114083 -86078 -192918 -86395 -113072 -104226 -85081 -109238
11085 -109238 -60936 -136879 -49223 -202615 -18817 -125407 -187752 2848 -150988 -82284
11075 -82284 -90381 -77632 -159042 -15165 -10169 30486 -163035 -138644 -139652 -155492 -172941 -41426
$$ packed form
11151h387l2033j67842Q2179m2445Q5102M9935k3330j22403R7333j33773M0327
11140a75337R0787o3558R1560J6890j6271p1119J7118M1395L1501L0695j06247
11129a12586L6644q7806Q9794k9652l3584K7269O9191k5244K3044k9270M0270
11118c1930q2571P5317n6578j3511J02263j45769J29800n9655R0506j95952J9504
11107a68576m8657j9054L0700N6915N9890p7625k7003J07689J5638p3343J30461
11096a2965j25696L9209q6225P1594K8005j06840J06523k6677Q846J9145k4157
11085a09238M8302p5943Q7656j53392J83798j06590o2345J90600j53836O8704
11075h2284q097J2749q1410J43877M996M0655j93521K4391j008j5840j7449J31515
$$ plain form
11063 -41426 -49754 -87956 -118630 -130256 -114548 -45142 -40420 -358 -189283 -85058 -49629 -143343
11051 -143343 -139423 -110959 -99998 -75439 -120311 -167291 -79398 -99892 -33126 -104857 19062
11040 19062 -269994 -123434 36009 -99269 -20390 27483 -202522 58721 -117358 -82632
11030 -82632 -104147 -156890 -97442 -193984 -89225 -144067 -57284 -48434 -7578 -34626 -54259 -102224
11018 -102224 -72138 -64539 -65349 -99529 -52681 -34991 -129363 -47001 -52362 -55624 -103470 -115616
11006 -115616 -74402 -25198 69198 31608 -99805 -832 42874 97504 -9271 129743 90460
10995 90460 192343 207406 207724 45322 -6574 -1221 -68604 58294 -49844 -78640 -93165
10984 -93165 -8247 -62673 14592 -60710 -14294 -112777 -225751 -180096 -170719 -248619 -183672 -126868
$$ packed form
11063d1426q328l8202l0674j1626J5708O9406M722M0062j88925J04225L5429r3714
11051a43343L920K8464J0961K4559m4872m6980Q7893k0494O6766p1731J23919
11040A9062k89056J46560J59443j35278P8879M7873k30005K61243j76079L4726
11030h2632k1515n2743N9448r6542J04759n4842Q6783Q850M0856k7048j9633m7965
11018a02224L0086P599q10l4180M6848J7690r4372Q2362n361l262m7846j2146
11006a15616M1214M9204R4396l7590j31413R8973M3706N4630j06775J39014l9283
10995I0460J01883J5063L18j62402n1896N353o7383J26898j08138k8796j4525
10984i3165Q4918n4426P7265p5302M6416r8483j12974M5655R377p7900O4947N6804
$$ plain form
10972 -126868 -201789 -177523 -233019 -123194 -194199 -184003 -128638 -166000 -160579 -58535 -68348
10961 -68348 20348 41603 52642 -64972 -209998 -86204 -169589 -5285 -76507 -110997 13255
10950 13255 -86336 -31573 -37624 49793 70446 -95175 -13560 -72811 -7751 -59918 27415 -36914
10938 -36914 -78277 23097 -84665 -43226 -89707 -245903 -63033 -39095 -179101 -62884
10928 -62884 -150492 -49600 -58519 -1449 -114766 -121141 64916 -122725 -173127 -210359 -98455
10917 -98455 -136471 -145754 -119257 -130910 -14432 -90285 -176012 -26551 -108003 -56907 -88912
10906 -88912 -74781 -206218 -51176 -40614 -70704 -19231 -129126 -92674 -149573 -89800 -242770
10895 -242770 8177 -94737 -126891 -129097 -176496 -80107 -133594 -106928 -190983 -192170 -197581 -66066
$$ packed form
10972a26868p4921K4266n5496J09825p1005J0196N5365l7362N421J02044r813
10961f8348Q8696K1255J1039j17614j45026J23794q3385J64304p1222l4490J24252
10950A3255r9591N4763o051Q7417K0653j65621Q1615n9251O5060n2167Q7333o4329
10938c6914m1363J01374j07762M1439m6481j56196J82870K3938j40006J16217
10928f2884q7608J00892q919N7070j13317o375J86057j87641n0402l7232J11904
10917i8455l8016r283K6497j1653J16478p5853q5727J49461q1452N1096l2005
10906h8912J4131j31437J55042J0562l0090N1473j09895L6452n6899N9773j52970
10895b42770K50947j02914l2154k206m7399R6389n3487K6666q4055j187n411J31515
$$ plain form
10883 -66066 -142911 -116155 -76175 -83319 -144441 -20828 -105051 -95064 -146773 -60596 -32 -54118
10871 -54118 -90654 -34957 -81297 -53997 -33585 -140746 -105355 -100246 -36881 -69872 -83549 45510
10859 45510 -28810 -54806 24266 16187 -140553 25936 -97091 -53795 -3529 -28254 -13410
10848 -13410 -165088 -47213 -47878 -39770 -102891 -140814 -80229 -195769 -11182 -80331 -55466
10837 -55466 -127809 -88318 19115 -163171 -97051 -236917 -42950 -24735 -76044 -89800 -56570
10826 -56570 -185063 -51756 -123210 -58664 47604 -252442 35194 -72228 10035 -64552
10816 -64552 13158 -129466 -23757 -85649 -32542 -63619 12486 -145267 -86205 -146318 19095
10805 19095 -41399 52 -110790 -82387 -88467 -88026 23951 -94677 -185385 -130433 -40038 -57563
$$ packed form
10883f6066p6845K6756L9980p144o1122J23613q4223R987n1709Q6177O0564n4086
10871e4118l6536N5697m6340K7300K0412j07161L5391N109O3365l2991j3677J29059
10859D5510p4320k5996P9072q079j56740J66489j23027M3296N0266k4725J4844
10848a3410j51678J17875o65Q108o3121l7923O0585j15540J84587o9149K4865
10837e5466p2343L9491J07433j82286O6120j39866J93967J8215n1309j3756L3230
10826e6570j28493J33307p1454O4546J06268l00046K87636j07422Q2263p4587
10816f4552P7710j42624J05709o1892N3107l1077P6105j57753N9062o0113J65413
10805A9095o0494M1451j10842K8403o080M41J11977j18628r0708N4952R0395j7525
$$ plain form
10793 -57563 -48766 -16671 -122160 -54424 -10195 -47199 -36078 -63467 -26167 -106860 -13600 -32499
10781 -32499 -169120 -92897 -124081 -49652 -11342 -84601 -111654 -55862 5268 -86105 -116234
10770 -116234 -228226 -62272 -49758 -27030 -128077 -127228 -171933 -124109 17672 -113948 -62306
10759 -62306 -20010 -96894 -112615 -38106 4117 -43719 -62909 -13379 -27478 -139522 -119908
10748 -119908 -120102 -74533 -133649 -14256 -11039 -109729 -28103 -95942 -153294 -149067 18441 -112709
10736 -112709 -210713 -26342 -129577 -33295 -118334 2701 -133874 -142377 -178919 -182964 -147544
10725 -147544 -8500 -76720 -30916 -19580 -123158 -35 -128523 69529 -23032 -72887
10715 -72887 -44178 -123258 42099 -111314 -5910 -32715 43158 -42496 -147735 -181353 -98092
$$ packed form
10793e7563Q797L2095j05489O7736M4229l7004J1121k7389L7300q0693R3260j8899
10781c2499j36621P6223l1184P4429L8310p3259k7053N5792O1130r1373l0129
10770a16234j11992J65954J2514K2728j01047Q49m4705M7824J41781j31620N1642
10759f2306M2296p6884j5721P4509M2223m7836j9190M9530j4099j12044J9614
10748a19908j94M5569n9116J19393L217r8690Q1626o7839n7352M227J67508j31150
10736a12709r8004J84371j03235R6282q5039J21035j36575q503l6542m045L5420
10725a47544J39044o8220M5804J1336j03578J23123j28488J98052r2561m9855
10715g2887K8709p9080J65357j53413J05404k6805P5873q5654j05239l3618Q3261
$$ plain form
10704 -98092 -109705 -86087 -98559 8471 -135565 -158321 6185 -122942 -89556 -72578 -141256
10693 -141256 -71350 -29275 -152124 -2675 -153553 -81026 -143958 -90618 -124010 -20863 -59706
10682 -59706 -35588 -71740 -117868 -155487 -42123 -156716 5831 -142317 -9833 -66882 -183653
10671 -183653 10694 -55797 -61991 -62355 -58639 -139535 -101425 16615 2023 34411 -46485 -95982
10659 -95982 -94115 -103065 -107762 4689 -130991 -51467 10531 -66352 -32021 -53327 -3327 -84277
10647 -84277 -33446 -62099 -54005 46256 -19876 -74279 -37790 -200071 -4862 -123543 -92802
10636 -92802 -26522 -105948 -38073 -190541 -173787 -169259 -91817 95433 -52342 73936 -11203
10625 -11203 13239 7395 -27053 -52720 -68928 16561 -55177 46854 -69401 -163412 -44531
$$ packed form
10704i8092j1613K3618j2472J07030j44036k2756J64506j29127L3386J6978o8678
10693a41256O9906M2075j22849J49449j50878P2527o2932N3340l3392J03147l8843
10682e9706K4118l6152m6128l7619J13364j14593J62547j48148J32484n7049j16771
10671a83653J94347o6491o194l64L716q0896L8110J18040j4592L2388q0896m9497
10659i5982J867q950m697J12451j35680P9524O1998p6883L4331k1306N0000q0950
10647h4277N0831k8653Q094J00261o6132n4403L6489j62281J95209j18681L0741
10636i2802O6280p9426O7875j52468J6754M528P7442J87250j47775J26278q5139
10625a1203K4442n844l4448k5667j6208Q5489p1738J02031j16255r4011J18881
$$ plain form
10614 -44531 -10498 -1874 -57031 -153119 -56234 -119457 -86893 -90107 -87934 -151804 -131002 -82786
10602 -82786 29813 50750 -17670 -15192 -24999 -89336 59164 67863 22990 91405 -33121 82876
10590 82876 -66094 39078 -78319 -22808 21000 25308 -7003 -40516 -79329 -13531 -4460
10579 -4460 -143993 -74653 -9355 -25852 -73617 -2317 -132474 -17952 -19955 -41588 -59473
10568 -59473 -23926 -32102 -93780 -1004 37991 -67420 -56751 -113534 54286 -31801 -42118
10557 -42118 -49795 -22514 14426 -95618 -40935 7077 -55538 -28358 -85405 -65371 10863 4910
10545 4910 -46748 -104771 -133809 -60637 -73654 23411 36283 9755 -90613 -48842 -35818 44134
10533 44134 9976 -57659 -94400 -102460 -81954 -4854 -19791 -75456 2736 -115100 -65774 -126138
$$ packed form
10614d4531L4033Q624n5157r6088R6885o3223L2564l214K173o3870K0802M8216
10602h2786J12599K0937o8420K478r807o4337J48500Q699m4873O8415j24526J15997
10590H2876j48970J05172j17397N5511M3808M308l2311l3513l8813O5798R071
10579d460j39533O9340O5298j6497m7765P1300j30157J14522k003k1633j7885
10568e9473L5547q176o1678R2776L8995j05411J0669n6783J67820q6087j0317
10557d2118p677K7281L6940j10044N4683M8012o2615K7180n7047K0034P6234n953
10545D910n1658n8023k9038P3172j3017R7065J2872k6528j00368M1771J3024P9952
10533D4134l4158o7635l6741q060K0506P7100j4937n5665P8192j17836M9326o0364
$$ plain form
10521 -126138 62268 -170164 -81606 9613 -79163 -148210 -42055 40127 -28562 44489 10813
10510 10813 -51985 -125946 -43046 -77441 -6997 -130461 -117319 -6829 -55089 84419 -34492
10499 -34492 66066 19091 -26031 -47813 -25530 9890 -33823 -122032 -37119 -15076 11265
10488 11265 -112381 -66056 -116125 -129316 -44679 38886 -63222 36047 10031 -122657 -56769
10477 -56769 -19127 -4304 -117130 -45630 -99709 -95629 -59416 -31176 -130210 -76030 -31081 -94841
10465 -94841 -25721 -146587 -73805 -96682 -65540 -64117 -134932 -76040 -74296 -112076 -6991 -124262
10453 -124262 91154 -2473 -93125 -20330 6529 -18962 -80462 15331 -106133 -25488 -80767
10442 -80767 -67552 -20369 -95517 -55056 4246 82698 70811 -154439 11928 -127996 -173143
$$ packed form
10521a26138J88406k32432Q8558R1219q8776o9047J06155Q2182o8689P3051l3676
10510A0813o2798p3961Q2900l4395P0444j23464J3142J10490m8260J39508j18911
10499c4492J00558m6975m5122k1782K2283L5420m3713q8209Q4913K2043K6341
10488A1265j23646M6325n0069j3191Q4637Q3565j02108R9269k6016j32688O5888
10477e6769L7642J4823j12826P1500n4079M080L6213K8240r9034N4180M4949o3760
10465i4841O9120j20866P2782k2877L1142J423p0815N8892J744l7780J05085j17271
10453a24262K15416r3627r0652P2795K6859k5491o1500R5793j21464Q0645n5279
10442h0767J3215M7183p5148M0461N9302P8452j1887k25250J66367j39924m5147
$$ plain form
10431 -173143 -21368 12847 -35725 12448 -88686 85743 -48348 -5971 -116553 -158354
10421 -158354 -23532 -93230 18828 -98954 -9024 -11322 -83040 -124946 -52994 73860 -92458
10410 -92458 21176 -83106 41050 -47974 -162499 -25598 -40691 -94577 -61731 -85900 -12640
10399 -12640 -121072 3656 -47111 -64754 13780 -45981 -5812 -137257 8659 -153386 -145367
10388 -145367 60448 -76354 -70554 -108548 -97555 6141 -149876 87314 -168166 -31221
10378 -31221 -159172 -210138 2412 -49142 44426 -72939 -56228 17237 -68238 -5052 54762
10367 54762 -37801 -30758 -146207 -130423 -107769 -49348 -105473 -56412 -106428 -153869 -47790
10356 -47790 -145767 -20013 -112263 -60635 -54200 -78912 -52660 18501 -12490 27038 40961 -73273
$$ packed form
10431a73143J51775L4215m8572M8173j01134J74429j34091M2377j10582m1801
10421a58354J34822o9698J12058j17782Q9930k298p1718m1906P1952J26854j66318
10410i2458J13634j04282J24156q9024j14525J36901j5093n3886L2846k4169P3260
10399a2640j08432J24728n0767j7643P8534n9761M0169j31445J45916j62045Q019
10388a45367K05815j36802N800l7994J0993J03696j56017K37190k55480J36945
10378c1221j27951n0966K12550n1554R3568j17365J6711P3465q5475O3186N9814
10367E4762r2563P043j15449J5784K2654N8421n6125M9061n0016m7441J06079
10356d7790r7977J25754r2250N1628O435k4712K6252P1161l0991L9528J3923j14234
$$ plain form
10344 -73273 -20131 -111779 -63132 -63667 -128343 -59954 31395 -142347 -121184 6555 -81166 17047
10332 17047 -92909 -31529 -9739 61077 -112854 -95527 -3642 -32401 44682 -75978 -78731
10321 -78731 110970 -103311 11307 82490 -30723 -112285 72354 -83715 -63805 -86549
10311 -86549 -110202 -63975 -95054 -5584 -38038 -113095 -2112 -154887 -95906 -34146 -46614
10300 -46614 1096 -51546 -112751 -121191 -67959 -43332 -8386 118287 -94181 6647 -160141
10289 -160141 -36542 35534 -59407 -97436 -70776 -27904 -42112 1413 -26991 -11629 2517
10278 2517 12243 -59370 -37800 4694 2554 51612 -47170 -14943 20830 -54811 -48527 46288
10266 46288 -32708 -89074 -76217 -53976 -26868 -84112 22463 -129024 -24705 -74221 -131108
$$ packed form
10344g3273N3142r1648M8647n35o4676O8389R1349j73742K1163J27739q7721R8213
10332A7047j09956O1380K1790P0816j73931J7327R1885k8759P7083j20660k753
10321g8731J89701k14281J14618P1183j13213q1562J84639j56069J9910k2744
10311h6549k3653M6227l1079Q9470l2454p5057J10983j52775N8981O1760j2468
10300d6614M7710n2642o1205q440N3232K4627L4946J26673k12468J00828j66788
10289a60141J23599P2076r4941l8029K6660M2872j4208M3525k8404J5362J4146
10278B517R726p1613K1570M2494k140M9058r8782L2227L5773p5641O284R4815
10266D6288p8996n6366J2857K2241K7108n7244J06575j51487J04319m9516n6887
$$ plain form
10255 -131108 -55027 -79167 -104183 -126893 17282 -49865 -118577 -4358 -102723 -52013 -44711
10244 -44711 -116885 -46749 -104771 -83380 -60493 -124504 16481 -32608 -63643 14327 49971
10233 49971 -6122 -22351 43396 -86516 38753 -26651 -55602 -74689 -143956 7391 -9758
10222 -9758 -119540 -11684 -52272 65855 -28217 -140998 -24243 -150366 58793 -13147
10212 -13147 -77552 -8939 -49515 -86115 -66270 -86793 -21831 43326 -54262 40094 -83306
10201 -83306 -98881 -37937 -51976 -85335 -77153 -49090 -190493 -20342 -39669 -938 69277
10190 69277 -22965 -145143 -13696 -40025 -129649 -22896 14800 -39755 -87969 -526 -18032
10179 -18032 70 17417 -61195 -210500 -91376 -165388 110820 -76020 -118579 -117492 -17947
$$ packed form
10255a31108P6081k4140k5016k2710J44175o7147o8712J14219r8365N0710P302
10244d4711p2174P0136n8022K1391K2887o4011J40985m9089l1035P7970L5644
10233D9971n6093j6229O5747j29912J25269o5404k8951j9087o9267J51347j7149
10222i758j09782J07856m0588J18127r4072j12781J16755j26123K09159p1940
10212a3147o4405O8613m0576l6600J9845k0523O4962O5157r7588R4356j23400
10201h3306j5575O0944j4039l3359Q182K8063j41403J70151j9327L8731P0215
10190F9277r2242j22178J31447k6329q9624J06753L7696n4555m8214Q7443j7506
10179a8032J8102J7347p8612j49305J19124p4012K76208j86840m2559J087R9545
$$ plain form
10168 -17947 -65423 5686 -9 -109039 18537 83853 -87921 -71540 -68049 -134625 -10587
10157 -10587 -4357 4836 -34491 164382 -40569 11503 87909 -74648 1277 -87636 -17134
10146 -17134 -47109 6375 -11104 -26702 -88570 -108335 37130 -837 -59079 28962 74703
10135 74703 -12394 -101767 50683 36076 83044 -46917 58193 6522 23816 9634 4896
10124 4896 40586 22570 -184452 7376 37399 -85435 -3527 -166022 -55136 -129971 -123220
10113 -123220 -63119 -46709 -14723 -146066 110782 -93192 -22983 -110278 -108881 -23091 -42028
10102 -42028 -79250 -124504 22365 -69593 45604 17701 32322 40281 -52963 -52586 -78609 57221
10090 57221 69601 82698 58834 92909 -26802 48538 -15308 116058 -805 -5155 -32319
$$ packed form
10168a7947m7476P1109n695j09030J27576O5316j71774J6381L491o6576J24038
10157a0587O230R193l9327J98873k04951N2072P6406j62557P5925q8913P0502
10146a7134k9975N3484j7479j5598o1868j9765J45465l7967n8242Q8041M5741
10135G4703q7097q9373J52450j4607M6968j29961J05110n1671J7294j4182m738
10124D896L5690j8016k07022J91828L0023j22834Q1908j62495J10886p4835O751
10113a23220O0101J6410L1986j31343K56848k03974P0209q7295J397Q5790j8937
10102d2028l7222m5254J46869r1958J15197k7903J4621P959r3244L77k6023J35830
10090E7221J2380J3097k3864L4075j19711P5340o3846J31366j16863m350k7164
$$ plain form
10079 -32319 147779 20170 -26334 27112 48203 -62129 -50858 -26559 91079 -80856 -71320
10068 -71320 -147407 9546 -3103 47968 65184 17470 111796 -78226 -43903 25153 6919
10057 6919 20022 88 -153881 109 -160054 36315 -6809 -71472 -195 -83150 118521
10046 118521 39120 8201 -38235 -79544 -19684 -49057 -20229 47365 70846 43348 12246
10035 12246 -37467 -82375 -78994 -2749 60413 53169 45607 14076 -4301 100465 48050 33946
10023 33946 20017 27729 20237 -174928 -51729 -27207 92044 5131 -3711 115114 -41349
10012 -41349 226561 30195 26381 91489 -1409 42259 17200 31258 41239 29527 64088 119258
10000 119258 136519 165809 219208 238923 435505 428341 391793 427030 409509 472012 413992
$$ packed form
10079c2319J80098j27609m6504N3446K1091j10332J1271K4299J17638j71935R536
10068g1320p6087J56953j2649N1071J7216m7714R4326j90022L4323O9056j8234
10057F919J3103j9934j53969J53990j60163J96369m3124o4663P1277q2955K01671
10046A18521p9401l0919m6436m1309N9860k9373K8828O7594K3481k7498l1102
10035A2246m9713m4908L381P6245O3162p244p562l1531j8377J04766n2415j4104
10023C3946j3929P712p492j95165J23199K4522J19251q6913q842J18825j56463
10012d1349K67910j96366l814O5108r2898M3668k5059J4058R981j1712L4561N5170
10000A19258J7261K9290N3399J9715J96582p164l6548L5237j7521O2503n8020
$$ plain form
9989 413992 305894 257669 209891 305506 228483 79884 59620 -40056 121074 77055 -10321
9978 -10321 73965 90938 55226 20783 -4805 68065 79330 73242 33755 16550 42684 -3423
9966 -3423 931 -20014 74831 151861 -57293 -100821 85481 70161 -2588 109323 77746 75858
9954 75858 157174 141816 213166 86839 124617 127228 124348 82619 118064 48893 95120 83969
9942 83969 9576 41191 44674 238791 114177 158444 256301 217885 264134 249060 293631 218779
9930 218779 265696 274620 236200 355918 291000 400718 285354 384056 284552 461856 481562
9919 481562 422616 421635 381168 241282 358185 122337 165272 153987 154800 114957 132689 106235
9907 106235 29068 186919 44303 -18110 149563 114057 100955 210006 165571 15145 23998
$$ packed form
9989D13992j08098m8225m7778R5615p7023j48599k0264r9676J61130m4019q7376
9978a0321Q4286J6973l5712l4443k5588P2870J1265o088l9487j7205K6134m6107
9966c423M354k0945R4845P7030k09154m3528J86302j5320p2749J11911l1577j888
9954G5858Q1316j5358P1350j26327L7778K611k880m1729L5445o9171M6227j1151
9942H3969p4393L1615L483J94117j24614M4267R7857l8416M6249j5074M4571p4852
9930B18779M6917Q924l8420J19718o4918J09718j15364R8702r9504J77304J9706
9919D81562n8946r81m0467j39886J16903k35848M2935j1285Q13l9843J7732k6454
9907A06235p7167J57851j42616o2413J67673l5506j3102J09051m4435j50426Q853
$$ plain form
9896 23998 160988 169876 111017 97683 110264 21650 29474 158870 156629 154078 238787 169117
9884 169117 320199 375529 451428 383766 359193 411573 319706 331970 397904 440233 393681
9873 393681 193588 275456 288662 244167 200331 276869 188815 295791 251598 176067 149724
9862 149724 206523 172791 245730 191602 199653 224200 367611 343629 391381 345560 511816
9851 511816 521702 535718 598626 706927 588013 836449 608227 856379 823875 861549 732906
9840 732906 620522 662958 597470 669880 515776 470968 472466 563223 490383 258757 528149
9829 528149 373628 374006 302289 277589 324553 188120 319228 187540 272060 228412 143646
9818 143646 224610 255660 205045 207309 220830 173355 219125 302746 410977 461527 463521 290868
$$ packed form
9896B3998J36990Q888n8859j3334J2581q8614P824J29396k241k551Q4709o9670
9884A69117J51082N5330P5899o7662k4573N2380r1867J2264O5934M2329m6552
9873C93681k00093Q1868J3206m4495m3836P6538q8054J06976m4193p5531k6343
9862A49724N6799l3732P2939n4128Q051K4547J43411k3982M7752m5821J66256
9851E11816R886J4016O2908J08301j18914K48436k28222K48152l2504L7674j28643
9840G32906j12384M2436o5488P2410j54104m4808J498R0757p2840k31626K69392
9829E28149j54521L78p1717k4700M6964j36433J31108j31688Q4520m3648q4766
9818A43646Q0964L1050n0615K264J3521m7475M5770Q3621J08231N0550J994j72653
$$ plain form
9806 290868 342632 306058 279200 194043 211346 143852 121815 179813 117544 120169 200034 252030
9794 252030 185147 216992 232720 120646 147791 173068 189922 151661 157353 120116 293506
9783 293506 283010 181948 182510 190057 107451 123991 149760 93905 46207 142671 93442 86574
9771 86574 150192 153426 126568 199998 113617 97264 104126 6285 177912 81032 185562 223805
9759 223805 256161 190620 158804 134056 151235 104368 198843 111712 107540 89868 226729 187014
9747 187014 123313 379155 214335 92847 231764 152930 170643 249354 299014 199687 216842
9736 216842 132608 164831 139728 106564 -4767 21889 -13169 112974 116573 -11532 139886
9725 139886 73166 108124 135157 155559 130712 222277 49473 162312 60717 25984 104582
$$ packed form
9806B90868N1764l6574k6858q5157J7303o7494k2037N7998o2269K625P9865N1996
9794B52030o6883L1845J5728j12074K7145K5277J6854l8261N692l7237J73390
9783B93506j0496j01062N62P547q2606J6540K5769n5855m7698R6464m9229o868
9771H6574O3618L234k6858P3430q6381j6353O862r7841J71627r6880J04530L8243
9759B23805L2356o5541l1816k4748J7179m6867R4475q7131m172j7672J36861l9715
9747A87014o3701K55842j64820j21488J38917p8834J7713P8711M9660r9327J7155
9736B16842q4234L2223k5103l3164j11331K6656l5058J26143L599j28105J51418
9725A39886o6720L4958K7033K0402k4847R1565j72804J12839j01595l4733P8598
$$ plain form
9714 104582 199719 100614 43875 81440 54484 101112 55463 44905 93963 22320 32424 39310
9702 39310 12970 87065 87519 167346 103323 245870 42187 143518 103720 72601 24941 -21604
9690 -21604 112932 91490 61724 129616 146827 18448 114657 41650 -7449 50173 123189
9679 123189 62327 180277 172757 214483 127241 147718 159993 98037 138528 75792 133440 134131
9667 134131 80862 225966 110258 133922 174957 107530 131944 44493 83030 141293 27905
9656 27905 207620 121743 98296 232633 42744 233152 147755 224729 169975 149752 191750
9645 191750 237679 171437 127398 86110 163643 170933 98715 148953 146626 191892 68445 155413
9633 155413 72251 213923 281732 177659 134021 73559 176806 186682 113518 213699 69703
$$ packed form
9714A04582R5137r9105n6739L7565k6956M6628m5649j0558M9058p1643J0104O886
9702C9310k6340P4095M54P9827o4023J42547k03683J01331l9798l1119m7660m6545
9690b1604J34536k1442k9766O7892J7211j28379R6209p3007m9099N7622P3016
9679A23189o0862J17950p520M1726q7242K0477J2275o1956M0491o2736N7648O91
9667A34131n3269J45104j15708K3664M1035o7427K4414q7451L8537N8263j13388
9656B7905J79715q5877k3447J34337j89889J90408q5397P6974n4754k0223M1998
9645A91750M5929o6242m4039m1288P7533P290p2218N0238k327M5266j23447Q6968
9633A55413q3162J41672O7809j04073m3638o0462J03247R876p3164J00181j43996
$$ plain form
9622 69703 112449 117863 150700 164047 208194 167647 379296 252980 258401 221475 264025 242127
9610 242127 286750 285048 414775 411405 265176 415949 454308 423011 447162 336653 319480
9599 319480 493598 335380 331302 322410 386821 316006 369742 267435 302048 263602 320639
9588 320639 238525 351967 197747 383933 391687 317386 391169 268947 299716 394099 445705
9577 445705 440813 398821 489625 602971 391578 518481 520018 469040 547219 434026 393211
9566 393211 464756 403308 355154 427088 437556 316057 251988 296545 367224 304215 215660
9555 215660 324884 286947 268275 278528 264414 233858 313441 377548 311369 321974 369997
9544 369997 295451 393125 435991 306148 366899 335116 349094 544089 334829 579084 471906
$$ packed form
9622F9703M2746N414L2837J3347M4147m0547K11649j26316N421l6926M2550k1898
9610B42127M4623j702J29727l370j46229J50773L8359l1297K4151j10509j7173
9599C19480J74118j58218m078q892O4411p0815N3736j02307L4613l8446N7037
9588C20639q2114J13442j54220J86186P754p4301P3783j22222L0769R4383N1606
9577D45705m892m1992R0804J13346k11393J26903J537n0978P8179j13193m0815
9566C93211P1545o1448m8154P1934J0468j21499o4069M4557P0679o3009q8555
9555B15660J09224l7937j8672J0253j4114l0556P9583O4107o6179J0605M8023
9544C69997p4546R7674M2866j29843O0751l1783J3978J94995k09260K44255j07178
$$ plain form
9533 471906 356741 549850 461688 468274 559216 422004 556831 555132 532860 565884 548519
9522 548519 668150 538360 611352 679223 742133 789267 782020 716658 817468 662413 784128
9511 784128 694196 801373 863056 769780 827854 753738 851033 920839 1000864 1006072 980782 1063269
9499 1063269 1041940 1175043 1137369 993645 1258122 1078172 1327217 1250920 1233608 1230000 1222015
9488 1222015 1218797 1316088 1247552 1257661 1207994 1103925 1092231 1187991 917445 1094895 990020
9477 990020 921568 986326 1068365 1056688 1063108 1101680 1100101 1150252 1290451 1397996 1519782
9466 1519782 1504804 1456795 1585144 1511114 1627404 1751608 1916803 2052911 2014869 1971403
9456 1971403 2105504 2089961 1951218 1978391 1988174 1907679 1837031 1659918 1768961 1680657 1542553
$$ packed form
9533D71906j15165J93109q8162O586R0942j37212J34827j699k2272L3024j7365
9522E48519J19631j29790P2992O7871O2910M7134p247o5362J00810j55055J21715
9511G84128q9932J07177O1683r3276N8074p4116R7295O9806Q0025N208k5290Q2487
9499A063269k1329J33103l7674j43724K64477j79950K49045p6297j7312l608p985
9488A222015l218R7291o8536J0109m9667j04069j1694R5760k70546J77450j04875
9477I90020o8452O4758Q2039j1677O420L8572j579N0151J40199J07545J21786
9466A519782j4978m8009J28349p4030J16290J24204J65195J36108l8042m3466
9456A971403J34101j5543j38743K7173R783q0495p0648j77113J09043q8304j38104
$$ plain form
9445 1542553 1592745 1568881 1605037 1574982 1596582 1507105 1497097 1561191 1474815 1629382 1576905
9434 1576905 1705723 1820573 1839065 1908368 1936005 1849822 2037296 1944775 2064999 1902181
9424 1902181 1909262 1957953 1910133 1793770 1850430 1926343 1743476 1846234 1827372 1713540 1743057
9413 1743057 1553157 1713214 1584670 1459306 1533527 1550783 1436425 1455318 1351896 1489113
9403 1489113 1525505 1444100 1392680 1440213 1429000 1471556 1355507 1364835 1469864 1368292 1414320
9392 1414320 1395665 1501179 1489744 1390206 1416918 1423783 1329765 1359774 1421227 1372931 1256965
9381 1256965 1280279 1247803 1395691 1400416 1406199 1413592 1342608 1404546 1482904 1612999 1666467 1725380
9369 1725380 1810290 2040279 2050192 2387473 2444041 2489885 2581091 2516671 2661860 2668168 2751256
$$ packed form
9445A542553N0192k3864L6156l0055K1600q9477j0008O4094q6376J54567n2477
9434A576905J28818J14850J8492O9303K7637q6183J87474r2521J20224j62818
9424A902181P081M8691m7820j16363N6660P5913j82867J02758j8862j13832K9517
9413A743057j89900J60057j28544j25364P4221J7256j14358J8893j03422J37217
9403A489113L6392q1405n1420M7533j1213M2556j16049R328J05029j01572M6028
9392A414320j8655J05514j1435r9538K6712O865r4018L0009O1453m8296j15966
9381A256965K3314l2476J47888M725N783P393p0984O1938P8358J30095N3468N8913
9369A725380Q4910K29989R913L37281N6568M5844R1206o4420J45189O308Q3088
$$ plain form
9358 2751256 2962740 3009632 2935442 2884554 2755832 2649260 2552809 2549738 2567747 2492941 2438777
9347 2438777 2301199 2443273 2273825 2476263 2407164 2345742 2490873 2503817 2767104 2973638
9337 2973638 3114146 3184703 3241760 3494638 3650142 3744980 3765497 3798117 4012430 3843061
9327 3843061 3976739 3840131 3656549 3570022 3201079 3019718 2861398 2812132 2750916 2687997
9317 2687997 2861637 2817653 2841757 2731119 2887146 2862340 2821470 2763253 2780739 2745972 2743190
9306 2743190 2663710 2710154 2731366 2614526 2607765 2600058 2526568 2637986 2664171 2740056 2841385
9295 2841385 2903071 2899921 2937032 3042921 2933315 3018794 3091403 3085677 3215889 3130437 3030062
9284 3030062 3159313 3273055 3338541 3344556 3281336 3462510 3420671 3559223 3426943 3428067 3533799
$$ packed form
9358B751256K11484M6892p4190n0888j28722j06572r6451l071J8009p4806n4164
9347B438777j37578J42074j69448K02438o9099o1422J45131J2944K63287K06534
9337B973638J40508P0557N7057K52878J55504R4838K0517L2620K14313j69369
9327C843061J33678j36608j83582q6527l68943j81361j58320m9266o1216o2919
9317B687997J73640m3984K4104j10638J56027k4806m0870n8217J7486l4767k782
9306B743190p9480M6444K1212j16840o761p707p3490J11418K6185P5885J01329
9295B841385O1686l150L7111J05889j09606Q5479P2609n726J30212q5452j00375
9284C030062J29251J13742O5486O015o3220J81174m1839J38552j32280J124J05732
$$ plain form
9273 3533799 3501008 3614546 3583185 3622187 3650285 3712998 3828849 3731136 3831718 3827461 4069119
9262 4069119 4099935 4203767 4351782 4252998 4399532 4418868 4626595 4652674 4790165 4756277
9252 4756277 4882784 4985011 5087072 5117922 5371000 5519604 5748904 5802665 5858493 5789459
9242 5789459 5831332 6042642 5968532 6085028 5966451 6018921 6290224 6376352 6659232 6792904
9232 6792904 6955095 7130400 7264422 7486555 7636348 7744267 7645532 7901181 7933765 8129358
9222 8129358 8330712 8496851 8708363 8931429 9070644 9223960 9398676 9662355 9993569 10146554
9212 10146554 10427910 10464915 10731225 10925612 11082945 11382973 11738297 12108095 12420077 12721946
9202 12721946 12981560 13107313 13284289 13544338 13709023 13929491 14194455 14546248 14925826
$$ packed form
9273C533799l2791J13538l1361L9002K8098O2713J15851r7713J00582m257K41658
9262D069119L0816J03832J48015r8784J46534J9336K07727K6079J37491l3888
9252D756277J26507J02227J02061L0850K53078J48604K29300N3761N5828o9034
9242E789459M1873K11310p4110J16496j18577N2470K71303Q6128K82880J33672
9232F792904J62191J75305J34022K22133J49793J07919r8735K55649L2584J95593
9222H129358K01354J66139K11512K23066J39215J53316J74716K63679L31214J52985
9212A0146554K81356L7005K66310J94387J57333L00028L55324L69798L11982L01869
9202A2721946K59614J25753J76976K60049J64685K20468K64964L51793L79578
$$ plain form
9193 14925826 15394452 16264509 17500296 19090488 20520017 21457530 22467340 23311426 24606100
9184 24606100 25793098 27029132 28069086 28522695 28639428 28182834 27870043 27583788 27439410
9175 27439410 27432674 27277553 27174307 27084601 27532209 28308934 29628084 31125301 32468615
9166 32468615 33587925 34721977 36216406 38782922 42114449 46132568 49476013 52426657
9158 52426657 55386475 58235983 62198433 68442440 77477451 87701947 95380355 100228996
9150 100228996 104118999 107684456 109634095 109983887 109769027 111092462 113395816 117582992
9142 117582992 123244422 128919228 133314436 136895560 140941901 148238935 163327228 192202539
9134 192202539 241594238 313554678 398237069 475269632 522960049 532968529 508652984
$$ packed form
9193A4925826M68626Q70057J235787J590192J429529R37513J009810Q44086J294674
9184B4606100J186998J236034J039954M53609J16733m56594l12791k86255j44378
9175B7439410o736j55121j03246q9706M47608P76725J319150J497217J343314
9166C2468615J119310J134052J494429K566516L331527M018119L343445K950644
9158E2426657K959818K849508L962450O244007R035011J0224496P678408M848641
9150A00228996L890003L565457J949639L49792k14860J323435K303354M187176
9142A17582992N661430N674806M395208L581124M046341P297034J5088293K8875311
9134A92202539M9391699P1960440Q4682391P7032563M7690417J0008480k4315545
$$ plain form
9127 508652984 456661349 389903869 322616799 262132107 211498020 172099743 143447828
9120 143447828 124892147 114837319 113134013 117866319 126118178 133407771 135947893 133783014
9112 133783014 128537410 122935510 119272780 117833762 116625012 113337172 107552899 99546139
9104 99546139 90623573 82476402 75549898 71307535 69547717 69223660 69385700 69063102 67667758
9095 67667758 65340745 62448390 59965594 58217684 57528945 57480551 58949011 63045967 68844426
9086 68844426 73308096 73641312 71569258 69649702 65884979 62604717 59097219 55596163
9078 55596163 50838952 45808721 41113216 36984756 33717015 31173330 29188996 27880240
9070 27880240 26556532 25705127 24893020 24456926 24251680 24080556 23981147 23910897 23948757 23886403
$$ packed form
9127E08652984n1991635o6757480o7287070o0484692n0634087l9398277k8651915
9120A43447828j8555681j0054828j703306M732306Q251859P289593K540122k164879
9112A33783014n245604n601900l662730j439018j208750l287840n784273q006760
9104I9546139q922566q147171o926504m242363j759818l24057J62040l22598j395344
9095F7667758k327013k892355k482796j747910o88739m8394J468460M096956N798459
9086F8844426M463670L33216k072054j919556l764723l280262l507498l501056
9078E5596163m757211n030231m695505m128460l267741k543685j984334j308756
9070B7880240j323708q51405q12107m36094k05246j71124r9409p0250L7860o2354
$$ plain form
9060 23886403 23817515 23556164 22967371 21763974 20453835 18710426 17416415 15999403 15211601
9051 15211601 14888241 14851828 14870466 14514519 13919339 13061567 12116413 11230620 10454977 9986967
9041 9986967 9392262 9053669 8656784 8593984 8264980 8097420 7895645 7672740 7392084 7103032
9031 7103032 6905377 6636578 6387671 6020255 5865099 5631631 5421537 5262019 5037391 4926458
9021 4926458 4718438 4635843 4389167 4296149 4302322 3906117 3865510 3668366 3713461 3525119 3388229
9010 3388229 3346778 3248717 3213778 3040134 2941306 2907836 3002165 2843190 2739853 2788843 2527587
8999 2527587 2459918 2520944 2499606 2529701 2363995 2108819 2159338 2092531 2060649 2070808 2032552
8988 2032552 2117745 1957004 1782448 1735839 1669402 1719061 1618200 1616524 1582506 1348273 1449628
$$ packed form
9060B3886403o8888k61351n88793j203397j310139j743409j294011j417012p87802
9051A5211601l23360l6413J8638l55947n95180q57772r45154q85793p75643m68010
9041I986967n94705l38593l96885o2800l29004j67560k01775k22905k80656k89052
9031G103032j97655k68799k48907l67416j55156k33468k10094j59518k24628j10933
9021D926458k08020q2595k46676r3018O173l96205m0607j97144M5095j88342j36890
9010C388229m1451r8061l4939j73644r8828l3470R4329j58975j03337M8990k61256
8999B527587o7669O1026k1338L0095j65706k55176N0519o6807l1882J0159l8256
8988B032552Q5193j60741j74556m6609o6437M9659j00861j676l4018k34233J01355
$$ plain form
8977 1449628 1392073 1293213 1378598 1287578 1182064 970932 1064299 996226 1108105 965165 944705
8966 944705 832361 825003 887536 786036 895866 884063 723674 878246 726817 719341 834454
8955 834454 836215 656472 653754 526805 472079 552452 412861 584101 451550 450951 457800 375041
8943 375041 372573 384587 397776 385137 314577 264825 208033 217728 280220 260414 240254 235789
8931 235789 221842 171964 157977 210562 139283 63695 31788 21526 16119 48481 111969 -49503
8919 -49503 84266 -101205 -20828 47141 -17663 -92893 -77635 -92873 -48926 -79698 80864
8908 80864 -145227 -46208 -188197 -50067 -46719 -75872 -19417 -62238 -165339 -75476 -166158
8897 -166158 -210057 -185884 -146184 -50492 -23704 -85777 -117767 -124182 -75445 -126004 -157990 3081
$$ packed form
8977A449628n7555r8860Q5385r1020j05514k11132R3367o8073J11879j42940k0460
8966I44705j12344p358O2533j01500J09830j1803j60389J54572j51429p476J15113
8955H34454J761j79743k718j26949n4726Q0373j39591J71240j32551n99O849q2759
8943C75041k468J2014J3189j2639p0560m9752n6792R695O2492j9806k0160m465
8931B35789j3947m9878j3987N2585p1279p5588l1907j0262n407L2362O3488j61472
8919d9503J33769j85471Q0377O7969o4804p5230J5258j5238M3947l0772J60562
8908H0864k26091R9019j41989J38130L348k9153N6455m2821j03101Q9863r0682
8897a66158m3899K4173L9700R5692K6788o2073l1990o415M8737n0559l1986J61071
$$ plain form
8885 3081 -125317 -164366 -129265 -315448 -90456 -141854 -200777 -118405 -99007 -115631 -96924
8874 -96924 -15790 -203319 -27298 -160651 -158355 -98326 -164165 -109766 -76153 -88174 -55168
8863 -55168 -98379 -139 158652 192276 342436 206432 266412 170098 116483 274589 118897
8852 118897 168615 74223 133318 138433 54846 188154 107166 131800 108022 42084 159011
8841 159011 82407 162806 170015 274273 292780 416467 537637 610937 751682 784856 883896
8830 883896 1063183 982422 1124105 1216219 1164715 1099439 921426 863111 742081 533133 594839
8819 594839 500348 445838 489015 368604 268102 144537 171081 330168 120759 342937
8809 342937 410025 341732 413130 395321 467444 651697 618714 702652 698221 730363 711812 684721
$$ packed form
8885C081j28398l9049L5101j86183K24992n1398n8923Q2372J9398j6624J8707
8874i6924Q1134j87529J76021j33353K296O0029o5839N4399L3613j2021L3006
8863e5168m3211R8240J58791L3624J50160j36004N9980r6314n3615J58106j55692
8852A18897M9718r4392N9095N115q3587J33308q0988K4634k3778o5938J16927
8841A59011p6604Q0399P209J04258J8507J23687J21170P3300J40745L3174R9040
8830H83896J79287q0761J41683R2114n1504o5276j78013n8315j21030k08948O1706
8819E94839r4491n4510M3177j20411j00502j23565K6544J59087k09409K22178
8809C42937O7088o8293P1398j7809P2123J84253l2983Q3938m431L2142j8551k7091
$$ plain form
8797 684721 698312 724238 718250 687386 863918 632812 459321 417764 353470 323720 266459
8786 266459 142753 194935 121001 216241 96421 80754 57481 52498 6303 124560 -4415
8775 -4415 10367 -79505 -52752 65634 113518 113231 9616 -1979 108989 25767 16747 27418
8763 27418 -28707 68781 -172321 -88695 -53121 -146293 -34184 -106307 -79017 -139179 -158817
8752 -158817 -110426 -223595 -4425 -275703 -137778 -95718 -167693 59361 -176626 -69671
8742 -69671 -138648 -56916 -85400 -113260 -86324 -109238 -217055 -154291 -159995 -130524 -265781 -205923
8730 -205923 -224713 -144482 -112352 -239649 -178314 -260791 -252517 -218047 -251876 -240250 -207749 -304158
8718 -304158 -277924 -173143 -232180 -293900 -204752 -309291 -137548 -315986 -337392 -153390 -252638
$$ packed form
8797F84721J3591K5926n988l0864J76532k31106j73491m1557o4294k9750n7261
8786B66459j23706N2182p3934R5240j19820j5667k3273m983m6195J18257j28975
8775d415J4782q9872K6753J18386M7884k87j03615j1595J10968q3222r020J0671
8763B7418n6125R7488k41102Q3626L5574r3172J12109p2123K7290o0162j9638
8752a58817M8391j13169K19170k71278J37925M2060p1975K27054k35987J06955
8742f9671o8977Q1732k8484k7860K6936k2914j07817O2764n704K9471j35257N9858
8730b05923j8790Q0231L2130j27297O1335q2477Q274L4470l3829J1626L2501r6409
8718c04158K6234J04781n9037o1720Q9148j04539J71743j78438k1406J84002r9248
$$ plain form
8707 -252638 -297297 -220855 -379538 -238301 -329978 -209887 -256676 -238795 -169741 -295075 -191470
8696 -191470 -292859 -337059 -231257 -170442 -193781 -337416 -320441 -302445 -138495 -351982 -141852
8685 -141852 -280542 -300441 -237590 -251108 -232174 -268217 -282372 -122524 -222684 -239567 -210818
8674 -210818 -227424 -266127 -96548 -164945 -93514 -136714 -279174 -36054 -51407 -248672 -249563
8663 -249563 -324227 -359385 -216011 -135991 -336629 -264416 -269870 -344036 -208224 -335887 -204832
8652 -204832 -258885 -299890 -323894 -226360 -321744 -325091 -372247 -312846 -297138 -316105 -300463 -267416
8640 -267416 -150980 -250151 -197581 -395717 -229393 -231755 -256856 -287478 -346168 -288516 -128442
8629 -128442 -206509 -260746 -230822 -309750 -249501 -261057 -263820 -160888 -372970 -223860 -146951
$$ packed form
8707b52638m4659P6442j58683J41237r1677J20091m6789J7881O9054j25334J03605
8696a91470j01389m4200J05802O0815k3339j43635J6975J7996J63950k13487K10130
8685a41852j38690j9899O2851j3518J8934l6043j4155J59848j00160j6883K8749
8674b10818j6606l8703J69579o8397P1431m3200j42460K43120j5353j97265q91
8663b49563p4664l5158J43374Q0020k00638P2213n454p4166J35812j27663J31055
8652b04832n4053m1005k4004R7534r5384l347m7156N9401J5708j8967J5642L3047
8640b67416J16436r9171N2570j98136J66324k362k5101l0622n8690N7652J60074
8629a28442p8067n4237K9924p8928O0249j1556k763J02932k12082J49110P6909
$$ plain form
8618 -146951 -211256 -200148 -216199 -114506 -227246 -200283 -132086 -293080 -294655 -163035 -257470
8607 -257470 -146432 -175403 -228101 -200777 -229395 -255896 -263225 -200371 -367156 -186630 -284059
8596 -284059 -364677 -224612 -216349 -244614 -185124 -294046 -290144 -276307 -113237 -232953 -229261
8585 -229261 -109006 -161163 -332645 -81268 -135325 -278117 -164568 -333457 -266185 -186213
8575 -186213 -221006 -165995 -219848 -279692 -182360 -198558 -88213 -109524 -317118 -233967 -343866
8564 -343866 -260735 -212709 -191730 -256091 -261999 -139301 -186529 -285586 -149923 -225861 -395687
8553 -395687 -329667 -243309 -243337 -301271 -245689 -152104 -172692 -286082 -108720 -318235 -286536 -216442
8541 -216442 -354983 -414662 -91202 82018 -13218 -64998 -102664 -51811 -248503 -236774 -356765
$$ packed form
8618a46951o4305J1108j6051J01693j12740K6963O8197j60994j575J31620r4435
8607b57470J11038k8971n2698K7324k8618k6501p329O2854j66785J80526r7429
8596b84059q0618J40065Q263k8265N9490j08922L902J3837J63070j19716L692
8585b29261J20255n2157j71482K51377n4057j42792J13549j68889O7272P9972
8575a86213l4793N5011n3853n9844R7332j6198J10345k1311k07594Q3151j09899
8564c43866Q3131M8026K0979o4361n908J22698m7228r9057J35663p5938j69826
8553c95687O6020Q6358k8n7934N5582R3585k0588j13390J77362k09515L1699P0094
8541b16442j38541n9679L23460J73220r5236n1780l7666N0853j96692J1729j19991
$$ plain form
8530 -356765 -261626 -154363 -279344 -202184 -246042 -162775 -102289 -111456 -275426 -26381 -62386
8519 -62386 -177561 -324660 -300517 -150511 -197746 -110545 -85279 -155831 -112996 -265879 -180477
8508 -180477 -204544 -230149 -319868 -223287 -206730 -209001 -109994 -302744 -221825 -339067 -76604
8497 -76604 -130162 -288293 -101419 -96392 -252257 -126385 -222607 -127267 -168097 -112325 -153215
8486 -153215 -240016 -176673 -280720 -196391 -198614 -143197 -96078 -85109 -145689 -44303 -246670
8475 -246670 -102422 -112135 -171138 -181450 -318781 -75761 -127382 -152246 -118350 -126799 -96936
8464 -96936 -336249 -155483 -238638 -260576 -174905 -180460 -91221 -237771 -102006 -194207 -143067
8453 -143067 -132724 -190754 -211871 -222503 -246356 -286659 -323751 -283616 -221486 -187702 -234986 -254168
$$ packed form
8530c56765R5139J07263j24981P7160m3858Q3267O0486r167j63970K49045l6005
8519f2386j15175j47099K4143J50006m7235Q7201K5266p0552M2835j52883Q5402
8508a80477k4067k5605q9719R6581J6557k271R9007j92750Q0919j17242K62463
8497g6604n3558j58131J86874N027j55865J25872r6222R5340m0830N5772m0890
8486a53215q6801O3343j04047Q4329k223N5417M7119J0969o0580J01386k02367
8475b46670J44248r713n9003j0312j37331K43020n1621k4864L3896q449K9863
8464i6936k39313J80766q3155k1938Q5671n555Q9239j46550J35765r2201N1140
8453a43067J0343n8030k1117j0632k3853m0303l7092M0135O2130L3784m7284j9182
$$ plain form
8441 -254168 -134263 -282144 -111480 -123496 -275502 -133049 -279364 -64002 -212839 -135508
8431 -135508 -174256 -218325 -283479 -110989 -145966 -190468 -124443 -159183 -257878 -237842 -175803
8420 -175803 -285715 -38285 -202962 -151484 -218487 -113332 -202136 -210066 -144957 -201212 -104289
8409 -104289 -110816 -99032 -80454 -154094 -136805 -106163 -232709 -116621 -104161 -265677 -140761
8398 -140761 -207201 -250499 -259690 -214593 -48779 -142993 -99429 -58658 16634 -316915 -204617
8387 -204617 -233928 -222034 -154278 -261479 -173215 -112130 -97434 -155285 -151564 -210138 -65607
8376 -65607 -140231 -233480 -171432 -245798 -76205 -131296 -64938 -193371 -57488 -157477 -209406
8365 -209406 -80458 -178323 -187767 -241478 -225824 -202348 -95743 -335744 -80686 -134117 -147834
$$ packed form
8441b54168J19905j47881J70664j2016j52006J42453j46315K15362j48837P7331
8431a35508l8748m4069o5154J72490l4977m4502O6025l4740r8695K0036O2039
8420a75803j09912K47430j64677N1478o7003J05155q8804p930O5109n6255R6923
8409a04289o527J1784J8578p3640J7289L0642j26546J16088J2460j61516J24916
8398a40761o6440m3298r191M5097J65814r4214M3564M0771P5292l33549J12298
8387b04617k9311J1894O7756j07201Q8264O1085J4696n7851L721n8574J44531
8376f5607p4624r3249O2048p4366J69593n5091O6358j28433J35883r9989n1929
8365b09406J28948r7865r444n3711J5654K3476J06605k40001K55058n3431j3717
$$ plain form
8354 -147834 -167827 -155628 -148168 -124605 -163182 -214840 -125465 -149138 -179877 -212064 -198117 -103399
8342 -103399 -182100 -220272 -190615 -160222 -69602 -104620 -248320 -141814 20637 -189582 -139121
8331 -139121 -194964 -169070 -310984 -141949 -89454 -304769 -156491 -215750 -3921 -125697
8321 -125697 -144902 -180750 -127884 -140919 -228329 -262160 -211606 -173476 -199737 -67963 -45186
8310 -45186 -136679 -73147 -96423 -153442 -118247 -50397 -63530 -80591 -34887 -153980 -143192 -135993
8298 -135993 -113648 -18844 -199536 -100366 -227384 -161890 -144897 -133243 -292168 -82177 -124256
8287 -124256 -89663 -148896 -77126 -141147 -90993 -165417 -108687 -63603 -225322 -147028 -82900
8276 -82900 -52971 -60110 -186720 -137033 -153950 -171066 -149350 -181868 -134459 -259198 -156510
$$ packed form
8354a47834j9993J2199P460K3563l8577n1658Q9375k3673l0739l2187J3947R4718
8342a03399p8701l8172K9657L0393R0620l5018j43700J06506J62451k10219N0461
8331a39121n5843K5894j41914J69035N2495k15315J48278n9259K11829j21776
8321a25697j9205l5848N2866j3035q7410l3831N0554L8130k6261J31774K2777
8310d5186r1493O3532k3276n7019L5195O7850j3133j7061M5704j19093J0788P199
8298a35993K2345R4804j80692R9170j27018O5494J6993J1654j58925K09991m2079
8287a24256L4593n9233P1770o4021N0154p4424N6730M5084j61719P8294O4128
8276h2900K9929p139j26610M9687j6917j7116K1716l2518M7409j24739J02688
$$ plain form
8265 -156510 -83948 -202913 -136317 -98359 -56367 -77363 5760 -238552 -113330 -72071 -152350
8254 -152350 -142634 -20581 -40282 -123960 -24703 -216578 -158696 -191982 -26181 -63859 1514
8243 1514 -183235 -48098 -105976 -171314 -138770 -80750 -109561 -208029 -62316 -208923 -86269
8232 -86269 -252112 -34747 -132933 -224658 -117680 -86097 -10568 -161982 -33168 52013 -159978
8221 -159978 -189148 -176065 -63642 -125111 -134154 -26243 -148343 -154003 -49448 -78219 61703
8210 61703 -46596 4884 -22888 -101723 -87050 -89638 157536 -90234 169044 -124379 -75172
8199 -75172 -78705 -62120 48110 -47616 58843 -231418 -37789 396744 -85929 41352 -88183
8188 -88183 93249 215102 137288 149106 119978 197892 221711 276064 270396 70864 182513
$$ packed form
8265a56510P2562j18965O6596L7958M1992k0996Q3123k44312J25222M1259q0279
8254a52350R716J22053j9701q3678R9257j91875N7882l3286J65801l7678O5373
8243A514j84749J35137n7878o5338L2544N8020k8811r8468J45713j46607J22654
8232h6269j65843K17365r8186r1725J06978L1583P5529j51414J28814Q5181k11991
8221a59978k9170J3083J12423o1469r043J07911j22100n660J04555k8771J39922
8210F1703j08299N1480k7772p8835J4673k588K47174k47770K59278k93423M9207
8199g5172l533J6585J10230r5726J06459k90261J93629M34533m82673J27281j29535
8188h8183J81432J21853p7814J1818k9128P7914K3819N4353n668j99532J11649
$$ plain form
8177 182513 85899 136577 129709 -133412 336 -124495 -171211 -149331 -127815 -103780 -71171
8166 -71171 -15054 -14324 28212 22263 -88423 24114 -84406 -38257 -63101 3926 -36666 -39762
8154 -39762 -152777 -57523 -104044 34498 -142708 -82903 -110143 -4291 -69740 18589 104798
8143 104798 6274 982 -58873 -33910 -87318 -71345 -34628 -48325 22379 42163 175452 88316
8131 88316 272726 238312 341996 278802 306444 260028 284335 134425 146415 180727 65422
8120 65422 24751 16598 53229 -29838 -26510 6824 -89103 -112438 -94596 -157512 -33131 -27249
8108 -27249 6469 -32890 -145353 -118869 -36590 -105022 -45821 -124044 -42594 -113528 -76030 -37232
8096 -37232 -203688 -128915 -10282 -80499 -51333 -56632 -180940 -107033 -183832 -119627 -239000
$$ packed form
8177A82513r6614N0678o868k63121J33748j24831m6716K1880K1516K4035L2609
8166g1171N6117P30M2536n949j10686J12537j08520M6149k4844O7027m0592l096
8154c9762j13015R5254m6521J38542j77206N9805k7240J05852o5449Q8329Q6209
8143A04798r8524n292n9855K4963n3408J5973L6717j3697P0704J9784J33289q7136
8131H8316J84410l4414J03684o3194K7642m6416K4307j49910J1990L4312j15305
8120F5422m0671q153L6631q3067L328L3334r5927k3335J7842o2916J24381N882
8108b7249L3718l9359j12463K6484Q2279o8432N9201p8223Q1450p0934L7498L8798
8096c7232j66456P4773J18633p0217K9166n299j24308P3907p6799O4205j19373
$$ plain form
8085 -239000 -137096 -94794 -89989 -27478 -144730 -136991 -170551 -243507 -61158 -156376 -177162
8074 -177162 -99372 -131654 -188397 -140870 -124915 -111206 -218806 -47755 -106853 -115287 -18606
8063 -18606 -109496 -52840 -78291 -74978 -66093 -80611 -235749 -18930 -138219 -95003 -52178 1320
8051 1320 -72814 -145054 -116583 -123402 -74014 -124551 -65297 -137990 -100604 -63532 -125843 19594
8039 19594 -119848 -148650 -61856 -6621 -76693 -132758 -90371 -151088 -85254 -60424 -165094
8028 -165094 -160020 -72764 -166835 -103782 -199727 -19734 -69313 -221129 -127310 -125485 -89587 -316752
8016 -316752 -83597 -145615 -86149 -19651 -152248 -27351 -157361 -95823 -71743 -101307 -44882
8005 -44882 -117389 -46075 -70967 -198763 -142695 -55052 43411 -33969 -11073 -10488 -156834 -209659
$$ packed form
8085b39000J01904M2302M805O2511j17252P739l3560p2956J82349r5218k0786
8074a77162P7790l2282n6743M7527J5955J3709j07600J71051n9098q434R6681
8063a8606r0890N6656k5451L313Q885j4518j55138K16819j19289M3216M2825N3498
8051A320p4134p2240K8471o819M9388n0537N9254p2693L7386L7072o2311J45437
8039A9594j39442k8802Q6794N5235p0072n6065M2387o0717O5834K4830j04670
8028a65094N074Q7256r4071O3053r5945J79993m9579j51816R3819J825L5898k27165
8016c16752K33155o2018N9466O6498j32597J24897j30010O1538K4080k9564N6425
8005d4882p2507P1314k4892j27796N6068Q7643R8463p7380K2896N85j46346n2825
$$ plain form
7993 -209659 -167544 -95406 -221774 -34650 -121753 -49470 -116398 -160993 -28797 -40106 23458
7982 23458 -45855 -190154 -66614 -187186 -236313 -137309 -199470 -105508 -205604 -83969 -144334
7971 -144334 -291250 -141871 -108591 -128146 -56678 -62964 -86567 -98972 -173307 -132522 -88041
7960 -88041 -61989 -136176 37034 -74187 -128662 -41861 -102232 -61231 -268038 -96516 -58428
7949 -58428 -137638 17948 -298097 -105351 -78833 -155413 -82430 -167243 -59805 -105130 -81577
7938 -81577 -56941 -90491 -95342 -84165 -188206 -122225 -20904 -200359 -91045 -118754 -18376
7927 -18376 -28913 -75610 -193346 -87647 -127118 -29023 -62118 -208573 -146640 -77421 -141396
7916 -141396 68311 -190465 -169797 -130763 -212365 -110774 -34489 -143219 6053 -98859
$$ packed form
7993b09659M2115P2138j26368J87124q7103P2283o6928m4595J32196j1309O3564
7982B3458o9313j44299J23540j20572m9127R9004o2161R3962j00096J21635o0365
7971a44334j46916J49379L3280j9555P1468o286k3603j2405p4335M0785M4481
7960h8041K6052p4187J73210j11221n4475Q6801o0371M1001k06807J71522L8088
7949e8428p9210J55586l16045J92746K6518p6580P2983q4813J07438m5325K3553
7938h1577K4636l3550m851J1177j04041O5981J01321j79455J09314k7709J00378
7927a8376j0537m6697j17736J05699l9471R8095l3095j46455O1933O9219o3975
7916a41396K09707k58776K0668L9034q1602J01591P6285j08730J49272j04912
$$ plain form
7906 -98859 -5499 28110 -219647 -28185 -110724 -62481 77797 -2963 -54725 19876 -3935
7895 -3935 125691 22681 51959 -29263 -70369 -127903 -122906 -36479 -122279 -161100 -12907 -74222
7883 -74222 -82033 -73931 -63421 -173239 -61778 -302505 -65725 -85151 -129898 -52250 -4664
7872 -4664 4481 -94055 -89499 -146245 -35540 -125861 -103243 -23560 98320 -133161 -160922 -38549
7860 -38549 -182507 32178 -28957 -51333 -80793 -202229 -109686 -61965 -18483 -57757 -5589
7849 -5589 -49956 -70355 -55035 291838 228545 -154083 -124237 -137334 3330 -151354 -111010
7838 -111010 -127086 108231 -129023 -103493 -57179 -45801 -80780 36284 22282 -104930 -16242
7827 -16242 -133414 -22195 -147419 -77359 -32818 -61636 -3932 -87927 -129251 -72664 -135821
$$ packed form
7906i8859R3360L3609k47757J91462q2539M8243J40278q0760n1762P4601k3811
7895c935J29626j03010K9278q1222m1106n7534M997Q6427q5800l8821J48193o1315
7883g4222p811Q102J0510j09818J11461k40727K36780j9426m4747P7648M7586
7872d664R145r8536M556n6746J10705r0321K2618P9683J21880k31481k7761J22373
7860c8549j43958K14685o1135k2376k9460j21436R2543M7721M3482l9274N2168
7849e589m4367k0399J5320L46873o3293l82628K9846j3097J40664j54684M0344
7838a11010j6076K35317k37254K5530M6314J1378l4979J17064j4002j27212Q8688
7827a6242j17172J11219j25224P0060M4541k8818N7704q3995m1324N6587o3157
$$ plain form
7816 -135821 -131277 -32265 -212162 -92503 17238 -123771 -103060 -246912 -43367 -105203 -161628
7805 -161628 -76780 -119476 -73712 -34765 -72173 -26820 -50856 -21256 -113716 -187952 -102997 27464
7793 27464 -43238 -93766 39088 -46375 -132611 -187519 -77494 12850 -173327 -111755 -125343
7782 -125343 -47279 -16392 -130241 -40681 -189423 1287 -101764 -44454 -161914 -124709 -30831
7771 -30831 -154956 -92102 -74499 -160599 -39406 -152908 -73570 -95690 -145256 -105992 -154101
7760 -154101 -159910 -177758 -103238 -167828 7721 -85881 -153232 -75787 -202917 -78416 -115973
7749 -115973 -20981 97922 -233920 -41984 -103094 -118496 -26455 -104533 -27340 -25483 -69430
7738 -69430 66531 -23694 -77196 -82225 5164 -140625 -264761 41211 -133383 7553 -73443
$$ packed form
7816a35821M544R9012j79897J19659J09741j41009K0711j43852K03545o1836n6425
7805a61628Q4848m2696M5764L8947l7408M5353k4036K9600r2460p4236Q4955J30461
7793B7464p0702n0528J32854q5463q6236n4908J10025R0344j86177O1572j3588
7782a25343P8064L0887j13849Q9560j48742J90710j03051N7310j17460L7205R3878
7771c0831j24125O2854J7603q6100J21193j13502P9338k2120m9566L9264m8109
7760a54101n809j7848P4520o4590J75549r3602o7351P7445j27130J24501l7557
7749a15973R4992J18903l31842J91936o1110j5402R2041p8078P7193J857m3947
7738f9430J35961r0225n3502n029Q7389j45789j24136L05972j74594J40936q0996
$$ plain form
7727 -73443 -129135 -52843 -101908 -59000 -27497 30640 -76716 -73283 -65010 -28310 -56137 -67196
7715 -67196 -110382 15364 -45019 -230657 -137430 -99251 2786 -19700 3867 14957 -59149
7704 -59149 -42064 15070 36091 -40597 1262 -44433 -1503 48907 -3946 -24615 33796 -55281
7692 -55281 -74588 60862 -125984 74670 -131484 -66962 13015 -99822 16962 -179458
7682 -179458 30038 -113153 -37648 7314 -144816 5599 -83393 -29072 -26527 -112968 -45082
7671 -45082 -147647 -56460 98805 -35760 42871 -43649 -101413 -23547 -106092 14593 -173428
7660 -173428 -62834 -123505 -41501 -59237 -67166 -122119 -24241 -143794 16672 -48988 -63371
7649 -63371 -91836 -115299 -13256 -83777 -92601 34072 -72452 -95528 -41517 12239 84690
$$ packed form
7727g3443n5692P6292m9065M2908L1503N8137j07356L433Q273L6700k7827j1059
7715f7196m3186J25746o0383j85638R3227L8179J02037k2486K3567J1090p4106
7704e9149J7085N7134K1021p6688M1859m5695M2930N0410n2853k0669N8411q9077
7692e5281j9307J35450j86846K00654k06154O4522P9977j12837J16784j96420
7682a79458K09496j43191P5505M4962j52130J50415q8992N4321K545q6441O7886
7671d5082j02565R1187J55265j34565P8631q6520n7764P7866q2545J20685j88021
7660a73428J10594o0671Q2004j7736p929n4953R7878j19553J60466o5660j4383
7649f3371k8465k3463J02043p0521q824J26673j06524k3076N4011N3756P2451
$$ plain form
7638 84690 60869 -6466 118946 103503 110831 -15777 103679 -10644 -19126 67626 -157279
7627 -157279 48490 -59063 31790 -139120 -18811 18211 -116016 109268 -57907 120446
7617 120446 -242621 2696 40567 -121357 10333 72402 22809 32283 -149083 19721 6243
7606 6243 -85656 5230 -173164 12711 -88494 -15939 80080 62273 -23454 -109282 -226360
7595 -226360 -97001 -59863 21036 -53321 -128812 -121668 -62719 15965 -10878 10144 17763 -5533
7583 -5533 -74264 10675 -53137 -85606 38948 -29047 97292 -70479 7024 -78209 -43913
7572 -43913 -8923 -11259 -41679 -37615 -61047 -33403 -71845 -28476 11997 -78800 -81052 15251
7560 15251 26690 -4724 118471 -35675 50727 -22057 53339 -65727 26382 6055 -72547
$$ packed form
7638H4690k3821o7335J25412j5443P328j26608J19456j14323q482Q6752k24905
7627a57279K05769j07553R0853j70910J20309L7022j34227K25284j67175J78353
7617A20446l63067K45317L7871j61924J31690O2069m9593R474j81366J68804j3478
7606F243r1899R0886j78394J85875j01205P2555R6019j7807q5727q5828j17078
7595b26360J29359L7138Q0899p4357p5491P144N8949P8684k6843K1022P619k3296
7583e533o8731Q4939o3812l2469J24554o7995J26339j67771P7503q5233L4296
7572d3913L4990k336l0420M064k3432K7644l8442M3369M0473r0797k252R6303
7560A5251J1439l1414J23195j54146Q6402p2784P5396j19066R2109k0327p8602
$$ plain form
7549 -72547 -40562 28896 8935 75330 -60129 48903 -9027 -21730 81174 61552 82000
7538 82000 73121 170620 174673 298708 376864 404093 416887 486005 411790 256860 255683 163562
7526 163562 87272 163513 -76764 103669 -84936 48016 19447 109865 110769 -43475 30084
7515 30084 109438 8603 8608 -87796 3617 42179 57573 -159817 -15714 17179 -12528 -86977
7503 -86977 -61853 61309 11222 -37918 70376 1418 53194 -27311 -190631 58924 -40837
7492 -40837 75280 -14665 -92779 21169 77406 58566 -18237 13672 96432 -64653 46551
7481 46551 -38426 -72320 12645 -69188 15785 -90137 -27263 -91985 -41455 59170 -34972
7470 -34972 42963 59372 -62377 63094 -115211 16240 19749 -48311 21578 -71284 -3227
$$ packed form
7549g2547L1985O9458j9961O6395j35459J09032n7930j2703J02904j9622K0448
7538H2000q879R7499M053J24035P8156K7229J2794O9118p4215j54930j177r2121
7526A63562p6290P6241k40277J80433j88605J32952k8569R0418R04j54244P3559
7515C0084P9354j00835Nr6404R1413L8562J5394k17390J44103L2893k9707p4449
7503h6977K5124J23162n0087m9140J08294o8958N1776q0505j63320K49555r9761
7492d0837J16117q9945p8114J13948N6237j8840p6803L1909Q2760j61085J11204
7481D6551q4977l3894Q4965q1833Q4973j05922O2874o4722N0530J00625r4142
7470c4972P7935J6409j21749J25471j78305J31451L509o8060O9889r2862O8057
$$ plain form
7459 -3227 8147 -61880 156423 99331 -21007 66439 -129651 61844 -122245 -178652 -78087
7448 -78087 -36626 -66512 11407 55777 -14072 91557 15077 35204 -13466 -68987 25064 73833
7436 73833 -19054 -53003 -58656 60020 98094 -47840 62830 -65833 66619 91778 24830
7425 24830 169297 5959 155765 66459 66530 182647 100707 150235 125171 123832 107490 66373
7413 66373 94364 56999 56365 35101 -86747 34877 -143185 -12473 111032 51170 78244
7402 78244 103765 172201 35663 51446 53765 75679 67724 187436 68532 143365 76174 37914
7390 37914 125225 70786 112813 70316 80852 112143 42202 24372 87266 211909 107633
7379 107633 114037 9565 21223 24156 205188 141250 189126 80498 224636 176617 209565
$$ packed form
7459c227J1374p0027K18303n7092j20338Q7446j96090J91495j84089n6407J00565
7448g8087M1461k9886P7919M4370o9849J05629p6480K0127m8670n5521R4051M8769
7436G3833r2887l3949n653J18676L8074j45934J10670j28663J32452K5159o6948
7425B4830J44467j63338J49806q9306P1J16117q1940M9528k5064j339j6342m1117
7413F6373K7991l7365o34k1264j21848J21624j78062J30712J23505n9862K7074
7402G8244K5521O8436j36538J5783K319K1914p955J19712j18904P4833o7191l8260
7390C7914Q7311n4439M2027m2497J0536L1291o9941j7830O2894J24643j04276
7379A07633O404j04472J1658K933J81032o3938M7876j08628J44138m8019L2948
$$ plain form
7368 209565 254773 224920 330961 320467 404078 388448 525740 577825 800386 861032 1246914
7357 1246914 1542842 2035958 2470295 2931332 2995436 3083411 2977868 2483293 2250423 1836780
7347 1836780 1443024 1170919 1005527 718839 613633 612457 416736 339191 419342 355751
7337 355751 366460 279795 188338 140738 248475 246996 279256 174261 178532 358200 221592
7326 221592 151972 177718 144610 237064 173389 196557 22904 120649 99078 124126 188474
7315 188474 78788 160754 402700 94155 358427 249293 220298 144636 49695 268046
7305 268046 130073 96928 95508 160123 282232 147451 121420 140095 139725 141720 194566 174939
7293 174939 144023 114354 185595 112925 132010 170016 234362 225014 195652 369904 82383
$$ packed form
7368B09565M5208k9853J06041j0494Q3611j5630J37292N2085K22561O0646L85882
7357A246914K95928M93116M34337M61037O4104Q7975j05543m94575k32870m13643
7347A836780l93756k72105j65392k86688j05206j176j95721p7545Q0151o3591
7337C55751J0709q6665r1457m7600J07737j479L2260j04995M271J79668j36608
7326B21592o9620K5746l3108R2454o3675K3168j73653R7745k1571K5048O4348
7315A88474j09686Q1966K41946l08545K64272j09134k8995p5662r4941K18351
7305B68046j37973l3145j420O4615J22109j34781k6031J8675l70J995N2846j9627
7293A74939l0916k9669P1241p2670J9085L8006O4346r348k9362J74252k87521
$$ plain form
7282 82383 272871 383274 296725 335576 209538 415141 282733 329861 336238 367647 383279
7271 383279 437960 542031 706836 710919 827523 735088 617166 723657 433985 527837 259423
7260 259423 563830 427619 322049 429126 273823 469212 301027 269413 409627 363948
7250 363948 414165 571270 463832 671229 776906 988275 1046902 1325393 1228911 1274412
7240 1274412 1287155 1048609 964834 795454 752428 644104 624674 583323 433873 444321 423983
7229 423983 324066 488186 359703 495817 329364 482193 435016 579195 514526 685445
7219 685445 788916 755490 822217 926158 779656 771693 717484 682258 618203 490753 462622
7208 462622 221968 434558 411183 453545 566651 403569 406607 219907 363696 343587 369871
$$ packed form
7282H2383J90488J10403q6549L8851j26038K05603j32408M7128O377L1409J5632
7271C83279N4681J04071J64805M083J16604r2435j17922J06491k89672R3852k68414
7260B59423L04407j36211j05570J07077j55303J95389j68185l1614J40214m5679
7250C63948N0217J57105j07438K07397J05677K11369N8627K78491r6482M5501
7240A274412J2743k38546q3775j69380m3026j08324j9430m1351j49450J0448k0338
7229D23983r9917J64120j28483J36114j66453J52829m7177J44179o4669J70919
7219F85445J03471l3426O6727J03941j46502p963n4209l5226o4055j27450k8131
7208D62622k40654K12590k3375M2362J13106j63082L038j86700J43789k0109K6284
$$ plain form
7197 369871 383722 340557 437504 417398 518068 359893 470562 477595 485463 466546 473880 360504
7185 360504 519820 423539 626200 427339 484269 419437 386893 444528 584832 459148 589839
7174 589839 510284 550003 699544 709236 839503 925645 1013748 1192674 1352625 1431415 1396138
7163 1396138 1412195 1581836 1420044 1521582 1373261 1278712 1136912 1068459 980510 857378
7153 857378 884749 863861 1062266 917267 945244 1018715 1035628 996997 1043705 864726 999194
7142 999194 764087 786916 834178 802920 725173 561193 682813 818991 818929 918125 741373
7131 741373 776888 811347 814489 792241 805166 750290 746341 826254 724331 858999 729297
7120 729297 757285 796388 730065 860915 839978 786568 953662 918165 833737 823267 844448
$$ packed form
7197C69871J3851m3165R6947k0106J00670j58175J10669P033P868j8917P334j13376
7185C60504J59316r6281K02661j98861N6930o4832l2544N7635J40304j25684J30691
7174E89839p9555L9719J49541R692J30267Q6142Q8103J78926J59951P8790l5277
7163A396138J6057J69641j61792J01538j48321r4549j41800o8453q7949j23132
7153H57378K7371k0888J98405j44999K7977P3471J6913l8631M6708j78979J34468
7142I99194k35107K2829M7262l1258p7747j63980J21620J36178o2R9196j76752
7131G41373L5515L4459L142k2248J2925n4876l949P9913j01923J34668j29702
7120G29297K7988L9103o6323J30850k0937n3410J67094l5497q4428j0470K1181
$$ plain form
7109 844448 934564 949857 1008925 883440 972994 930511 1088140 924083 1036962 1082897 946186
7098 946186 1029067 1041529 1112782 1046831 1187722 1061184 1192092 1111238 1155388 1198305 1236344
7087 1236344 1312148 1287985 1224301 1371712 1325526 1303583 1468352 1350496 1505143 1376605
7077 1376605 1458620 1422649 1556731 1634939 1522512 1621366 1602684 1581959 1687232 1718739 1770154
7066 1770154 1640520 1847923 1811858 1866285 2043301 1772968 2110253 2051888 2045313 2035685 2102460
7055 2102460 1983490 2141650 2093694 2196709 2309704 2479840 2398902 2367673 2520884 2458948
7045 2458948 2614070 2606247 2790595 2672668 2845016 2745052 2766386 2894497 2868591 3176939
7035 3176939 3134017 3344115 3247110 3286809 3400906 3563241 3597215 3495501 3526769 3750736
$$ packed form
7109H44448R0116J5293N9068j25485Q9554m2483J57629j64057J12879M5935j36711
7098I46186Q2881J2462P1253o5951J40891j26538J30908q0854M4150M2917L8039
7087A236344P5804k4163o3684J47411m6186k1943J64769j17856J54647j28538
7077A376605Q2015l5971J34082P8208j12427R8854j8682k0725J05273L1507N1415
7066A770154j29634K07403l6065N4427J77016k70333L37285n8365o575r628O6775
7055B102460j18970J58160m7956J03015J12995J70136q0938l1229J53211o1936
7045B458948J55122p823J84348j17927J72348r9964K1334J28111k5906L08348
7035C176939m2922K10098r7005L9699J14097J62335L3974j01714L1268K23967
$$ plain form
7025 3750736 3714066 3977500 3950348 4054595 4098250 4140154 4406589 4438254 4612566 4586683 4624439
7014 4624439 4853447 4940791 5133438 5196234 5332257 5517847 5743934 5866813 6030794 6069632
7004 6069632 6271382 6512689 6674019 7062292 7080275 7398429 7604490 7801841 8049525 8331738
6994 8331738 8676490 9031415 9562493 9944351 10580372 11120920 11791057 12721803 13449795 14572014
6984 14572014 15700114 17035429 18711704 20816898 23329664 26701582 31175795 38266291
6976 38266291 48840754 64368575 82081142 97142724 104737466 104165503 97604136 86837256
6968 86837256 74824599 63442001 53559669 46103356 40401520 36671884 34339339 32929040
6960 32929040 32413446 32667358 33603725 35387287 37840091 41417952 46247427 53033657 63180421
$$ packed form
7025C750736l6670K63434k7152J04247M3655M1904K66435L1665J74312k5883L7756
7014D624439K29008Q7344J92647O2796J36023J85590K26087J22879J63981L8838
7004F069632K01750K41307J61330L88273J7983L18154K06061J97351K47684K82213
6994H331738L44752L54925N31078L81858O36021N40548O70137R30746P27992J122219
6984A4572014J128100J335315J676275K105194K512766L371918M474213P090496
6976C8266291J0574463J5527821J7712567J5061582P594742n71963o561367j0766880
6968H6837256j2012657j1382598r882332p456313n701836l729636k332545j410299
6960C2929040n15594K53912R36367J783562K452804L577861M829475O786230J0146764
$$ plain form
6951 63180421 79360983 104874077 139623412 175606794 200549437 207664590 199021278
6944 199021278 179494639 153862562 127204257 103303581 83394328 67963698 56138179
6937 56138179 47765836 41976031 37948401 34953593 32965821 31849130 31537867 32204446
6929 32204446 33210599 35412426 38801101 44602419 54310057 68773890 86365464 101785938
6921 101785938 109762057 109129922 101643334 89599451 75890863 62444220 50807149 41076407
6913 41076407 33628065 27753672 23570390 20435468 18042287 16089528 14499857 13303214
6905 13303214 12304789 11498365 10853473 10218368 9629281 9277113 8828548 8622960 8243812
6896 8243812 7960713 7793402 7522029 7266224 7148658 6986298 6917174 6687532 6468613 6380795
$$ packed form
6951F3180421J6180562K5513094L4749335L5983382K4942643P115153q643312
6944A99021278j9526639k5632077k6658305k3900676j9909253j5430630j1825519
6937E6138179q372343n789805m027630k994808j987772j116691l11263O66579
6929C2204446J006153K201827L388675N801318R707638J4463833J7591574J5420474
6921A01785938P976119o32135p486588j2043883j3708588j3446643j1637071r730742
6913D1076407p448342n874393m183282l134922k393181j952759j589671j196643
6905A3303214r98425q06424o44892o35105n89087l52168m48565k05588l79148
6896H243812k83099j67311k71373k55805j17566j62360o9124k29642k18919q7818
$$ plain form
6886 6380795 6056790 6059458 5893801 5773395 5792357 5643477 5414437 5328813 5154163 4919112
6876 4919112 4782057 4722566 4502056 4366779 4154714 4091423 4206089 3954406 4016086 4105190
6866 4105190 4104506 4156467 4184783 4457589 4720620 4655755 4733514 4666649 4658107 4865320 4850481
6855 4850481 4938767 4757375 4564748 4359303 4054936 3840953 3516978 3297971 3151051 2906161
6845 2906161 2918469 2885441 2852191 2900193 2916313 3152648 3113591 3250335 3632238 3890380 3941696
6834 3941696 4029674 4060716 4154509 3991263 4018252 3841374 3728412 3431933 3250133 3084619
6824 3084619 2841509 2622605 2534825 2368748 2308710 2243577 2199153 2169701 2264540 2158785 2255744
6813 2255744 2383120 2234009 2393679 2188437 2365797 2140141 2208188 2175277 1821495 1828442
$$ packed form
6886F380795l24005K668j65657j20406J8962j48880k29040q5624j74650k35051
6876D919112j37055n9491k20510j35277k12065o3291J14666k51683O1680Q9104
6866D105190o84N1961K8316K72806K63031o4865P7759o6865q542K07213j4839
6855D850481Q8286j81392j92627k05445l04367k13983l23975k19007j46920k44890
6845B906161J2308l3028l3250M8002J6120K36335l9057J36744L81903K58142N1316
6834C941696Q7978L1042R3793j63246K6989j76878j12962k96479j81800j65514
6824C084619k43110k18904q7780j66077o0038o5133m4424k9452R4839j05755R6959
6813B255744J27376j49111J59670k05242J77360k25656O8047l2911l53782O947
$$ plain form
6803 1828442 1686063 1637451 1413198 1430909 1379994 1369971 1194745 1281848 1256306 1252151 1250289
6792 1250289 1212233 1223335 1070831 1064763 979999 1000306 927559 916075 901755 873422 952170
6781 952170 875547 930287 798633 821994 844445 791443 875665 956004 960586 956512 1084953 1170531
6769 1170531 1011625 1006088 1008857 881752 839630 677508 628579 763304 537994 587682 511183
6758 511183 599794 630995 415532 583654 552889 584658 512575 620701 684623 577995 673331
6747 673331 730364 703654 823338 788340 728558 905319 689052 722188 719678 639570 572546
6736 572546 523515 564594 528946 538825 465896 474622 408723 601687 473161 451424 616845
6725 616845 494595 561443 536400 542839 557407 529131 566985 610941 648145 730743 674539 635467
$$ packed form
6803A828442j42379m8612k24253J7711n0915j0023j75226Q7103k5542m155j862
6792A250289l8056J1102j52504o068q4764K0307p2747j1484j4320k8333P8748
6781I52170p6623N4740j31654K3361K2451n3002Q4222Q0339M582m074J28441Q5578
6769A170531j58906n537K769j27105m2122j62122m8929J34725k25310M9688p6499
6758E11183Q8611L1201k15463J68122l0765L1769p2083J08126O3922j06628R5336
6747F73331N7033k6710J19684l4998n9782J76761k16267L3136k510q0108o7024
6736E72546m9031M1079l5648R879p2929Q726o5899J92964j28526k1737J65421
6725F16845j22250O6848k5043O439J4568k8276L7854M3956L7204Q2598n6204l9072
$$ plain form
6713 635467 699230 815178 864099 826997 887627 903860 1097975 996183 1094675 1105540 1141080
6702 1141080 1093285 1006844 1031355 913828 990750 880665 799939 841345 746965 963744 865245
6691 865245 937428 1016509 960908 897541 875108 926581 946654 879753 871208 1058172 858335
6680 858335 1103942 1098333 1205880 1117946 1143576 1279174 1392543 1509769 1455425 1549571 1567328
6669 1567328 1390297 1362640 1237473 1260731 1270909 1320367 1207278 1264086 1290372 1355322 1193186
6658 1193186 1277576 1221840 952966 1265197 1268488 1342158 1451957 1477473 1788588 1887241 2086900
6647 2086900 2197586 2186685 2198437 2156375 1899259 1814387 1619124 1348018 1410992 1405567 1301676
6636 1301676 1289385 1172640 1228578 1234605 1128064 1106834 1010177 1139131 972284 1039183 1117837
$$ packed form
6713F35467O3763J15948M8921l7102O0630J6233J94115j01792R8492J0865L5540
6702A141080m7795q6441K4511j17527P6922j10085q0726M1406r4380K16779r8499
6691H65245P2183P9081n5601o3367k2433N1473K0073o6901q545J86964j99837
6680H58335K45607n609J07547q7934K5630J35598J13369J17226n4344R4146J7757
6669A567328j77031k7657j25167K3258J0178M9458j13089N6808K6286O4950j62136
6658A193186Q4390n5736k68874L12231L291P3670J09799K5516L11115R8653J99659
6647B086900J10686j0901J1752m2062k57116q4872j95263k71106O2974n425j03891
6636A301676j2291j16745N5938O027j06541k1230r6657J28954j66847O6899P8654
$$ plain form
6625 1117837 1242672 1286317 1394218 1563812 1682821 1728483 1700932 1725108 1595633 1680366
6615 1680366 1745656 1979464 2075106 2220862 2366480 2418718 2628432 2558041 2419491 2326162
6605 2326162 2205766 2082286 2061336 2297529 2570589 2836447 3099104 3151021 3127801 2788091
6595 2788091 2587168 2255122 1966269 1674006 1511962 1273708 1120275 1133917 939165 933446
6585 933446 893866 871442 850197 863914 757180 894345 748990 666559 846488 753384 851518
6574 851518 693271 760752 763979 734095 778001 771295 842585 860572 849232 824850 644011 732432
6562 732432 685441 737775 746982 743237 857227 715228 859503 869229 703434 882454 875769
6551 875769 831700 804941 841063 853903 819368 721503 795987 786146 734806 824467 886598 822195
$$ packed form
6625A117837J24835M3645J07901J69594J19009M5662k7551K4176j29475Q4733
6615A680366O5290K33808R5642J45756J45618N2238K09714p0391j38550r3329
6605B326162j20396j23480k0950K36193K73060K65858K62657N1917k3220l39710
6595B788091k00923l32046k88853k92263j62044k38254j53433J3642j94752n719
6585I33446l9580k2424k1245J3717j06734J37165j45355q2431J79929r3104R8134
6574H51518j58247O7481L227k9884M3906o706P1290J7987j1340k4382j80839Q8421
6562G32432m6991N2334R207l745J13990j41999J44275R726j65795J79020o685
6551H75769m4069k6759L6122J2840l4535r7865P4484r841n1340Q9661O2131o4403
$$ plain form
6539 822195 814833 732823 896638 794556 865517 851336 820395 911893 1057702 1052785 1113877
6528 1113877 1063198 1015061 1043983 993466 953967 894996 905817 957897 935610 984033 921673
6517 921673 902718 816550 861790 833956 893358 924841 934658 898272 794127 811056 881132 830505
6505 830505 779503 879295 953025 969602 1101417 1019579 982635 1010277 1084527 1005845 1036140
6494 1036140 1055939 1085315 1164400 1132667 1081063 1068217 1134260 1129191 1106875 1113314 1150486 1157126
6482 1157126 1225366 1209263 1150713 1170753 1153719 1242197 1332215 1431128 1353527 1440740 1294074
6471 1294074 1392611 1497951 1386267 1522803 1427006 1498722 1565871 1388874 1672843 1487915
6461 1487915 1547450 1550795 1659961 1785731 1853219 1894320 1854778 1862887 1922045 2031384 2033265
$$ packed form
6539H22195p362q2010J63815j02082P0961j4181l0941R1498J45809m917O1092
6528A113877n0679m8137K8922n0517l9499n8971J0821N2080k2287M8423o2360
6517I21673j8955q6168M5240k7834N9402L1483R817l6386j04145J6929P0076n0627
6505H30505n1002R9792P3730J6577J31815q1838l6944K7642P4250p8682L0295
6494A036140J9799K9376P9085l1733n1604j2846O6043n069k2316O439L7172O640
6482A157126O8240j6103n8550K0040j7034Q8478R0018R8913p7601Q7213j46666
6471A294074R8537J05340j11684J36536r5797P1716O7149j76997K83969j84928
6461A487915N9535L345J09166J25770O7488M1101l9542Q109N9158J09339J881
$$ plain form
6450 2033265 2191393 2071080 2113973 2105992 2227492 2135195 2209149 2236613 2211460 2255384 2296330
6439 2296330 2450564 2377276 2584742 2579583 2493349 2764286 2686040 2866372 2902264 2944917 3032984
6428 3032984 3141166 3475452 3595964 4031470 4139520 4462185 4598416 4950807 4939748 4986112
6418 4986112 4953448 4716409 4822223 4844440 4854967 4929693 4857902 5103547 5248920 5464551
6408 5464551 5407717 5372629 5460592 5396226 5468801 5556407 5521127 5571552 5712761 5714546 5845230
6397 5845230 5872145 5812545 5641696 5808388 5780505 5862457 5922824 6054057 6148209 6269302 6291307
6386 6291307 6597915 6845924 6918542 7201856 7322961 7505245 7751728 8089394 8428308 8795286
6376 8795286 9045826 9403927 9637412 9982381 10220150 10656506 10951411 11416265 11942017 12386670
$$ packed form
6450B033265J58128j20313M2893p981J21500r2297P3954K7464k5153M3924M0946
6439B296330J54234p3288K07466n159q6234K70937p8246J80332L5892M2653Q8067
6428C032984J08182L34286J20512M35506J08050L22665J36231L52391j1059M6364
6418D986112l2664k37039J05814K2217J0527P4726p1791K45645J45373K15631
6408E464551n6834l5088Q7963o4366P2575Q7606l5280N0425J41209J785J30684
6397E845230K6915n9600j70849J66692k7883Q1952O0367J31233R4152J21093K2005
6386F291307L06608K48009P2618K83314J21105J82284K46483L37666L38914L66978
6376H795286K50540L58101K33485L44969K37769M36356K94905M64854N25752M44653
$$ plain form
6366 12386670 12865180 13360225 13692333 14064641 14402637 15013865 15732027 16544810 17523634
6357 17523634 18533500 19731548 20921861 21964480 23120125 24611826 26273670 28446456
6349 28446456 31430879 35120875 40211469 46148876 52951750 60403125 68886896 79927294
6341 79927294 97046471 128495757 182362236 257442538 337408326 398416150 426306425
6334 426306425 419558858 383495818 329480320 269866592 215316263 168763495 131765962
6327 131765962 103707729 83118492 68042704 56737321 47984612 41031746 35805911
6320 35805911 31541011 28450124 25702097 23603559 21883391 20375114 19204648 18217713
6312 18217713 17479705 16776324 16101020 15638462 14917448 14417119 13902430 13497790 13229709
$$ packed form
6366A2386670M78510M95045L32108L72308L37996O11228P18162Q12783R78824
6357A7523634J009866J198048J190313J042619J155645J491701J661844K172786
6349B8446456K984423L689996N090594N937407O802874P451375Q483771J1040398
6341G9927294J7119177L1449286N3866479P5080302P9965788O1007824K7890275
6334D26306425o747567l6063040n4015498n9613728n4550329m6552768l6997533
6327A31765962k8058233k0589237j5075788j1305383q752709o952866n225835
6320C5805911m264900l090887k748027k098538j720168j508277j170466r86935
6312A8217713p38008p03381o75304m62558p21014n00329n14689m04640k68081
$$ plain form
6303 13229709 12921273 12613768 12290628 11807524 11344100 10613460 10091659 9665084 9202701
6294 9202701 8834456 8378672 8144822 7665261 7479721 7104692 7031545 6622449 6377255 6358904
6284 6358904 6190517 6037202 5943939 5616819 5671669 5517094 5358322 5207649 5157666 4938614
6274 4938614 4777151 4573444 4456522 4164964 4189023 4042267 3920580 3882700 3641475 3707658
6264 3707658 3535570 3528883 3380116 3202000 3290437 3233353 3255221 3200234 3319674 3297320 3253018
6253 3253018 3261455 3379161 3567912 3847776 4115893 4297603 4348039 4169863 4027482 3827776
6243 3827776 3484747 3254792 2863020 2953384 2637479 2562243 2298755 2345602 2174271 2374853
6233 2374853 2230114 2230041 2293566 2311758 2182492 2165501 2194374 2096997 2050181 1951346 1936549 1967098
$$ packed form
6303A3229709l08436l07505l23140m83104m63424p30640n21801m26575m62383
6294I202701l68245m55784k33850m79561j85540l75029p3147m09096k45194j8351
6284F358904j68387j53315r3263l27120N4850j54575j58772j50673m9983k19052
6274D938614j61463k03707j16922k91558K4059j46756j21687l7880k41225O6183
6264C707658j72088o687j48767j78116Q8437n7084K1868n4987J19440k2354m4302
6253C253018Q437J17706J88751K79864K68117J81710N0436j78176j42381j99706
6243C827776l43029k29955l91772R0364l15905p5236k63488M6847j71331K00582
6233B374853j44739p3O3525J8192j29266j6991K8873r7377m6816r8835j4797L0549
$$ plain form
6221 1967098 1859411 2105041 2155795 2114248 2234716 2313106 2562137 2501322 2386609 2229234
6211 2229234 2068552 2042012 1855098 1805674 1761707 1630911 1648003 1509687 1525733 1484937 1386121
6200 1386121 1444468 1363439 1347699 1409233 1317040 1409680 1315172 1357106 1309169 1206084 1238183
6189 1238183 1034211 1281362 1072640 1141533 961772 938200 1061076 993508 968223 857159
6179 857159 842596 935422 919587 886641 892260 877167 869881 907129 769836 995842 901492 890114
6167 890114 1084624 1018758 1117230 969583 1041698 1003308 1023517 1109719 964320 1056893 1034767
6156 1034767 940672 1175585 1166401 1337267 1303509 1449249 1571611 1688867 1685186 1809330 1667564
6145 1667564 1649698 1894953 1922512 2071103 2205490 2251348 2088967 2040310 1924281 1653126
$$ packed form
6221A967098j07687K45630N0754m1547J20468P8390K49031o0815j14713j57375
6211B229234j60682k6540j86914m9424m3967j30796J7092j38316J6046m0796r8816
6200A386121N8347q1029j5740O1534r2193R2640r4508M1934m7937j03085L2099
6189A238183k03972K47151k08722O8893j79761k3572J22876o7568k5285j11064
6179H57159j4563R2826j5835l2946N619j5093p286L7248j37293K26006r4350j1378
6167H90114J94510o5866R8472j47647P2115l8390K0209Q6202j45399R2573k2126
6156A034767r4095K34913r184J70866l3758J45740J22362J17256l681J24144j41766
6145A667564j7866K45255K7559J48591J34387M5858j62381m8657j16029k71155
$$ plain form
6135 1653126 1609184 1420402 1333550 1171226 1170974 1114245 1161875 1118038 1178183 1059988 1125160
6124 1125160 1162353 1114448 1347168 1410765 1649218 1857699 2254919 2487322 2840173 3116562
6114 3116562 3171149 3311678 3075965 2851243 2628883 2345713 1941435 1796847 1502378 1435654
6104 1435654 1306084 1128118 1045155 1090708 1004524 973780 1011314 1005174 1056163 991899 1051541
6093 1051541 1005843 869303 960527 758452 679659 782502 627068 725881 588617 623831
6083 623831 714725 608830 707338 726871 766154 806149 679052 788625 890823 879924 1255892
6072 1255892 1701194 2029422 2423428 2524214 2594846 2519981 2368763 1937794 1710908 1367810
6062 1367810 1186586 985748 934147 834988 702455 690279 578794 715927 567905 603431
$$ packed form
6135A653126m3942j88782q6852j62324k52n6729M7630m3837O0145j18195O5172
6124A125160L7193m7905K32720O3597K38453K08481L97220K32403L52851K76389
6114C116562N4587J40529k35713k24722k22360k83170m04278j44588k94469o6724
6104A435654j29570j77966q2963M5553q6184l0744L7534o140N0989o4264N9642
6093A051541m5698j36540R1224k02075p8793J02843j55434R8813j37264L5214
6083F23831R0894j05895R8508J9533L9283L9995j27097J09573J02198j0899L75968
6072A255892M45302L28228L94006J00786P0632p4865j51218m30969k26886l43098
6062A367810j81224k00838n1601r9159j32533j2176j11485J37133j48022L5526
$$ plain form
6052 603431 363929 409306 411261 328676 377102 414645 384300 342164 371665 199649 315391
6041 315391 286925 507829 396970 338315 298505 345535 280938 405616 382499 480305 418099
$$ packed form
6052F03431k39502M5377J955q2585M8426L7543l0345m2136K9501j72016J15742
6041C15391k8466K20904j10859n8655l9810M7030o4597J24678k3117R7806o2206
$$ [...]
##END NTUPLES=NMR SPECTRUM
##END=
