##TITLE=abcd
##JCAMPDX= 6.0         $$ Bruker NMR JCAMP-DX V2.0
##DATA TYPE= NMR SPECTRUM
##DATA CLASS= NTUPLES
##ORIGIN= UXNMR, Bruker Analytische Messtechnik GmbH
##OWNER= root
$$ XWIN-NMR		Version 3.5
$$ Thu Jul  9 19:49:25 2026 Russian Standard Time (UT+4h)  servis@DPX200
##.OBSERVE FREQUENCY= 200.131235884673
##.OBSERVE NUCLEUS= ^1H
##.ACQUISITION MODE= SIMULTANEOUS
##.ACQUISITION SCHEME= undefined
##.AVERAGES= 32
##.DIGITISER RES= 18
##SPECTROMETER/DATA SYSTEM= spect
##.PULSE SEQUENCE= zg
##.SOLVENT NAME= CDCl3
##.SHIFT REFERENCE= (INTERNAL, CDCl3, 0, 16.4885)
##AUDIT TRAIL= $$ (NUMBER, WHEN, WHO, WHERE, WHAT)
$$ ##TITLE= Audit trail, XWIN-NMR		Version 3.5
$$ ##JCAMPDX= 5.01
$$ ##ORIGIN= Bruker BioSpin GmbH
$$ ##OWNER= servis
$$ F:\spectra/data/av/nmr/H1/1/pdata/1/auditp.txt
$$ ##AUDIT TRAIL=  $$ (NUMBER, WHEN, WHO, WHERE, WHAT)
(   1,<2026-07-09 19:47:14.98 +0400>,<servis>,<DPX200>,
      <created by zg, POWCHK disabled, PULCHK disabled
       configuration hash MD5:
       00 E9 B6 7A A2 85 ED C7 34 08 36 98 17 FE 4E 26
       data hash MD5: 32K
       DD 8B 0E F8 40 86 41 8C CF 61 BE 62 09 05 A7 70>)
(   2,<2026-07-09 19:48:59.98 +0400>,<servis>,<DPX200>,
      <Start of raw data processing
       efp BC_mod = 2 LB = 0.05 FT_mod = 6 PKNL = 1 PHC0 = -415.39 PHC1 = 3.101563 SI = 16K 
       data hash MD5: 16K
       E0 90 AF 28 5A DD 9E 17 88 9E CB 2D 45 63 C6 BD>)
$$ ##END=
$$ 
$$ hash MD5
$$ 1B 14 61 EB 32 22 E8 98 86 29 B4 91 0F 16 41 CE
##$RELAX= 
##$RELAX= 
##$RELAX= 
##$RELAX= 
##$RELAX= 
##$RELAX= 
##$RELAX= 
##$RELAX= 
$$ Bruker specific parameters
$$ --------------------------
##$DU= <F:\spectra>
##$EXPNO= 1
##$NAME= <H1>
##$PROCNO= 1
##$TYPE= <nmr>
##$USER= <av>
##$AMP= (0..31)
100 100 100 100 100 100 100 100 100 100 100 100 100 100 100 100 100 100 
100 100 100 100 100 100 100 100 100 100 100 100 100 100 
##$AQSEQ= 0
##$AQ_mod= 1
##$AUNM= <au_zg>
##$AUTOPOS= <>
##$BF1= 200.13
##$BF2= 200.13
##$BF3= 200.13
##$BF4= 200.13
##$BF5= 500.13
##$BF6= 500.13
##$BF7= 500.13
##$BF8= 500.13
##$BYTORDA= 1
##$CFDGTYP= 0
##$CFRGTYP= 5
##$CHEMSTR= <none>
##$CNST= (0..31)
1 1 145 1 1 1 1 1 1 1 1 1 1 1 1 1 1 1 1 1 1 1 1 1 1 1 1 1 1 1 1 1 
##$CPDPRG= <>
##$CPDPRG1= <>
##$CPDPRG2= <>
##$CPDPRG3= <>
##$CPDPRG4= <mlev>
##$CPDPRG5= <mlev>
##$CPDPRG6= <mlev>
##$CPDPRG7= <mlev>
##$CPDPRG8= <mlev>
##$CPDPRGB= <>
##$CPDPRGT= <>
##$D= (0..31)
0 2 0 0 0 0 0 0 0 0.06 0 0 0 0 0 0 0.0002 0 0 0 0 0 0 0 0 0 0 0 0 0 0 
0 
##$DATE= 1783612034
##$DBL= (0..7)
120 120 120 120 120 120 120 120 
##$DBP= (0..7)
150 150 150 150 150 150 150 150 
##$DBP07= 0
##$DBPNAM0= <>
##$DBPNAM1= <>
##$DBPNAM2= <>
##$DBPNAM3= <>
##$DBPNAM4= <>
##$DBPNAM5= <>
##$DBPNAM6= <>
##$DBPNAM7= <>
##$DBPOAL= (0..7)
0.5 0.5 0.5 0.5 0.5 0.5 0.5 0.5 
##$DBPOFFS= (0..7)
0 0 0 0 0 0 0 0 
##$DE= 6
##$DECBNUC= <off>
##$DECIM= 32
##$DECNUC= <off>
##$DECSTAT= 4
##$DIGMOD= 1
##$DIGTYP= 9
##$DL= (0..7)
0 120 120 120 120 120 120 120 
##$DP= (0..7)
150 150 150 150 150 150 150 150 
##$DP07= 0
##$DPNAME0= <>
$$ [...]
##$SUBNAM4= <"">
##$SUBNAM5= <"">
##$SUBNAM6= <"">
##$SUBNAM7= <"">
##$SUBNAM8= <"">
##$SUBNAM9= <"">
##$SW= 20.6817932712277
##$SWIBOX= (0..15)
0 0 3 0 0 0 0 0 0 0 0 0 0 0 0 0 
##$SW_h= 4139.07284768212
##$TD= 32768
##$TD0= 1
##$TE= 0
##$TE2= 300
##$TE3= 300
##$TEG= 300
##$TL= (0..7)
0 120 120 120 120 120 120 120 
##$TP= (0..7)
150 150 150 150 150 150 150 150 
##$TP07= 0
##$TPNAME0= <>
##$TPNAME1= <>
##$TPNAME2= <>
##$TPNAME3= <>
##$TPNAME4= <>
##$TPNAME5= <>
##$TPNAME6= <>
##$TPNAME7= <>
##$TPOAL= (0..7)
0.5 0.5 0.5 0.5 0.5 0.5 0.5 0.5 
##$TPOFFS= (0..7)
0 0 0 0 0 0 0 0 
##$TUNHIN= 0
##$TUNHOUT= 0
##$TUNXOUT= 0
##$USERA1= <user>
##$USERA2= <user>
##$USERA3= <user>
##$USERA4= <user>
##$USERA5= <user>
##$V9= 5
##$VALIST= <valist>
##$VCLIST= <CCCCCCCCCCCCCCC>
##$VD= 0
##$VDLIST= <DDDDDDDDDDDDDDD>
##$VPLIST= <PPPPPPPPPPPPPPP>
##$VTLIST= <TTTTTTTTTTTTTTT>
##$WBST= 1024
##$WBSW= 30
##$XGAIN= (0..3)
0 0 0 0 
##$XL= 0
##$YL= 0
##$YMAX_a= 1070923
##$YMIN_a= -1613403
##$ZGOPTNS= <>
##$ZL1= 120
##$ZL2= 120
##$ZL3= 120
##$ZL4= 120
##$ABSF1= 0
##$ABSF2= 0
##$ABSG= 0
##$ABSL= 0
##$ALPHA= 0
##$AQORDER= 0
##$ASSFAC= 0
##$ASSFACI= 0
##$ASSFACX= 0
##$ASSWID= 0
##$AUNMP= <proc_1d>
##$AZFE= 0.1
##$AZFW= 0.1
##$BCFW= 0
##$BC_mod= 2
##$BYTORDP= 0
##$COROFFS= 0
##$CY= 18.4799938201904
##$DATMOD= 1
##$DC= 0
##$DFILT= <>
##$DTYPP= 0
##$F1P= 9.9274215381318
##$F2P= -0.165520771350173
##$FCOR= 1
##$FTSIZE= 16384
##$FT_mod= 6
##$GAMMA= 0
##$GB= 0
##$INTBC= 1
##$INTSCL= 4.127829e-11
##$ISEN= 128
##$LB= 0.05
##$LEV0= 0
##$LPBIN= 0
##$MAXI= 10000
##$MC2= 0
##$MEAN= 0
##$ME_mod= 0
##$MI= 50
##$NCOEF= 0
##$NC_proc= -3
##$NLEV= 6
##$NOISF1= 3.799351
##$NOISF2= 2.8
##$NSP= 0
##$NTH_PI= 0
##$NZP= 0
##$OFFSET= 16.48848
##$PC= 4
##$PHC0= -415.39
##$PHC1= 3.101563
##$PH_mod= 1
##$PKNL= yes
##$PPARMOD= 0
##$PSCAL= 4
##$PSIGN= 0
##$REVERSE= no
##$SF= 200.130005582386
##$SI= 16384
##$SIGF1= 3
##$SIGF2= 2
##$SINO= 400
##$SIOLD= 16384
##$SREGLST= <1H.CDCl3>
##$SSB= 0
##$STSI= 16384
##$STSR= 0
##$SW_p= 4139.07284768211
##$SYMM= 0
##$S_DEV= 0
##$TDeff= 32768
##$TDoff= 0
##$TI= <>
##$TILT= no
##$TM1= 0
##$TM2= 0
##$TOPLEV= 0
##$USERP1= <user>
##$USERP2= <user>
##$USERP3= <user>
##$USERP4= <user>
##$USERP5= <user>
##$WDW= 1
##$XDIM= 16384
##$YMAX_p= 273196002
##$YMIN_p= -264786
$$ End of Bruker specific parameters
$$ ---------------------------------
##NTUPLES= NMR SPECTRUM
##VAR_NAME=  FREQUENCY,     SPECTRUM/REAL,   SPECTRUM/IMAG
##SYMBOL=    X,             R,               I
##VAR_TYPE=  INDEPENDENT,   DEPENDENT,       DEPENDENT
##VAR_FORM=  AFFN,          ASDF,            ASDF
##VAR_DIM=   16384,         16384,           16384
##UNITS=     HZ,            ARBITRARY UNITS, ARBITRARY UNITS
##FACTOR=    0.252644378177508, 1,           1
##FIRST=     3299.83951724647, 0,            0
##LAST=      -839.233330435636, 0,           0
##MIN=       -839.233330435636, -264786,     0
##MAX=       3299.83951724647, 273196002,    0
$$ Real data points
##PAGE= N=1
##DATA TABLE= (X++(R..R)), XYDATA
$$ [...]
9606a664j6309R57L3952l7292j7175M4476k8605J9472J0112J8726l548j6195J8523
9593B5430j0978J5650L211m153j1601L6279p3799O2460k593J0810k2650k1282
9581F784K454J1092j4965J1347k4946K1800K5625l3869j6811K3168j4523K5700
9569B2856p499M0455l4429J3836K1691j1177J4640m3533M1019r894J9493n1098
9557A6360L0453k5106P875m38qJ9592l732k1843K1886k0798L3956k9072K1765
9544E0890J2123K8374O524J3541P090J288P404j704J4140r632j2340J1274J6442
9531A45414l9794K0283o1376M7819j6106j6474M959K08q845L900K8218j8905K9454
9518A18755K0935M276n891L0666N178J6147L4578l405K6042R191j1631O143P888
$$ plain form
9606 -1664 -17973 -17016 16936 -20356 -37531 6945 -21660 -2188 7924 26650 23102 6907 25430
9593 25430 14452 30102 33313 29160 17559 53838 -19961 42499 39906 50716 28066 6784
9581 6784 9238 20330 5365 16712 -8234 13566 39191 5322 -11489 11679 -2844 22856
9569 22856 15357 55812 21383 35219 56910 45733 60373 16840 57859 47965 67458 16360
9557 16360 46813 21707 29582 29144 29136 48728 44996 23153 45039 24241 58197 29125 50890
9544 50890 63013 91387 97911 111452 118542 119830 127234 125530 139670 130038 117698 128972 145414
9531 145414 105620 125903 64527 112346 96240 79766 84725 84933 76088 79988 108206 89301 118755
9518 118755 139690 143966 138075 168741 173919 190066 224644 221239 247281 256472 244841 250984 258872
9505B58872K957k4419K7229p831L0064M0975J7663m697P239L8765M865j9807K3367
9492C95242j0356m33k5285j3235O789k1327k4932k877L4570m3576j275M0052o865
9479C26492o510K4007K6042N429L4213K237K5520M514P92O5897K634J7756k0262
9466E08761J2064J3559k1545l7687M2849m566n3209q795J6280J0926l9567J105
9454D40175J194r015M9979K3398j7845J392J0667K9171L8500N1407L9695L0828
9442F89546M0905r050k486M4146r331K9812l0993Q316k0453l5036O0410k877O090
9429G68999J0433O3896k1329P008K102k4642j1732l847l1536L2089J6455R4110
9417I02006j4538J1931K7395m370O748L2617q166P190M302k8017J5173j3598o119
$$ plain form
9505 258872 261829 237410 264639 256808 286872 327847 345510 340813 348052 386817 391682 371875 395242
9492 395242 384886 384453 359168 345933 352722 331395 306463 303586 338156 294580 293305 333357 326492
9479 326492 319982 343989 370031 375460 409673 411910 437430 441944 442736 508633 511267 529023 508761
9466 508761 520825 534384 512839 475152 518001 513435 460226 451431 467711 478637 439070 440175
9454 440175 441369 432354 482333 505731 487886 489278 499945 529116 567616 619023 658718 689546
9442 689546 730451 721401 718915 763061 753730 783542 752549 760865 740412 705376 765786 762909 768999
9429 768999 779432 843328 821999 829007 831109 806467 794735 790888 759352 791441 807896 902006
9417 902006 887468 899399 926794 922424 929172 961789 953623 960813 965115 937098 952271 938673 932554
9404I32554j2574l5209j0237l0429R206O2926n944J5597k4146K4422j7533K7106
9392I35739p671l2737l3757l1409n9180k6811j5292o182k6178r144j1354J9289
9380F95313n739l7069J1737k1606j7680k5511P47K2225J6865l03K665P413K677
9367F51734r399L1011k7810P5883J5932O7016J22569J25391Q2813J07682O7679
9356A310501K1359M7706J4168O3485L7806J2871L9469m9813l3233m4264j14057
9345A305998l3257l3600k7108n4046m442l4143k1756j9242J0978J376O2124P6258
9333A229140R3520P2160J47055Q1909J20611J38394J25254J07799Q8453O7140
9323B271435L267K9748k1664k0587j05018o2244j64114j64816j30898j07586j03976
$$ plain form
9404 932554 919980 884771 874534 844105 853311 916237 910293 925890 901744 926166 908633 935739
9392 935739 928068 895331 861574 830165 770985 744174 728882 722700 696522 687378 676024 695313
9380 695313 689574 652505 664242 642636 624956 599445 600192 622417 639282 638979 641644 649057 651734
9367 651734 642335 673346 645536 721419 737351 804367 926936 1052327 1135140 1242822 1310501
9356 1310501 1331860 1379566 1393734 1457219 1495025 1507896 1547365 1497552 1464319 1420055 1305998
9345 1305998 1272741 1239141 1212033 1157987 1153545 1119402 1097646 1078404 1089382 1090758 1152882 1229140
9333 1229140 1322660 1394820 1541875 1623784 1744395 1882789 2008043 2115842 2204295 2271435
9323 2271435 2274702 2304450 2282786 2262199 2157181 2094937 1930823 1766007 1635109 1527523 1423547
9312A423547o1725K530n1620n6817j7372j3910l296n314j9719K0674M4545l812
9300A257711Q360j33L5112k8695k0248k157R632k8963Q709Q06n0983M1034j3894
9287A216291K1756q57j078K9398k4332L9242K1273K416L1946L6286L847K5534
9275A401722j0477j300K1210L1131o673K5251m616J2508j1231N2471r488K6426
9263A526934Q4073L0798J0431N5876J5487R3321j0568L8997O315L8249j1275L7874
9251A916512M2891k5141M0674O2606K6735M0011Q5479N0009P246R799J4077N5995
9239B326893M9065K6332K9008N6869L3129K3219K7160N8934L8802M8038O3671
9228B781120M4035N2265M2887M4278R0345Q8785N8335R3139R2696O4135M6962
$$ plain form
9312 1423547 1361822 1364352 1312732 1255915 1238543 1224633 1221337 1216023 1196304 1216978 1261523 1257711
9300 1257711 1266071 1265938 1301050 1272355 1252107 1249950 1259582 1230619 1239328 1240134 1189151 1230185 1216291
9287 1216291 1238047 1237190 1236112 1265510 1241178 1280420 1301693 1304109 1336055 1372341 1376188 1401722
9275 1401722 1391245 1389945 1411155 1442286 1435613 1460864 1456248 1468756 1457525 1509996 1500508 1526934
9263 1526934 1611007 1641805 1652236 1708112 1723599 1816920 1806352 1845349 1851664 1889913 1878638 1916512
9251 1916512 1959403 1934262 1974936 2037542 2064277 2104288 2189767 2239776 2247022 2256821 2270898 2326893
9239 2326893 2375958 2402290 2431298 2488167 2521296 2544515 2571675 2630609 2669411 2717449 2781120
9228 2781120 2825155 2877420 2920307 2964585 3054930 3143715 3202050 3295189 3387885 3452020 3498982
9217C498982M0256M5602N2687P8973P5578M3640O6991N5951P1823O3530J16062
9206D210075J00574P4676J48397R2920O4687P6701N7733P8994J33785J11767R7019
9195E247328J65897J54186J25975J46213R6096J10624M9423P3824M9694P6079
9185F295339O8442N5675J07371J31983K58587J72484K91396K99727M56260O54051
9175H791315Q52447J027707Q48440P19693P97053P95691P57125O67784O73911
9166A5931166N71902K67691k36862k71357l42911k89366j53348n7091j06378r1261
9156A5222185j301N9620J44916K97774M57809P05761R51935J101376J372092J644701
9146B1956868J825866K293654K991614L252645L210887K132002J430814J449941
$$ plain form
9217 3498982 3539238 3584840 3637527 3716500 3792078 3835718 3902709 3958660 4030483 4094013 4210075
9206 4210075 4310649 4385325 4533722 4626642 4691329 4768030 4825763 4904757 5038542 5150309 5247328
9195 5247328 5413225 5567411 5693386 5839599 5935695 6046319 6095742 6169566 6219260 6295339
9185 6295339 6363781 6419456 6526827 6658810 6917397 7089881 7381277 7681004 8137264 8791315
9175 8791315 9643762 10671469 11519909 12239602 13036655 13832346 14589471 15257255 15931166
9166 15931166 16503068 16770759 16533897 16262540 15919629 15630263 15476915 15419824 15313446 15222185
9156 15222185 15220884 15280504 15425420 15723194 16181003 16886764 17838699 18940075 20312167 21956868
9146 21956868 23782734 26076388 29068002 32320647 35531534 37663536 39094350 40544291
9138D0544291J558264J758962J793502J438320J468667K043831K807334L002798
9130E6415969K218388P41775R8451j45220j74234N98277J879577L128690M652186
9121F9413859O680863Q847341J1583295J5426225K0446741K6262737K9001385
9114A87662446K7404342K1838611J5198978R712265J512944p653300j5120327
9107B40555959k0219481k2831182k3121484k0820577j6587267j2031680q710668
9100A16233620o573719n150563l557268k696482l092602l852080m549954n047481
9092H1713471n283461n002584l939540k689709r57640K67754Q47839j18337q27107
9083F4010686j278587k626084l278354l624871l620843l442969k969014k462170
$$ plain form
9138 40544291 42102555 43861517 45655019 47093339 48562006 50605837 53413171 56415969
9130 56415969 58634357 59376132 59474583 59329363 59155129 59753406 61632983 64761673 69413859
9121 69413859 76094722 84942063 96525358 111951583 132398324 158661061 187662446
9114 187662446 215066788 236905399 252104377 261816642 263329586 255676286 240555959
9107 240555959 220336478 197505296 174383812 153563235 136975968 124944288 116233620
9100 116233620 109659901 104509338 100952070 98255588 95162986 91310906 86760952 81713471
9092 81713471 76430010 71427426 67487886 64798177 63840537 64108291 64956130 64837793 64010686
9083 64010686 62732099 60106015 56827661 53202790 49581947 46138978 43169964 40707794
9075D0707794k012888j541378j101786n03917J11656N85767O78111L6822r67875
9066C5992306j878351k415653k774098k697029k345065j903217j436850j051293
9058A9490750p12598o40767n25355m74885l67643k30126j17377J7715k8467l5463
9048A6375784L9467n596j50806k80223n41923p67145q43574q49389p67235n57168
9038A1652192l81966k57471k29015l56559l83129m75422n00340n00600m45089
9029H122601m09866l37777k73515k52663j92539j97035j92610j81198j53130j88613
9019E743655j73534j78455j61131j79078j66118j43251j71042j13135j34501j17593
9009D205817j04819o0965j52871p0020r2148j08414n8189j13490q8247j15309
$$ plain form
9075 40707794 38694906 37153528 36051742 35547825 35659481 36245248 36923359 36960181 35992306
9066 35992306 34113955 31698302 28924204 26227175 23882110 21978893 20542043 19490750
9058 19490750 18778152 18137385 17612030 17137145 16769502 16539376 16421999 16439714 16411247 16375784
9048 16375784 16415251 16409655 16258849 15978626 15436703 14669558 13825984 12976595 12209360 11652192
9038 11652192 11270226 11012755 10783740 10427181 10044052 9568630 9068290 8567690 8122601
9029 8122601 7712735 7374958 7101443 6848780 6656241 6459206 6266596 6085398 5932268 5743655
9019 5743655 5570121 5391666 5230535 5051457 4885339 4742088 4571046 4457911 4323410 4205817
9009 4205817 4100998 4040033 3887162 3817142 3724994 3616580 3558391 3444901 3356654 3241345
8999C241345q3508j03028p5644p8646o4510q7581l9281o8639o9328n7751o2425
8988B451004m1015p6946q0166Q279o3509n8383j6269l9056m8607k3538q0949l6296
8976A894549n6160n5389o0133o5597n3540k3634o4481n3671n9056N38l9930m4385
8964A319111k2254n784P443k4330n5270q551l7586j5672k0773l4252l6367p461
8952A058254l7058k1550o2966j5429m209m7438j8339J5728n1187j9309k4164o689
8940G65644j3042n7737q354j9828k476k7921O136m5458Q550n4501L8008j1279
8928E77742n3734J2773m7432r870j0903q211l2790K0934p995J5785l7997J5316
8916D33618l8733J6296k3448j0398j2155M921j2295j5505m131n1602R762M604
$$ plain form
8999 3241345 3157837 3054809 2979165 2900519 2836009 2748428 2709147 2640508 2571180 2513429 2451004
8988 2451004 2409989 2333043 2252877 2261156 2197647 2139264 2122995 2083939 2035332 2011794 1930845 1894549
8976 1894549 1838389 1783000 1722867 1657270 1603730 1580096 1515615 1461944 1402888 1403426 1363496 1319111
8964 1319111 1296857 1291073 1298516 1274186 1218916 1210365 1172779 1157107 1136334 1102082 1065715 1058254
8952 1058254 1021196 999646 936680 921251 917042 869604 851265 866993 815806 796497 772333 765644
8940 765644 752602 694865 686511 666683 664207 636286 642422 596964 605514 551013 589021 577742
8928 577742 524008 536781 489349 479479 468576 460365 427575 448509 440514 456299 418302 433618
8916 433618 394885 411181 387733 377335 365180 370101 357806 342301 338170 286568 296330 300934
8904C00934j1684k9707m103R02m3105L2058l5458k4053O350k648K8597k8380M679
8891A94382k4200J9254l5445j6624K3756j5198M226k2981R213J5078j7044l1864
8879A02553K2045P63J154j3449m720Q38l1406j0552M153J7764j5760k0205L3994
8866H7172l8964j2835L3266m3687L5885l1748J466J5853k4558q532o073L7910
8854D5155J9103k330o98O95k5145L1695O5264o593L6544R781J9437K010j0414
8841A84504L0365j568L007k9646J4904l4847l0370j8921K5871l9161j5114N137
8829I4161K8416n1610j2947L1649j7263j3803L9561J0603O7759L4334N6552L8288
8817C05700N6021L4924N0737O8970L1549j2280K1383k0890J6400n278j411K1425
$$ plain form
8904 300934 289250 259543 255440 256342 213237 245295 209837 185784 192134 189486 218083 189703 194382
8891 194382 170182 189436 153991 137367 161123 145925 150151 127170 136383 151461 134417 102553
8879 102553 124598 125361 126515 113066 108346 109184 77778 67226 71379 89143 73383 53178 87172
8866 87172 48208 35373 68639 24952 60837 29089 30555 46408 21850 13318 7245 45155
8854 45155 64258 61928 61230 61925 36780 68475 133739 127146 163690 173471 192908 194918 184504
8841 184504 214869 213301 216308 186662 201566 166719 136349 117428 143299 104138 89024 94161
8829 94161 122577 70967 58020 89669 72406 58603 98164 108767 176526 210860 267412 305700
8817 305700 361721 396645 447382 516352 547901 535621 557004 536114 552514 547236 545825 567250
8805E67250k0963M3451o4093Q963k5782o1740m3544l9249p8119j3540r513k1725
8793B41396o679j952q013M6602j610L8787O0870J545J14260k7138K7080J3438
8781D98586m51j1436N135J0830k6514p3197M719m4542k3546l1909j6148p704k1692
8768B62131k3436L9324n6692k330j3040j2908j1440k0698p145M676K1082l6443
8756A43081r663l3092J8025j9174k1127j5798N173o359l6631n248j4118Q907l88
8743A3588j3840n61L8434k8013K63j1401L3561j8696l3216M107K8680J5148j6544
8730A1510k7938J1290K3226o153n891k5459l803j0425K3267m264j4214l1502j3629
8717g3985J7478q695k7949L0776N081j0088l458l1706P190L341J1481J8642j6735
$$ plain form
8805 567250 546287 589738 525645 534608 508826 447086 403542 364293 286174 272634 263121 241396
8793 241396 234717 232765 224752 271354 269744 308531 369401 370946 485206 458068 485148 498586
8781 498586 498135 486699 491834 502664 476150 402953 407672 363130 339584 307675 291527 283823 262131
8768 262131 238695 278019 221327 218997 205957 193049 181609 160911 153766 158442 179524 143081
8756 143081 133418 100326 118351 99177 78050 62252 67425 61066 24435 19187 5069 13976 13588
8743 13588 -252 -813 37621 9608 9871 -1530 32031 13335 -19881 -15774 12906 28054 11510
8730 11510 -16428 -5138 18088 11935 6044 -19415 -23218 -33643 -10376 -14640 -28854 -60356 -73985
8717 -73985 -56507 -65202 -93151 -62375 -57294 -67382 -70840 -102546 -95356 -92015 -80534 -61892 -78627
8704g8627l0047K1740K63J3957l2687j0110N3619m4305P946K520q23n246k3850
8691a25650M7705l5892J479N92K91L10P752j6486k5485L3499L992j3986K862M8106
8677g0911l4213j6129J2080l2564O580k815k951N5767O997l3826J5450J6330j6492
8664i6697J0071n733k0462K83k374K6710l3991L4390k1838k503J5019k9873N680
8651a21318l0746K1113K130J4751p191j8617L5275j1041K8307k2863r185k0267
8639a39652J0763J5941j3031N029j1202J86J7951j4383J8233M847p657J548o670
8626a18097j2919L422j8308L5730k1715J5789m679J049J1385j1248q356L2488
8614i5459k4392J6192J2518l226k7198l635J5117k1963K6920P135j0194j1574
$$ plain form
8704 -78627 -108674 -86934 -86671 -72714 -105401 -115511 -61892 -106197 -98251 -95731 -96554 -101800 -125650
8691 -125650 -77945 -113837 -112358 -111766 -111475 -111165 -103413 -119899 -145384 -111885 -107893 -121879 -119017 -70911
8677 -70911 -105124 -121253 -109173 -141737 -135157 -137972 -140923 -85156 -78159 -111985 -96535 -80205 -96697
8664 -96697 -86626 -92359 -112821 -112538 -114912 -88202 -122193 -87803 -109641 -112144 -97125 -126998 -121318
8651 -121318 -152064 -130951 -128821 -114070 -121261 -139878 -104603 -115644 -87337 -110200 -119385 -139652
8639 -139652 -128889 -112948 -125979 -120950 -132152 -131966 -114015 -128398 -110165 -105318 -112975 -111427 -118097
8626 -118097 -131016 -127594 -145902 -110172 -131887 -116098 -120777 -119728 -108343 -119591 -127947 -95459
8614 -95459 -119851 -103659 -91141 -94367 -121565 -125200 -110083 -132046 -105126 -97991 -108185 -119759
8602a19759r104L8914q748j0594r348K573j2604J9443R659k6377J5665n128M2448
8589g2960n1226J6475K4565o524p696L429O049m2598L5411k418j3200M2394l7610
8576a05909j929L1963p810n0217O8813p944m8825K5956K938L9658j4890j2302
8564h0498q502j6117M3527l7176L2721k6778j24J4793M414J652q090O105k4295
8551i8368J4910j5423J1324P404j6586K0385j5469k1565K2943Q117K0931R859
8539e1538J3515j4147k4525j1724N4009j08461L4330l0578K2324L0415m1108K4736
8527a02752K0692m375r57l9093J5422J7377j924k0689K322K0239l6709K4042M192
8514a02213q81J6844r313j1717l7696L9810J8893l3357J7035j4339M0056J74j1702
$$ plain form
8602 -119759 -128863 -89949 -98697 -109291 -118639 -116066 -128670 -109227 -99568 -125945 -110280 -115408 -72960
8589 -72960 -124186 -107711 -83146 -89670 -97366 -93937 -87888 -130486 -95075 -97493 -110693 -68299 -105909
8576 -105909 -107838 -75875 -83685 -133902 -65089 -73033 -121858 -95902 -92964 -53306 -68196 -80498
8564 -80498 -89000 -105117 -61590 -98766 -66045 -92823 -92947 -78154 -73740 -72088 -80178 -74073 -98368
8551 -98368 -83458 -98881 -87557 -80153 -96739 -76354 -91823 -113388 -90445 -82328 -61397 -51538
8539 -51538 -38023 -52170 -76695 -88419 -34410 -142871 -108541 -139119 -116795 -86380 -127488 -102752
8527 -102752 -82060 -86435 -87392 -126485 -111063 -93686 -95610 -116299 -113977 -93738 -130447 -106405 -102213
8514 -102213 -103094 -86250 -95563 -107280 -144976 -105166 -86273 -119630 -102595 -116934 -76878 -76704 -88406
8501h8406k3951j7699J4221k744J1451l531J2189j0829Q558O193o196l22j9244
8488a20310L737n387J0526j8821L561J3309k4808K840K5846k5020K606J8501m219
8475a17639j5270J5254k1230o815K4144J032l3938L7828L132l3275K0911J5387
8463a10479j7780J421j2011J3030L352J154k203O669j7186q965K1992p657k0769
8450a49432L0847r28P220j3574j1549K4465j7800j4002K4367j1283K207K3920
8438a05542k0726j5301m623J9010P735J6227j6666l95k4490K6718m6138O0894
8426a03297j5616q557k0555K5128k5058L4358j6627J4465j3489J2430j1445K9281
8414i8982k5689m076K9653l4916k0905K5580L5491k6850l3881K0226J881r896
$$ plain form
8501 -88406 -112357 -130056 -115835 -118579 -107128 -110659 -98470 -109299 -100741 -94548 -100744 -101066 -120310
8488 -120310 -116573 -121960 -111434 -130255 -126694 -113385 -138193 -135353 -109507 -134527 -131921 -113420 -117639
8475 -117639 -132909 -117655 -138885 -145700 -121556 -120524 -154462 -116634 -113502 -146777 -125866 -110479
8463 -110479 -128259 -126838 -138849 -125819 -122467 -121313 -123516 -116847 -134033 -142998 -121006 -128663 -149432
8450 -149432 -118585 -119513 -112293 -125867 -137416 -112951 -130751 -144753 -120386 -131669 -129462 -105542
8438 -105542 -126268 -141569 -146192 -127182 -119447 -103220 -119886 -120281 -144771 -118053 -164191 -103297
8426 -103297 -118913 -127470 -148025 -122897 -147955 -113597 -130224 -115759 -129248 -116818 -128263 -98982
8414 -98982 -124671 -128747 -99094 -134010 -154915 -129335 -93844 -120694 -154575 -134349 -132468 -142364
8402a42364J3819j8565J8804q910p74M2592j8915J3214J449k5367J7027l985Q496
8389a03479K4126m3445J171K0481k0506k9675L1631j7348j7057P900Q114J6643
8377a21444j9444J8214O692j2541J33k247J6481K8969j7810J2567Q422l3133j4520
8364a29661J0780q015O297J6582j7017j6603J1707k513J2916l400j4008J1493
8352a21442j6732P328J1316q239O704k7753o850L8847L1253k1957j3610J6618
8340a04517k9149j952l139K3078N660j0388j6217P298J2210k0338L8735o759j9029
8327a24507J52J0635J5710j8886J5128j8164j9410K6065k0482R037J4509J78n4999
8314a65034P5679m5681J8322J542L961j1033P662j0283l5197M3565J7074k6345
$$ plain form
8402 -142364 -128545 -147110 -128306 -137216 -137990 -95398 -114313 -101099 -99650 -125017 -107990 -111975 -103479
8389 -103479 -79353 -122798 -121627 -101146 -121652 -151327 -119696 -137044 -154101 -146201 -138087 -121444
8377 -121444 -140888 -122674 -115982 -128523 -128390 -130637 -114156 -85187 -102997 -90430 -82008 -115141 -129661
8364 -129661 -118881 -126896 -120599 -104017 -121034 -137637 -125930 -128443 -115527 -118927 -132935 -121442
8352 -121442 -138174 -130846 -119530 -127769 -121065 -148818 -155668 -116821 -85568 -107525 -121135 -104517
8340 -104517 -133666 -135618 -138757 -115679 -110019 -120407 -136624 -129326 -117116 -137454 -98719 -105478 -124507
8327 -124507 -124355 -113720 -98010 -116896 -101768 -119932 -139342 -113277 -133759 -124722 -110213 -110035 -165034
8314 -165034 -89355 -135036 -116714 -115172 -111211 -122244 -114582 -124865 -160062 -116497 -99423 -125768
8302a25768J248J2095R993l5250L8871j0169k9394J9469j2778J5454j5054j498
8290a32781k6743L0468L8959n1951J6887j0180K8061k9013J74J8795p264j1847
8278a36435O108K8842J1131l0227j8601P563K4220k4187J9128q113O171j7592
8266a31992j5902J7739j5101K7396k9281J4630J3896m1555L6126j408J427k4101
8254a48126L1665Q527K0805k7905j058K6512l0455j3220j6411K477K413l0655
8242a75431J8571j5354L9143J5532N261j7918j1371j4255L9362o8801j1116M773
8230a91604M8741k3892K2262k756K77J5571j1690J3353Q569n672K2370o808J536
8217a09743k434k3549J0189J1678J0664K170j0705L1255k6493J975j9315j7113
$$ plain form
8302 -125768 -124520 -112425 -102432 -137682 -98811 -108980 -138374 -118905 -131683 -116229 -131283 -132781
8290 -132781 -159524 -129056 -90097 -142048 -125161 -135341 -107280 -136293 -136119 -117324 -124588 -136435
8278 -136435 -130327 -101485 -90354 -120581 -139182 -131619 -107399 -131586 -112458 -120571 -114400 -131992
8266 -131992 -147894 -130155 -145256 -117860 -147141 -132511 -118615 -160170 -124044 -125452 -124025 -148126
8254 -148126 -116461 -107934 -87129 -115034 -116092 -89580 -120035 -133255 -149666 -147189 -144776 -175431
8242 -175431 -156860 -172214 -133071 -117539 -112278 -130196 -141567 -155822 -116460 -185261 -196377 -191604
8230 -191604 -142863 -166755 -144493 -147249 -146972 -131401 -143091 -129738 -121169 -126841 -104471 -111279 -109743
8217 -109743 -112177 -135726 -125537 -113859 -103195 -101025 -111730 -80475 -106968 -104993 -124308 -141421
8205a41421j3479O212J6893M881k5297j6376J7789K9581j0952m1535K6872J2720
8193a34112J0687K86406k28141l839l7214m4503P1050k4253n0665J9354j2555
8182a47785J7649k019J0036p935k0181L3523o434K1003l811j5920K97k0856K8921
8169a13512O850k1778k6819K4809P08p877J1206N883L0055m8824R175J137Q906
8156a20081L283j4835m755N763J7725j4127J7245J4415k8199J0478k9066K7409
8144a14745l516K514k5662J0617L439J5713j5796O933J8238k3353j2490p072K0825
8131a24355K8243k6201j3258M8644l6651J4858l3659L3856l6849n094K8470Q875
8119a13121L95l32o338j0688j4139N9160l7687K9507k6182J8293j8974j2964J2494
$$ plain form
8205 -141421 -154900 -148688 -131795 -126914 -152211 -168587 -150798 -121217 -132169 -173704 -146832 -134112
8193 -134112 -123425 162981 -65160 -68999 -106213 -150716 -79666 -103919 -154584 -135230 -147785
8182 -147785 -130136 -132155 -122119 -130054 -150235 -116712 -123146 -102143 -105954 -121874 -121577 -142433 -113512
8169 -113512 -106662 -128440 -155259 -130450 -129742 -137619 -126413 -120530 -90475 -139299 -130124 -128987 -120081
8156 -120081 -116798 -131633 -136388 -130625 -112900 -127027 -109782 -95367 -123566 -113088 -142154 -114745
8144 -114745 -118261 -115747 -141409 -130792 -127353 -111640 -127436 -120503 -102265 -125618 -138108 -145180 -124355
8131 -124355 -96112 -122313 -135571 -86927 -123578 -108720 -142379 -108523 -145372 -150466 -121996 -113121
8119 -113121 -112726 -113058 -119396 -130084 -144223 -85063 -122750 -93243 -119425 -101132 -120106 -133070 -120576
8106a20576p356J1024k0297j856N4149l9211N059k1119M3694j0495k0080J1821
8094a15243L1501j6548l1111K4582K234J3562j3557J280K2322m3746j0935K8387
8082a07272K6945l8096Q248J6593j137n606j0658j5596O311J9847J1987j8723
8070a07157J3246j4825J3787J3351l4622N736p78K310j4368J5728J1472K06O451
8057h9463j3784J0864l4495P927L8484m2489J9651J1274j8528M208k1393L5858
8045i1886L153j0883j5105q552L0836m3787L5892k2147J1942N830J1506j7301
8033a10502j0153J7796K3001k2097K3749l1510L4567m9776K2054r820J6149j8553
8021a15095j3406K8563J3544p455R525j89l0932J2372j2988L8342Q12k3441J8973
$$ plain form
8106 -120576 -127932 -116908 -137205 -139061 -84912 -124123 -119064 -140183 -96489 -106984 -127064 -115243
8094 -115243 -83742 -100290 -131401 -106819 -104585 -91023 -104580 -103300 -80978 -124724 -135659 -107272
8082 -107272 -80327 -118423 -110175 -93582 -94719 -100325 -110983 -126579 -120268 -100421 -88434 -107157
8070 -107157 -93911 -108736 -94949 -81598 -116220 -110484 -111262 -108952 -123320 -107592 -96120 -95914 -89463
8057 -89463 -103247 -92383 -126878 -118951 -80467 -122956 -103305 -92031 -110559 -106351 -127744 -91886
8045 -91886 -88733 -99616 -114721 -123273 -92437 -136224 -100332 -122479 -110537 -104707 -93201 -110502
8033 -110502 -120655 -102859 -79858 -101955 -78206 -109716 -75149 -124925 -102871 -112691 -96542 -115095
8021 -115095 -128501 -99938 -86394 -93849 -84324 -84513 -115445 -103073 -116061 -77719 -76907 -100348 -81375
8008h1375p26k2895J5857J4033m1547J0088J5633j8432K6187m3866K2824L538
7996a00681M549K6054l895j6950l5478M1436k772q871j0030L3553k1138J2329
7984h1894J1045p273j0569L758R750k607n394m255k9869J813J3510o479K0153
7971h8311l519k3846J1046M2762l3160r761J0935Q120Q241m071J63j3634R843
7958h5192J0646k2413L2794j3986N288j8116k86j9687K849n044J751M6902m1922
7945a06416J5556j5422J4686o343J6247l4066J2656n418o69N292M628Q200Q168
7932h2901n622J7273L457n1710J7742K0445k7336o154K3671O184J4752k0976j0225
7919a01400J2371l0397M091K9321K1624k6116m8089M9666k6491J2252m0896L1366
$$ plain form
8008 -81375 -82101 -104996 -89139 -75106 -116653 -106565 -90932 -109364 -83177 -127043 -104219 -100681
7996 -100681 -96132 -70078 -73973 -90923 -126401 -84965 -87737 -96608 -106638 -73085 -94223 -81894
7984 -81894 -70849 -78122 -88691 -84933 -75183 -77790 -83184 -87439 -117308 -115495 -101985 -108464 -88311
7971 -88311 -91830 -115676 -104630 -61868 -95028 -104789 -93854 -85734 -77493 -81564 -81401 -95035 -85192
7958 -85192 -74546 -96959 -64165 -78151 -72863 -90979 -91265 -110952 -108103 -113147 -111396 -64494 -106416
7945 -106416 -90860 -106282 -91596 -97939 -81692 -115758 -103102 -108520 -109189 -103897 -99269 -91069 -82901
7932 -82901 -88523 -71250 -67793 -119503 -101761 -81316 -108652 -114806 -91135 -84951 -70199 -91175 -101400
7919 -101400 -89029 -119426 -115335 -86014 -64390 -90506 -138595 -88929 -115420 -103168 -144064 -112698
7907a12698J2064k7100J2582J3553p203k0138L675M4760j8716Q851k1459J7477
7895i4352o694J6278m6601J3517N150J7897j2479j8098L1863n420r649j4338K7779
7882i5147N59k5431L235K864J5133M433j8658N6599k8873m1995K1832l018J2466
7869i6001o231q712J7737k8084K0930R479j8571l796L5710l983j1942j056k2177
7856a16697K1801p05m170L416j5879N2862j12632l3577P4558k8456K8759L7961
7844i2759o220l8631J8874J839n988k716J6647K2753j8547j4379J0736k230L614
7831a07007j4445J8328k6243L4773L008p114j7919J1174Q834M021k7689J1025
7819a09254K4809k5352J6602j0801p249L3845k9762J2639r008j5190J0792M3192
$$ plain form
7907 -112698 -100634 -127734 -115152 -101599 -108802 -128940 -125265 -80505 -99221 -90370 -111829 -94352
7895 -94352 -101046 -84768 -131369 -117852 -112702 -94805 -107284 -125382 -93519 -98939 -108588 -122926 -95147
7882 -95147 -94588 -120019 -116784 -113920 -98787 -94354 -113012 -56413 -85286 -127281 -105449 -108467 -96001
7869 -96001 -102232 -110944 -93207 -121291 -100361 -90882 -109453 -113249 -77539 -81522 -93464 -94520 -116697
7856 -116697 -94896 -95601 -99771 -96355 -112234 -59372 -172004 -205581 -131023 -159479 -130720 -92759
7844 -92759 -98979 -137610 -118736 -116897 -122885 -125601 -108954 -86201 -104748 -119127 -108391 -110621 -107007
7831 -107007 -121452 -103124 -129367 -94594 -91586 -98700 -116619 -105445 -96611 -92590 -120279 -109254
7819 -109254 -84445 -109797 -93195 -103996 -111245 -77400 -107162 -94523 -103531 -118721 -107929 -64737
7807f4737k3730J5794k7261P847K0382k9272M187L409J5647k0444L130j933K494
7794i4487j3135N2595m6480q968L1878n081k3052L0182l3156r34J846K0537p977
7781i6232P379K2396j0203j9809m554j9017M7306j494n393j1689k8849K5479J2335
7768h2345J8747o208m2943j5257L8081l412r351L1350J198k6291J6068K936p298
7755h4725Q324J077j8045j4498J2072N840K5288R386l1040J5124j290l7554K2172
7742h7869K796k0917j3994K5803P036k9232M3025l2738J5366P176O528j2523k2159
7729a11702J765M1245j5164l0219J1188K1252J935J2000k1418O666j0604j4650
7717a07706J0570L922L484J4389q590J1164r107k2034J4639l64K1898l4848P670
$$ plain form
7807 -64737 -88467 -72673 -99934 -92087 -71705 -100977 -96790 -93381 -77734 -98178 -95048 -96981 -94487
7794 -94487 -107622 -55027 -101507 -110475 -78597 -83678 -106730 -76548 -109704 -110638 -108792 -88255 -96232
7781 -96232 -88853 -66457 -76660 -96469 -101023 -120040 -72734 -74228 -79621 -91310 -120159 -94680 -82345
7768 -82345 -63598 -69806 -112749 -128006 -89925 -93337 -102688 -71338 -70140 -96431 -80363 -77427 -84725
7755 -84725 -76401 -75324 -93369 -107867 -95795 -89955 -64667 -55281 -86321 -71197 -72487 -110041 -87869
7742 -87869 -85073 -105990 -119984 -94181 -87145 -116377 -73352 -106090 -90724 -83548 -77020 -89543 -111702
7729 -111702 -109937 -68692 -83856 -114075 -102887 -81635 -79700 -67700 -89118 -82452 -93056 -107706
7717 -107706 -97136 -93214 -89730 -75341 -83931 -72767 -81874 -103908 -89269 -89633 -67735 -102583 -94913
7704i4913R224j1724k0093M1589M003l1708K214j306Q920K1053k6202J5675j9452
7691a02720J6867l265R481J7666l9387R062M262m87r13o446L926J2161k5416M3233
7677f1976m1717J5650J7462r032k1375L14N433Q071K9336q929j9407M7424n5223
7664i3969m809J7873N181m2139K7729j293j7509J4954P440j4946j943q518L18
7651a11631K6632M242k1571J0642J2742j8160j7734L7802P628J5685l3885k971
7639i0579N6556n7358M882P910K7265l2193J275j91K978l099N167J7298j4154
7626g4243m3275K8697K4837l4900N222J0061L0456k6538j039J6458k7086k057
7614i3407R762N637k634k3991K5171J2294l4075J9871K354M250j8517k2837J2364
$$ plain form
7704 -94913 -85689 -97413 -117506 -75917 -71914 -103622 -101408 -102714 -93794 -72741 -98943 -83268 -102720
7691 -102720 -85853 -89118 -79637 -61971 -101358 -92296 -88034 -88521 -89434 -95880 -91954 -79793 -105209 -61976
7677 -61976 -103693 -88043 -70581 -79613 -100988 -100674 -95241 -87170 -57834 -66763 -86170 -38746 -93969
7664 -93969 -98778 -80905 -75724 -117863 -90134 -91427 -108936 -93982 -86542 -101488 -103431 -111949 -111631
7651 -111631 -84999 -80757 -102328 -91686 -78944 -97104 -114838 -77036 -69408 -53723 -87608 -90579
7639 -90579 -34023 -91381 -86499 -78589 -51324 -83517 -82242 -82433 -79455 -82554 -77387 -60089 -74243
7626 -74243 -117518 -88821 -63984 -98884 -93662 -83601 -53145 -79683 -80722 -64264 -91350 -93407
7614 -93407 -83645 -78008 -80642 -104633 -79462 -67168 -101243 -81372 -79018 -74768 -93285 -116122 -103758
7601a03758J6351j3763K097O4226m0309l5175L2264m540l214m194K0202l0792
7589a00605R556p668J199L4149j6791J1396N506K6586n4041L1630J036o35L515
7576e5167k8100K3513j2947j6751K3766p05j658p50R065k3953k826J9839q641
7563g5315R049P14m850k7332L6713n562k1180L5191l0408l613J7954j6694J5570
7550f9763n210L556l182K1545k2813q860k247J5391r207J8494r312l81m0212R462
7536a02739O1094k484l8474J2753J28q988q733m89L136J756J2181k2252M2172
7523e0939k6682K9325M060K3449m4396K4137P37J1099K6264l125J364l7103J208
7510d0602M6696r264k4526K8600N6051K2080k0649J1098K0223o763l4236r555
$$ plain form
7601 -103758 -87407 -101170 -99073 -34847 -75156 -110331 -78067 -82607 -85821 -90015 -69813 -100605
7589 -100605 -91049 -98717 -97518 -63369 -80160 -68764 -63258 -36672 -90713 -59083 -58047 -58682 -55167
7576 -55167 -83267 -59754 -72701 -89452 -65686 -66391 -68049 -68799 -59734 -83687 -86513 -66674 -75315
7563 -75315 -66266 -65552 -70402 -97734 -61021 -66583 -87763 -52572 -82980 -86593 -68639 -85333 -69763
7550 -69763 -74973 -71417 -74599 -53054 -75867 -84727 -86974 -71583 -80790 -62296 -71608 -71989 -112201 -102739
7536 -102739 -41645 -44129 -82603 -69850 -69722 -78710 -87443 -87932 -84796 -83040 -70859 -93111 -50939
7523 -50939 -77621 -48296 -44236 -20787 -65183 -41046 -40309 -29210 -2946 -6071 -4707 -41810 -40602
7510 -40602 6094 -3170 -27696 904 56955 79035 58386 69484 89707 82944 48708 39153
7498C9153j839k7394k3852M537K074m2727l2358L9615o774j7925k6725M3732J2677
7485c7806m4735J6130J460J8884l1571k103J9617k6835K0090J9495J40j3574j9155
7472g9963k828L8179k2367J3051J4981l4680L825j5035J5662q427J6646R014J6525
7459c5417q620O0k0606K3590r494k7343M5293p700k0155K6945j2900r31j8044
7446f5322K3477k7025K0853J5414l0732J804k1541J2582O737r292L7847k0335
7434e5533K933k5578J1783L0665j9993K1255j8292O369j3939L4792q204P099P51
7421b5892o331R161j8276N9211l0792p868L173K4535k4809J2061M807j1954J1582
7408a392k9293L288K7810j0085N761n462J1476m3842J3183M9159o7037L4954P04
$$ plain form
7498 39153 37314 9920 -13932 -9395 -7321 -50048 -82406 -42791 -49565 -67490 -94215 -50483 -37806
7485 -37806 -82541 -66411 -64951 -46067 -77638 -79741 -60124 -86959 -66869 -47374 -47234 -60808 -79963
7472 -79963 -82791 -44612 -66979 -53928 -38947 -73627 -69802 -84837 -69175 -77602 -60956 -51942 -35417
7459 -35417 -44037 -43977 -64583 -40993 -50487 -77830 -32537 -40237 -60392 -33447 -46347 -47278 -65322
7446 -65322 -41845 -68870 -48017 -32603 -63335 -61531 -83072 -70490 -63753 -73045 -35198 -55533
7434 -55533 -52600 -78178 -66395 -35730 -55723 -34468 -52760 -46391 -60330 -25538 -33742 -26643 -25892
7421 -25892 -32223 -23062 -41338 17873 -12919 -20787 -17614 6921 -17888 -5827 -1020 -12974 -1392
7408 -1392 -30685 -27397 413 -9672 -3911 -9373 2103 -41739 -28556 20603 -46434 -11480 -10776
7395a0776P245J0519o341j0613M54K637o569l3340L8363j8589M6059j3322k3563
7382a7836O768j117J7218J5862k5639j2938N0089j8291j9992M028r690J9093r801
7369b246k844j0076J5403J1835N750K8325j5715P981L0877j4388o557J9492m97
7356F7340J4895J8719L6200L5870M4843L0451Q9025J31448J70149K45978K85068
7345A169986K28061K58379J55986M8479n7962j27175k14444k30875k07252k08371
7335H14812j61461r5566j00245r1240l9848k0611l910o912j1903m7903J3324o1442
7323A87095o744l4607J980n0840q059j7931k5312j832J395J5889l6327n1275P2540
7310D5972j2609n0332J3899J7372J4769l7343Q265K2710l591k3302J5223Q840
$$ plain form
7395 -10776 -3531 6988 647 -9966 -9512 -6875 -13444 -46784 -8421 -27010 19049 5727 -17836
7382 -17836 -11068 -12185 5033 20895 -4744 -17682 32407 14116 -5876 -1848 -11538 7555 -2246
7369 -2246 -5090 -15166 237 12072 17822 46147 30432 38413 69290 54902 48345 67837 67340
7356 67340 82235 100954 137154 173024 217867 248318 337343 468791 638940 884918 1169986
7345 1169986 1398047 1656426 1812412 1860891 1802929 1675754 1461310 1230435 1023183 814812
7335 814812 653351 557785 457540 366300 326452 305841 301931 295019 283116 235213 248537 187095
7323 187095 180351 145744 147724 96884 88825 70894 45582 43750 45145 61034 24707 -26568 45972
7310 45972 33363 -16969 -3070 14302 29071 -8272 -7 22703 19112 -4190 11033 19873
7298A9873k8149k1066o184J2766J6861l7299M0266R97k8440Q367O6l434J3352
7285a2024m372Q687m1704K0801O084L1881m4573j3596K733M9732k8333j5047O414
7272c3317p998k3656L7948K4316m8786J9142j817M782O450K471j0694O612N209
7259a9338k0714j1593L3198k9497K734L2389k2957o614q683L916K1364k5357J9298
7246c1854K355N744k5232L3732k6052J4078j4373m508K0201k1625j0323L2188
7234b5669j6969j164m141J7568O907j6878j5590L7743Q328j6499R698j5802K0288
7221a2180r986M109n179j4746j9188K0833J1183K0031j2677k9610p482J9678m138
7208c9352Q115M3048k9959j2203j5216K2493l1075K2953l3208K4908J5206l128
$$ plain form
7298 19873 -8276 -29342 -35526 -22760 -5899 -43198 -2932 -1935 -30375 -22008 -21942 -25376 -12024
7285 -12024 -16396 -7709 -49413 -28612 -22528 9353 -35220 -48816 -46083 3649 -24684 -39731 -33317
7272 -33317 -41315 -64971 -27023 -2707 -51493 -32351 -34168 -29386 -22936 -20465 -31159 -24547 -19338
7259 -19338 -40052 -51645 -18447 -47944 -45210 -12821 -35778 -42392 -51075 -47159 -25795 -51152 -31854
7246 -31854 -29499 -23755 -48987 -15255 -41307 -27229 -41602 -46110 -25909 -47534 -57857 -25669
7234 -25669 -42638 -43802 -47943 -30375 -23468 -40346 -55936 -18193 -9865 -26364 -16666 -32468 -12180
7221 -12180 -22166 -18057 -23236 -37982 -57170 -36337 -25154 -5123 -17800 -47410 -54892 -35214 -39352
7208 -39352 -31237 11811 -18148 -30351 -45567 -23074 -54149 -31196 -64404 -39496 -24290 -27418
7196b7418J7940J2096j403k2202j150k3433j764N6082j5424J411l7614K1088J7457
7183d334j2814j315O699J5484n4638K8220K703k849k9308J6695K8199j7212j5250
7170c9720K3146J348J8754m1329J5637j856O709N479J1437K2940k6312O118J5553
7157A7904K3252M598J7392K0860O258J8003O228J8049k2539K696J5082l8480P56
7144I0059j4445J3109K8404n8116k4932L1093m68K4833J2448K3232M502q2806
7132D6913M0864j5411j2438j2568k3981J1186l8294j9595M0909j4227N737j7138
7120h043J4864n600j7970K3855R731j1772j3880J5305j5396k142L0231r450J402
7107A1135l585p361o584M0131j1139k6331K1892j8630j4955K2087K5100k5050
$$ plain form
7196 -27418 -9478 2618 1215 -20987 -22137 -45570 -47334 8748 -6676 -5265 -42879 -21791 -4334
7183 -4334 -17148 -18463 -11764 3720 -50918 -22698 -19995 -22844 -52152 -35457 -7258 -24470 -39720
7170 -39720 -16574 -15226 3528 -37801 -22164 -24020 -17311 -11832 -395 22545 -3767 2351 17904
7157 17904 41156 45754 63146 84006 90264 108267 114495 132544 110005 112701 127783 89303 90059
7144 90059 75614 88723 117127 59011 34079 65172 64704 89537 101985 125217 129719 46913
7132 46913 87777 72366 59928 47360 23379 34565 -3729 -23324 17585 3358 9095 -8043
7120 -8043 6821 1221 -16749 7106 16837 5065 -8815 6490 -8906 -11048 19183 9733 11135
7107 11135 7550 189 -6395 33736 22597 -3734 18158 -472 -15427 6660 31760 6710
7095F710j4045K8109j6092K6564l1517K4735k0542k095j1214K6342O73k6432K9991
7082B1187l7365M1516j2247j8778J4390Q832k7410J3395J8391j8151J1208N147
7070B0115L192N542K1572l3995J0262l6331m221M433K9561Q23k0179J7232k7260
7057i254K9552N219j2982J155J9627k8292J0342j0341N488K6969j4493K7091k6963
7044B3118J1735j9814m350L2432j6435J599j924N2189k9889L631m8878N6189k1691
7031C7912J3430j8829p746L1237J2423k2681K1077k3111K7343r517J8544M772
7019H4854Q078J5288L7651N6658L8662P403N4340K9597l0438j754k3188n4843
7007B22308k0567l5344l0533j5798K9380m821m9719L2508l2813l02L5092k74j0058
$$ plain form
7095 6710 -7335 20774 4682 31246 -271 24464 3922 1827 -9387 16955 17628 -8804 21187
7082 21187 -16178 25338 13091 -5687 8703 17535 -9875 3520 21911 3760 14968 20115
7070 20115 23307 28849 50421 16426 26688 -9643 -13864 -9431 20130 20953 774 18006 -9254
7057 -9254 20298 25517 12535 13690 33317 5025 15367 5026 10514 37483 22990 50081 23118
7044 23118 34853 15039 10689 43121 26686 28285 26361 78550 48661 52292 3414 59603 37912
7031 37912 51342 32513 24767 56004 68427 45746 66823 43712 71055 61538 80082 84854
7019 84854 92932 108220 145871 202529 241191 248594 302934 332531 302093 300339 277151 222308
7007 222308 201741 166397 135864 120066 149446 144625 94906 127414 94601 94299 129391 129117 119059
6994A19059j157P019R048k7599K4353k6932K3770N866M055q323K5504j7371J9153
6981A56445J6961k8267J145K7793J0108j0830J7421q314L1256J4211L7713N7450
6969C23092N5950j9581N1516J9760p729J5441N963K6216q564L5427O3128Q1860
6957F42479Q0042J71789K56488K99005L75425K62772J39315n30q1441j93525k22742
6946A729077j89871j41976p7676r3818k9687n6422j8126q0752o2207Q331j9748
6935I67125J423N3663R6087J46943K44498L44827O34477P01276O63588L85486
6925D239393P5456r5842l38235m77725m94136m23403m12670k87469k25174j43723
6915A416472j24487j20700q1878j4080n4317o2201N58l3840M6763R6035J11393
$$ plain form
6994 119059 117902 124921 133969 106370 130723 103791 127561 133427 137482 129159 154663 137292 156445
6981 156445 173406 145139 146284 174077 184185 173355 190776 182462 213718 227929 265642 323092
6969 323092 379042 359461 410977 430737 423008 438449 444412 470628 462064 497491 560619 642479
6957 642479 722521 894310 1150798 1449803 1825228 2088000 2227315 2226785 2145344 1951819 1729077
6946 1729077 1539206 1397230 1319554 1225736 1196049 1139627 1121501 1040749 978542 986873 967125
6935 967125 968548 1022211 1118298 1265241 1509739 1854566 2489043 3190319 3853907 4239393
6925 4239393 4314849 4219007 3880772 3403047 2908911 2485508 2072838 1785369 1560195 1416472
6915 1416472 1291985 1171285 1089407 1075327 1021010 958809 959367 925527 972290 1068325 1179718
6904A179718K25218L31401L42582K49745J12922k1639j36098k15164k67222k75813
6894A525650k34953k22303j43645j01145q6795o8337n4229n160k9046l592j9693
6883E56752K8622m868k9695K871m0078Q14k6540l2206j9617l0559k2938k0466
6871C62092L7630o6339l9095j7118J0299P273m5520K517J6759J4923r855k8566
6859B45000q47r83n4M1020j9994M206j0210L5520l3316N811l013K1362n8507J4870
6845B40865K5486k9468J327k1202k2075r332R80J8810j4172K9256j9079R098J6415
6832B26909K4351n085K0320l4629k308P654r585k2153J6557k7216K3658k1113
6820A97360N074Q927K0587k5150j0778L9156n0854L2296j3219J8767r547j4272
$$ plain form
6904 1179718 1404936 1736337 2078919 2328664 2441586 2419947 2283849 2068685 1801463 1525650
6894 1525650 1290697 1068394 924749 823604 736809 668472 614243 609083 580037 576445 556752
6883 556752 585374 580506 550811 553682 513604 514418 487878 455672 436055 405496 382558 362092
6871 362092 399722 333383 294288 277170 287469 294742 249222 251739 268498 283421 273566 245000
6859 245000 244153 243170 243116 284136 264142 268348 258138 293658 260342 266153 263140 284502 225995 240865
6845 240865 266351 236883 238210 217008 194933 185601 186581 205391 191219 220475 201396 210494 226909
6832 226909 251260 246175 266495 231866 229558 237212 227627 205474 222031 194815 218473 197360
6820 197360 202434 211361 231948 206798 196020 235176 184322 216618 203399 222166 212619 198347
6808A98347P564M087n168K4904J7379j5539k6480J665L1963N1433J2255K6807
6796C29217L7285n891R365M044j567l4875o580m0197k146q553M293Q612j5735
6783B77272K3921l4197K964K5361O255j8365k2083L287k7309J3414J4997r486
6771B56031L54j8511J0273k0714K4420j3724M8626J9300K6407N2228O3773j6627
6759D31836J2333j4396P945o6386m3222N127k2692k9741J9334l6726j0850j1036
6747B41526RJ3862J1364Q109K9247J9375M8710K7555N1338K3929L9060j296J4400
6734E27188j7035O8987N3009Q2545M3768M2804L0977q016P681o5655m2640m1218
6722F82395n7241o8268j3733o2206j1691k0585J9644k1781J5136r353m762q884
$$ plain form
6808 198347 205911 209998 204830 229734 247113 231574 205094 206759 238722 290155 302410 329217
6796 329217 366502 360611 369976 374020 372453 337578 330998 290801 288655 280102 284395 293007 277272
6783 277272 301193 266996 269960 295321 301576 283211 261128 264415 237106 250520 265517 256031
6771 256031 256385 237874 248147 227433 251853 238129 286755 306055 332462 384690 448463 431836
6759 431836 444169 429773 437718 371332 328110 333237 310545 280804 300138 263412 252562 241526
6747 241526 241535 255397 266761 274870 304117 323492 372202 399757 451095 475024 514084 512788 527188
6734 527188 510153 579140 632149 714694 758462 801266 832243 824227 831908 766253 723613 682395
6722 682395 625154 556886 543153 480947 469256 448671 468315 446534 461670 452317 447555 438671
6710D38671j1181J6613K9699N3327P6019Q3691J08027J06449M0238L6886j7584
6699I60855n511j1670n5516l6291n4062o1073l4960o227j6618n0637K6171j2647
6687F41814J3443r469K0155K2835J8107l3788L6508O1170J2919P0056k916r825
6675H41009m2069l3317o0964k5358m1611j3892m1390l7227R484j0387k9277k1776
6663D93225J6281q055N630L2509N6962L0440p844j0058J8404L9919L1005R369
6651G07787L5745r512l1240J7522J251k5589J728l890K2575k179K710K2583j8257
6638G21234M922p749j6466M5604L8168K4346K5260M5094P682O5251L2329O0126
6626A045801J7623j2822n1035l3458p5275n4932o5519o6261k0969m6055p964l8709
$$ plain form
6710 438671 427490 444103 473802 527129 603148 686839 794866 901315 941553 978439 960855
6699 960855 955344 943674 888158 851867 797805 736732 701772 695545 678927 628290 654461 641814
6687 641814 655257 645788 665943 688778 706885 673097 709605 770775 783694 853750 850834 841009
6675 841009 798940 765623 704659 679301 637690 623798 582408 545181 554665 544278 515001 493225
6663 493225 509506 501451 507081 539590 596552 626992 619148 609090 627494 667413 698418 707787
6651 707787 743532 734020 702780 720302 721553 695964 697692 693802 716377 714198 716908 739491 721234
6638 721234 726156 718407 701941 747545 785713 810059 835319 880413 888095 953346 985675 1045801
6626 1045801 1063424 1050602 999567 966109 890834 835902 770383 704122 683153 637098 629134 590425
6614E90425K2888l2200M7599K3859L1268N5549P1987O4762J01528N1741K4551
6603A053957J7922K6117k8646l1087k8924p4125l5026n0753k4691j6309n552K4816
6591H27699M7516L2780M4923O7502J50931J48292K68614K53062K00686J22302
6581B164307n862k6600j47887j52380j90803j48861j36322j18767r3500n5601
6571A087724m3717k3530j8083l9896J3618j1555j3073l379k2361k272m7722j049
6559H74705k9608J7691q495l0958M0496M8516N457l3808K2870j9215K6536m090
6547I10097L6964M10k945k9316K7367N987q472J7782M572m1701q537k9668j818
6534H80722Q969j5573K5284R670j8717L2925L4674M954J5522L3720m2394M1152
$$ plain form
6614 590425 613313 581113 628712 652571 683839 739388 811375 876137 977665 1029406 1053957
6603 1053957 1071879 1097996 1069350 1038263 1009339 935214 900188 849435 824744 808435 802883 827699
6591 827699 875215 907995 952918 1020420 1171351 1319643 1588257 1841319 2042005 2164307
6581 2164307 2158445 2131845 1983958 1831578 1640775 1491914 1355592 1236825 1143325 1087724
6571 1087724 1044007 1020477 1002394 962498 976116 964561 951488 948109 925748 923476 875754 874705
6559 874705 845097 862788 854293 823335 863831 912347 917804 883996 906866 887651 914187 910097
6547 910097 947061 947471 944526 915210 942577 948564 940092 957874 962446 920745 912208 882540 880722
6534 880722 889691 874118 899402 909072 890355 923280 957954 962908 978430 1012150 969756 1010908
6522A010908n3076Q3558N2636l2426k6300J0221J8006j0684j513M0083L5550n1598
6510A075365j2437J0627r615N264P051n711R017j0253K2999L1393k5256K5854
6498A124298J4962k3675Q414o511N4285j3081j6729J1816l596j8785j9098J9243
6486A131543Q199k8826m342j3570J6882R974j4718K0076J5435j6403L9429L6917
6474A200596n880k5944O939M1912Q400K2701L9644L5954L1480Q790K3829K7969
6462A416390L4132K225L643M9465j6121J7695K7669J6851N604N60K9007L9580
6450A626700l214L5482K8728L0961L9507L0030K2569M6370M4576L4779M2269L6724
6438B015481O3676N6997R5088m189O4836K9914J8772L6814M4020j114Q6447J3685
$$ plain form
6522 1010908 957832 1041390 1094026 1061600 1035300 1045521 1063527 1052843 1051330 1091413 1126963 1075365
6510 1075365 1062928 1073555 1063940 1069204 1076255 1070544 1079561 1069308 1092307 1123700 1098444 1124298
6498 1124298 1139260 1115585 1123999 1117488 1171773 1158692 1141963 1153779 1150183 1131398 1112300 1131543
6486 1131543 1139742 1110916 1106574 1093004 1109886 1119860 1105142 1125218 1140653 1124250 1163679 1200596
6474 1200596 1194716 1168772 1175711 1217623 1226023 1248724 1288368 1324322 1355802 1364592 1388421 1416390
6462 1416390 1450522 1452747 1456390 1505855 1489734 1507429 1535098 1551949 1557553 1558113 1587120 1626700
6450 1626700 1623486 1658968 1687696 1718657 1758164 1788194 1810763 1857133 1901709 1936488 1978757 2015481
6438 2015481 2079157 2136154 2231242 2227053 2291889 2321803 2340575 2377389 2421409 2420295 2506742 2520427
6426B520427L9178O2838R100L0661K6433O7027K5947M1763N6204O8112M0818M0892
6414C029400R3003J4870N8219N1132R8913J24565J02825J44484J95795K27335
6404D140541K09726K11429K18116J97079J92584J28273O3107J207n9719p1983
6394E230360m4466l8840j7701K4305Q2804O0512J01726Q8591Q0299P5020J16742
6383E759352J03572R8249J85227J39519J47512J59339J44095J94961J57443J68711
6373G257980J38951J62774J79536J65135J80689K48579K66897L15438L87958M69285
6363I773222N67414O53255O94388P59665Q51546R68840J191817J487514J928144
6354A8875805K591348L827433O002209R078504J1340992J0732466O593979K305920
$$ plain form
6426 2520427 2559605 2622443 2631543 2662204 2688637 2755664 2781611 2823374 2879578 2947690 2988508 3029400
6414 3029400 3122403 3137273 3195492 3246624 3345537 3470102 3572927 3717411 3913206 4140541
6404 4140541 4350267 4561696 4779812 4976891 5169475 5297748 5360855 5362062 5302343 5230360
6394 5230360 5185894 5147054 5129353 5153658 5236462 5296974 5398700 5487291 5567590 5642610 5759352
6383 5759352 5862924 5961173 6146400 6285919 6433431 6592770 6736865 6931826 7089269 7257980
6373 7257980 7396931 7559705 7739241 7904376 8085065 8333644 8600541 8915979 9303937 9773222
6363 9773222 10340636 10993891 11688279 12447944 13299490 14268330 15460147 16947661 18875805
6354 18875805 21467153 25294586 31296795 40375299 51716291 62448757 69042736 71348656
6346G1348656q29884m038400o010786o336772n899378m952576l741795k425371
6338C7113694j126229p5130J000906K315899M075956O282398Q686041J1383275
6330F9656810J4092607J5488719J4738182J2085669Q740307O165663N418047Q894251
6322A55280255J6891199K6143689L0830880K6561948J5835376J652655j2087846
6315B61108156k2960101k9437088l0261697k7615866k2615542j6133058q917317
6308A03167487k214888K166465K127451j494553m936932p537919r826587j0642138
6300G0808386r961707q756373p303637n801101m334084l181427k418414j958409
6292B7093234j623342j461812j399404j262649j204701j062203r92606q53064
$$ plain form
6346 71348656 70518772 66480372 60469586 54132814 48233436 43280860 39539065 37113694
6338 37113694 35987465 35912335 36913241 39229140 43305096 49587494 58273535 69656810
6330 69656810 83749417 99238136 113976318 126061987 134802294 140967957 146386004 155280255
6322 155280255 172171454 198315143 229146023 255707971 271543347 273196002 261108156
6315 261108156 238148055 208710967 178449270 150833404 128217862 112084804 103167487
6308 103167487 100952599 103119064 105246515 103751962 98815030 91277111 81450524 70808386
6300 70808386 60846679 52090306 44786669 38985568 34651484 31470057 29051643 27093234
6292 27093234 25469892 24008080 22608676 21346027 20141326 19079123 18086517 17233453
6284A7233453p48158o42084n88121m65467l83251m29309l77793l65187l48753
6275A2885330l33451k89373k48071k23760k30960k06928k72192k57134l37158
6266A0486303l25904l39369l67072l15337k74316k61302k62705k28240k17045
6257G895013j66085j85077j32933j52223p3345q0719o2819q3839q8809j45837
6247F723327j39438j80922j64889j46317j19062o1399L8217M4546R5545P0459
6237F160067J8871r1303j06619j68865k16014j96951k17137j85859j18992j52647
6227D724551p9808l4824q4166l1982o8700j03558j13990j13913j31881r9365j45682
6216C716682m8584q3535j04168o2331m2924n6629n5842n4306n2535r848q3915
$$ plain form
6284 17233453 16485295 15843211 15255090 14789623 14406372 13977063 13599270 13234083 12885330
6275 12885330 12551879 12262506 12014435 11790675 11559715 11352787 11080595 10823461 10486303
6266 10486303 10160399 9821030 9453958 9138621 8864305 8603003 8340298 8112058 7895013
6257 7895013 7728928 7543851 7410918 7258695 7185350 7104631 7041812 6957973 6869164 6723327
6247 6723327 6583889 6402967 6238078 6091761 5972699 5911300 5949517 5994063 6089608 6160067
6237 6160067 6178938 6087635 5981016 5812151 5596137 5399186 5182049 4996190 4877198 4724551
6227 4724551 4644743 4609919 4525753 4493771 4425071 4321513 4207523 4093610 3961729 3862364 3716682
6216 3716682 3668098 3584563 3480395 3418064 3375140 3318511 3262669 3208363 3155828 3145980 3062065
6205C062065k4637l091p1526o4566q941n4626n6320p5723m4662j2022m8395n5267
6193B542289N936J254l1704k8426J6806o470k8111L46n3828k6143o4108k9006
6181B298835j0931j9475m2103m833m354m7892j1143k388l4182q004J8683j9561
6169B112652n494k0946l3k3628m304K9576J2937n404j2049J8238M9651R6284N1628
6156B299108J36072J25647J56722J43191J30770R9898q651o752n0407q6894j22830
6145B815874r1919p6708k5284m2453K8937J07799J09304N552L9722l2778n2104
6134B785942j33850r0325j04583j29208r5989o6392o0772l7745r574m0957k2897
6123A993650j1166l3375j8734k7277L198R099J0840N786J741K9312L0666j4309
$$ plain form
6205 3062065 3037428 3034337 2962811 2898245 2889304 2834678 2778358 2702635 2657973 2645951 2597556 2542289
6193 2542289 2548225 2549479 2517775 2489349 2506155 2499685 2471574 2471920 2418092 2391949 2327841 2298835
6181 2298835 2287904 2268429 2226326 2221493 2217139 2169247 2158104 2155716 2121534 2113530 2132213 2112652
6169 2112652 2107158 2086212 2086179 2062551 2058247 2087823 2100760 2095356 2083307 2101545 2151196 2247480 2299108
6156 2299108 2435180 2560827 2717549 2860740 2991510 3091408 3082757 3076005 3025598 2938704 2815874
6145 2815874 2723955 2647247 2621963 2579510 2608447 2716246 2825550 2831102 2870824 2838046 2785942
6134 2785942 2652092 2561767 2457184 2327976 2231987 2165595 2104823 2067078 2057504 2016547 1993650
6123 1993650 1982484 1949109 1930375 1903098 1906296 1915395 1926235 1932021 1933762 1963074 1993740 1979431
6111A979431p11m4025n8606l7118j6587n7807k2379k0619j8908K418m1860L9240
6099A702469k3050M0331j1528j0724j2423J933q047j6215K2161j1476N450O750
6087A685631K7788K9876J1527L6855k9815L5967l0143k2647M1329k1475m859r140
6075A750894P6022O603L8489m3308O2629l943O8461M6956R5601K4571O709K5412
6063B155096K1830l6869r62K9823o429M3482N4539O4176J61284J65800K14515
6052B866285J99474J78856J56346M5100J2578l5409q9135n7606r3845q9557j02931
6041B990156j03120o1266r3726r0482l5355l5757k4025J1969m507M3568O681k0849
6029B583287M6323J2467M7837N7811L9610R9803M6565K644P335n682n0839K7745
$$ plain form
6111 1979431 1978720 1934695 1876089 1838971 1822384 1764577 1742198 1721579 1702671 1705089 1663229 1702469
6099 1702469 1679419 1719750 1708222 1697498 1685075 1687008 1678961 1662746 1684907 1673431 1678881 1685631
6087 1685631 1713419 1743295 1754822 1791677 1761862 1797829 1767686 1745039 1786368 1764893 1760034 1750894
6075 1750894 1826916 1833519 1872008 1828700 1891329 1887386 1955847 2002803 2098404 2122975 2129684 2155096
6063 2155096 2176926 2140057 2139095 2168918 2162489 2205971 2260510 2324686 2485970 2651770 2866285
6052 2866285 3065759 3244615 3400961 3446061 3458639 3423230 3334095 3276489 3182644 3093087 2990156
6041 2990156 2887036 2825770 2732044 2641562 2606207 2570450 2546425 2558394 2553887 2597455 2604136 2583287
6029 2583287 2629610 2642077 2689914 2747725 2787335 2887138 2933703 2936347 2943682 2938000 2887161 2914906
6017B914906n4694J2507j6537L5057l2939P4222J3461j3N3046K2546M9044K8763
6005C099369M7653j6912O2490Q680L4316K5970J8035N1443J4393N4787K6564L3725
5993C460513L0460L5191J8383O3016L6497L5595N9585O3107M0957O7684L7294
5982C948282J00468M5434K6126P2365J4136R1316M7163L8214P2220O8357K0629
5971D544710P4655R0604L6054J06356O5113O4158R4254L9394J21470N5910Q9984
5960E382662P7089J25873J02068J09785J49275J23396J35578J95755K43513K68382
5950F913376K34835K65523K28348J70862N1385N3574p122k3923P21N732L6481
5939G929792O6325O9503O4864J45094J09060J48190J31710J85501J10320J75705
$$ plain form
6017 2914906 2860212 2872719 2856182 2891239 2858300 2932522 2945983 2945970 2999016 3021562 3070606 3099369
6005 3099369 3147022 3130110 3192600 3201280 3235596 3261566 3279601 3331044 3345437 3400224 3426788 3460513
5993 3460513 3490973 3526164 3544547 3607563 3644060 3679655 3739240 3802347 3843304 3910988 3948282
5982 3948282 4048750 4094184 4120310 4192675 4206811 4298127 4345290 4383504 4455724 4524081 4544710
5971 4544710 4619365 4709969 4746023 4852379 4917492 4981650 5075904 5115298 5236768 5292678 5382662
5960 5382662 5459751 5585624 5687692 5797477 5946752 6070148 6205726 6401481 6644994 6913376
5950 6913376 7148211 7413734 7642082 7812944 7864329 7917903 7910781 7886858 7887579 7893311 7929792
5939 7929792 7996117 8065620 8130484 8275578 8384638 8532828 8664538 8850039 8960359 9136064
5929I136064J76209J69280J63162K36904J46733K03788K07228J97369K15616K40637
5919A1092990K23553K48907K49015K41534K44518K84851K26810K90018K53870
5910A3356066L12349K93526L29341L24530L12728L51535L32743L34251L84891
5901A6331960M21219M19421M37744M86792N21756N25897N51190N49984M96278
5892B0742241M59862M35805M53273L87629M09157M05284L96639L89822L97695
5883B4477407M04552M48621M59468M65475M38593M71788M35941M88398M23534
5874B8513777M45118M40083M35183L83397M01585L90202M08214L53980L20307
5865C2091846K41949K01987J68503J09871N1134J7448l148n7000n0492j22978
$$ plain form
5929 9136064 9312273 9481553 9644715 9881619 10028352 10232140 10439368 10636737 10852353 11092990
5919 11092990 11316543 11565450 11814465 12055999 12300517 12585368 12812178 13102196 13356066
5910 13356066 13668415 13961941 14291282 14615812 14928540 15280075 15612818 15947069 16331960
5901 16331960 16753179 17172600 17610344 18097136 18618892 19144789 19695979 20245963 20742241
5892 20742241 21202103 21637908 22091181 22478810 22887967 23293251 23689890 24079712 24477407
5883 24477407 24881959 25330580 25790048 26255523 26694116 27165904 27601845 28090243 28513777
5874 28513777 28958895 29398978 29834161 30217558 30619143 31009345 31417559 31771539 32091846
5865 32091846 32333795 32535782 32704285 32814156 32865290 32882738 32879590 32822590 32772098 32649120
5855C2649120j35673j58798j65434k12956k61288k72437k97403k91780l51890
5846C0501461l52040l21301l72149l51200m38075l96420m77622m97436m84390
5837B6810828m96375n39998m73257n00148n25579m45931n00126m76359m47617
5828B2405438m77223m52382m48182m29359m56256m38290m07600m07086l99561
5819A8489499l86083l52881l89590l71290l44341l25486l56751l26698l25861
5810A5310518k79604l21009l08687k70775k59640k71855k59452k44073k07341
5801A2888082k71703k38284k33848k11702k36945j93766k00720k07707j69705
5792A0923702j82380k02342j41007j87729j92150j38615j77395j42980j30624
$$ plain form
5855 32649120 32513447 32354649 32189215 31976259 31714971 31442534 31145131 30853351 30501461
5846 30501461 30149421 29828120 29455971 29104771 28666696 28270276 27792654 27295218 26810828
5837 26810828 26314453 25774455 25301198 24801050 24275471 23829540 23329414 22853055 22405438
5828 22405438 21928215 21475833 21027651 20598292 20142036 19703746 19296146 18889060 18489499
5819 18489499 18103416 17750535 17360945 16989655 16645314 16319828 15963077 15636379 15310518
5810 15310518 15030914 14709905 14401218 14130443 13870803 13598948 13339496 13095423 12888082
5801 12888082 12616379 12378095 12144247 11932545 11695600 11501834 11301114 11093407 10923702
5792 10923702 10741322 10538980 10397973 10210244 10018094 9879479 9702084 9559104 9428480
5783I428480j91701j46614j71056j52053j60276k01326j27568j39072r8443j79968
5773G860403j20923j25692j44566j15464j02186r3951q3426j46140j30034p8003
5763F720018j21553j16338q6408j17054q1337r4097o7302n2644p2567m5894n5207
5752E809617p2304o8226o0263m5385l3559n5070j1614r4040q5012J3854p0734
5741E227264l7128k5079o3097j3545n1299q63l6687p1764l656o0723k8453m4173
5729D790797m1706r2088m7497m7319l2171o4560l5486j6788m4062n5835m6578
5718D266707m8222n128l5409l3122J1429l4280o7075l6114o571k1064N0406o529
5706D035028K8240J31850J55278Q3358J2441j6562o3364r3726j07874q3094o9167
$$ plain form
5783 9428480 9236779 9090165 8919109 8767056 8606780 8405454 8277886 8138814 8040371 7860403
5773 7860403 7739480 7613788 7469222 7353758 7251572 7157621 7074195 6928055 6798021 6720018
5763 6720018 6598465 6482127 6395719 6278665 6197328 6103231 6035929 5983285 5910718 5864824 5809617
5752 5809617 5737313 5669087 5608824 5563439 5529880 5474810 5463196 5369156 5284144 5297998 5227264
5741 5227264 5190136 5165057 5101960 5088415 5037116 5036253 4999566 4927802 4924146 4863423 4834970 4790797
5729 4790797 4749091 4657003 4609506 4562187 4530016 4465456 4429970 4413182 4369120 4313285 4266707
5718 4266707 4218485 4213357 4177948 4144826 4156255 4121975 4054900 4018786 4012215 3991151 4041557 4035028
5706 4035028 4063268 4195118 4350396 4433754 4446195 4429633 4366269 4272543 4164669 4081575 4012408
5695D012408q3331k4890l5603l1732J89Q872K2533L7680Q2267J07838J36894J25148
5683D358273J5484L6692k9770m0891m8296l8083n8319q3075o89j6796L3506k6275
5671D101761K5909L0419j7623L4999M3751J6436O125O2629P6391L9907O3504R6975
5659D581183Q4774P2980Q4068J20925J09269P2753J15260J30317J09896J10442
5649E591867J05282J60083J00911J40471J87149J76950J84757K70768L41460M11972
5639G671670M69439N68702O88932P43599R03939J111159J459154J946211K755707
5630A8318512M190828O682056R043917R833036P638518L677760J85287k726674
5622E6843240m877000n660490n319597m411748l554057k578378j722764j106693
$$ plain form
5695 4012408 3929077 3904187 3868584 3836852 3837041 3845913 3868446 3906126 3988393 4096231 4233125 4358273
5683 4358273 4373757 4410449 4380679 4339788 4291492 4253409 4195090 4112015 4111326 4094530 4128036 4101761
5671 4101761 4127670 4158089 4140466 4175465 4219216 4235652 4241777 4304406 4380797 4420704 4484208 4581183
5659 4581183 4665957 4738937 4823005 4943930 5053199 5125952 5241212 5371529 5481425 5591867
5649 5591867 5697149 5857232 5958143 6098614 6285763 6462713 6647470 6918238 7259698 7671670
5639 7671670 8141109 8709811 9398743 10142342 11046281 12157440 13616594 15562805 18318512
5630 18318512 22509340 29191396 38235313 48068349 55706867 59384627 59569914 56843240
5622 56843240 51966240 46305750 40986153 36574405 33020348 30441970 28719206 27612513
5614B7612513n18671m1479L92378R61537J810815L336619N415056Q107272J0822876
5605E7898916J2587595J2443126R667767M867754N12848l401252p400123r506111
5597G7670520r936846r477290q303078o705216n083040l752532k527443j586510
5589C0298565q15814k11926J60578N49022J303864K617872M916264P833457R524473
5580E6176355Q077513L606290m42385l523135o459737p799278p703986o978363
5572C4953274n970629m758717l614228k631479k000876j622624j316914j059461
5564A1978346r52371p77172o25882n95476m54799m38273l47776l45133l44958
5555G096506k19085k41210k41215k71491j66125k07168j67030j29988j38617j36428
$$ plain form
5614 27612513 27093842 27052363 27444741 28406278 30217093 33553712 38968768 47076040 57898916
5605 57898916 70486511 82929637 92597404 97465158 97978006 94576754 87176631 77670520
5597 77670520 67733674 58256384 49953306 43248090 38165050 34412518 31885075 30298565
5589 30298565 29482751 29270825 29431403 29980425 31284289 33902161 38818425 46651882 56176355
5580 56176355 64253868 67860158 67417773 63894638 57434901 49635623 41931637 34953274
5572 34953274 28982645 24223928 20609700 17978221 15977345 14354721 13037807 11978346
5564 11978346 11025975 10248803 9622921 9027445 8572646 8134373 7786597 7441464 7096506
5555 7096506 6877421 6636211 6394996 6123505 5957380 5750212 5583182 5453194 5314577 5178149
5545E178149j25576r1575q1060r7120q0960q3088p9160o2677r4352o0350j10298
5534D211933p5246r1265j8062o6908n8785K2096P253L3285M5843O4912J43432
5523D218488K28785L22518K11212R4487k1581j22239k69253l14619k84276k72531
5513C790991k06341j78536j67978j02164q0556l1240j5915j8288P7444P2907J05087
5502C245411J12005J17964J57908J71468K15583L97656O33476P47248O74424L85417
5492F858560L8483k15004m30714n78656n99208n12066m50328m16311l00798k14167
5482C179791j77024j06008r3165n2665L929o9612J4273j9429k467K568N9055M9746
5470B788992J70172L12182L64550L18358J77721K3118j46141k53576l36107l61696
$$ plain form
5545 5178149 5052573 4960998 4879938 4782818 4701858 4618770 4539610 4476933 4382581 4322231 4211933
5534 4211933 4136687 4045422 4027360 3960452 3901667 3923763 3931016 3964301 4010144 4075056 4218488
5523 4218488 4447273 4769791 4981003 5075490 5053909 4931670 4662417 4347798 4063522 3790991
5513 3790991 3584650 3406114 3238136 3135972 3055416 3024176 3008261 2989973 3067417 3140324 3245411
5502 3245411 3357416 3475380 3633288 3804756 4020339 4417995 5051471 5798719 6473143 6858560
5492 6858560 6897043 6682039 6251325 5672669 5073461 4561395 4111067 3694756 3393958 3179791
5482 3179791 3002767 2896759 2803594 2750929 2754858 2685246 2699519 2680090 2677623 2680191 2739246 2788992
5470 2788992 2959164 3271346 3635896 3954254 4131975 4155093 4008952 3755376 3419269 3057573
5460C057573k79793k03583j86749j21908m4561m2610n0066p470n4526j5968k1428
5449B028911o6120j4690k1731m6007J0382L6949Q3380N2914K6923P6485M6132
5438B213528J0159j5502l4861n7604o9206q7396l2591n5036q4623j3961k6320
5427A746587j2514l0254j3311k431j7147J499R039K6403N6054J06227Q6470R1904
5415B048526P6641K7186L5428m8244m6099k0319l6060k6865K709M1593K0444J626
5403B076566j7138L8856n5210n6674m9453n0425j3560l7254k1261l5995P6879
5392A855331Q097j9088k8092o3885j04020o0743j34136r6169m0971l9751p1104
5381A205469K1588J4284J8875j3938M4692L4920L3759M4171j9895K1415k584m6382
$$ plain form
5460 3057573 2777780 2574197 2387448 2265540 2220979 2178369 2128303 2120833 2066307 2050339 2028911
5449 2028911 1962791 1948101 1926370 1880363 1890745 1927694 2011074 2063988 2090911 2167396 2213528
5438 2213528 2223687 2208185 2173324 2115720 2046514 1959118 1926527 1871491 1786868 1772907 1746587
5427 1746587 1734073 1703819 1690508 1688077 1670930 1672429 1681468 1707871 1763925 1870152 1956622 2048526
5415 2048526 2125167 2152353 2187781 2139537 2093438 2073119 2037059 2010194 2012903 2054496 2074940 2076566
5403 2076566 2059428 2098284 2043074 1986400 1936947 1886522 1872962 1835708 1814447 1778452 1855331
5392 1855331 1863428 1844340 1816248 1752363 1648343 1587600 1453464 1357295 1316324 1276573 1205469
5381 1205469 1227057 1241341 1260216 1246278 1290970 1325890 1359649 1403820 1383925 1405340 1402756 1356374
5369A356374o1028J0032n6602j5474J265l696l2411L0712O110J5403l8897m5132
5357A166656n6208o2618l0275j06131m3532L694j8684o1510K4284j4850N2795
5346H53621J6652Q8390L5921R2454P6373J2600M0953M7718K3646l0884l161m9764
5334A204519o0798p3473j06410p9312r4195o3260o8064o3395l1847l2306M739
5323E36198o458l7222M5993j707k6331L6874k0589M5989R272N8245J1384k3272
5311F28376o636l6983k5898m0242n1361l4742j6209m1782p305k6951l8643N922
5299C07546J5468k5428k1929j1724J3513j8739j637J1750J341k5076J9202k608
5287B61679R277j2011J170O573j6132P635n577q036k8841l7187K2535n231j3567
$$ plain form
5369 1356374 1295346 1305378 1248776 1233302 1234567 1230871 1198460 1229172 1235282 1250685 1211788 1166656
5357 1166656 1110448 1047830 1017555 911424 867892 871586 852902 791392 815676 800826 853621
5346 853621 870273 958663 994584 1087038 1163411 1176011 1216964 1264682 1288328 1257444 1254283 1204519
5334 1204519 1143721 1070248 963838 884526 790331 727071 659007 595612 563765 531459 536198
5323 536198 529740 492518 538511 536804 510473 547347 526758 572747 582019 640264 651648 628376
5311 628376 621740 584757 558859 518617 467256 432514 416305 374523 367218 340267 301624 307546
5299 307546 323014 297586 275657 263933 277446 258707 257070 268820 270161 245085 264287 261679
5287 261679 270956 258945 260115 266688 250556 258191 252614 244578 215737 178550 201085 195854 182287
5274A82287p991K6009n906k509j0221j0512K0418m2605K9930K299J3164k2611
5262A71752j9860J1307K6510m5616L4569j3175n344K879J1322k2344j0941J1880
5250A52939J1708k99k1150L056l107k2992K0623L716m2820j197K520M8918K0512
5237A72427n0058J6976N987J6752r028M910L251J1959l0967O107J2438K6596n3890
5224A33460L8101n308k8139M755r760M666j818j626j5845m838q224Q33J9921m4264
5210H1914K3350J6745j3038l188m012J2500k704O960m693o366K9576l5591J7693
5197A19146J955K14p276j7347J3516J7296j9515O109m658j5650j6459M1771k7659
5184I1443N2067J7035j3752k7726l328N7248l6609J0731M0757n1303P909n166
$$ plain form
5274 182287 174296 200305 194399 191890 181669 171157 191575 148970 178900 181199 194363 171752
5262 171752 151892 163199 189709 144093 178662 165487 160143 163022 174344 152000 141059 152939
5250 152939 164647 164348 143198 146254 143147 120155 140778 144494 101674 100477 102997 151915 172427
5237 172427 122369 139345 145332 162084 153056 157966 161217 173176 142209 148316 160754 187350 133460
5224 133460 171561 166253 138114 142869 133109 137775 135957 134331 118486 113648 105424 106257 126178 81914
5210 81914 105264 122009 108971 105783 101771 114271 111567 118527 113834 107468 137044 101453 119146
5197 119146 121101 121315 114039 96692 110208 127504 107989 114098 109440 93790 77331 119102 91443
5184 91443 143510 160545 146793 119067 115739 172987 136378 147109 187866 136563 144472 139306
5172A39306M1680j4235j5563j3374j0889o148j5644L9820n9580M6112r221r480
5160A12784m021q088L0056k9020O221r541J4776n374J279K3173m667p718j785
5147A18075j6533Q95Q117n39j024J7021o864p637O833j555j4039l126K7276R159
5133A36059l2810J3742l67r458n212J175j2757J8499k1250k1067L6643l2985M610
5120G4822K6280j7294P662K3336k2124J4356L013r4Q607j2657n002J746J1322
5107A13973K0536k112l603M575J1206m752J3608J8207K1080K1948K7675L7209
5095B79550J16696R9068P6932L9034K478k8769p7717n7998p5250o5309m646k8747
5083B75322n2276P223M416j3626N394j5312n401J8203J0240l2392L0837j80J1005
$$ plain form
5172 139306 180986 166751 151188 137814 126925 120777 105133 144953 85373 131485 122264 112784
5160 112784 108763 100675 130731 101711 107932 98391 113167 107793 109072 132245 127578 119860 118075
5147 118075 101542 102437 110554 110015 108991 126012 119148 111511 118344 116789 102750 99624 126900 136059
5133 136059 103249 116991 116624 107166 101954 103129 90372 108871 87621 66554 103197 70212 74822
5120 74822 101102 83808 91470 114806 92682 107038 110051 109957 118564 105907 100905 102651 113973
5107 113973 134509 132397 128794 133369 144575 139823 153431 171638 192718 214666 242341 279550
5095 279550 396246 495314 572246 611280 613758 584989 507272 449274 374024 308715 304069 275322
5083 275322 223046 230269 234685 221059 226453 211141 205740 223943 234183 201791 232628 232448 243453
5070B43453k0210K4565k6106p451J7983k15m0105K7055j4533j4888K3758M4394
5058B57700J0993K9868M9490j312M0922M2792K5502L2905Q4623K3991O6233J1071
5046F74778J2687j0071l0990j8015p7607j9984l2739j6251j9892l005m2051R850
5034D26710j0353k0151L9174j7304J6678K1990j9040M8349J4412l6004J5818k3657
5022D56622J1737j5652q813j0930O208l0833J5693j1766L3189R610J1295N6480
5010E22840L0963L5101J1273J7697J5098j3151n4584J9712p3236K7142j2175J8238
4998E44918m9361o624K199k2835k6453N2707p943l629J6453O368k1899P272K6936
4985E18109M8391l94J2639J4819K1968Q836K0404r205N3157l0660R052N9562J6896
$$ plain form
5070 243453 223243 247808 221702 214251 232234 232019 191914 218969 204436 189548 213306 257700
5058 257700 268693 298561 348051 346739 387661 430453 455955 488860 573483 597474 663707 674778
5046 674778 687465 677394 646404 628389 550782 530798 498059 481808 461916 458911 416860 426710
5034 426710 416357 396206 435380 418076 434754 456744 437704 486053 500465 464461 480279 456622
5022 456622 468359 452707 443894 432964 439172 408339 424032 412266 445455 455065 466360 522840
5010 522840 553803 588904 600177 617874 632972 619821 565237 584949 511713 538855 526680 544918
4998 544918 495557 488933 491132 468297 441844 494551 486608 482979 499432 505800 483901 491173 518109
4985 518109 566500 566106 578745 593564 615532 624368 644772 635567 688724 658064 667116 726678 743574
4972G43574j061K2085N054k6367j1508j1255J8025J5692o813L4820J7242R229
4960H08717K9940N1980N2852K8413m737Q7067m638k0483J2015k4976m6181n8874
4948I11095n6041j7302l3575K410j632l0722j0853L2204J6972K9388J8859Q939
4936H69742L9234L1742l18L607N6256q059R147K6353q706n711j9424J219p1317
4923I23765k3374l1496k8043o0583M176L448o371K1638L8437M2832O5676J8738
4911I68843O0314M9091J3116N2371k9406O703k9518o7085l3198m5830k7038m5633
4899H72730l684k3738l533R186K9636J5167K2687M2996N732M5032m936M1263N150
4886A053688J2594N3437J3733L1340J31604R0223M5204N8890J5407k7745o9199
$$ plain form
4972 743574 742513 764598 769652 743285 731777 720522 738547 754239 747426 782246 799488 808717
4960 808717 838657 890637 943489 971902 967165 1054232 1049594 1029111 1041126 1016150 969969 911095
4948 911095 855054 837752 804177 806587 804955 774233 763380 795584 812556 841944 860803 869742
4936 869742 908976 940718 940400 944007 1000263 992204 1001351 1027704 1018998 1013287 993863 995082 923765
4923 923765 900391 868895 840852 780269 784445 787893 781522 803160 841597 884429 950105 968843
4911 968843 1029157 1078248 1091364 1143735 1114329 1121032 1091514 1024429 991231 945401 918363 872730
4899 872730 869046 845308 841775 850961 880597 895764 918451 961447 967179 1012211 1007275 1048538 1053688
4886 1053688 1066282 1119719 1133452 1164792 1296396 1386619 1431823 1490713 1506120 1478375 1409176
4875A409176p4618q1685m5627n2137m9195m44Q460K8421l282R9334L3771L8551
4863A310725N4599L9134M3211N0096J56527J55117K16508L60581M06298L80036
4853C172832K13933Q5411p6045j71645l03161k64277k94463k21386j50987r2366
4843A897846p7153k4703k475P6173L4675J501L4213N7756R7668O3884J33116K04421
4831B496922K75152M12267N31322N75352L86264K06041K9860j50530l18848l77896
4821D065906l53860l75621l30422k39429j89447j65525o5737j2175k2707M238
4811B315221m453N8654N8870N2955J24446J43479J56687J53704L34286L25772
4801C719621K67158J68219J8087j34573j96783k58703k08908k73584k07160j92077
$$ plain form
4875 1409176 1334558 1252873 1207246 1155109 1105914 1105470 1113930 1142351 1139069 1238403 1272174 1310725
4863 1310725 1365324 1404458 1447669 1497765 1654292 1809409 2025917 2386498 2792796 3172832
4853 3172832 3386765 3472176 3396131 3224486 2921325 2657048 2362585 2141199 1990212 1897846
4843 1897846 1820693 1795990 1793515 1869688 1904363 1905864 1940077 1997833 2095501 2159385 2292501 2496922
4831 2496922 2772074 3184341 3715663 4291015 4677279 4883320 4913180 4762650 4443802 4065906
4821 4065906 3712046 3336425 3006003 2766574 2577127 2411602 2345865 2333690 2310983 2315221
4811 2315221 2310768 2369422 2428292 2481247 2605693 2749172 2905859 3059563 3393849 3719621
4801 3719621 3986779 4154998 4173085 4038512 3841729 3583026 3374118 3100534 2893374 2701297
4791B701297j25322j18667j03066m8246j8165k2839l2389j2503l6311q083M1129
4780B216835J188N1763M6023Q2208J32448J21110J01386L4318J9560J236n0330
4769B757745l2321j8129k1490m8963L2673l6689J3436M1322L8099M5399j3523
4758B757559M7524P8402N668O9334M9146P8367k4311J28866P1065O5353P3860
4747C400833J14001J34036J41529J16543K30611K03701K50868K44356L31135L50153
4737E517766M61331O03090Q09102J155176J733759K407078K837978K462499J559937
4728A9547716O55945j20294r08858j282102j255202j133253p98879n94370l08542
4719A3802161n0984R1264M03938P30876J227710K017082L078329M279811N157117
$$ plain form
4791 2701297 2575975 2457308 2354242 2305996 2287831 2264992 2232603 2220100 2183789 2175706 2216835
4780 2216835 2218023 2269786 2315809 2398017 2530465 2651575 2752961 2787279 2806839 2808075 2757745
4769 2757745 2725424 2707295 2685805 2636842 2669515 2632826 2646262 2687584 2725683 2771082 2757559
4758 2757559 2805083 2883485 2889153 2958487 3007633 3086000 3061689 3190555 3261620 3326973 3400833
4747 3400833 3514834 3648870 3790399 3906942 4137553 4341254 4592122 4836478 5167613 5517766
4737 5517766 5979097 6582187 7391289 8546465 10280224 12687302 15525280 17987779 19547716
4728 19547716 20203661 20083367 19174509 17892407 16637205 15503952 14705073 14110703 13802161
4719 13802161 13751177 13842441 14246379 14977255 16204965 18222047 21300376 25580187 30737304
4710C0737304N631020N800160N377452M030509K056510j00402j860387l371191
4702D8300975m234908m354035m142625l537230k736314j894324r55570R339Q82977
4693B7338285J927630K888756L923007M673360N465359N751255N239033M464909
4685F1671594L774345K561137O95035j332439l018337m572360n482049n658018
4677D8638908n541737m922943m159049l290330k376257j423274n25872M59393
4669B6858839J405950K314563L142543L853585M148988L839017L119647J978560
4661E0661692K24983j501575l152648m315636m822761m827179m394469l799771
4653B4072636l037168k256011j645539j240851r24648o60435l36360j56270K73072
$$ plain form
4710 30737304 36368324 42168484 47545936 51576445 53632955 53532553 51672166 48300975
4702 48300975 44066067 39712032 35569407 32032177 29295863 27401539 26445969 26455308 27338285
4693 27338285 29265915 32154671 36077678 40751038 46216397 51967652 57206685 61671594
4685 61671594 65445939 68007076 68702111 67369672 64351335 59778975 54296926 48638908
4677 48638908 43097171 38174228 34015179 30724849 28348592 26925318 26399446 26858839
4669 26858839 28264789 30579352 33721895 37575480 41724468 45563485 48683132 50661692
4661 50661692 50886675 49385100 46232452 41916816 37094055 32266876 27872407 24072636
4653 24072636 21035468 18779457 17133918 15893067 14968419 14307984 13971624 13815354 14088426
4644A4088426P53685J279110J661894J415838N30802l17655j005855j583539j880435
4635A4942271j817036j691738j490225j179281r09850o99118o05784m45484l76768
4626E726987l46610k96858k51117j98216j88317j79009j43743j51412j09358j19149
4616C743198j07677j17341j28844q7493q9335q0105p0491r9891m5729q9048k0329
4605B806915q3022j4527o9708l762j11181n5343m3780n5252p0056o9092p4450
4594B156742o0920m6411o8214n4447o2618l0999k1347l5445j6132k0729l3599
4583A705881j065j7124p7794m103p896l5444k2224n3341k7814j6225n0053k0364
4571A372434m9334m8496j1024n3387j3648l0970j2146j6738n4401k4026M252l216
$$ plain form
4644 14088426 14842111 16121221 17783115 19198953 19729755 19412100 18406245 16822706 14942271
4635 14942271 13125235 11433497 9943272 8763991 7854141 7155023 6549239 6103755 5726987
4626 5726987 5380377 5083519 4832402 4634186 4445869 4266860 4123117 3971705 3862347 3743198
4616 3743198 3635521 3518180 3389336 3301843 3212508 3132403 3061912 2962021 2916292 2827244 2806915
4605 2806915 2723893 2709366 2639658 2635896 2524715 2469372 2425592 2370340 2300284 2231192 2156742
4594 2156742 2095822 2049411 1981197 1926750 1864132 1833133 1811786 1776341 1760209 1739480 1705881
4583 1705881 1704816 1687692 1609898 1605795 1597899 1562455 1540231 1486890 1459076 1442851 1392798 1372434
4571 1372434 1323100 1274604 1263580 1210193 1196545 1165575 1153429 1136691 1082290 1058264 1062516 1059300
4559A059300m0627K5099j7563n998l8682k8482k1190k9761j7266j2102k7013m356
4547H41359l9946l6689j8014L7432o2280L6270l4853K0281k5620l5614k0254k8776
4535F33296M120n8362r77K5485o2741L3152o4745j6545N921M202j5825p968k300
4522D76713m2411R033J786l1405q067k5639j4277K9665l1349J3023j5095K3943
4510C85920m0017J7535K5024j6388j5918l655k0893N640j8070o762q442J952j5157
4497B90769p375m162L6209L965J9784j8849K7505J1234J5125Q247j1515J6446
4485C87383N723J9443N0783L5119K0148L8138J3612L4958n851L112j9445j5175
4473E67948j9124L447r180L8661N5487O0355J2454M3215m456K53L32J3871k441
$$ plain form
4559 1059300 1018673 1043772 1026209 1020211 981529 953047 931857 902096 884830 872728 845715 841359
4547 841359 801413 764724 746710 784142 721862 758132 723279 743560 717940 682326 662072 633296
4535 633296 637416 579054 578077 603562 540821 573973 509228 492683 498604 502806 486981 479013 476713
4522 476713 434302 443335 445121 413716 405649 380010 365733 395398 364049 377072 361977 385920
4510 385920 345903 363438 388462 372074 356156 352501 331608 337248 319178 312416 303974 305926 290769
4497 290769 283394 279232 315441 319406 339190 320341 347846 359080 374205 382452 370937 387383
4485 387383 393106 412549 463332 498451 518599 556737 570349 605307 599456 602568 583123 567948
4473 567948 548824 552271 543091 581752 637239 697594 710048 753263 748807 749060 749392 763263 760822
4460G60822L6846M36J7984Q389j6416m1456l9938l2190n4669o3587l2613o8631
4448D74977k1291M800j7553K3004l737K5977K863k836O6582k694O8094K1303j3463
4435F26026K5373J3744k6910K5570K408j4315K8808o715M5958P7150N1877J50476
4423I99450J93133J76828O9434L7053R574p3622n2814q9921p3016q5204m8005
4412A062890m8013o6907p3471j4785n8970n6510l0234L7754o883L3681O6363J32026
4400I76941J38307J70990P5955J241j6632j25461j56556p9161j21892p1820r4264
4389F97648r2844r223p7767o6148q095p0908k3715j315m1641K1022k535m17k1295
4376C02767j5757J652J7770r568k0984o223O4419k7337K0426Q869L2259K703K0386
$$ plain form
4460 760822 797668 798104 816088 824477 808061 766605 726667 694477 639808 576221 543608 474977
4448 474977 453686 458486 440933 463937 460200 486177 489040 486204 552786 550092 618186 639489 626026
4435 626026 651399 665143 638233 663803 666211 651896 680704 673989 719947 797097 848974 999450
4423 999450 1192583 1369411 1438845 1475898 1485472 1411850 1359036 1269115 1196099 1110895 1062890
4412 1062890 1014877 947970 874499 859714 800744 744234 714000 751754 744871 778552 844915 976941
4400 976941 1115248 1286238 1362193 1363434 1346802 1221341 1064785 985624 863732 791912 697648
4389 697648 604804 595581 517814 451666 443571 372663 348948 347633 305992 327014 324479 324062 302767
4376 302767 287010 288662 306432 296864 275880 269657 334076 306739 327165 336034 368293 370996 391382
4363C91382j2458M6739J9114k9806O838J1311m8924L7005j6234P126J2891m855
4351D20129L1401M6016j6072q061J1713n942K4699K9952M6736k3686P7284M643
4339F38812K0366K4122M6645O0359N7944R2253N6475J35069J04866J13593J25170
4328A475674J75395O4236P6913J51274J31355O9829O1294p9186j40422j95298
4318A791064k15241k11122j71607j64357j46642r4320q0036m5179k8323n9854
4308E74383j402o2905J5710l6826J659k5733J4443q614n7594N28K7059l0267l5620
4295C74821j3105J0243k4567k4295J7741r748l3860k2714M251J4435l4162n126
4283B53914J6169l0939j5571p300K7555j4395l2260k9360K0675m9561L8671K117
$$ plain form
4363 391382 378924 425663 444777 414971 421809 433120 384196 421201 404967 412093 424984 420129
4351 420129 451530 497546 481474 473413 485126 479184 503883 533835 580571 556885 634169 638812
4339 638812 659178 683300 729945 790304 848248 940501 996976 1132045 1236911 1350504 1475674
4328 1475674 1651069 1715305 1792218 1943492 2074847 2144676 2205970 2126784 1986362 1791064
4318 1791064 1575823 1364701 1193094 1028737 882095 787775 707739 662560 634237 574383
4308 574383 572981 510076 525786 488960 490619 464886 479329 470715 413121 413649 440708 410441 374821
4295 374821 361716 371959 347392 323097 340838 331090 297230 274516 278767 293202 259040 253914
4283 253914 270083 239144 223573 216273 243828 229433 197173 167813 188488 138927 177598 179715
4271A79715J9255j8212M000K2115m3906O0117j646J3748P70j9466L3641O990J3493
4258B70614K0608K2752J0527k4807N4135K1636l192J3238K744o165J4896m255
4246C92731J6732K8968p2962N5094k5280J0515L058l7740n885J4280j1970l7944
4234C29597j240n396m1784l0786R946l5926J1515k3998K4700l0209o20m7062q030
4221A50707j1765M813J2179k3632P088m1516K8321L1946k8061n050j9593J8113
4209A23550J3711n3479K6493K896N6657k3604r124K6428L4697j8504K6120j6956
4197A88885J4312O089J5294p905K2150J7909j0928M274j3636l657m311J093p3278
4184A56291J5424K319K5911k9436J3007j3568J83j2045m6262j3608o432q635j3993
$$ plain form
4271 179715 198970 180758 184758 206873 162967 223084 221438 235186 235956 216490 250131 257121 270614
4258 270614 291222 313974 324501 299694 353829 375465 372273 385511 388255 382090 396986 392731
4246 392731 409463 438431 365469 420563 395283 405798 408856 371116 365231 379511 367541 329597
4234 329597 328357 322961 281177 250391 260337 224411 235926 211928 236628 206419 205799 158737 150707
4221 150707 138942 143755 155934 132302 139390 97874 126195 158141 130080 125030 105437 123550
4209 123550 137261 83782 110275 113171 169828 146224 137100 163528 198225 179721 205841 188885
4197 188885 203197 209286 224580 216675 238825 256734 245806 250080 236444 232787 228476 229569 156291
4184 156291 171715 174034 199945 170509 183516 169948 170131 158086 111824 98216 91784 83149 69156
4171F9156O053J17l0575J0235J2198k0261k0445j2960L7823l1389R012j3743k0420
4158e199l2039M5542k2218J1756l3741L8291k3194K3880j9252j7053L1392m2829
4146d4664P764K6747k3538j742k52K8478j5170o675L467j2348K945j3350M3327
4133e011k8347n147j9209J4479J848N083R32J80K1549l0611o060j723j059K6040
4119b7056k8848Q525J579j8908K5380j0616k207J1366J2057j9192J7180l9600
4107g0340J0417j862K1645J642j4826K1340j2632j0574l912m933J1344O593j9630
4094f5728M4409j4950j0930o650K1500j0109J3726j5866M333j074L0379l1857
4082d2817L505q823J4749M228J7492k6573P570k514J9058l644r654K4930j527
$$ plain form
4171 69156 75209 75326 44751 54986 67184 46923 26478 13518 51341 19952 28964 15221 -5199
4158 -5199 -37238 8304 -13914 -2158 -35899 2392 -20802 3078 -16174 -33227 -1835 -44664
4146 -44664 -36900 -10153 -33691 -35433 -35685 -7207 -22377 -29052 -25585 -37933 -34988 -48338 -5011
4133 -5011 -33358 -38505 -57714 -43235 -41387 -36304 -35372 -35192 -13643 -44254 -50314 -52037 -53096 -27056
4119 -27056 -55904 -47379 -45800 -64708 -39328 -49944 -52151 -40785 -28728 -47920 -30740 -70340
4107 -70340 -59923 -61785 -40140 -38498 -53324 -31984 -44616 -55190 -59102 -64035 -52691 -46098 -65728
4094 -65728 -21319 -36269 -47199 -53849 -32349 -42458 -28732 -44598 -40265 -41339 -10960 -42817
4082 -42817 -39312 -48135 -33386 -29158 -11666 -38239 -30669 -33183 -14125 -17769 -27423 -2493 -4020
4069d020m7676L6095L1011m0395K4614K7882r11m3680n119O1590j5783l0652N5409
4056D8365l3980K1888QQ752K1554n696j7655L054j2901J0544M742J7598k618r350
4042E4305j4095M1266J1806n4504K9500M191o26m126K6681M8906l0319J5663j018
4029A27630N1902j4883j4948K5639n593o9070j5286J7460r862q791k9272M2332
4017I7258k3385j1541L4720j5763K5373M141k2953N80J2048O698L971P114M241
4004A22502j9357J549k256N022J4871l0467k2580K965k8570k7476J6653K1009
3992E3865k4586m368k2028O0413j1420l269k8045j967L163j0365k4156O0K5466
3979A2763l4371o980l3169L5570J1857j1405l9215J2779q402L221L1866k9924
$$ plain form
4069 -4020 -51696 -15601 15410 -24985 -371 27511 26600 -17080 -22199 39391 23608 -7044 48365
4056 48365 14385 36273 36281 45033 66587 60891 43236 46290 33389 43933 48675 66273 63655 54305
4042 54305 40210 81476 93282 38778 68278 72469 71843 67717 94398 143304 112985 128648 127630
4029 127630 179532 164649 149701 175340 169747 100677 85391 102851 92989 84198 54926 97258
4017 97258 73873 62332 97052 81289 106662 110803 87850 88430 100478 107176 111147 118261 122502
4004 122502 103145 104694 102438 107460 122331 91864 69284 72249 43679 16203 32856 53865
3992 53865 29279 24911 2883 63296 51876 48607 20562 18595 21758 11393 -12763 -12703 12763
3979 12763 -21608 -28588 -61757 -26187 -14330 -25735 -64950 -52171 -60573 -57352 -25486 -55410
3967e5410K3236m418L995j8970k4953J4085j9641K3251j8396K3745n4943M0673
3955f7746K851m439p868K0986l3504l0858M7085K9616j9501n4557M2701j2121
3943h7355P36L425Q63K5244m7684J4283J3901j2856k3742J1310M902J1299k3728
3930a09402M3047k2669J0887O309n930j298l9986m5L1349R564m096q99j0622k32
3916i4023j8517J209K7918r090m2922k001J8253L071Q50M7882m4302q740K1824
3903i8588Q384j5250L515J4021j6501o470k0489J0341M438L69j204K5062J2127
3890h0245l9352N136J2655J092j0927q972J3240q116m5701N0643L013K0832l6302
3877a23004M745J9796r061M288j0778n354K678l3077M3680P91N42m5588M1857
$$ plain form
3967 -55410 -32174 -36592 -32597 -51567 -76520 -62435 -82076 -58825 -77221 -53476 -108419 -67746
3955 -67746 -64895 -69334 -77202 -56216 -89720 -120578 -73493 -43877 -63378 -117935 -75234 -87355
3943 -87355 -86619 -83194 -82331 -57087 -104771 -90488 -76587 -89443 -113185 -101875 -96973 -85674 -109402
3930 -109402 -66355 -89024 -78137 -71828 -77758 -79056 -119042 -119087 -87738 -78174 -82270 -83169 -93791 -94023
3916 -94023 -112540 -111331 -83413 -92503 -135425 -137426 -119173 -116102 -115252 -67370 -111672 -120412 -98588
3903 -98588 -90204 -105454 -101939 -87918 -104419 -110889 -131378 -121037 -116599 -116230 -117434 -92372 -80245
3890 -80245 -119597 -114461 -101806 -100714 -111641 -120613 -107373 -115489 -161190 -110547 -107534 -86702 -123004
3877 -123004 -118259 -98463 -107524 -103236 -114014 -119368 -116690 -149767 -106087 -105296 -104754 -150342 -108485
3864a08485j8156K318K0099k1729K0821j0348J372J2415p422k0809R352j0546
3852a31118J9004n170K667j3570M1500n045m4810m809K1481k7559N134k2403N2140
3839a12558K466j9477r068p167J5212J4935k2739K3962j6223J2022J9842l476
3827a02269j2402l345J2642m5872M9441l2631M1768q4565N2966k4J948k8696K7335
3814a23704P362k4363L449K2388n395q365Q743K9906l3122r676p571N6526j6889
3801a00711k2010K9698R567m3656l9879K3310K9060k0278j6363K1159r549J0606
3789a29046q393K9653K870k0745j3287J2238k0117O545k07L5128l0997k285J1035
3776a27608o982Q079l0665L8670k7780j2684K2872p905K0886Q167O653J926k3367
$$ plain form
3864 -108485 -126641 -124323 -104224 -125953 -105132 -115480 -114108 -101693 -109115 -129924 -120572 -131118
3852 -131118 -112114 -117284 -114617 -128187 -86687 -91732 -136542 -141351 -119870 -147429 -142295 -164698 -112558
3839 -112558 -110092 -129569 -138637 -145804 -130592 -115657 -138396 -114434 -130657 -118635 -98793 -102269
3827 -102269 -114671 -118016 -105374 -151246 -101805 -134436 -92668 -177233 -124267 -124291 -122343 -151039 -123704
3814 -123704 -116342 -140705 -137256 -114868 -120263 -128628 -119885 -89979 -123101 -132777 -140348 -83822 -100711
3801 -100711 -122721 -93023 -83456 -127112 -166991 -143681 -114621 -134899 -151262 -130103 -139652 -129046
3789 -129046 -137439 -107786 -104916 -125661 -138948 -126710 -146827 -140282 -140489 -105361 -136358 -138643 -127608
3776 -127608 -134590 -126511 -157176 -118506 -146286 -158970 -136098 -144003 -123117 -114950 -108297 -106371 -129738
3763a29738j0711L1668J5271m5978j938K6332M34l8829K838P7768m1980l5410
3751a50273M3526J6880n1931L79K2322j5315k2925j0842N8617O12n2618J5960
3739a45608J7082J917m8994M0355R648j6263j4715K1860k7133j488K6713J116
3727a35510m278P91j9059K2618m891l7677M004N5278m705j8359R732J9373k3778
3714a36461l954M3979l9959j776j6058K6752J4290j0096j5618K358Q476j3441
3702a41508j3702M5895l1002M85K716m622k1085K9594O916j8942K750L218J8207
3689a21080p722R045n128m094l0283K3587j5831K0886L024O974k239p618q522
3676a39001L7176l3560J57m98Q876l8880N659J5139J3476J170K1564m7982K8840
$$ plain form
3763 -129738 -140449 -108781 -93510 -139488 -141426 -115094 -114660 -153489 -150651 -72883 -114863 -150273
3751 -150273 -106747 -89867 -141798 -141419 -119097 -134412 -157337 -168179 -109562 -108950 -161568 -145608
3739 -145608 -128526 -126609 -175603 -135248 -125600 -141863 -156578 -134718 -161851 -163339 -136626 -135510
3727 -135510 -139788 -138997 -158056 -135438 -140329 -178006 -174002 -118724 -123429 -141788 -132056 -112683 -136461
3714 -136461 -140415 -96436 -136395 -138171 -154229 -127477 -113187 -123283 -138901 -136543 -128067 -141508
3702 -141508 -155210 -109315 -140317 -139832 -137116 -141738 -162823 -133229 -126313 -145255 -142505 -139287 -121080
3689 -121080 -128802 -119757 -124885 -128979 -159262 -135675 -151506 -130620 -127596 -120622 -122861 -130479 -139001
3676 -139001 -101825 -135385 -135228 -135726 -126850 -165730 -160071 -144932 -131456 -130286 -108722 -156704 -127864
3663a27864L631R682k4604k4575K4420J1533j4459J5217j1657K7885m344m652
3651a19787L535R345l0125j514k64M264k4583j959K8188k2951J4051p445J2366
3638a36879K3368l8221J4308L3222k1456j7910J22R252l53r801L2385J1944l0320
3625a30339q916P997k0437R141l5924P0742n0383L9037O641r696j0695q468K2454
3612a18846P122k0248P702k3649K3907j5144K7762m2983M0434k1219K0306k7423
3600a42279K9630L380k2739J9751m9688L9658j6458L5692o6083M4911q158J8924
3588a13459J0137m1842m067K762o468J6097J839M1026l1113n037r507L3756l7352
3575a43228n445J746K1145k9134p197N646J7620L6316j9880j0138R874n39m0376
$$ plain form
3663 -127864 -124233 -114551 -139155 -163730 -139310 -127777 -142236 -127019 -138676 -110791 -115135 -119787
3651 -119787 -116252 -106907 -137032 -138546 -138810 -134546 -159129 -161088 -132900 -155851 -141800 -149245 -136879
3638 -136879 -113511 -151732 -137424 -104202 -125658 -143568 -143446 -134194 -134547 -144348 -111963 -100019 -130339
3625 -130339 -139255 -131258 -151695 -142554 -178478 -107736 -158119 -119082 -112441 -122137 -132832 -141300 -118846
3612 -118846 -111724 -131972 -124270 -147919 -124012 -139156 -111394 -154377 -113943 -135162 -114856 -142279
3600 -142279 -112649 -109269 -132008 -112257 -161945 -122287 -138745 -103053 -169136 -124225 -132383 -113459
3588 -113459 -103322 -145164 -149231 -146469 -152937 -136840 -135001 -93975 -125088 -130125 -139632 -105876 -143228
3575 -143228 -148673 -146927 -125782 -154916 -162113 -156467 -138847 -102531 -122411 -132549 -122675 -123214 -163590
3562a63590K4762m066K4218j9593J2404n786K4545l0145k67K5237j9915j8860
3550a51056L7786r588r846j8906o67k5156R378L679K4734j9924L5910o370M608
3537a25418J5308j8975j1806m661L1064j9469L5224K883j826J3021k839j292j3144
3524a01930o830P222K09K2116j7663j4430J4724l9179K6994l278k6239J0100j0326
3511a38510K3480N814k7927K4298l622m3025K4559J4283k8211k343k2183K3272
3499a50115NK4543n231j9874m1216L2261J384K9476J1603o720k925k3643k413
3486a52865J7995J518R443l012l951k1799K1828L5081n7414N3457l3990j842k3867
3473a59418K1435J9119l574P266j1622l1516L4058J924K2499q955j4170q914j4203
$$ plain form
3562 -163590 -138828 -142894 -118676 -138269 -125865 -131651 -107106 -137251 -137518 -112281 -132196 -151056
3550 -151056 -113270 -122858 -132704 -151610 -152277 -177433 -168055 -164376 -139642 -159566 -123656 -130026 -125418
3537 -125418 -110110 -129085 -140891 -145552 -114488 -133957 -98733 -95850 -97676 -84655 -87494 -88786 -101930
3524 -101930 -108760 -101538 -101329 -79213 -96876 -111306 -96582 -135761 -108767 -112045 -138284 -128184 -138510
3511 -138510 -115030 -109216 -137143 -112845 -116467 -159492 -134933 -120650 -148861 -151204 -173387 -150115
3499 -150115 -150110 -125567 -130798 -150672 -191888 -159627 -158243 -128767 -117164 -123884 -126809 -150452 -152865
3486 -152865 -134870 -133352 -123909 -126921 -130872 -152671 -130843 -95762 -153176 -99719 -133709 -135551 -159418
3473 -159418 -137983 -118864 -122438 -115172 -126794 -158310 -124252 -122328 -99829 -108784 -122954 -131868 -146071
3460a46071J3289j1369K944J7084k965l5443L5964J9169l3487K8703k8045N952
3448a34275j2100K748N959n052Q101K595m3785M3109k4508L0182R356j3075O584
3435a24161j8255J4957m590r008o527J9649j7795j0683M2074j4531p668K918j7017
3422a50637J5694O602k1k7534M3613j4326k2579M1323m357J8968k3600N862k5819
3409a36811K5532k0406Q654q430k244K2101n897J4885p022l2515L3351K5011j318
3396h5109j360L4L9074k6722n97j4730j8837L3124N76m4984N334m571j6187Q112
3382a26843q63L8648l5955j7979L6088m2452K9729j7352M005q214L807N807l146
3369a34720j2931O537K1987j1717O250K7456Q709k8918j1612J1086j6030M619
$$ plain form
3460 -146071 -132782 -144151 -141207 -124123 -127088 -162531 -126567 -107398 -140885 -112182 -140227 -134275
3448 -134275 -146375 -143627 -137668 -142720 -134619 -132024 -175809 -132700 -157208 -127026 -117670 -130745 -124161
3435 -124161 -142416 -127459 -132049 -141057 -147584 -127935 -145730 -156413 -114339 -128870 -136538 -133620 -150637
3422 -150637 -134943 -128341 -128362 -155896 -112283 -126609 -149188 -107865 -112222 -93254 -116854 -110992 -136811
3409 -136811 -111279 -131685 -123031 -131461 -133705 -111604 -117501 -102616 -109638 -142153 -108802 -83791 -85109
3396 -85109 -86469 -86435 -47361 -74083 -74680 -89410 -108247 -75123 -74547 -119531 -114197 -118768 -134955 -126843
3382 -126843 -127706 -89058 -125013 -142992 -106904 -149356 -119627 -136979 -132974 -141188 -137381 -131574 -134720
3369 -134720 -147651 -141114 -119127 -130844 -124594 -97138 -88429 -117347 -128959 -117873 -133903 -129284
3357a29284m373p209M069j9541K4767J243N0050k1019O511m4240K7533j5295J7637
3344a09151J536r279J8313l3938K9366P560O515J6006K3637N3589K7357J6268
3332D7779Q066J9600k8692j1056n9895j9256P868o1257j2162K5727k2860k0148
3320a26286j897K282k480J9960k4462O931K1438N005k5241o259J8867j1977l7254
3307a61373O202K9540J2957k8626J2029N583N438J7658l6804J730J6748J3576
3295a05342m2114j6899M4620j4724J8223J5J3600j2005k2504j3637K7450k2139
3283a45456L3011J9195o0147N826J1836J0215J487r590j0423N967J646N139L2116
3270i9178j8333k6959o708M1826k8602M603m568J8814k2911k8299L6965j7725
$$ plain form
3357 -129284 -133657 -140866 -136797 -156338 -131571 -130328 -80278 -101297 -94786 -139026 -111493 -126788 -109151
3344 -109151 -107615 -116894 -98581 -132519 -103153 -95593 -89078 -73072 -49435 4154 31511 47779
3332 47779 55845 75445 46753 35697 -24198 -43454 -35586 -96843 -109005 -83278 -106138 -126286
3320 -126286 -128183 -125901 -128381 -108421 -132883 -125952 -104514 -99509 -124750 -131009 -112142 -124119 -161373
3307 -161373 -155171 -125631 -112674 -141300 -129271 -123688 -118250 -100592 -137396 -135666 -118918 -105342
3295 -105342 -147456 -164355 -119735 -134459 -116236 -116221 -102621 -114626 -137130 -150767 -123317 -145456
3283 -145456 -112445 -93250 -153397 -147571 -135735 -125520 -124033 -133623 -144046 -138079 -136433 -131294 -99178
3270 -99178 -117511 -144470 -151178 -109352 -137954 -133351 -137919 -119105 -142016 -170315 -133350 -151075
3258a51075L9660j8329r378M13L6066k9959j1248M0699j6525k9826k9031N6318
3246a22215q256p254J9049n884j2980J3599j2365J5962o025N763k2319m523k2272
3233a69720J5657J5521K7732k4286K6246j5032L801l2721O2331k8979k3630j693
3221a44773O62K2008j1279j7802P167M192M6059m8967L2750o584k1513J4813j407
3208a24674m985q337J4405j3338K1614k4644p702K6199J0282m592n616P696m1763
3195a55455q295K5883j8870J9875M891J9879m1300O591K5857m3733J6576K1924
3183a26177J5287k6020K4473l2230L0217k5891M6659n5629K3951j1334k8019K9035
3171a35678L5192n7605N1296l2702J3705K4816j8602k0237J8312j9103j3610K7057
$$ plain form
3258 -151075 -111415 -129744 -139122 -138709 -102643 -132602 -143850 -103151 -119676 -149502 -178533 -122215
3246 -122215 -130471 -137725 -118676 -124560 -137540 -123941 -136306 -120344 -126369 -120606 -142925 -147448 -169720
3233 -169720 -154063 -138542 -110810 -135096 -108850 -123882 -120081 -152802 -90471 -119450 -143080 -144773
3221 -144773 -144111 -122103 -133382 -151184 -144017 -139825 -93766 -142733 -109983 -116567 -138080 -123267 -124674
3208 -124674 -129659 -137996 -123591 -136929 -115315 -139959 -147661 -121462 -111180 -115772 -121388 -113692 -155455
3195 -155455 -163750 -137867 -156737 -136862 -131971 -112092 -153392 -146801 -120944 -164677 -148101 -126177
3183 -126177 -110890 -136910 -112437 -144667 -114450 -140341 -93682 -149311 -125360 -136694 -164713 -135678
3171 -135678 -100486 -158091 -106795 -139497 -125792 -100976 -119578 -139815 -121503 -140606 -154216 -127159
3159a27159J362j4225r842M3030k1413j0284p510K4508l2100K2021m1877M3784
3147a29705l0999L5999l789l990j7582N5922k9967q303o926Q147N90m4538K6749
$$ plain form
3159 -127159 -125797 -140022 -149864 -106834 -128247 -138531 -146041 -121533 -153633 -131612 -173489 -129705
3147 -129705 -160704 -124705 -128494 -132484 -150066 -94144 -124111 -132414 -139340 -131193 -130603 -175141 -148392
$$ [...]
##END NTUPLES=NMR SPECTRUM
##END=
