##TITLE=abcd
##JCAMPDX= 6.0         $$ Bruker NMR JCAMP-DX V2.0
##DATA TYPE= NMR SPECTRUM
##DATA CLASS= NTUPLES
##ORIGIN= UXNMR, Bruker Analytische Messtechnik GmbH
##OWNER= root
$$ XWIN-NMR		Version 3.5
$$ Fri Mar 27 17:57:12 2026 Russian Standard Time (UT+4h)  servis@DPX200
##.OBSERVE FREQUENCY= 200.131235884673
##.OBSERVE NUCLEUS= ^1H
##.ACQUISITION MODE= SIMULTANEOUS
##.ACQUISITION SCHEME= undefined
##.AVERAGES= 32
##.DIGITISER RES= 18
##SPECTROMETER/DATA SYSTEM= spect
##.PULSE SEQUENCE= zg
##.SOLVENT NAME= CDCl3
##.SHIFT REFERENCE= (INTERNAL, CDCl3, 0, 16.4885)
##AUDIT TRAIL= $$ (NUMBER, WHEN, WHO, WHERE, WHAT)
$$ ##TITLE= Audit trail, XWIN-NMR		Version 3.5
$$ ##JCAMPDX= 5.01
$$ ##ORIGIN= Bruker BioSpin GmbH
$$ ##OWNER= servis
$$ F:\spectra/data/av/nmr/H1/1/pdata/1/auditp.txt
$$ ##AUDIT TRAIL=  $$ (NUMBER, WHEN, WHO, WHERE, WHAT)
(   1,<2026-03-27 17:52:23.31 +0400>,<servis>,<DPX200>,
      <created by zg, POWCHK disabled, PULCHK disabled
       configuration hash MD5:
       00 E9 B6 7A A2 85 ED C7 34 08 36 98 17 FE 4E 26
       data hash MD5: 32K
       0C CB A0 37 59 89 3E C7 43 7C 31 AB B3 CC C4 D8>)
(   2,<2026-03-27 17:56:47.82 +0400>,<servis>,<DPX200>,
      <Start of raw data processing
       efp BC_mod = 2 LB = 0.05 FT_mod = 6 PKNL = 1 PHC0 = -256.1951 PHC1 = -0.898437 SI = 16K 
       data hash MD5: 16K
       3D 81 CF 65 CA 04 6D 41 7D CC 94 8D 80 B9 68 B3>)
$$ ##END=
$$ 
$$ hash MD5
$$ 9D FE C9 1B 1F F7 9E A5 8B A6 24 A7 48 43 E8 C2
##$RELAX= 
##$RELAX= 
##$RELAX= 
##$RELAX= 
##$RELAX= 
##$RELAX= 
##$RELAX= 
##$RELAX= 
$$ Bruker specific parameters
$$ --------------------------
##$DU= <F:\spectra>
##$EXPNO= 1
##$NAME= <H1>
##$PROCNO= 1
##$TYPE= <nmr>
##$USER= <av>
##$AMP= (0..31)
100 100 100 100 100 100 100 100 100 100 100 100 100 100 100 100 100 100 
100 100 100 100 100 100 100 100 100 100 100 100 100 100 
##$AQSEQ= 0
##$AQ_mod= 1
##$AUNM= <au_zg>
##$AUTOPOS= <>
##$BF1= 200.13
##$BF2= 200.13
##$BF3= 200.13
##$BF4= 200.13
##$BF5= 500.13
##$BF6= 500.13
##$BF7= 500.13
##$BF8= 500.13
##$BYTORDA= 1
##$CFDGTYP= 0
##$CFRGTYP= 5
##$CHEMSTR= <none>
##$CNST= (0..31)
1 1 145 1 1 1 1 1 1 1 1 1 1 1 1 1 1 1 1 1 1 1 1 1 1 1 1 1 1 1 1 1 
##$CPDPRG= <>
##$CPDPRG1= <>
##$CPDPRG2= <>
##$CPDPRG3= <>
##$CPDPRG4= <mlev>
##$CPDPRG5= <mlev>
##$CPDPRG6= <mlev>
##$CPDPRG7= <mlev>
##$CPDPRG8= <mlev>
##$CPDPRGB= <>
##$CPDPRGT= <>
##$D= (0..31)
0 2 0 0 0 0 0 0 0 0.06 0 0 0 0 0 0 0.0002 0 0 0 0 0 0 0 0 0 0 0 0 0 0 
0 
##$DATE= 1774619542
##$DBL= (0..7)
120 120 120 120 120 120 120 120 
##$DBP= (0..7)
150 150 150 150 150 150 150 150 
##$DBP07= 0
##$DBPNAM0= <>
##$DBPNAM1= <>
##$DBPNAM2= <>
##$DBPNAM3= <>
##$DBPNAM4= <>
##$DBPNAM5= <>
##$DBPNAM6= <>
##$DBPNAM7= <>
##$DBPOAL= (0..7)
0.5 0.5 0.5 0.5 0.5 0.5 0.5 0.5 
##$DBPOFFS= (0..7)
0 0 0 0 0 0 0 0 
##$DE= 6
##$DECBNUC= <off>
##$DECIM= 32
##$DECNUC= <off>
##$DECSTAT= 4
##$DIGMOD= 1
##$DIGTYP= 9
##$DL= (0..7)
0 120 120 120 120 120 120 120 
##$DP= (0..7)
150 150 150 150 150 150 150 150 
##$DP07= 0
$$ [...]
##$SUBNAM4= <"">
##$SUBNAM5= <"">
##$SUBNAM6= <"">
##$SUBNAM7= <"">
##$SUBNAM8= <"">
##$SUBNAM9= <"">
##$SW= 20.6817932712277
##$SWIBOX= (0..15)
0 0 3 0 0 0 0 0 0 0 0 0 0 0 0 0 
##$SW_h= 4139.07284768212
##$TD= 32768
##$TD0= 1
##$TE= 0
##$TE2= 300
##$TE3= 300
##$TEG= 300
##$TL= (0..7)
0 120 120 120 120 120 120 120 
##$TP= (0..7)
150 150 150 150 150 150 150 150 
##$TP07= 0
##$TPNAME0= <>
##$TPNAME1= <>
##$TPNAME2= <>
##$TPNAME3= <>
##$TPNAME4= <>
##$TPNAME5= <>
##$TPNAME6= <>
##$TPNAME7= <>
##$TPOAL= (0..7)
0.5 0.5 0.5 0.5 0.5 0.5 0.5 0.5 
##$TPOFFS= (0..7)
0 0 0 0 0 0 0 0 
##$TUNHIN= 0
##$TUNHOUT= 0
##$TUNXOUT= 0
##$USERA1= <user>
##$USERA2= <user>
##$USERA3= <user>
##$USERA4= <user>
##$USERA5= <user>
##$V9= 5
##$VALIST= <valist>
##$VCLIST= <CCCCCCCCCCCCCCC>
##$VD= 0
##$VDLIST= <DDDDDDDDDDDDDDD>
##$VPLIST= <PPPPPPPPPPPPPPP>
##$VTLIST= <TTTTTTTTTTTTTTT>
##$WBST= 1024
##$WBSW= 30
##$XGAIN= (0..3)
0 0 0 0 
##$XL= 0
##$YL= 0
##$YMAX_a= 378572
##$YMIN_a= -304870
##$ZGOPTNS= <>
##$ZL1= 120
##$ZL2= 120
##$ZL3= 120
##$ZL4= 120
##$ABSF1= 0
##$ABSF2= 0
##$ABSG= 0
##$ABSL= 0
##$ALPHA= 0
##$AQORDER= 0
##$ASSFAC= 0
##$ASSFACI= 0
##$ASSFACX= 0
##$ASSWID= 0
##$AUNMP= <proc_1d>
##$AZFE= 0.1
##$AZFW= 0.1
##$BCFW= 0
##$BC_mod= 2
##$BYTORDP= 0
##$COROFFS= 0
##$CY= 18.4799938201904
##$DATMOD= 1
##$DC= 0
##$DFILT= <>
##$DTYPP= 0
##$F1P= 9.9274215381318
##$F2P= -0.165520771350173
##$FCOR= 1
##$FTSIZE= 16384
##$FT_mod= 6
##$GAMMA= 0
##$GB= 0
##$INTBC= 1
##$INTSCL= 4.127829e-11
##$ISEN= 128
##$LB= 0.05
##$LEV0= 0
##$LPBIN= 0
##$MAXI= 10000
##$MC2= 0
##$MEAN= 0
##$ME_mod= 0
##$MI= 50
##$NCOEF= 0
##$NC_proc= -6
##$NLEV= 6
##$NOISF1= 3.799351
##$NOISF2= 2.8
##$NSP= 0
##$NTH_PI= 0
##$NZP= 0
##$OFFSET= 16.48848
##$PC= 4
##$PHC0= -256.1951
##$PHC1= -0.898437
##$PH_mod= 1
##$PKNL= yes
##$PPARMOD= 0
##$PSCAL= 4
##$PSIGN= 0
##$REVERSE= no
##$SF= 200.130005582386
##$SI= 16384
##$SIGF1= 3
##$SIGF2= 2
##$SINO= 400
##$SIOLD= 16384
##$SREGLST= <1H.CDCl3>
##$SSB= 0
##$STSI= 16384
##$STSR= 0
##$SW_p= 4139.07284768211
##$SYMM= 0
##$S_DEV= 0
##$TDeff= 32768
##$TDoff= 0
##$TI= <>
##$TILT= no
##$TM1= 0
##$TM2= 0
##$TOPLEV= 0
##$USERP1= <user>
##$USERP2= <user>
##$USERP3= <user>
##$USERP4= <user>
##$USERP5= <user>
##$WDW= 1
##$XDIM= 16384
##$YMAX_p= 315782187
##$YMIN_p= -870442
$$ End of Bruker specific parameters
$$ ---------------------------------
##NTUPLES= NMR SPECTRUM
##VAR_NAME=  FREQUENCY,     SPECTRUM/REAL,   SPECTRUM/IMAG
##SYMBOL=    X,             R,               I
##VAR_TYPE=  INDEPENDENT,   DEPENDENT,       DEPENDENT
##VAR_FORM=  AFFN,          ASDF,            ASDF
##VAR_DIM=   16384,         16384,           16384
##UNITS=     HZ,            ARBITRARY UNITS, ARBITRARY UNITS
##FACTOR=    0.252644378177508, 1,           1
##FIRST=     3299.83951724647, 0,            0
##LAST=      -839.233330435636, 0,           0
##MIN=       -839.233330435636, -870442,     0
##MAX=       3299.83951724647, 315782187,    0
$$ Real data points
##PAGE= N=1
##DATA TABLE= (X++(R..R)), XYDATA
$$ [...]
9080B7389463o040464m641280k856350k326354j513066r83015r12472q48727o36470
9071F631265m64311k07283m86562o21249L9272k14291k58759k2936k27786k59395
9061C907965P037j1363m44475J71972j05333j50523J4609J3771P4646j16904L6157
9050C397559k33909m2490j26178J10474r2604l35090j45260M9384r0605J57357
9040B648638l52255J80970k14784p5693J37529l6950q8625P6243J68922m2039
9030B401956j37677L12677r2596J06390P8145l1318J8571K7108M8345j16305l3907
9019B581389k10950J9070j92303J2108r2494j22886K7956J6594l28885J17262
9009A826861P7663J11085J21658m14821K74065N7941n1070m6571o7J5422j56383
$$ plain form
9080 27389463 21348999 16707719 13851369 11525015 10011949 9028934 8116462 7267735 6631265
9071 6631265 6166954 5959671 5473109 4851860 4891132 4676841 4418082 4395146 4167360 3907965
9061 3907965 3915002 3903639 3459164 3631136 3525803 3375280 3389889 3403660 3478306 3361402 3397559
9050 3397559 3163650 3121160 2994982 3105456 3012852 2677762 2532502 2581886 2491281 2648638
9040 2648638 2296383 2477353 2262569 2186876 2324405 2287455 2198830 2275073 2443995 2401956
9030 2401956 2264279 2576956 2484360 2590750 2668895 2637577 2656148 2683256 2731601 2615296 2581389
9019 2581389 2370439 2389509 2197206 2209314 2116820 1993934 2021890 2038484 1709599 1826861
9009 1826861 1904524 2015609 2137267 1722446 1996511 2054452 2003382 1956811 1956744 1972166 1815783
8998A815783J72471j57682K5225J72465r3369J72562p7531r8568n0390j579k03867
8987A675520Q7719K59766l72890M3757k9222K6418j45400J90905q2954j1035o3649
8976A578935m215J25532k34985L4650j28310K43904N966R079J43181j3242M399
8965A764894O0756J73014k47914L8051j42812L5016K8643j60290K3363j27693
8955A445028o0972K22246K7315k13265q2735o1173M9586J00112l7601r0590q1405
8944A216546K52239j77225k7394j53598J53631K3503K5568k03163K33495J6362
8934A359964p0251P012J67105q7305j6845n9015J78711k52521k6077L89898j18704
8923A471972k16750o1328J74190j07599q4411N3664j69401L3698j89321K43005
$$ plain form
8998 1815783 1988254 1830572 1855797 2028262 1934893 2107455 2029924 1931356 1880966 1879387 1675520
8987 1675520 1763239 2023005 1650115 1693872 1664650 1691068 1545668 1736573 1653619 1642584 1578935
8976 1578935 1574720 1700252 1465267 1499917 1371607 1615511 1621477 1630556 1773737 1760495 1764894
8965 1764894 1825650 1998664 1750750 1788801 1645989 1681005 1709648 1549358 1572721 1445028
8955 1445028 1384056 1606302 1633617 1420352 1337617 1276444 1326030 1426142 1388541 1297951 1216546
8944 1216546 1468785 1291560 1264166 1110568 1264199 1287702 1313270 1110107 1343602 1359964
8934 1359964 1289713 1296725 1463830 1376525 1359680 1300665 1479376 1226855 1200778 1590676 1471972
8923 1471972 1255222 1193894 1368084 1260485 1176074 1229738 1060337 1094035 904714 1147719
8913A147719k56374J79838K4117k70256J31247J15874P2841J15332j13280n7115
8903A089943J5695M2736M3302M7390l05212M12132q3987j67953N9740J5233l9622
8892A129397K29291q7179l8353M5482j84329J57011Q7960p7587L7065L0787k4227
8881A305318o8397O2971K9124Q4578j12396L45162m0869J74794j34597J62213
8871A807901P751J34872j40142j44804J12776k48440P4119j67615Q9177q2618
8861A442977j78357J17544k37304J87063q3278Q8713o7383o7766p1030J07106
8851A238285q910k0941J38497r1168P4273P0638j21488p0246J84954j68271J68563
8840A394186K4471j39344J5368P7986j36671J28395p7716K3880J01865j99544
$$ plain form
8913 1147719 891345 1071183 1095300 825044 956291 1072165 1145006 1260338 1147058 1089943
8903 1089943 1105638 1148374 1191676 1239066 933854 1345986 1261999 1094046 1153786 1169019 1129397
8892 1129397 1358688 1271509 1233156 1278638 1094309 1251320 1339280 1261693 1298758 1329545 1305318
8881 1305318 1236921 1299892 1329016 1413594 1301198 1646360 1605491 1780285 1645688 1807901
8871 1807901 1815652 1950524 1810382 1665578 1778354 1529914 1604033 1436418 1525595 1442977
8861 1442977 1264620 1382164 1144860 1331923 1248645 1337358 1269975 1202209 1131179 1238285
8851 1238285 1229375 1208434 1346931 1255763 1330036 1400674 1279186 1208940 1393894 1225623 1394186
8840 1394186 1418657 1279313 1294681 1372667 1235996 1364391 1286675 1310555 1412420 1212876
8830A212876O292p0849l1057J98924j97091P4070j35379P3854n1754l3661p6557
8819I69668J51779N1027k10404J19704R8600p4576j10174j30241J92043O376k5751
8808A038051j20285J194J02006k8085O0289J04209j49447J46873J59625j1302
8798A303128J43895k17328P8856k13313J9448j64275J36394j51151K11456j20870
8788A026240l2616P4410P6061l65011O265J94066j09690K68456j28425n9529j09029
8777H41198J04048N6886r1750J09303J40386k30005j66465J52137M0276J85297
8767A141311j01029o9387J1835j48468L7000p5771J43022J16374q0831J16375
8757A090431k56359K04749M3231P2264j81382P0548k4641P5973r4827q1517J32260
$$ plain form
8830 1212876 1219168 1148319 1117262 1316186 1119095 1193165 1057786 1131640 1079886 1046225 969668
8819 969668 1121447 1172474 962070 1081774 1180374 1105798 995624 865383 1057426 1063802 1038051
8808 1038051 917766 918960 1020966 992881 1053170 1157379 1007932 1154805 1314430 1303128
8798 1303128 1447023 1229695 1308551 1095238 1114686 950411 1086805 935654 1147110 1026240
8788 1026240 993624 1068034 1144095 779084 785349 979415 869725 1138181 1009756 950227 841198
8777 841198 945246 1002132 910382 1019685 1160071 930066 763601 915738 956014 1141311
8767 1141311 1040282 970895 982730 834262 871262 795491 938513 1054887 974056 1090431
8757 1090431 834072 1038821 1082052 1154316 972934 1043482 1018841 1094814 999987 918470 1050730
8746A050730j3500j62563J72365r9387J54551j37125N4444o1388Q6049l39J13405
8735A157242r4721o1234j3678J63838j286p2670J9624K7698k8683j42577J50672
8724A104225r0482L0153o5677k4675J22566J68321j33449J33564j39273l2545
8714A072728k82j52039J02611M9360j10066J82420j20083k28688J97422l1461
8704I61922j9100J01043j55527K23323J0627k51088K27999N7647k36732M4756
8694I64870r9895K9323J08092k06140J28147N9103j84822L14043k07329J42554
8684A047946j62510k8431J39012K7741r7196J77705l9631m4090K882j53873O8703
8673I38258R5470K03282K76420M212q1097r4368M156k02568O5086k47284o0941
$$ plain form
8746 1050730 1037230 874667 1047032 947645 1102196 965071 1019515 958127 1044176 1043837 1157242
8735 1157242 1062521 1001287 987609 1151447 1150161 1077491 1097115 1124813 1096130 953553 1104225
8724 1104225 1013743 1043896 978219 953544 1076110 1244431 1110982 1244546 1105273 1072728
8714 1072728 1072446 920407 1023018 1072378 962312 1144732 1024649 795961 993383 961922
8704 961922 942822 1043865 888338 1111661 1122288 871200 1099199 1156846 920114 964870
8694 964870 864975 894298 1002390 796250 924397 983500 798678 1112721 905392 1047946
8684 1047946 885436 857005 996017 1023758 926562 1104267 1064636 1020546 1023428 869555 938258
8673 938258 1033728 1237010 1513430 1517642 1436545 1342177 1346333 1143765 1208851 961567 900626
8662I00626N3873K49081k78605L3269Q2024k06469j2579J37539P5857k12849O3061
8651H84828K8482n4577K15562r6073K5262N7457j86618J7720J63723m3665J951
8640A014052j02772K7629Q155M7935J6560j74174K0297L5474J3152p2741J77382
8629A010949j23369J80207j58834M4221j78699K65564r3538n8771k0699p3956
8619G93075K07584K6634o4854J01793q3907j46243j9076J75261L5072j52548J67235
8608A040026r1002L2281j00874L5538o3585J06021k9791j42420J41511l4864l1737
8597H61104J56031j60031j2375m3638K12085k3748o5668M8241o1956O705R6245
8586A012995p2453R9172j17952r6003J56104k47239J43024J3957K7984J09172
$$ plain form
8662 900626 954499 1203580 924975 958244 1040268 833799 821220 958759 1034616 821767 884828
8651 884828 913310 858733 1074295 978222 1003484 1060941 874323 892043 1055766 1012101 1014052
8640 1014052 911280 938909 947064 994999 1011559 837385 857682 893156 906308 833567 1010949
8629 1010949 887580 1067787 908953 953174 774475 1040039 946501 887730 867031 793075
8619 793075 1000659 1027293 962439 1064232 980325 834082 815006 990267 1025339 872791 1040026
8608 1040026 949024 981305 880431 915969 852384 958405 928614 786194 927705 892841 861104
8597 861104 1017135 857104 844729 801091 1013176 989428 923760 972001 910045 916750 1012995
8586 1012995 940542 1039714 921762 825759 981863 734624 877648 891605 919589 1028761
8576A028761o4338M1544R8479J9802k27713K0366j59104J68949N8990N488P2369
8565A063593o2158K44816q8655p7374N4501j72529j74636L68650l95457J22016
8555H82767Q0877q9873K19525k0805l3221j49144p6737J06902l504J49186p0197
8544I95776K19287j85891j53925J70995J20061k93036K59830M13J62062J034253
8534B329825j612797l06664M16679j89575J40217q7837L11442j54787L5119n4536
8524H27086O333L7570N1033l2035q5037r6134K44810j52671J5812j38372K64031
8513I42426k12083l046K56438j04280j51811P1277J54306l0684o5706R9386K35138
8502A191361j65142K7157j14711n5076Q7941j59836q4100K52308k2040r9324q3008
$$ plain form
8576 1028761 964423 1005967 1104446 1124248 896535 916901 757797 926746 985736 991224 1063593
8565 1063593 1001435 1246251 1157596 1080222 1134723 962194 787558 1156208 760751 882767
8555 882767 963644 873771 1093296 1072491 1039270 890126 813389 920291 916787 1065973 995776
8544 995776 1215063 1029172 875247 1046242 1166303 873267 1133097 1133510 1295572 2329825
8534 2329825 717028 410364 827043 637468 777685 689848 1001290 846503 881622 827086
8524 827086 833419 870989 922022 889987 804950 708816 953626 800955 816767 678395 942426
8513 942426 730343 727297 983735 879455 727644 798921 953227 922543 856837 956223 1191361
8502 1191361 1026219 1053376 938665 883589 971530 811694 727594 979902 957862 858538 775530
8491G75530k2250J07211J155J23012l15472J65958n8839J16607k5769N2391j53653
8480G65881J67545P6637j5225j54771O9563q4862j20960J07227J20013p8542l2162
8469H20344R2185j11225J28012j00887p083J32927K922j24506m5492p8820P6967
8458G85344Q674Q7792K309n0109J17669r4650k4281k19079K05961j81361K27639
8447H65908N5831p7277J06870j09504j63779J16034o8047J02452J02708o0784
8437H70412j12882K50703N9518j44394j12605R6040j24827Q5623j75698J21413
8427H13303p2082J64901l5438Q3356j15507j19731N1784P88q0477M7015J54188
8416H92100O4024j44974R0903j87342P304P5356P7799P0775j10660k1385k00525
$$ plain form
8491 775530 753280 860491 861646 984658 669186 835144 776305 892912 867143 919534 765881
8480 765881 933426 1010063 994838 840067 909630 824768 703808 811035 931048 852506 820344
8469 820344 912529 801304 929316 828429 821346 954273 957195 832689 787197 708377 785344
8458 785344 794018 881810 884119 834010 951679 857029 832748 613669 819630 638269 865908
8447 865908 921739 844462 951332 841828 678049 794083 726036 828488 931196 870412
8437 870412 757530 1008233 1067751 923357 810752 906792 781965 867588 691890 813303
8427 813303 741221 906122 870684 954040 838533 718802 770586 771374 690897 737912 892100
8416 892100 956124 811150 902053 714711 722015 797371 875170 945945 835285 813900 613375
8405F13375J98921J7190J9791l2712J9311q5415Q6802l189o2037J03739k24182
8394F51594R90L45139l72486Q7193j75649J73167J85723p3685r0303O4915K07478
8383A004076l5792j78713j62855K39898k8098k15012J64877R6580j70123j2389
8373G02449n8987M2505j8120K23509k38696J44301M5878k80354J84321J36312
8363H83118j10689O327N171Q6741k660j85697p3841J02830R3624k0728M8377j28347
8351G04226J04684p6104q6417K89525l16396K01698J0660R436M1283j76156k29710
8340D76729K62494q3907L9223J3492p1511l060K18856J9175j74807J11661k04485
8329F03860Q7369Q0791J32268j22026o5691M2742J32753k03296J10661m1484j49709
$$ plain form
8405 613375 812296 829486 849277 816565 835876 750461 837263 834074 772037 875776 651594
8394 651594 652584 997723 625237 712430 536781 709948 895671 821986 731683 796598 1004076
8383 1004076 968284 789571 626716 866614 838516 623504 788381 884961 714838 702449
8373 702449 643462 685967 667847 891356 652660 796961 842839 562485 746806 883118
8363 883118 772429 778756 783927 870668 868008 682311 608470 711300 804924 784196 832573 704226
8351 704226 808910 732806 646389 935914 619518 821216 831876 841312 882595 706439 476729
8340 476729 739223 655316 694539 708031 636520 633460 852316 871491 696684 808345 603860
8329 603860 691229 772020 904288 782262 716571 759313 892066 688770 799431 757947 608238
8318F08238J51949m055l86099L33068R0791n8321L669o4855P5231k14311K47727
8307G83032j23239l9473J48626m0512l11435L05407J32652k17136Q8139j02909
8297F23152J1298j02627J23363J46588L0218j68438l555j12029j3154M3307K1231
8286E99354j4712o4079N2628r7660Q4411J19858N7888j74588M4620p0855K11606
8275G48471K7752j25219j59378k1798j5843K29640o4009J1795j7773j13006K30647
8264G31279o1653q4448j50966K78668k79041M0272M5931J55329m0426q0212J50262
8253G04995j42395J05215j41404O2588q2724K1657J33355j11254J08110l2639
8243F25504n1796n3558J79027j86444j8491J77867l3383m0634k1687k9729J24588
$$ plain form
8318 608238 760187 756132 370033 703101 793892 735571 739240 674385 749616 535305 783032
8307 783032 659793 620320 768946 728434 416999 722406 855058 637922 726061 623152
8297 623152 634450 531823 655186 801774 831992 663554 659999 547970 534816 578123 599354
8286 599354 584642 520563 573191 475531 559942 679800 737688 563100 607720 536865 748471
8275 748471 776223 651004 491626 469828 453985 683625 619616 631411 613638 500632 731279
8264 731279 669626 585178 434212 712880 433839 474111 520042 675371 634945 554733 704995
8253 704995 562600 667815 526411 588999 506275 527932 661287 550033 658143 625504
8243 625504 573708 520150 699177 512733 494242 672109 638726 598092 576405 546676 671264
8232F71264k468k07221Q08J25817l324J31040K9114l73174L11555k76042O8678
8221D76047Q3088j45438K07617n2359j34034O7244J26094l11514J50671R9131
8211E66547R6047j94959J4321J19460m7529Q9421l9125J6568P8778l65126K50723
8200E85126K5927j62158L35375k1454o646j38893k3472M43244j676132R65011
8190C25928M703J71215r0456P8195J36070j79821K65701j54287r4710J89342q2054
8179E69826Q8078j93816j6971O4618J77649k66572J32541J2147P258N933j86552
8168C94139J87728K4029r9754O6818Q2562J39117j68163J72669J33567R1972K27830
8157A252514j90733M9421R90L2559R7995L4736J82995j19378k0008K6991j50205
$$ plain form
8232 671264 668796 461575 462383 588200 584876 715916 745030 371856 683411 407369 476047
8221 476047 559135 413697 621314 568955 434921 502165 628259 316745 467416 566547
8211 566547 662594 467635 481956 601416 553887 643308 604183 620751 699529 334403 585126
8200 585126 611053 448895 784270 762816 756170 617277 593805 1037049 -639083 325928
8190 325928 330631 501846 411390 489585 625655 445834 711535 557248 462538 651880 569826
8179 569826 657904 464088 447117 511735 689384 422812 555353 567500 574758 580691 394139
8168 394139 581867 605896 506142 572960 655522 794639 626476 799145 932712 1024684 1252514
8157 1252514 1061781 1111202 1112192 1144751 1242746 1277482 1460477 1341099 1321091 1348082 1197877
8146A197877j34627N6741j12309n2711K36785l81709p7059m9104N5037r732o6438
8135F62751R070q4017J43021j83308Q3011o7700J6284l0633J04983j54354L36484
8124H35592l56877K39870j56197P0368r7890l7903k4705J17904n0788J39017Q5533
8113G63924l05745J122J78062l53796K54772m944j28807J05702N346j65341N6599
8102D06894Q1388l09236J38334K6558M7469J9102r7548K03463j04649J13007j17476
8091D07306p7469o9041r912J63815p2697o5397R6622N8096M951r6123r4564J00664
8079C46251q1516p6402J94013p9675j06851K68040j69979p3623L2742J09345Q4510
8068D46855q3136j5361P232P9319j54403R3927J5064o6032j3368M9231L0280k9041
$$ plain form
8146 1197877 1063250 1119991 1007682 954971 1191756 810047 732988 683884 738921 729189 662751
8135 662751 671821 587804 730825 547517 630528 562828 579112 548479 653462 499108 835592
8124 835592 478715 718585 562388 632756 534866 496963 472258 590162 539374 678391 763924
8113 763924 458179 459301 637363 283567 538339 533395 404588 510290 515636 350295 406894
8102 406894 488282 179046 317380 343938 391407 410509 312961 516424 411775 524782 407306
8091 407306 329837 260796 250884 414699 342002 276605 373227 431323 436274 340151 245587 346251
8079 346251 264735 188333 382346 302671 195820 463860 293881 220258 253000 362345 446855
8068 446855 363719 348358 355590 434909 280506 374433 389497 323465 310097 359328 389608 360567
8056C60567j51676J38591j5770j9331J76968l0434j46217j0413N9254O9566j52558
8045B78547j01444J18337M1559j62549J15851k54169K98518J49713j51290l9557
8035B93516n0083J6732n6015J83872L339J1448r1950q5529J45200j97739Q0451
8024B53242l496j33604K01210o2406K14837k55160O3958P0421k36301L28404k71805
8013A69300K68577r7126l57321J93319Q8917L4853m7220j80791L59010k06498
8003B25020J64282j67634L6296o6976L34923m95894J94089k1552J11553k5183
7993B88924J6713j67965K6947R5250M534r6231Q5899j15408K04463m6388Q6902
7982C83640k00126O236L9129Q1980r2124P3384o4517l2416M3048p885o7546o5166
$$ plain form
8056 360567 208891 347482 331712 312381 489349 458915 312698 302285 361539 431105 278547
8045 278547 177103 295440 336999 174450 290301 36132 334650 484363 333073 293516
8035 293516 243433 260165 204150 388022 391361 402809 310859 225330 370530 172791 253242
8024 253242 249746 116142 317352 254946 469783 214623 278581 349002 112701 441105 169300
8013 169300 437877 340751 -16570 176749 265666 300519 253299 72508 431518 225020
8003 225020 389302 221668 257964 190988 525911 30017 224106 202554 314107 288924
7993 288924 305637 137672 164619 259869 264403 168172 254071 138663 343126 296738 383640
7982 383640 183514 189750 228879 310859 218735 292119 227602 195186 238234 230349 162803 97637
7970I7637p1620M3589K21732Q2965k40839L1423R0248j22881L4134K31784k41656
7959A56516J99128j60124R0621j57271P5561P13M0811r6736J30283m2260q1881
7948A55361P7294K512q5896O3436j1540m8107N4840R2851j26574j43257L21715
7937C52635j53391J57141j57283j57225K37337o3339l8458K23138q5031r0530
7927B24994P3444K3619j2901R4750k48169n6081K76678p034J46063l03580j26119
7916H5664R7283O7883L9418k5086j44367O1022O994Q617J4438N0666l6732N3054
7904B78854Q5751k62839K19249k8248l14744L98968o3852p7838j02397k892l0400
7893I9612J54184k38183L09442L6559k43469K33593l71730P1820J64338l24l5461
$$ plain form
7970 97637 26017 69606 291338 374303 133464 164887 255135 132254 166388 398172 156516
7959 156516 355644 195520 286141 128870 204431 205144 245955 149219 279502 237242 155361
7948 155361 232655 235167 149271 212707 201167 153060 207900 300751 174177 30920 352635
7937 352635 199244 356385 199102 41877 279214 215875 177417 400555 315524 224994
7927 224994 298438 322057 309156 403906 155737 99656 376334 369300 515363 211783 85664
7916 85664 182947 250830 290248 265162 120795 181817 188811 197428 211866 262532 225800 278854
7904 278854 364605 101766 321015 292767 -21977 376991 313139 235301 132904 130012 99612
7893 99612 253796 15613 325055 361614 118145 351738 -19992 51828 216166 215842 180381
7882A80381o7757J67924j21581Q0745K3620q0659R9356p3779J32140k42017J79371
7871B77744j31844J47437r6114k22899J82120M2402q52k3027k60735L26102j83305
7860E7029P9309J6280l5585j93465M30487k42614O2024J66952l2492j80814J34061
7849B61172J21002k63950o8315J42777j5975Q2045j18970p1508n7447R3263j89521
7838h5427K31433M6398q4065J1086J82259k44742j2951O8966L9820q2473K66353
7827C36657j08590n318J4736k29642M1556M8767j31873r90K13798J56630j85860
7816A49871j00408P4548J61504j83753j06026J65113j85550K25623p7842K33183
7806C56263k21253l8034k92524K43622K15652j46580j12770o6505J43852J09915
$$ plain form
7882 180381 112624 280548 158967 239712 263332 182673 282029 208250 340390 98373 277744
7871 277744 145900 293337 197223 -25676 156444 198846 197994 174967 -85768 240334 57029
7860 57029 136338 152618 117033 -76432 354055 111441 173465 340417 307925 127111 261172
7849 261172 382174 118224 49909 192686 176711 258756 139786 68278 10831 104094 -85427
7838 -85427 146006 192404 108339 119425 301684 56942 43991 112957 152777 70304 336657
7827 336657 228067 222749 237485 7843 49399 98166 -33707 -34697 179101 335731 149871
7816 149871 49463 124011 285515 101762 -4264 160849 -24701 200922 123080 356263
7806 356263 135010 96976 -195548 48074 263726 117146 4376 -62129 81723 191638
7796A91638k07794J11876J10107r4045O5323j76624J49539k5271M7139j5361P7363
7785B33890M680m358J85818j49395l3144K0311j05915n2439J60138p5315J9545
7774B03816J39548j05801j80796J60278j50425M6599k53156k08811L37845j59262
7764a70165J0574J14419l3469j13475J47019j4106K42016J21980l4786l8287Q4996
7753C16716l06307L59722j16069p5744n561K08079k24551O0882l6098J77614j61378
7742A97305j03698j34206J73153j6436N2391J07439r7997p1529m3642j13705J12044
7731F1119k36760L41012j54178j2737J15632J22393n7212J41074j22497r3942
7721A03904r9844r1962k62569N02057N2226L7556k78647J31431j30713j0887R9477
$$ plain form
7796 191638 -16156 95720 205827 111782 177105 481 150020 124749 171888 156527 233890
7785 233890 238570 234212 420030 270635 237491 257802 151887 99448 259586 184271 203816
7774 203816 343364 237563 56767 217045 66620 113219 -139937 -348748 -10903 -170165
7764 -170165 -159591 -45172 -78641 -192116 -45097 -59203 182813 304793 270007 231720 316716
7753 316716 10409 370131 254062 178318 172757 380836 156285 217167 181069 358683 197305
7742 197305 93607 -40599 132554 116118 168509 275948 177951 106422 62780 -50925 61119
7731 61119 -175641 165371 11193 -1544 114088 236481 179269 320343 197846 103904
7721 103904 4060 -87902 -350471 151586 203812 241368 -37279 94152 -36561 -47448 52029
7710E2029M376P7259J60330j47085l4451o0949M4040j9983o5516K05755p7k96461
7698h0733J14079J66275k79448J08653J62611j33644p8980R4537r4480l727L8241
7687A3384j3912J26099r6586r4329l750Q7518J19346k09476K24430o1746k7415
7676F3563j0488j7366M7238M0038j47366j06866J93907L3758m1018Q0774k03104
7665f6930K18285j60955p7040K00480K0487N011M0966n3544l387l897p2332j9596
7653B7548o6274m6330Q6791J15054Q4383p1367j29273J89226k23108J53964K8933
7642A49547P6240n3236j85033j7790J58010m1413J09414k01917J54383m7588L4630
7631A35247o3012J33888j01929o8222k4922L5746K24001j25004j13418L19534
$$ plain form
7710 52029 56405 133664 293994 146909 112458 51509 95549 75566 10050 215805 215728 -80733
7698 -80733 33346 199621 -79827 28826 191437 57793 -21187 73350 -21130 -24857 13384
7687 13384 -528 125571 28985 -65344 -69094 18424 137770 -71706 152724 90978 63563
7676 63563 53075 35709 82947 122985 -24381 -131247 62660 96418 55400 136174 -66930
7665 -66930 151355 -9600 -86640 113840 134327 139338 180304 126760 123373 119476 47144 27548
7653 27548 -38726 -85056 1735 116789 201172 129805 532 189758 -33350 120614 149547
7642 149547 225787 172551 -12482 -30272 127738 86325 195739 -6178 148205 100617 135247
7631 135247 72235 206123 104194 35972 11050 46796 270797 145793 32375 351909
7621C51909l28176J41585o02r6851R6070J9507j46565M6435J09981j25427q3419
7610a5553J43496L989N4167j92577N2538j8506K05552r1097n7812R4377l80930
7599b02356L52057J75087k97217K25279j53593J01456J67026j37284J1333q7351
7589A54437j38256K60094Q4505k07725N8405j39868K75696q7282n8975l161l8675
7578A59195L325J46383M8072o7992j63430J20442N9915j87555K45090J8357j1822
7567C69980m0625j82674O0416J66676j47070J7788l4455J63735j64507p5448J66620
7556C00436j44258J02426j42900K72509k1898q1992j06716k4837L9518q445r2517
7545I1326j90424K27416r8975L29913k19680L6580L3216j6344q246N8269k51522
$$ plain form
7621 351909 23733 165318 164716 67865 163935 183442 36877 83312 193293 67866 -15553
7610 -15553 127943 131932 186099 -6478 46060 27554 233106 142009 84197 178574 -202356
7599 -202356 149701 324788 27571 252850 99257 200713 367739 230455 241788 154437
7589 154437 16181 276275 360780 153055 211460 71592 347288 260006 201031 197870 159195
7578 159195 162520 308903 356975 288983 125553 245995 305910 118355 363445 381802 369980
7567 369980 329355 146681 207097 373773 226703 244491 210036 373771 209264 133816 300436
7556 300436 156178 258604 115704 388213 366315 284323 177607 152770 192288 183843 91326
7545 91326 -99098 128318 29343 359256 139576 176156 209372 193028 184782 243051 -8471
7534h471J24902J88356j87111j7095n1306J06627j21201j53373K93968j06458
7524F8838j63810M6665k1323J32124k6831O3848p5845p0552J92489K9936j56469
7513A9070J35152L5693j54023J38125N1630l9597O0451j36220m4308j42777M9965
7502b6839K5057p7767J07929J06439j2744k7449N9730k14286J95113N4060j52273
7491C6970L63L5890J01823P2248n8743m2643M1347k81788J21436J18495L0214
7480A75612k9037K01642k85260O4577j54511j8044J85197O3680j80072K33376
7470B57160j78361Q7574L6131M6582N7213j678q9716J4619o3736j58469K35929
7459B43248R4422k39210R5670J27419l66979K92415k6193l6538q6932J56089J9066
$$ plain form
7534 -8471 116431 304787 117676 100581 49275 155902 34701 -118672 175296 68838
7524 68838 -94972 -48307 -69630 62494 35663 99511 23666 -46886 145603 175539 19070
7513 19070 154222 189915 35892 174017 225647 186050 246501 110281 65973 -76804 -26839
7502 -26839 -1782 -79549 28380 134819 122075 94626 154356 -59930 135183 189243 36970
7491 36970 37333 73223 175046 247294 188551 145908 187255 -94533 26903 145398 175612
7480 175612 146575 348217 62957 127534 -26977 -45021 140176 203856 23784 257160
7470 257160 78799 166373 202504 249086 306299 304621 214905 229524 165788 7319 243248
7459 243248 337670 98460 194130 321549 -45430 246985 220792 184254 97322 253411 272477
7448B72477j357j61491L9999M38868m06606K5642J27826j37852l2149N5807p9912
7437A41252P2484m7853K13029J24789k07971J83318j14112R71r3233Q8351q8834
7426B72191J32554N1622l6966P8140M6600k26352J31177J55268k6306q5152p045
7415D85731J47576O6260j47771J57039o903k14120l1323K84426j79956N8342j14938
7404E04363J70226k25309K1410m5915J73561p1481k83354L26727j46414K03175
7394F26989N839j98271r7693Q5381J17847j93202J3199R0862k1131K34665k61165
7383D03320L3732l22j33937J97204j59916p239J94769k69163K18001k6605j15884
7372C33960J25355Q9064j94802L1557j60136j66439J80794Q7219k53459O3451
$$ plain form
7448 272477 271120 109629 149628 588496 181890 207532 335358 197506 165357 221164 141252
7437 141252 213736 165883 378912 503701 295730 479048 364936 365907 272674 361025 272191
7426 272191 404745 456367 419401 497541 544141 317789 448966 604234 577928 492776 485731
7415 485731 633307 699567 551796 708835 701932 487812 456489 740915 560959 619301 504363
7404 504363 674589 449280 470690 424775 598336 526855 243501 570228 423814 626989
7394 626989 632828 434557 336864 422245 540092 346890 360089 450951 429820 664485 403320
7383 403320 437052 436730 302793 499997 340081 332842 527611 258448 476449 449844 333960
7372 333960 459315 548379 353577 385134 224998 58559 239353 326572 73113 136564
7362A36564o3635J89202J79601m24140K43120K18729k06768M2532r1930n1463
7352A71812L41831l76077P1879J27687j78254J4149J47713j00346n1998m6621
7342A21775L7740r9572J92939L3890k15750M5178m6057N9161j73032L0990l9556
7331e2294N8302j1113K58577j59470J01693p6512j8453j70827L38663k39421J33178
7320A62323J1640j83511q8099K99087j67520J38368n2215j26150R4590j24314
7310c5801k9795P2904j04519K23202L6624j81648N2021O447j23741J15752R9950
7299A31396l5113p700K35748j51479m4459J10693k24780Q909n0044j1482L08781
7288B70470l00145N340J92859p6709O1051p5274K73810r6885K4074o0839j41160
$$ plain form
7362 136564 72929 262131 441732 17592 260712 479441 272673 315205 223275 171812
7352 171812 513643 137566 209445 337132 158878 173027 320740 220394 168396 121775
7342 121775 159515 59943 252882 286772 71022 116200 70143 129304 -43728 -12738 -52294
7331 -52294 6008 -5105 253472 94002 195695 119183 100730 -70097 268566 29145 162323
7320 162323 173963 -9548 -97647 201440 33920 172288 120073 -6077 88513 -35801
7310 -35801 -65596 7308 -97211 125991 162615 -19033 32988 39435 -84306 31446 131396
7299 131396 96283 88583 324331 172852 128393 239086 14306 23215 -26829 -38311 270470
7288 270470 -29675 -24335 168524 91815 152866 77592 351402 254517 278591 217752 76592
7277G6592j20456J00128K02112j83671j80258J91890O7961l40004J01839m7876
7267a31743J65641j58130J80763n9918J71800o3479N904j28887J32321P2471j30763
7256E5980K42675k73475M04559k69843J13453J08025L2436Q2989j09991n2318
7246C34490j11011l1206J30435j48894K24742j05531P3472O5650k5826n0304n619
7235C50398L0150l1417j12149o1696r491j34224J471Q2397j21765K26928m49596
7224b28994K84560r8891N5803K1282k66634J71498j02554N2799J2742P7510M3928
7213B3049J33237K7540j46959J41538r8473J39051J992J2892j34426l2405l5874
7202C1162M22606m27004O9150q0651J37952L6944J14926j65544K06656k67923
$$ plain form
7277 76592 -43864 56264 258376 74705 -105553 86337 154298 -185706 -83867 -131743
7267 -131743 33898 -124232 56531 -3387 168413 104934 110838 -18049 114272 186743 55980
7256 55980 298655 25180 429739 159896 273349 381374 413810 496799 386808 334490
7246 334490 223479 192273 322708 173814 398556 293025 366497 432147 406321 356017 350398
7235 350398 380548 349131 236982 175286 165795 31571 33042 115439 -6326 220602 -228994
7224 -228994 55566 -43325 12478 33760 -232874 -61376 -163930 -111131 -98389 -20879 23049
7213 23049 156286 183826 36867 178405 79932 218983 220975 233867 99441 67036 31162
7202 31162 453768 26764 95914 15263 153215 190159 305085 139541 346197 78274
7192G8274J57810q8592l481p5274K1398O822j45676J67072k31769K9465j49173
7181b33124L20587j67971j63656K35437k6837P7103l3395j58104j0712R7217o6261
7170a29716J0190J42826k63109L25377k16228R9499k00558K16059k04374K37916
7160A7882j26809P5669q7332L9097Q6598J2344j00531j21789J3633K83254n717
7149H6299j38570N122j38994L76462k71910n2410r660Q728n5718l0574j34232
7138c55457O4445K48373j03698j79692P1714J75436n9045L8729l9600r3198J93406
7127c8587j76497K65218n9487J738k20002K13744j4017k41802J76251Q887K5172
7116e9382M6953j36070q7957J47026K42953l52811Q7669L00162l42961J30649
$$ plain form
7192 78274 236084 147492 144011 68737 90135 96957 -48719 118353 -113416 -83951 -233124
7181 -233124 87463 -80508 -244164 -8727 -35564 41539 8144 -149960 -160672 -63455 -129716
7170 -129716 -119526 23300 -239809 85568 -130660 -31161 -231719 -15660 -220034 17882
7160 17882 -108927 -33258 -120590 -81493 5105 17449 -83082 -204871 -191238 92016 86299
7149 86299 -52271 -47149 -186143 190319 -81591 -134001 -143661 -134933 -190651 -221225 -355457
7138 -355457 -291012 -42639 -146337 -326029 -254315 -78879 -137924 -99195 -138795 -231993 -38587
7127 -38587 -215084 50134 -9353 -7615 -227617 -13873 -27890 -269692 -93441 -84554 -59382
7116 -59382 -12429 -148499 -236456 -89430 153523 -199288 -111619 188543 -154418 -23769
7106b3769j10989J65269p8458P32l4623J61521k17002l358J04716O1100j86854
7095a61715J96441o4224m5584j09257J30923J99978Q7314l11600K22523o6989
7085G7810q6692R0034m6673J00588J31129j85929o83l8034k0953P1149j13112
7074b1366J14589k7872o38K0742j65042K34842p1980Q091j642N5912M5656l092
7062A88200o0305J17345j47994M0158M0029K1449k036M425R8216J7183K12284
7051E28954k26691M8696J01539J24402J65587J62739P7498K04319L80510M90396
7041B057949M70930j02728k60557j37218n71773k60758j8874l0034l73206l1846
7031G41885l01799J47920m1308j15148j65137J22677m8314J24884j17822J09281
$$ plain form
7106 -23769 -134758 30511 -47947 -47215 -81838 79683 -137319 -140677 -35961 25139 -161715
7095 -161715 34726 -29498 -75082 -184339 -53416 146562 233876 -77724 144799 77810
7085 77810 -8882 81152 34479 135067 266196 80267 79584 41550 20597 91746 -21366
7074 -21366 93223 65351 64713 85455 -79587 155255 83275 91366 89724 145636 191292 188200
7062 188200 127895 245240 97246 137404 177433 198882 196846 201271 299487 316670 528954
7051 528954 302263 350959 452498 576900 742487 905226 982724 1187043 1567553 2057949
7041 2057949 2528879 2426151 2165594 2028376 1456603 1195845 1176971 1146937 773731 741885
7031 741885 440086 588006 546698 431550 266413 389090 340776 465660 347838 457119
7021D57119j54164J21464L7282k47760J5763p9602j2010L8198j8812K6061k38572
7010e5033L23662j18577k1416J20854k19337P7021p4805N9150R0143j40866M2939
6999H3735N0544o2191j60075K49763k70449K55249j79209k8409J99844j05564
6989C3238J12219k13428J73626j23369Q8438j74230M227j6442J9846J60490j38588
6978g3973m9633J04478Q2599k49501K81847R43j01611J44600n4717k5497K4016
6967H3551k00259K37792o1366r1652m9969K5111J74279j71225J39526r7305j3994
6956b5511O7710j12946K29266l92334J68580O6529J6675K6683N3467k41424J68747
6945B5442j42772P641r642m6952M4630L68936l37912L48036j15178Q3141J24978
$$ plain form
7021 457119 302955 424419 461701 213941 229704 150102 138092 176290 157478 183539 -55033
7010 -55033 268629 150052 128636 249490 30153 107174 32369 91519 181662 40796 83735
6999 83735 134279 72088 -87987 161776 -108673 146576 -32633 -61042 138802 33238
6989 33238 145457 -67971 105655 -17714 70724 -103506 -99279 -115721 -95875 64615 -73973
6978 -73973 -123606 -19128 63471 -186030 95817 96760 -4851 139749 85032 59535 83551
6967 83551 -116708 121084 59718 -31934 -81903 -56792 117487 -53738 85788 -11517 -25511
6956 -25511 42199 -70747 158519 -233815 -65235 1294 17969 44652 98119 -143305 25442
6945 25442 -117330 -109689 -119331 -166283 -121653 247283 -90629 257407 142229 225370 350348
6934C50348j89690K0542o3199O8509j37203j08198K52419k32882M9136O5321r5813
6923b0710J15529n9392r670J80710r6481j02585K602m7070L9415l5141J07685
6912G4892j06163j718K10959q7021N8526q8505K70863m7974J54590K14108M2072
6901F94629M6328j91007l9532k09406K68597k39731M7198r9002Q858O7278m5313
6890C08897k41214L73925k95247J51236j06099J59240j50351K22334k90412J3640
6880A45949L36385k32925m8358L5925R9473K2573J3572p736j05804P7005K6854
6869C62913J13934l7503J63796K4297R3391k90117p6512J46459q2029j62053J9214
6858B75790J649O2793j69306K05819r7530j82914K10268J0901j31099k55001J83212
$$ plain form
6934 350348 160658 181200 118001 186510 49307 -58891 193528 -39354 9782 75103 -20710
6923 -20710 94819 35427 25757 206467 109986 7401 10003 -37067 2348 -32793 74892
6912 74892 -31271 -32989 177970 90949 149475 60970 331833 283859 438449 652557 694629
6901 694629 740957 549950 510418 301012 569609 329878 377076 278074 286932 354210 308897
6890 308897 67683 441608 146361 297597 191498 350738 200387 422721 132309 145949
6880 145949 482334 249409 201051 236976 336449 359022 372594 364858 259054 336059 362913
6869 362913 476847 439344 603140 627437 720828 430711 354199 500658 418629 256576 275790
6858 275790 277439 340232 170926 376745 279215 96301 306569 317470 186371 -68630 114582
6847A14582Q9809J75420l08676J26303J9908l8173Q7735k71041K0237J88567P8244
6836B82915j18176j97076J19760L2561K524p4913J44171M0959k2638q6146J08514
6825B32455l6584K5470k653p9926J32959R221r3863J15043k17213L13916j57778
6814B41047N9442L805m3992l7868j4904J02486n6126j95761K56262K3179L7521
6803C75091m2955J43452J28022j5656L00834l3780m4495M62975L04678j0195K30083
6792A798054k75457m4898k97675j20419j04976m2863k13577j0312J68111j22324
6782G33664O2902k1787j71200O8995J31761j03645n0121L3217P1805N0515J26447
6771I32553J32032J86799M1862K12680M45756M19741J73994k7597J57981k64801
$$ plain form
6847 114582 204391 379811 71135 197438 217346 179173 266908 -4133 16104 204671 282915
6836 282915 164739 -32337 87423 119984 122508 47595 191766 232725 210087 123941 232455
6825 232455 195871 221341 218688 138762 271721 280942 187079 302122 84909 398825 241047
6814 241047 300489 304294 260302 222434 207530 310016 253890 58129 314391 337570 375091
6803 375091 332136 475588 603610 587954 888788 855008 810513 1273488 1578166 1567971 1798054
6792 1798054 1522597 1477699 1180024 1059605 954629 911766 698189 687877 855988 733664
6782 733664 796566 774779 603579 672574 804335 700690 650569 683786 755591 806106 932553
6771 932553 1064585 1251384 1293246 1505926 1951682 2371423 2545417 2517820 2675801 2411000
6761B411000J4009P7386L5900m56606j65215k14118l85148N5938r4247r0022J16739
6750A305616j48675M529M9893n9809J2895j71530J64236M1986M088O4298l3701
6739A233826n5558J31629L05026K68069K82470K86462K23856l05004p22m05585
6729A964469l38684R2817k75399l82715J66832J7534n3901j46421j4585j4955
6719A014992J06615K40302M2889L3378j88512R5363k61663j07479K19036J30500
6709A325421q7501j4540p0152m2375J072m62288K52934L35717k54690K99199l18702
6698I64095J27452j6173J58070k30481J12482j94324m5469K31622k60670J12837
6688I59441q8708l6430J07593j45626L20546k36980J46213J32658R5783N9679
$$ plain form
6761 2411000 2425009 2502395 2538295 2081689 1916474 1702356 1317208 1373146 1278899 1188877 1305616
6750 1305616 1156941 1161470 1211363 1151554 1164449 992919 1157155 1199141 1203229 1267527 1233826
6739 1233826 1178268 1309897 1614923 1882992 2165462 2451924 2675780 2370776 2370054 1964469
6729 1964469 1625785 1718602 1443203 1060488 1227320 1244854 1190953 1044532 1029947 1014992
6719 1014992 1121607 1361909 1404798 1438176 1249664 1345027 1083364 975885 1194921 1325421
6709 1325421 1237920 1223380 1153228 1110853 1111925 649637 902571 1238288 983598 1282797 964095
6698 964095 1091547 1075374 1233444 1002963 1115445 921121 875652 1107274 846604 959441
6688 959441 870733 834303 941896 796270 1116816 879836 1026049 1158707 1254490 1314169
6678A314169j73927J81394k80017k7899n752q6129L6856N7622J7890j62141J15064
6667I87130k06504O3406J5976l3940Q7317N9104Q7827n8149K27600p8466K20263
6656A371564k28210J229m287j75072O4141l0192j9720M6317j51989k2035J15744
6645I67490r2258k72630M67896r0331j16128j39168K2626J04052J58377j58264
6635H51662k6256R6230J45101M8854n4127M8979J0097l3071k23636J44814p6611
6624I32036J50370L5088J0523J74099j54603M6124r1309j3196m8878J16828j1935
6613A145147n9970K42672J93036P2040r669J12143k77681K18306l5069P9214k97805
6602A382364J63738j56678m1254k890o2928J60565j68060K25606K43594j66494
$$ plain form
6678 1314169 1140242 1321636 1041619 1013720 1007968 921839 958695 1016317 1034207 872066 987130
6667 987130 780626 844032 860008 826068 913385 972489 1060316 1002167 1229767 1151301 1371564
6656 1371564 1143354 1144583 1140296 965224 1029365 999173 979453 1025770 873781 851746 967490
6645 967490 875232 602602 1070498 980167 864039 724871 747497 851549 1009926 851662
6635 851662 825406 921636 1066737 1115591 1061464 1110443 1120540 1087469 863833 1008647 932036
6624 932036 1082406 1117494 1128017 1302116 1147513 1193637 1102328 1089132 1040254 1157082 1145147
6613 1145147 1085177 1327849 1520885 1592925 1583256 1695399 1417718 1636024 1600955 1680169 1382364
6602 1382364 1546102 1389424 1348170 1345280 1282352 1442917 1274857 1500463 1744057 1577563
6592A577563l3266L7166p2577Q5628m7254j14360J03036j23121n4388O6556J02234
6581A527217J22266n0927p2737K02486J8567L5952J43492P7336q6228j0048J76604
6570B083980o9986q039O9850K7260J35860j28899K18689Q1375J6485N3286Q3074
6559B562935j63368L45243j95685J40521j46431J2840J11369o4066J16329j47937
6549B571750J39800J60612n4885J78762J37031k27630J60650M4377J025m7959
6539C063533K38381j75951N5943J46276j64955L43570j26142L9902m383j97683
6529C218491L97416l0686N6330J3182K6129O4194J32322P8437o6383L93196n9461
6518D223167P2792K11334o5012K19216J73074p9756J17720L85432j93192K65892
$$ plain form
6592 1577563 1544297 1581463 1508886 1594514 1547260 1432900 1535936 1412815 1358427 1424983 1527217
6581 1527217 1649483 1598556 1525819 1728305 1746872 1782824 1926316 2003652 1917424 1907376 2083980
6570 2083980 2013994 2005955 2075805 2103065 2238925 2110026 2328715 2410090 2426575 2479861 2562935
6559 2562935 2399567 2744810 2549125 2689646 2543215 2556055 2667424 2603358 2719687 2571750
6549 2571750 2711550 2872162 2817277 2996039 3133070 2905440 3066090 3110467 3111492 3063533
6539 3063533 3301914 3125963 3181906 3328182 3163227 3506797 3380655 3420557 3416174 3218491
6529 3218491 3615907 3585221 3641551 3654733 3680862 3745056 3877378 3955815 3889432 4282628 4223167
6518 4223167 4295959 4507293 4442281 4661497 4834571 4754815 4872535 5257967 5064775 5330667
6508E330667J191K00786N7179K91956j50578K68318K33804j46751K67026p4686
6498F278912K77559K36093L29366J34668J49277q89L20626L44783J10101J81878
6488H362374K03565J13031L86736K67269L85810J82219K09551M42617J66649N13914
6478A1233735L37956L70042M16575N65151O62385N47766O04058P89453N92056
6469A6119177P90591J014259R66136J097734J179737J180377J219504J277596
6461B4845111J411602J765705J723243J805755J721664J992920K046145K402638
6453C9714783K274592K574407K839711K858917L009234L255939L158394L346963
6445F3032940L104133K909941L090235K240746K119122J582347J093019P41040
$$ plain form
6508 5330667 5331858 5532644 5589823 5881779 5731201 5999519 6233323 6086572 6353598 6278912
6498 6278912 6556471 6792564 7121930 7256598 7405875 7404986 7725612 8070395 8180496 8362374
6488 8362374 8565939 8678970 9065706 9332975 9718785 9901004 10110555 10553172 10719821 11233735
6478 11233735 11571691 11941733 12358308 12923459 13585844 14133610 14737668 15527121 16119177
6469 16119177 16909768 17924027 18890163 19987897 21167634 22348011 23567515 24845111
6461 24845111 26256713 28022418 29745661 31551416 33273080 35266000 37312145 39714783
6453 39714783 41989375 44563782 47403493 50262410 53271644 56527583 59685977 63032940
6445 63032940 66137073 69047014 72137249 74377995 76497117 78079464 79172483 79913523
6437G9913523N43157l66490l85321n71449j003677r31615j173398j245071j198425
6428G3581234j241665j689264j301922j511350j803987j950224j609453k025470
6420F0447899k401442k123681j998804k339123k175850k075789j899841j873265
6412D3560104j744000j582758j391882j568277j318344j289301j168317j235849
6404C2261376j068322p22919q46603p96235o77069p87716m11491n13245n04070
6395B5933706l92140l42099o16177k73897k94568n84403k70173j16443m19106
6386B2624700l12656l02572l01979n38684k92486l88340k55900j68173j12411
6377A9951499j48169m20527J43845l36864k45954p8349p6866k33899l54262r6583
$$ plain form
6437 79913523 80456680 80090190 79704869 79133420 78129743 77198128 76024730 74779659 73581234
6428 73581234 72339569 70650305 69348383 67837033 66033046 64082822 62473369 60447899
6420 60447899 58046457 55922776 53923972 51584849 49408999 47333210 45433369 43560104
6412 43560104 41816104 40233346 38841464 37273187 35954843 34665542 33497225 32261376
6404 32261376 31193054 30470135 29623532 28827297 28150228 27362512 26951021 26437776 25933706
6395 25933706 25541566 25199467 24583290 24309393 24014825 23430422 23160249 23043806 22624700
6386 22624700 22312044 22009472 21707493 21168809 20876323 20487983 20232083 20063910 19951499
6377 19951499 19803330 19382803 19526648 19189784 18943830 18865481 18788615 18554716 18200454 18103871
6367A8103871l51302j69022k02628j94131l85583o4861j52155p4252l52151K58086
6357A6415872j10638j55313J59471p78229J50644K26632k2429m2075k5086k02176
6347A5616673j71454j7921k27704j23620j09662j40297m747k50599q714l1527
6337A4530428k24915p7762N4407j49236j79747R3300j35152j13257R6670k13570
6327A3681166L9317J10783j95280r1093J95706J05313j5714N5346K63998L13613
6317A4463155J37743M20604j6888j75431l87361J4081l51975j21351p8067p7504
6307A3827006k06093R5959j74396p2201L8155n5528J9329N5175k06869K77283
6297A3597820J6852l9274K37563j33487J8293K77206M4402m8259k8756K08919
$$ plain form
6367 18103871 17752569 17583547 17380919 17186788 16801205 16736344 16584189 16509937 16157786 16415872
6357 16415872 16305234 16149921 16309392 15531163 15681807 15908439 15886010 15843935 15818849 15616673
6347 15616673 15445219 15427298 15199594 15075974 14966312 14826015 14821268 14570669 14561955 14530428
6337 14530428 14305513 14227751 14282158 14132922 13953175 14046475 13911323 13798066 13894736 13681166
6327 13681166 13720483 13831266 13635986 13544893 13740599 13845912 13830198 13885544 14149542 14463155
6317 14463155 14600898 15021502 15004614 14829183 14441822 14455903 14103928 13982577 13904510 13827006
6307 13827006 13620913 13716872 13542476 13470275 13508430 13452902 13472231 13527406 13320537 13597820
6297 13597820 13614672 13575398 13812961 13679474 13697767 13974973 14019375 13971116 13942360 14151279
6287A4151279J29393P7517j20832M9136J12563P5967K43375M8432K4664K19372
6277A5010866n9772J08268J88136L8733L7002l0134l1634K24974J34972M7487
6267A5668898R3413J34885l4365J79254Q1889l6835J14946R5973k82954J02130
6257A6117234K37040R7111q3608L0122q378M3670K65737K4745j92321r2888n2703
6246A6385761j51093M4031j81473p3731l09328L25760j63657R473l47276L9117
6236A5577584J19744o6605l647J44843J93398j85196j40167j2464j65546j26386
6226A5335558m70513j50027l06349M5852j01790k38533J4883J61230j64193K15236
6216A4341354Q8588j19309j09842n62961l07586l82056j93875k35394k3808K97866
$$ plain form
6287 14151279 14280672 14358189 14237357 14286493 14399056 14475023 14718398 14766830 14791494 15010866
6277 15010866 14951094 15059362 15247498 15286231 15323233 15293099 15261465 15486439 15621411 15668898
6267 15668898 15762311 15897196 15862831 16042085 16123974 16087139 16202085 16298058 16015104 16117234
6257 16117234 16354274 16451385 16367777 16397899 16389521 16433191 16698928 16723673 16531352 16438464 16385761
6246 16385761 16234668 16278699 16097226 16023495 15714167 16039927 15876270 15885743 15538467 15577584
6236 15577584 15697328 15630723 15627076 15771919 15965317 15780121 15639954 15627490 15461944 15335558
6226 15335558 14865045 14715018 14408669 14454521 14352731 14114198 14129081 14290311 14126118 14341354
6216 14341354 14429942 14310633 14200791 13637830 13330244 12948188 12754313 12518919 12495111 12792977
6206A2792977j58457K87955J31642q9548k73645n42303k61308l57919j98688l01564
6196A1029142j95694k29153j91894j12607J10329K46585K46332J09203k25815
6187A0786428K22363j993J33395j88398J20285n41043o8133n49953J7537j82585
6177I747903N5913K6301l98504j09270p4377l44201q7808k12711k59871J34668
6167H478043p091j47481M62455j01358J38376J99569q9970R1814N1752J04942
6157I181051M00090K18758N548l40509J4955m87528j16650n47041j32697k70736
6147G925241m9606j01483q8937p2511L58023l33787p303J03621n9105Q6497l4675
6136G725975j25233O0410M8315j9944l19177j1930k59294Q474o4737J84768r202
$$ plain form
6206 12792977 12634520 12922475 13054117 12964569 12690924 12148621 11887313 11529394 11330706 11029142
6196 11029142 10833448 10604295 10412401 10299794 10410123 10656708 10903040 11012243 10786428
6187 10786428 11008791 11006798 11140193 10951795 11072080 10531037 10462904 9912951 9930488 9747903
6177 9747903 9803816 9830117 9431613 9322343 9247966 8903765 8815957 8603246 8343375 8478043
6167 8478043 8470952 8323471 8785926 8684568 8822944 9022513 8932543 9024357 9076109 9181051
6157 9181051 9581141 9799899 9805447 9464938 9479893 8992365 8875715 8328674 8195977 7925241
6147 7925241 7875635 7774152 7685215 7612704 7970727 7636940 7629637 7733258 7674153 7760650 7725975
6136 7725975 7600742 7661152 7709467 7689523 7370346 7358416 7099122 7107596 7042859 7227627 7218425
6125G218425o4382k50930K58357N9143j32692k83202J27321M1878o6154l49043
6115F558721N6859K02707r3169j52597L1012j03434J67912j80962r1189K61113
6105F656973k56289j13348K08251j76499k7995j42176l7649M60660k12241K382
6095F362069J55340N3126J30937J12804K91948K2276L8338j62992J85487L74217
6085G563550l22684L26015Q3028N1958K25451K87122R7914L21788L35871K39647
6075I209660N12930M24141N14462M40295K32161K85985K74474M95649N58090M80383
6065A3428230R03027Q54275Q43165R13809J307637J331285J527955K027354J789739
6056B4926476J959342K530343K677780L770272M678426N459407P076772R315042
$$ plain form
6125 7218425 7154043 6903113 7161470 7220613 7087921 6804719 6932040 6973918 6907764 6558721
6115 6558721 6615580 6818287 6725118 6572521 6603533 6500099 6668011 6487049 6395860 6656973
6105 6656973 6400684 6287336 6495587 6319088 6291093 6148917 6111268 6571928 6359687 6362069
6095 6362069 6517409 6570535 6701472 6814276 7106224 7128500 7166838 7003846 7189333 7563550
6085 7563550 7240866 7566881 7649909 7701867 7927318 8214440 8312354 8634142 8970013 9209660
6075 9209660 9722590 10146731 10661193 11101488 11333649 11619634 11894108 12389757 12947847 13428230
6065 13428230 14331257 15185532 16028697 16942506 18250143 19581428 21109383 23136737 24926476
6056 24926476 26885818 29416161 32093941 35864213 40542639 46002046 53078818 62393860
6048F2393860J1945976J7216756K5740970L9634112N6350585O2056480M0443448
6041C15782187j708984l1439338m3458458m2553684l6690587k9108328k2755056
6034A08067752j7942033j3913416j0722227q913185o658110n406870m776278l650982
6026C6084651l035657k651330k005271j690585j594027j348375j243875j055990
6018B1459541j273995q37686p73984n68553n14022q72264l18991p23195l81312
6009A5195539o43488m70522l38274j35112m93043k80314m23169k59774m73033
6000A1678810m14090j51148l50859j42408l80048k82409k33495j37164k18443
5991I368746k61505J71479r9520j49100J71875K46993L1784l91058o4472n83821
$$ plain form
6048 62393860 74339836 91556592 117297562 156931674 213282259 275338739 315782187
6041 315782187 314073203 282633865 239175407 196621723 159931136 130822808 108067752
6034 108067752 90125719 76212303 65490076 56576891 49918781 44511911 39735633 36084651
6026 36084651 33048994 30397664 28392393 26701808 25107781 23759406 22515531 21459541
6018 21459541 20185546 19347860 18573876 18005323 17491301 16619037 16300046 15576851 15195539
6009 15195539 14552051 14081529 13743255 13608143 13115100 12834786 12411617 12151843 11678810
6000 11678810 11264720 11113572 10762713 10620305 10240257 9957848 9724353 9587189 9368746
5991 9368746 9107241 9278720 9179200 9030100 9201975 9448968 9480752 9089694 9025222 8441401
5981H441401j87729l90748j97939j07367l25576k27225P8826k63868n5109l7425
5971F727241j56792q3738K21667l9443j93341R2852j81195k20653n6588j98637
5961E911373j91439k39819K58936l33506J26719q9484K10481l61328j10663O5436
5951E246706K1601o299P4615l53462J58553J24324L6873J44021L90282L65013
5941F202227j32707q3606m24008j76929k31325M9767j4138k65940m0479Q9414
5931D972276r0670j43334N3418N1985q5352K23496k3667J50227K55454R6969L04633
5920E765435M68808N6210L61268j03934j96413N5994m96880j64925j86130j69699
5910E389734l09778K1389L1692j20978L6198J52947J86509J54071J88728k03465
$$ plain form
5981 8441401 8253672 7862924 7664985 7557618 7232042 7004817 7083643 6819775 6764666 6727241
5971 6727241 6570449 6486711 6708378 6668935 6475594 6568446 6387251 6166598 6110010 5911373
5961 5911373 5719934 5480115 5739051 5405545 5532264 5442780 5653261 5291933 5181270 5246706
5951 5246706 5268307 5262008 5336623 4983161 5141714 5266038 5302911 5446932 5837214 6202227
5941 6202227 6069520 5985914 5561906 5384977 5153652 5203419 5189281 4923341 4882862 4972276
5931 4972276 4881606 4738272 4791690 4843675 4758323 4981819 4958152 5108379 5363833 5460802 5765435
5920 5765435 6234243 6290453 6651721 6547787 6351374 6407368 5910488 5745563 5559433 5389734
5910 5389734 5079956 5101345 5133037 5012059 5048257 5201204 5387713 5541784 5730512 5527047
5900E527047L2452k91464p8807J89439k6048o9110P9564p2150L56496O29521J446239
5889G723179J195586K48105o02264r27034q50710l16656m07653j45619l10834
5880E606100N6365m6193j61658K52343L50389M06264L65096K18871l01216n8148
5870F688213l58641l32528j92065j94021j89161j35569K19981K7635o0990J12395
5860E585249k0539l0918p2087J74839J35963J05179Q4686K00883J49040L65242
5850F677537K92704M43381O97656L19718p9511L6780k22396l64832M9818K4536
5840G875391M918l3367o023J87686K91687N4408J26410j7498J97654J40318j07057
5829H714527K2936n7629J14135p4852P9287J8918L6583p7462M638J15051J51242
$$ plain form
5900 5527047 5559499 5268035 5189228 5378667 5352619 5283509 5363073 5290923 5647419 6276940 7723179
5889 7723179 8918765 9166870 8564606 7637572 6786862 6470206 6062553 5916934 5606100
5880 5606100 5662465 5616272 5454614 5706957 6057346 6463610 6828706 7047577 6746361 6688213
5870 6688213 6329572 5997044 5804979 5610958 5421797 5286228 5506209 5533844 5472854 5585249
5860 5585249 5564710 5533792 5461705 5636544 5772507 5877686 5962372 6163255 6312295 6677537
5850 6677537 6970241 7413622 8111278 8430996 8351485 8388265 8165869 7801037 7850855 7875391
5840 7875391 7880309 7846942 7840919 8028605 8320292 8374700 8501110 8483612 8681266 8821584 8714527
5829 8714527 8737463 8679834 8793969 8719117 8798404 8817322 8853905 8776443 8781081 8896132 9047374
5818I047374m1553j09819J62647l70325n0635J3216n397K36869r6294J49932J98032
5807I134047J95895N3159K86843M72352M45945P39281R40578R45987J498719R65127
5797A5677933N82608k14054l08413o57048k74751l70118l722n7461k5317N0569
5787A4400226j35128n13945j39474j79268l2755m44680k8588k55815n9953Q2047
5777A2692667j0159j64082N513Q0770J40352K46868J5514J25840L03881K78134
5767A3715298M98233J86487J44919K87837J10763N9531K25701K91546N92271J047012
5757A7159598J189111J152474R79444j37823o05673q40075r65347n97523m54652
5748A6879534k18087l83783q8401N0264j1722Q9143J42765K02383M21599L6835
$$ plain form
5818 9047374 9005821 8896002 9058649 8688324 8637689 8650905 8645508 8882377 8786083 8936015 9134047
5807 9134047 9329942 9383101 9669944 10142296 10588241 11327522 12268100 13214087 14712806 15677933
5797 15677933 16260541 16046487 15738074 15081026 14806275 14436157 14432435 14374974 14349657 14400226
5787 14400226 14265098 13751153 13611679 13432411 13399656 12954976 12926388 12670573 12610620 12692667
5777 12692667 12682508 12518426 12523939 12604709 12745061 12991929 13007443 13133283 13437164 13715298
5767 13715298 14213531 14400018 14544937 14832774 14943537 15003068 15228769 15520315 16112586 17159598
5757 17159598 18348709 19501183 20480627 20342804 19737131 18897056 17931709 17334186 16879534
5748 16879534 16661447 16277664 16189263 16239527 16227805 16316948 16459713 16662096 17083695 17120530
5738A7120530K85020L96268L93836P07491N39251P22433K062292K516912J835557
5729B6579590k16885j240015j105374j229618r06819j38157L1405O1120O33273
5720B2468520J270962J435188K412315J635941R22088N87553J361152K159532
5712C4253251J203406j088749k312887j941300k075550r05431m93699o34551l20608
5703B5683882k12275n8936P4628J22129J16732J23041M34989K7677L29440O23959
5693B7265266M22576L78631O72605Q38430Q37350R84820J061088J384524J225472
5684C5070762J765023J965408K207594K554827K396378K234142J744654N23893
5676E0462681k52337j054289j320444j321259j274993j220955p80654o25484n43527
$$ plain form
5738 17120530 17405550 17801818 18195654 18903145 19442396 20164829 22227121 24744033 26579590
5729 26579590 26362705 25122690 24017316 22787698 21880879 21742722 21774127 21835247 22468520
5720 22468520 23739482 25174670 27586985 29222926 30145014 30732567 32093719 34253251
5712 34253251 35456657 34367908 32055021 30113721 28038171 27132740 26639041 26004490 25683882
5703 25683882 25471607 25412671 25487299 25609428 25726160 25849201 26284190 26311867 26641307 27265266
5693 27265266 27687842 28066473 28739078 29577508 30414858 31399678 32460766 33845290 35070762
5684 35070762 36835785 38801193 41008787 43563614 45959992 48194134 49938788 50462681
5676 50462681 50210344 49156055 47835611 46514352 45239359 44018404 43237750 42612266 42068739
5667D2068739j54004m3204J00564J70553M04470L31271O30863N13843O52143O30192
5657D5305430M71314Q00003M50625P32511Q09054P85635P20526N79221Q18389
5648E1472708N36586M95656M59512N62125M08983J17315K13648K98786M6367n5875
5638E4555811P6582J86686M0793R0124r8601K37927J02366K22570L3429L49633
5628E5797320J39967L68875N35338O49466L43415P4362n545Q39887N13006k38836
5618E9017255l03591k05409o00813k20021j86579k56053k10193n22782m71349
5609E6040465m26688o90141n51573l96971o47608m03098n27647p06726k63285
5600E1426728m53344O4076k19659m2454J9509J09951K74339j216M41138L28582
$$ plain form
5667 42068739 41914735 41871531 41972095 42142648 42547118 42878389 43509252 44023095 44675238 45305430
5657 45305430 45776744 46576747 47027372 47759883 48568937 49354572 50075098 50654319 51472708
5648 51472708 52009294 52504950 52964462 53526587 53935570 54052885 54266533 54565319 54611686 54555811
5638 54555811 54632393 54819079 54859872 54949996 54851395 55089322 55191688 55414258 55447687 55797320
5628 55797320 55937287 56306162 56841500 57490966 57834381 57908743 57903198 58743085 59256091 59017255
5618 59017255 58713664 58508255 57907442 57687421 57500842 57244789 57034596 56511814 56040465
5609 56040465 55613777 54923636 54372063 53975092 53327484 52924386 52396739 51690013 51426728
5600 51426728 50973384 51037460 50817801 50775347 50794856 50904807 51179146 51177930 51619068 51947650
5590E1947650P49617O79459N36001O05926Q48745Q64058Q55649N75715L05888
5581E7968708O02444K75373L83513r3964L25175n1197L18353K07319K21577K31612
5571F0388913O65659N20879P65413P86946J206046J286905J391270J508810J707701
5562G0228542J360841J660284J094859J163168N59225N70457q3374k08423q76022
5553G5469557j030430j540075j380666j597452j695266j832474j589002j286441
5545F3517751j345825r99436j044583p92520m49063l58038k37740j79170K8382
5536E8139758l7181J25894j78505l00341q5361q16842n54229j140544j240298
5527E3912351j329493j335116j522357j500759j291552j338705n77805o71147
$$ plain form
5590 51947650 52697267 53376726 53912727 54518653 55367398 56231456 57087105 57662820 57968708
5581 57968708 58571152 58846525 59230038 59136074 59461249 59410052 59728405 59935724 60157301 60388913
5571 60388913 61054572 61575451 62340864 63127810 64333856 65620761 67012031 68520841 70228542
5562 70228542 71589383 73249667 74344526 75507694 76066919 76637376 76554002 76345579 75469557
5553 75469557 74439127 72899052 71518386 69920934 68225668 66393194 64804192 63517751
5545 63517751 62171926 61172490 60127907 59335387 58886324 58528286 58290546 58111376 58139758
5536 58139758 58102577 58228471 58049966 57749625 57664264 56847422 56293193 55152649 53912351
5527 53912351 52582858 51247742 49725385 48224626 46933074 45594369 45016564 44345417
5519D4345417l12237q91821r98356r43769r15929q6635l39948k52752j12036r5119
5509C9396815L34349j3284K23021o4051J24528j06102q940l64166N9275l48418
5499C9233027k72004l37581m49805j17714l13848n91208j06573k01311M3488J4158
5489C6900629j7806j58183K45792k46040K53361o5684k4766J69396J93973j35595
5479C7115077K85722r6456N642P8916m0790j09031p3901o0754j91355k7758m11263
5468C6474049k12246J7145k22645K7663l329N3982j00571N7236j37251Q9615k98584
5457C5745064j02215n6638k32227k99464O698l57924m8774q0870p6099j29077
5447C4368474l48082l2048J0415K7612k65340L7106J01320n28073J86422M3835
$$ plain form
5519 44345417 44033180 43141359 42143003 41199234 40283305 40196670 39856722 39603970 39491934 39396815
5509 39396815 39731164 39717880 39940901 39876850 40001378 39895276 39886336 39522170 39581445 39233027
5499 39233027 38961023 38623442 38173637 38055923 37742075 37150867 37044294 36842983 36886471 36900629
5489 36900629 36882823 36724640 36970432 36724392 36977753 36912069 36887303 37056699 37250672 37115077
5479 37115077 37400799 37304343 37309985 37388901 37348111 37239080 37165179 37104425 36913070 36885312 36474049
5468 36474049 36261803 36278948 36056303 36083966 36080637 36134619 36034048 36091284 35954033 36043648 35745064
5457 35745064 35642849 35586211 35353984 35054520 35061218 34703294 34654520 34573650 34497551 34368474
5447 34368474 34020392 33988344 33998759 34026371 33761031 33798137 33899457 33371384 33557806 33601641
5437C3601641m3191J34712j19459J76506n536n2697K26529n3807p3901K69735
5427C4060532k58837J42470J16014L81957L80802J046323J581918K585390M536572
5418D4573141N654055N680358M680453J923210j021721l025285m838163m909260
5410D8716788m506760l867434k650029k155117j635010r47111q98604p16912m22758
5401C0917053q73513p8017p18356j26453l85331j80580l08977R1214j40273J0085
5391B8206852j30107q3535k23201p6014l6481k58574L3886r4900k6861j34534
5381B7176531J60906j74914K40846k01414k77840Q2369j29267k62160J73803j92401
5371B6596459Q4398L7168k27588K18976J93770k19769P6034j52748K62336l4571
$$ plain form
5437 33601641 33558450 33693162 33573703 33750209 33744673 33691976 33918505 33864698 33790797 34060532
5427 34060532 33801695 33944165 34060179 34442136 34822938 35869261 37451179 40036569 44573141
5418 44573141 50227196 55907554 60588007 62511217 61489496 58464211 53626048 48716788
5410 48716788 44210028 40342594 37692565 35537448 33902438 32955327 32056723 31339811 30917053
5401 30917053 30043540 29965523 29247167 29120714 28735383 28554803 28245826 28337040 28196767 28206852
5391 28206852 28076745 27993210 27770009 27693995 27657514 27398940 27432826 27337926 27311065 27176531
5381 27176531 27337437 27162523 27403369 27201955 26924115 27006484 26877217 26615057 26788860 26596459
5371 26596459 26680857 26718025 26490437 26709413 26903183 26683414 26759448 26606700 26869036 26834465
5361B6834465J34156r0669J4887j05735l3892J99078l20287J03346J04464l80846
5351B6458967K2702Q1105k2446l0476j9906L8957K7631j6404L9968o7696O5099
5340B6577501j04285O1711J8104L6281j85248m8229o6996j03399j79674p1395
5330B5934371k78738O398l23652J9917k82299n35757R9914l08356l14560O7790
5320B4085028k72692n6489k32874j80360q5638k16451k17886j22013m82008M1652
5310B2260269l31154j4520k35250k90956j86706k87285k11103m10532k72354l23673
5300A9696736l08610j73103m47404k03487k98453j75519l92366j18946o0244k46780
5290A7271824j16618j74604p040n05645P6820j58821j4738m35556n0010l3510
$$ plain form
5361 26834465 26968621 26877952 26892839 26787104 26753212 26952290 26632003 26735349 26839813 26458967
5351 26458967 26481669 26562774 26540328 26509852 26489946 26528903 26556534 26540130 26580098 26512402 26577501
5340 26577501 26473216 26534927 26553031 26589312 26404064 26355835 26288839 26185440 26005766 25934371
5330 25934371 25655633 25662031 25338379 25358296 25075997 24540240 24640154 24331798 24017238 24085028
5320 24085028 23812336 23755847 23522973 23342613 23256975 23040524 22822638 22700625 22218617 22260269
5310 22260269 21929115 21914595 21679345 21388389 21201683 20914398 20703295 20292763 20020409 19696736
5300 19696736 19388126 19215023 18767619 18564132 18265679 18090160 17697794 17578848 17518604 17271824
5290 17271824 17155206 16980602 16973562 16467917 16544737 16385916 16371178 15935622 15885612 15852102
5280A5852102k15075j02412j66595j47795j82013k00577j24209J04028k42336
5271A4575118P4405k78837k1581k18119J4510l0753J8891j6222L8914k23646k03595
5260A3729085J65082j81504p4148K73237J29492j22158j59982q0091J01276Q2817
5250A3863106k8490O981Q2471k42951k50946L28155K884l69696R2136R016o1535
5239A3431131K65204l8900o4083j88989J27938j73725L7853l4235l4666Q2067
5229A3409595n08145L84023j97785k09214M3839k01366l6780L0319k69179q6546
5219A2358761j61421j18711p8302j00582k11673j54234k5733l75796J33442k11621
5209A1054130m3883j87957r2059j8649L0275j61954R77859M39239N81147J1408
$$ plain form
5280 15852102 15637027 15534615 15368020 15220225 15038212 14837635 14713426 14817454 14575118
5271 14575118 14649523 14370686 14349105 14130986 14145496 14114743 14133634 14117412 14156326 13932680 13729085
5260 13729085 13894167 13712663 13638515 13911752 14041244 13919086 13759104 13679013 13780289 13863106
5250 13863106 13834616 13841597 13924068 13681117 13430171 13758326 13761210 13391514 13483650 13492666 13431131
5239 13431131 13696335 13657435 13593352 13404363 13532301 13358576 13396429 13362194 13327528 13409595
5229 13409595 12901450 13285473 13087688 12878474 12922313 12720947 12684167 12714486 12445307 12358761
5219 12358761 12197340 12078629 12000327 11899745 11688072 11533838 11508105 11132309 11265751 11054130
5209 11054130 11010247 10822290 10730231 10711582 10741857 10579903 11557762 11997001 12578148 12589556
5199A2589556p67062m28212n33185j32184o834K41262K5246l31561l2376o6580
5189A0558070l12011n23051n24216l08854l25928k60904j03067l65447o6649L6399
5179G804342J1058J34930j52465L1936j37327R0968k24873J33142k3602j3067
5169G655042k4149J5612j66912N8283Q1055k38199L9926R0218k03977M6141p8831
5158G274209M5475j17263k01132l8730L244j90707L76542O8789L1288k86140J71083
5147G136658p4180l18527R9698r1067L6536J01125J9241J1188K71959J29070K90581
5136G612282L63501j00116J81910L15350p5033k41775k93661k65608j73575j11123
5126G212152n32814R7776k55693k75825M49814O2733K51965M54315R5091n2539
$$ plain form
5199 12589556 11822494 11394282 10861097 10728913 10722079 10963341 10988587 10657026 10624650 10558070
5189 10558070 10246059 9723008 9198792 8889938 8564010 8303106 8200039 7834592 7767943 7804342
5179 7804342 7815400 7950330 7797865 7829801 7692474 7783442 7558569 7691711 7668109 7655042
5169 7655042 7630893 7646505 7479593 7537876 7618931 7380732 7420658 7510876 7306899 7353040 7274209
5158 7274209 7319684 7202421 7001289 6962559 6965803 6775096 7151638 7220427 7251715 6965575 7136658
5147 7136658 7062478 6743951 6843649 6752582 6789118 6890243 6909484 6920672 7192631 7321701 7612282
5136 7612282 7975783 7875667 8057577 8372927 8297894 8056119 7762458 7496850 7323275 7212152
5126 7212152 6679338 6777114 6521421 6245596 6695410 6758143 7010108 7464423 7559514 7506975
5116G506975l03875k55948j86346j37169q8999o6436j20892J24190J27865j74840
5106F424525L16773o5124K09339k52949j69987n8817K47102l2298k57402N7615
5096F418777n6716R8348J14196j57467K82554K85803J42403J33996K80731L92535
5086G935160j35432K53529l68466J03260l9007j75741J49327Q3235N9415J29749
5076G995029K51436k04829K93994J6805L83964M30856J54457L73206M70467N53105
5066A0718490N70110J053688P93060P24512R95267P30753J857089M822405R086455
5057C1351829J2344679J1915655P817568j432674n387365o103058m537518m902059
5049D1067057o736235n624071m063967k873165j336430m03759J058796J471480
$$ plain form
5116 7506975 7203100 6947152 6760806 6623637 6534638 6468202 6347310 6471500 6599365 6424525
5106 6424525 6741298 6676174 6885513 6632564 6462577 6403760 6650862 6618564 6361162 6418777
5096 6418777 6362061 6460409 6574605 6417138 6699692 6985495 7127898 7261894 7542625 7935160
5086 7935160 7799728 8053257 7684791 7788051 7749044 7573303 7722630 7805865 7865280 7995029
5076 7995029 8246465 8041636 8335630 8352435 8736399 9167255 9321712 9694918 10165385 10718490
5066 10718490 11288600 12342288 13135348 13859860 14855127 15585880 17442969 22265374 31351829
5057 31351829 43696508 55612163 63429731 61997057 56609692 50506634 45969116 41067057
5049 41067057 34330822 28706751 24642784 21769619 20433189 20029430 21088226 22559706
5041B2559706O46410o20503j817576j636933j576179j046978q96835l35726l45442
5032A4929944m17354j8853o7494J73858j6034m6483K79131K25168K83854L93656
5022A5719393J023735J060995J427773Q20502L82212N38203L07042K08655K20658
5013B1709168k48542n87461p22256k53442k64822j92377K36779L48047M79620
5004B0504714L92887M78558j833j70373Q932O7118J46805K41965K72648L39515
4994B2280936L22080M37980O20931O86454N40916N70954N36740O0864J29499N30820
4984B6718174J11156L13050K42237J57294L11963L58269R8455K84096o7006L93831
4974B8921519L06676l4741K07372M15024k8001K74824M00491L02607L01497L37048
$$ plain form
5041 22559706 23206116 22585613 20768037 19131104 17554925 16507947 15611112 15275386 14929944
5032 14929944 14512590 14493737 14426243 14600101 14584067 14537584 14816715 15041883 15325737 15719393
5022 15719393 16743128 17804123 19231896 20052398 20434610 20972813 21279855 21488510 21709168
5013 21709168 21460626 20873165 20150909 19897467 19632645 19440268 19677047 20025094 20504714
5004 20504714 20897601 21376159 21374326 21203953 21212885 21280003 21426808 21668773 21941421 22280936
4994 22280936 22603016 23040996 23661927 24348381 24889297 25460251 25996991 26057855 26187354 26718174
4984 26718174 26829330 27142380 27384617 27541911 27853874 28212143 28310598 28594694 28527688 28921519
4974 28921519 29228195 29193454 29400826 29815850 29787849 30062673 30463164 30765771 31067268 31404316
4964C1404316K90965M84870K20576P27912M81054L58915L50413O19813J43365
4955C5082199K27688L08218P0175L83676J08649K39830O7066k62626j0078k62274
4945C5952523n50744l9285m08052k42096j80484j43746k08680j62120r6975j60356
4935C3759985J88968o9986M1557P8558J38736J76229L7081J96218P3877R708M2923
4924C4673854k11285L28052R976k20534l35047l06515k15396o72715q41227l83007
4914C1826156n65546o00212m83499o95583m55128m71229n31641m53831k71245
4905B7298242k72705m74663j25456k99028j10284k28807q6855l24293j75043j89898
4895B5011210j70705l53332j34205j72890n01124j13198l83012m38556m88635
$$ plain form
4964 31404316 31695281 32180151 32400727 33128639 33609693 33968608 34319021 34938834 35082199
4955 35082199 35309887 35618105 35688280 36071956 36180605 36420435 36487501 36224875 36214797 35952523
4945 35952523 35401779 35362494 34954442 34712346 34531862 34388116 34179436 34017316 33920341 33759985
4935 33759985 33948953 33878967 33920524 33999082 34137818 34314047 34351128 34547346 34621223 34630931 34673854
4924 34673854 34462569 34790621 34800597 34580063 34245016 33938501 33723105 33050390 32209163 31826156
4914 31826156 31260610 30660398 30176899 29481316 29026188 28554959 28023318 27569487 27298242
4905 27298242 27025537 26550874 26425418 26126390 26016106 25787299 25700444 25376151 25201108 25011210
4895 25011210 24840505 24487173 24352968 24180078 23678954 23565756 23182744 22744188 22255553
4886B2255553o77226k50730m40588m75810n34425l48837m99423l39812k40124
4877A8448578l46387n42089l2969m16061j89174l21856k73841q7266l77289r8193
4867A5763453l15263k90383l03229N5401j99056j38242l87018J22337m68317R495
4857A3849178l15636k61713j90583k61278J23152l08113k12181j17912l28456
4848A1976458Q2122k19061k17129Q4636p2413j41532L641k12207K1112j08295
4838A1197332J42364p5712N283r4352n5477r3871m3067K25740K09789k44517K50874
4827A1424386j0674N39187J056695J213510Q50699O49740o4282L53634J49598
4818A6162493L03533K18933l23887j144130o98084p67612o13537j74192k56439
$$ plain form
4886 22255553 21578327 21327597 20887009 20411199 19876774 19527937 19028514 18688702 18448578
4877 18448578 18102191 17560102 17527133 17111072 16921898 16600042 16326201 16238935 15861646 15763453
4867 15763453 15448190 15157807 14854578 14909979 14710923 14572681 14185663 14308000 13839683 13849178
4857 13849178 13533542 13271829 13081246 12819968 12943120 12635007 12422826 12304914 11976458
4848 11976458 12058580 11839519 11622390 11707026 11634613 11493081 11496722 11284515 11305627 11197332
4838 11197332 11339696 11263984 11269267 11174915 11119438 11025567 10982500 11208240 11418029 11173512 11424386
4827 11424386 11413712 11952899 13009594 14223104 15073803 15723543 15659261 16012895 16162493
4818 16162493 16466026 16684959 16361072 15216942 14518858 13751246 13137709 12963517 12707078
4809A2707078J79024j67015m3256J26449K20367K15861K18701K62003J50862L25019
4799A4195093m3976K34147R655K01886L8294p2942N56905J60276L24873M56730
4789A6060941N30483K85354K59358J83566M90076q118N34597N69094J12561O55517
4779A9673429O55060K50424N39628L57182O84731M76694L44519K98837L91041
4770B3671545O96936K06N68576N41466M45200P37206O30973P91156L86458O52673
4760B9122395J93729O19673Q7591N24655L99838M07575L36132K91275L67102O63230
4750C3013195N76262N65612O79686N50204P06147R10874P68319J031055R03249
4741C9704603Q39748R88898Q29564Q37661M59529Q51723N07914M40116N17228
$$ plain form
4809 12707078 12886102 12719087 12675831 12802280 13022647 13238508 13457209 13719212 13870074 14195093
4799 14195093 14151117 14385264 14394919 14596805 14635099 14562157 15119062 15279338 15604211 16060941
4789 16060941 16591424 16876778 17136136 17319702 17809778 17801660 18336257 18905351 19017912 19673429
4779 19673429 20328489 20578913 21118541 21475723 22160454 22637148 22981667 23280504 23671545
4770 23671545 24368481 24368687 24937263 25478729 25923929 26661135 27292108 28083264 28469722 29122395
4760 29122395 29316124 29935797 30023388 30548043 30947881 31355456 31691588 31982863 32349965 33013195
4750 33013195 33589457 34155069 34834755 35384959 36091106 37001980 37770299 38801354 39704603
4741 39704603 40544351 41533249 42362813 43200474 43660003 44511726 45019640 45459756 45976984
4732D5976984L79279N10273K74660L25716O41283L48213N28519M89001O43217
4723E0117145O28541P03455P18466R23627O90837J376061P74692J096446J112725
4714E8141995P13217J089026N19149R74514R03600M83075O16747Q19840N82660
4705F4843823O54271M28391P53976N92309Q94914M55320P01267M27260L57753
4696G0109284P06004L30275M73721L81864K77370K03276M07430J16646L52701
4687G3358571J81705J10679L6577K65615Q4562K63220K15036k47088J87892k84441
4677G4172328j99079n9618m98883m52257k89727n85381q59424l40088q75504l83107
4667F9629260q64810p29942n67374q52900m58262p96833m70032q56340p99629
$$ plain form
4732 45976984 46356263 46866536 47141196 47466912 48108195 48456408 48984927 49473928 50117145
4723 50117145 50745686 51449141 52167607 53091234 53782071 55158132 55932824 57029270 58141995
4714 58141995 58855212 59944238 60463387 61437901 62341501 62824576 63441323 64261163 64843823
4705 64843823 65498094 65926485 66680461 67272770 68167684 68623004 69324271 69751531 70109284
4696 70109284 70815288 71145563 71619284 72001148 72278518 72481794 72889224 73005870 73358571
4687 73358571 73540276 73650955 73687532 73953147 74037709 74300929 74515965 74268877 74456769 74172328
4677 74172328 73973249 73913631 73414748 72962491 72672764 72087383 71227959 70887871 70012367 69629260
4667 69629260 68764450 68034508 67467134 66614234 66155972 65359139 64889107 64032767 63233138
4658F3233138q65531n52863p65408p74011q47208p18980q05633r06942q15554
4649E6181008r25016p99158o05499o26087p66058m91775r98686p09110o82418
4640D9577201q74512r31464j033635p50739j100034j236277p82929j115457j165082
4631D0587072r47241o60573j292378j060208o97918r90615p39482j053043p00782
4622C2444832o50102q31576q10028p22903n02684q48621o03056o49109q12319
4613B6014434m68396p40793n39499o51953q20586l68851m52528p36879k43419
4604B0991530n80337o83102m60394q5867p82562l48928l93894l50797m27804k62002
4594A6615843l56571m44864l37833k99121p5338n31099j81002j90600l62460l01022
$$ plain form
4658 63233138 62367607 61814744 61049336 60275325 59428117 58709137 57903504 56996562 56181008
4649 56181008 55255992 54456834 53851335 53225248 52459190 51967415 50968729 50259619 49577201
4640 49577201 48702689 47771225 46737590 45986851 44886817 43650540 42867611 41752154 40587072
4631 40587072 39639831 38979258 37686880 36626672 35928754 34938139 34198657 33145614 32444832
4622 32444832 31794730 30963154 30153126 29430223 28927539 28078918 27475862 26826753 26014434
4613 26014434 25546038 24805245 24265746 23613793 22793207 22424356 21971828 21234949 20991530
4604 20991530 20411193 19728091 19267697 19181830 18399268 18050340 17656446 17305649 16877845 16615843
4594 16615843 16259272 15814408 15476575 15177454 15102116 14571017 14390015 14199415 13836955 13535933
4584A3535933l33169l21926k08407j88300j29074k76901L774j87843l73800j70489
4574A1349798k94413K84790l50539j41797m8920O6618j23401j12938j58634J84572
4564A0655136m46785l74384Q0837k53488k00009J35272n07275Q3069q9387j69443
4554H913543M9776l47587O2570q2809K0331l27469l7778J18247m07211K03917
4544H165530l15168Q528J38226j60528j88969M941q4542M106j79826Q3175j09753
4533G365720j61097J39934J16011l37637n9225K91656k45122j72306J45017l2788
4523G050163j58223M4889L230j56882P6417k24026K00245k50184J35353q8351
4513F632631R054j97948O870K4955Q3846M2694m8501j34217n7643j19763K03241
$$ plain form
4584 13535933 13202764 12880838 12672431 12484131 12355057 12078156 12081930 11894087 11520287 11349798
4574 11349798 11055385 11340175 10989636 10847839 10798919 10865537 10742136 10629198 10470564 10655136
4564 10655136 10208351 9833967 9914804 9661316 9461307 9596579 9089304 9172373 9082986 8913543
4554 8913543 8963319 8615732 8678302 8595493 8615824 8288355 8250577 8368824 7961613 8165530
4544 8165530 7850362 7858890 7997116 7836588 7647619 7652560 7568018 7572124 7392298 7475473 7365720
4533 7365720 7204623 7344557 7460568 7122931 7063706 7355362 7110240 6937934 7082951 7050163
4523 7050163 6891940 6936829 6940059 6783177 6859594 6635568 6835813 6585629 6720982 6632631
4513 6632631 6641685 6443737 6450607 6475562 6559408 6602102 6553601 6419384 6361741 6241978 6445219
4502F445219O7508j91707j39830J80915j19168K01408j22441K10910j45420K470
4492F389864J18552k18661J46274p0156O6689K9330J52226L14465p3944j71894
4482F682745J18892k56784k8149j31833j36669K7913J32156k5190j564R2748j63350
4471F310915J62400j06538m6787R3533j41495j0638j792J63582K85248j21560
4461F586868M8694J6779L04131k646l7519L77102k54565j49539L7485j49334N2562
4450F830018j22874j27117J87483j73528l3066J13298J0111M6700n3269K52455
4440F930211j40168K10610m5586L83171j55598j80946J01063j0237j26684J68544
4430G134380q080j3996K26269p3029O3495r8161M3383J96146j53579J67210j8098
$$ plain form
4502 6445219 6512727 6321020 6181190 6362105 6242937 6444345 6321904 6532814 6387394 6389864
4492 6389864 6508416 6289755 6436029 6365873 6432562 6461892 6614118 6928583 6854639 6682745
4482 6682745 6801637 6544853 6516704 6384871 6248202 6276115 6408271 6383081 6381517 6474265 6310915
4471 6310915 6473315 6366777 6319990 6413523 6272028 6261390 6259598 6423180 6708428 6586868
4461 6586868 6635562 6652341 6956472 6953826 6916307 7293409 7038844 6889305 6926790 6777456 6830018
4450 6830018 6707144 6580027 6767510 6593982 6560916 6674214 6684325 6731025 6677756 6930211
4440 6930211 6790043 7000653 6955067 7338238 7182640 7001694 7102757 7092520 6965836 7134380
4430 7134380 7126300 7112304 7338573 7265544 7329039 7230878 7274261 7470407 7316828 7484038 7465940
4419G465940O7088P1339j81201L73200j40282O0774J76895L7894L809J63446j29852
4408G969050K29128m3716O2939l3364K06514o188J04147j65488K26991K73401
4398H823414m8888K54756K04041K07120K06267J56342J2103n6603R4409j19578
4388I733383J61779K51777m33900L64751Q881L31545J21490P8417M00470m103
4378A1014490K35215K51293L04475K1515J56849K7111K91863J84148M21280J98504
4368A3106743N52240J02828J03917M73754M19836M34153O0805J82731l1823J86507
4358A5591691M07041m0699K18277J69869L08800L49978J61210L41077K51315L38968
4348A8097527M99781O00082N34114M25028O01620O73393Q69832O76485R79837
$$ plain form
4419 7465940 7533028 7604367 7423166 7796366 7656084 7716858 7893753 7931647 7935456 8098902 7969050
4408 7969050 8198178 8154462 8217401 8184037 8390551 8384363 8488510 8323022 8550013 8823414
4398 8823414 8774526 9029282 9233323 9440443 9646710 9803052 9815155 9758552 9852961 9733383
4388 9733383 9895162 10146939 9713039 10077790 10086671 10418216 10539706 10618123 11018593 11014490
4378 11014490 11249705 11500998 11805473 11826988 11983837 12010948 12302811 12486959 12908239 13106743
4368 13106743 13658983 13761811 13865728 14339482 14759318 15193471 15254276 15437007 15405184 15591691
4358 15591691 15998732 15958033 16176310 16346179 16654979 17004957 17166167 17507244 17758559 18097527
4348 18097527 18597308 19197390 19731504 20156532 20758152 21431545 22301377 22977862 23957699
4339B3957699O37814J058107Q77100J409749J606419J703553K085545K144648
4331C5480634K798123L267123L493520M023544M608603N178986O304833Q907356
4323G4062722J4433087K7368812M4731296M8494793K3630249r930883k6477724
4316A96312352k9396977k7128967k2179218j7736861j4148554j0823419q837195
4309F6061161o941362n720101m614349l777764l562955k348284k342883j800620
4301C4952843j650044j334242j187565j234228o41614q09316m69052p40518p32651
4292B6153613n88563o19969m25631l62327m55468o01325n35297n87586m96824
4283B1480623n43216m05849n67488o06756m53782n50170n75285k71459k87632
$$ plain form
4339 23957699 24595513 25653620 26530720 27940469 29546888 31250441 33335986 35480634
4331 35480634 38278757 41545880 45039400 49062944 53671547 58850533 65155366 74062722
4323 74062722 88495809 115864621 160595917 209090710 232720959 222790076 196312352
4316 196312352 166915375 139786408 117607190 99870329 85721775 74898356 66061161
4309 66061161 59119799 53399698 48785349 45007585 41444630 39096346 36753463 34952843
4301 34952843 33302799 31968557 30780992 29546764 28905150 28095834 27626782 26886264 26153613
4292 26153613 25565050 24945081 24519450 24157123 23701655 23100330 22565033 21977447 21480623
4283 21480623 20937407 20531558 19964070 19357314 18903532 18353362 17778077 17506618 17218986
4274A7218986n57783k66798l71651k68363j35573l51496q6617j40772j05766k99275
4264A4634892m4263k44264n9095o8415k03417j17793l66439P7618m57361k46644
4254A2904819j45218j46331l06940n9861k17137k81125q3778l21070L3931k49162
4244A1128128o3244k11568j63820J46792l45820o6344k39363K14164O3279k74173
4234A0188031J03621p162j9275j44860k9885j61403M3207k49547j26220k38479
4224I358028l97200k1327k62073j6861m55n5680j15491O4669k99281q4059k00224
4213G970046Q8882m2294J09830k06354l4869j09111n677j62621K7627M68348k90224
4202G813583j06536J24313k7149k81272Q7999l60068J26364j48057N2620j63353
$$ plain form
4274 17218986 16661203 16394405 16022754 15754391 15618818 15267322 15180705 15039933 14934167 14634892
4264 14634892 14590629 14346365 14287270 14218855 14015438 13897645 13531206 13608824 13151463 12904819
4254 12904819 12759601 12613270 12306330 12246469 12029332 11748207 11664429 11343359 11377290 11128128
4244 11128128 11064884 10853316 10689496 10836288 10490468 10424124 10184761 10398925 10462204 10188031
4234 10188031 10291652 10284490 10265215 10120355 10090470 9929067 9972274 9722727 9596507 9358028
4224 9358028 8960828 8939501 8677428 8660567 8660112 8604432 8488941 8553610 8254329 8170270 7970046
4213 7970046 8058928 8016634 8126464 7920110 7885241 7776130 7770453 7607832 7635459 8103807 7813583
4202 7813583 7707047 7831360 7804211 7522939 7610938 7250870 7377234 7229177 7281797 7118444
4192G118444j34094p1212o5379k8400J3266P8732j45275q8212j10734J76840j24388
4181F619588m8963J9511N5405j17986j05917K1854j34164J66367j09776n6081
4171F309838J05849k5919k5404j12251j54582L16142q5592J00116q3842L5099
4161F379454o4891n16676O8530j36462l6100K19522k28203k21046J12553j5874
4151E560807J56237o8233k98191J05630j25096Q1401J47999l15156K64174p3339
4141E436233k15550k2135J21080k82840J19653l0995Q5388Q252L0620j40819J56732
4130E265619k76363k9280N5616P1898j90404K11671j50520J29473j57910J81889
4120E111689N5991j35018K37375k0192q8984K16661O9751K14738J15604k17552
$$ plain form
4192 7118444 6984350 6913138 6847759 6819359 6832625 6911357 6766082 6677870 6567136 6743976 6619588
4181 6619588 6570625 6590136 6645541 6527555 6421638 6443492 6309328 6475695 6365919 6309838
4171 6309838 6415687 6389768 6364364 6252113 6097531 6413673 6328081 6428197 6344355 6379454
4161 6379454 6314563 5797887 5866417 5729955 5693855 5913377 5685174 5464128 5576681 5560807
4151 5560807 5717044 5648811 5350620 5456250 5331154 5412555 5560554 5245398 5509572 5436233
4141 5436233 5220683 5198548 5319628 5036788 5156441 5125446 5210834 5219086 5249706 5108887 5265619
4130 5265619 4989256 4959976 5015592 5087490 4897086 5108757 4958237 5087710 4929800 5111689
4120 5111689 5167680 5032662 5270037 5249845 5160861 5377522 5447273 5662011 5777615 5560063
4110E560063J93888Q444j41187n1874K73900j53024K77424K13871J14480j4242
4100F281743j21845p2895K74928J52226j32685l6672J11225k09572L10882L7776
4090F595111l9201L29481J61768R2255M11902K63936J24527P3596l7489o5984
4080G909902k0726J01330q0676J36846o9412Q288K45807R6000L85730J05440P5978
4069H894507J78838K37672k21516J55913J88223k95922K88440o3619J73621K74039
4059I810196q443K24250L59706N0544M45601M41109J96017L87478O65180J83264
4049A2754902O56791M15495L73353N03256J98766J29234J19136Q6487N0708J29905
4039A5418033m8166k25319J81269m1373O0565K31654J50846L73298N14480J99797
$$ plain form
4110 5560063 5753951 5762395 5621208 5569334 5843234 5690210 5967634 6181505 6295985 6281743
4100 6281743 6159898 6087003 6361931 6514157 6381472 6344800 6456025 6246453 6557335 6595111
4090 6595111 6555910 6885391 7047159 7139414 7551316 7815252 7939779 8013375 7975886 7909902
4080 7909902 7889176 7990506 7909830 8046676 7977264 7985552 8231359 8327359 8713089 8818529 8894507
4069 8894507 9073345 9311017 9089501 9245414 9433637 9137715 9426155 9362536 9536157 9810196
4059 9810196 9801753 10026003 10385709 10436253 10881854 11322963 11518980 11906458 12571638 12754902
4049 12754902 13411693 13827188 14200541 14703797 14902563 15031797 15150933 15237420 15288128 15418033
4039 15418033 15369867 15144548 15325817 15284444 15345009 15576663 15727509 16100807 16615287 16815084
4029A6815084R01729P87286Q43325J111294J663026K156054K843975K575727J521925
4020C1219425K76225j226530j873324k291667k003032j582203j302876r10529
4012B0305489o98787m96090J4504n4681p5906J81972N02394M44942O74799P51393
4002B1550029N59421N97425O26419P67909P46858Q17057N75022k34020m78134
3993B5527986q31285j314423j442517j550755j332263j005370r37129n51831q14001
3984A5748412P31j63048J55798j4730K13762o0505M96040k33116n30005q396m63794
3973A5141149o02606m70924o95043q59220m42607n41647n37931m70096o61806
3964I859269j44174m46321k24221j94282l96824j07840j68845n2963j30993j90184
$$ plain form
4029 16815084 17716813 18504099 19347424 20458718 22121744 24277798 27121773 29697500 31219425
4020 31219425 31495650 30269120 28395796 26104129 24101097 22518894 21216018 20305489
4012 20305489 19606702 19110612 19125116 19070435 18994529 19176501 19678895 20123837 20798636 21550029
4002 21550029 22109450 22706875 23333294 24101203 24848061 25665118 26240140 26006120 25527986
3993 25527986 24696701 23382278 21939761 20389006 19056743 18051373 17114244 16562413 15748412
3984 15748412 15749143 15586095 15741893 15727163 15940925 15880420 16376460 16143344 15613339 15604943 15141149
3973 15141149 14538543 14067619 13372576 12513356 12070749 11529102 10991171 10521075 9859269
3964 9859269 9715095 9268774 9044553 8850271 8453447 8345607 8176762 8123799 7992806 7802622
3954G802622j92302k93204R9472j67484j86469k74572j53665k84313J14292k38037
3944F226340n7579j66640j28241q7778m6603k7375k22837J8335k2309j8954k73483
3933E192876K922K0319j83898J07779j90471l07842K04609j76930q6761o9873
3923D512730m5461P8086o0881k2621n0682q9516j75913O046J34475m1264l51449
3912C893550J53238m31132O0517J55721k47563J06147k40979J86831j06513l1512
3902C498305j62145n3874m3079j11352M0135o5499j27326J11463r6065K6199O4429
3891C081191j54327J45011k04598L1865J5037J07383j5381k21235k0424J01773
3881B866295k86815k24446j4246p8504J64952j71554n430M8999j62658J6309j17156
$$ plain form
3954 7802622 7610320 7317116 7416588 7249104 7062635 6788063 6634398 6350085 6464377 6226340
3944 6226340 6168761 6002121 5873880 5786102 5739499 5712124 5489287 5507622 5485313 5466359 5192876
3933 5192876 5195798 5216117 5032219 5139998 4949527 4641685 4846294 4669364 4582603 4512730
3923 4512730 4467269 4545355 4484474 4461853 4411171 4321655 4145742 4151788 4286263 4244999 3893550
3912 3893550 4046788 3615656 3676173 3831894 3584331 3690478 3449499 3636330 3529817 3498305
3902 3498305 3336160 3282286 3239207 3127855 3167990 3102491 2975165 3086628 2990563 3016762 3081191
3891 3081191 2926864 3071875 2867277 2899142 2914179 3021562 3006181 2784946 2764522 2866295
3881 2866295 2579480 2355034 2340788 2262284 2427236 2255682 2250252 2299251 2136593 2152902 2035746
3870B035746o9625O5339j32000K27505j24588j40064J08162M1024N6023j55503
3860A912019O395l7635L2748n8582K7642j08607J11227j84608m3650l3766j80369
3849A442814Q4805N7928K2282J60579j19714k9358p3381r0390O878L9552k9257
3838A472738J9706k2743m8799J9928l3293j36621J51390J42094j31641L848j32912
3827A303695J73847Q8776l05577K99536k04309J48779l20787L00316j5326j11955
3817A356995j6937J4550M0478j36911L334M5675K69328l81058J2759K58747k66551
3806A200409M4055R7934O6336l74825L22891j90176J17096j83606N0885R6745
3796A247744K13866j78155p9823J65251k22790k19376K84219k3971J70651l8187
$$ plain form
3870 2035746 1966121 2031460 1899460 2126965 2002377 1862313 1970475 2011499 2067522 1912019
3860 1912019 1918414 1880779 1913527 1854945 1882587 1773980 1885207 1700599 1656949 1623183 1442814
3849 1442814 1527619 1585547 1607829 1768408 1648694 1619336 1545955 1455565 1462443 1501995 1472738
3838 1472738 1492444 1469701 1420902 1440830 1407537 1270916 1422306 1564400 1432759 1436607 1303695
3827 1303695 1477542 1566318 1260741 1560277 1355968 1504747 1183960 1484276 1468950 1356995
3817 1356995 1340058 1354608 1395086 1258175 1261509 1307184 1576512 1195454 1208213 1466960 1200409
3806 1200409 1244464 1342398 1408734 1033909 1356800 1166624 1283720 1100114 1150999 1247744
3796 1247744 1461610 1283455 1203632 1368883 1146093 926717 1210936 1186965 1357616 1319429
3786A319429j68663K429K5600j48235J55753k0384J2378k93820K26676q5301K76269
3775A302131j23588j21734l1660j6663J02475J06375l09474J9867J71843J47997
3765A247569L1473l42649J75772j48938J13066K9941q5279r7155J00976p4736
3755I50040K09932j01683q1455J57765n524K9924j81714j49498J22859J51142
3745A101788k9930K3698j31425o784k0932J17389L3865j70079R5982K90681k27564
3734A076689k50332M00598j87192l8522k9847j9741O0784q6304j53874L27481
3724A099740j72602p1146K17039l38260L11376p2762r8326n1350n8073K74572
3714A040208l00707K86358k07305r0985K910J41345L505R2635J6801k08212K77125
$$ plain form
3786 1319429 1150766 1153195 1178795 1030560 1186313 1165929 1178307 884487 1111163 1025862 1302131
3775 1302131 1178543 1056809 1025149 1008486 1110961 1217336 907862 927729 1099572 1247569
3765 1247569 1279042 936393 1112165 963227 1076293 1106234 1020955 923800 1024776 950040
3755 950040 1159972 1058289 976834 1134599 1129075 1158999 977285 827787 950646 1101788
3745 1101788 1071858 1095556 964131 957347 936415 1053804 1087669 917590 1013572 1304253 1076689
3734 1076689 826357 1226955 1039763 1001241 971394 951653 1012437 926133 772259 1099740
3724 1099740 927138 855992 1073031 734771 1046147 973385 875059 823709 765636 1040208
3714 1040208 739501 1025859 818554 727569 730479 871824 875329 967964 984765 776553 1053678
3703A053678l6247j42460k0564K3377J2653N1541k11696k9751J22210k665R5756
3692I15832j33866J2113J22174m6186Q8867j65894j00353O7170J43572j22597
3682G80832J22393k16641J32039Q4047o6816n5987M0552M5930N4224j04016P4357
3671H90914j76346r0798P5031P6974k7445j17913j24435Q2570J05720N8349M3347
3660G95968j76854K47526J43605k46383j34751J93006J2779k44051L78930j73620
3650G96155j84802J24588j54029K86592r3067L6118p570j66275J47581J7085J35434
3639I37810k69103J9912J44325r2835k27120M9309J94145k4116N6865N5605j51153
3628F93644R8749K4250j53067J24500k4936R878q391K546K38274j41762L11831
$$ plain form
3703 1053678 1017431 874971 854407 877784 890437 941978 730282 700531 822741 820076 915832
3692 915832 781966 794079 916253 870067 958934 793040 692687 759857 903429 780832
3682 780832 903225 686584 818623 902670 835854 779867 820419 866349 920573 816557 890914
3671 890914 714568 623770 698801 775775 748330 630417 505982 588552 694272 752621 795968
3660 795968 619114 866640 1010245 763862 629111 822117 834896 590845 969775 796155
3650 796155 611353 735941 581912 868504 775437 811555 803985 637710 785291 802376 937810
3639 937810 668707 688619 832944 740109 512989 562298 756443 732327 789192 844797 693644
3628 693644 792393 816643 663576 788076 763140 773018 764627 767173 1005447 863685 1175516
3617A175516j82472M7880o0090j52133l1031K07564k57172O5204j75072j86701
3607D51493K19852K05985j07420K696k0900j05471J57361j1585k41204J10404
3597F61211K2476P1622j78346J7840q3673P1088j07174J24549O9319J4038k0617
3586F62333k9456k31673K73129k53114L9226J49641j11218P3866K13704m02966
3576C83472K68625P019j43475j3101J38539j07443K0923k4831R3099j06886K32134
3565G48075j41566o2963O2379k4949j27004K82751j86835K44811k70121J00092
3555F24670o2973J58477J2470k02346J01645j07020J75426P9512r9291K84050
3545I64620l38903J76046k21768K49359j9127j49005K75835k30343O5854L51935
$$ plain form
3617 1175516 993044 1040924 980834 828701 797670 1005234 748062 813266 638194 451493
3607 451493 671345 877330 769910 772606 751706 646235 803596 792011 550807 661211
3597 661211 683687 755309 576963 594803 511130 582218 475044 599593 668912 682950 662333
3586 662333 632877 401204 674333 421219 460445 610086 498868 572734 786438 383472
3576 383472 652097 659116 515641 502540 641079 533636 554559 529728 622827 515941 748075
3565 748075 606509 543546 605925 580976 453972 736723 549888 794699 524578 624670
3555 624670 561697 720174 732644 530298 631943 524923 700349 779861 680570 964620
3545 964620 625717 801763 579995 829354 810227 661222 937057 706714 772568 1124503
3535A124503j2922L33143m6586m5389P3250N0054N09726O69583L74268p86924
3525B242706l05723k52949m06914q934o4318m58037R1934J62494l91956K37781
3515H46084m8561K85702l74672P2625J29121M51888M85850k18543j50983j16908
3505A361603k01568j85620j13936l6568M1464p7658o3403N6963o3946J29266k02106
3494F44491J34388m0202N6299o2300P7228n2876J28104m8826j27274n8538J00871
3483G51365O3123k97975R7851K3059p2400J48457K6025j1734j00973K870J26863
3472G56531P6978j44047m2166R901j11771J33115l94o8178P9943J75103k42103
3461F22912R025K87412m44144L81943j49183R958J78655o2235k6563M8208l08185
$$ plain form
3535 1124503 1111581 1444724 1398138 1352749 1425999 1476053 1985779 2655362 3029630 2242706
3525 2242706 1936983 1684034 1277120 1268186 1203868 745831 837765 1000259 608303 846084
3515 846084 797523 1083225 708553 781178 910299 1362187 1848037 1629494 1478511 1361603
3505 1361603 1160035 974415 860479 823911 865375 787717 724314 781277 717331 846597 644491
3494 644491 778879 738677 794976 732676 809904 757028 885132 836306 709032 650494 751365
3483 751365 814488 516513 614364 637423 565023 713480 739505 727771 626798 629668 756531
3472 756531 833509 689462 647296 657197 545426 678541 678147 609969 689912 865015 622912
3461 622912 631937 919349 475205 857148 707965 717923 896578 834343 807780 855988 547803
3450E47803N99930j91220m3328J61505N47854O11185J17204m05227l37587r2326
3440A515793j13102M9011j03716J08082L8148j16323o4296J64660N5326M2521
3430A576104p4686L51829M39758J337997K837339K590547M7588j782658j736792
3421E587026j318070q57790q78039l28598l40356j49438q7874q3982j04607L9466
3411A477738q5427O9424q7092j71465q228r372K04774l64819K51178k09847L32512
3400A399376J2721p6859L31533P590K4027J38840j21289J30947p8467L2124J43736
3389A944279R5450K88911O6880O15895Q08199J014244J839775K817032K639097
3380A2129762M92197j464606k017242j682918j764415j178843q76140o25055n17139
$$ plain form
3450 547803 1147733 956513 913185 1074690 1622544 2233729 2350933 1945706 1608119 1515793
3440 1515793 1402691 1451702 1347986 1456068 1494216 1377893 1313597 1478257 1533583 1576104
3430 1576104 1501418 1853247 2293005 3631002 6468341 9058888 9106476 7323818 5587026
3421 5587026 4268956 3411166 2533127 2204529 1864173 1714735 1626861 1542879 1438272 1477738
3411 1477738 1392311 1461735 1374643 1203178 1194950 1185578 1390352 1025533 1276711 1066864 1399376
3400 1399376 1412097 1335238 1666771 1674361 1698388 1837228 1715939 1846886 1768419 1800543 1944279
3389 1944279 2039729 2328640 2395520 3011415 3819614 4833858 6673633 9490665 12129762
3380 12129762 12621959 11157353 9140111 7457193 5692778 4513935 3637795 3012740 2495601
3371B495601k19127j83883k93546P2604j54165j2978M0660j21367k92618P4631
3361A405812m5250K15231m69684J3157N9613r2726j92772R7777K4714q720l5729
3350I71423L28921j98221j8517o5391K4600Q8168j55352N3512K7657K7510q8506
3339I95804K04452j5210J31874L0914l9811L3825k24699J51129m7917K53699O7067
3328A541127M83519J95663K010254L588469L072616j171038j946669j899140j436616
3319D438185j005836q15359n35391l32023l02888q8165L3405j75150L02970l18680
3309A201068j65811N2433j04642J2385n5477r656q1192K39811k83615r108O2346
3298H58542J0213j64997N321N6052k00025Q1559p481J8195J57496j68989P4381
$$ plain form
3371 2495601 2276474 2092591 1799045 1871649 1717484 1704506 1745166 1623799 1331181 1405812
3361 1405812 1360562 1575793 1106109 1119266 1178879 1086153 893381 991158 1015872 1007152 971423
3350 971423 1300344 1102123 1083606 1018215 1042815 1130983 975631 1029143 1056800 1084310 995804
3339 995804 1200256 1185046 1316920 1347834 1308023 1341848 1117149 1268278 1220361 1474060 1541127
3328 1541127 2024646 2220309 4230563 7819032 10891648 9720610 7773941 5874801 4438185
3319 4438185 3432349 2616990 2081599 1749576 1446688 1358523 1391928 1216778 1519748 1201068
3309 1201068 1035257 1087690 983048 995433 939956 930300 849108 1088919 805304 796196 858542
3298 858542 868755 703758 709079 765131 565106 646665 639184 657379 814875 645886 720267
3287G20267j60583J82957Q1457j23228j44219m6108k8856K35573j3199o5614j9075
3276F19372k5796j01894J82627j43378N9494N8690l4169m2413q3362N3667o1868
3265D80970J14464l55105J50726K66340J38744k86845o021J16922k01971K06099
3255F24323j49899J25388k85973j5585J28075J98605j27717p9047m5362J65886
3245E38694N4055k57172L2265J4787q6469L72056l20051L8567R0971P024j1666
3234D73061j72588K10960j43543Q8744j62617J55746j9922M4373j82846O6927
3224C58295R3849j28747P420R2617L3j48629J80758K16124j01512J53636l74023
3213C49821Q9013n5675J7265J06739j9546n6799N3633l2745n6233j44545J60859
$$ plain form
3287 720267 559684 742641 824098 700870 556651 510543 481687 717260 704061 638447 619372
3276 619372 593576 491682 674309 530931 590425 649115 614946 572533 489171 542838 480970
3265 480970 595434 240329 391055 657395 796139 509294 503273 620195 418224 624323
3255 624323 474424 599812 313839 298254 426329 624934 497217 418170 372808 538694
3245 538694 592749 335577 367842 382629 296160 668216 348165 386732 477703 484727 473061
3234 473061 300473 511433 367890 456634 294017 449763 429841 474214 291368 358295
3224 358295 452144 323397 330817 423434 423467 274838 455596 671720 570208 723844 349821
3213 349821 438834 383159 400424 507163 487617 430818 484451 451706 395473 250928 411787
3202D11787j62103J24865O2874j51732J50926J07165j92056J84838k68513J07113
3192C75164j4650n4006J82896j58761J59905j81052J62592j88137J65460M6313
3182D95724l7352k0700j76764K26958o6344m1016j49633K89420j76918j89297
$$ plain form
3202 411787 249684 374549 437423 285691 436617 543782 351726 536564 268051 375164
3192 375164 360514 306508 489404 330643 490548 309496 472088 283951 449411 495724
3182 495724 458372 437672 260908 487866 421522 380506 230873 520293 343375 154078
$$ [...]
##END NTUPLES=NMR SPECTRUM
##END=
