##TITLE=abcd
##JCAMPDX= 6.0         $$ Bruker NMR JCAMP-DX V2.0
##DATA TYPE= NMR SPECTRUM
##DATA CLASS= NTUPLES
##ORIGIN= UXNMR, Bruker Analytische Messtechnik GmbH
##OWNER= root
$$ XWIN-NMR		Version 3.5
$$ Wed Mar  4 17:02:24 2026 Russian Standard Time (UT+4h)  servis@DPX200
##.OBSERVE FREQUENCY= 200.131235884673
##.OBSERVE NUCLEUS= ^1H
##.ACQUISITION MODE= SIMULTANEOUS
##.ACQUISITION SCHEME= undefined
##.AVERAGES= 32
##.DIGITISER RES= 18
##SPECTROMETER/DATA SYSTEM= spect
##.PULSE SEQUENCE= zg
##.SOLVENT NAME= DMSO
##.SHIFT REFERENCE= (INTERNAL, DMSO, 0, 16.4885)
##AUDIT TRAIL= $$ (NUMBER, WHEN, WHO, WHERE, WHAT)
$$ ##TITLE= Audit trail, XWIN-NMR		Version 3.5
$$ ##JCAMPDX= 5.01
$$ ##ORIGIN= Bruker BioSpin GmbH
$$ ##OWNER= servis
$$ F:\spectra/data/av/nmr/H1/1/pdata/1/auditp.txt
$$ ##AUDIT TRAIL=  $$ (NUMBER, WHEN, WHO, WHERE, WHAT)
(   1,<2026-03-04 16:57:39.39 +0400>,<servis>,<DPX200>,
      <created by zg, POWCHK disabled, PULCHK disabled
       configuration hash MD5:
       00 E9 B6 7A A2 85 ED C7 34 08 36 98 17 FE 4E 26
       data hash MD5: 32K
       E2 FB 99 FA 46 34 73 FB E5 9E 8E 6F 70 5D 31 E1>)
(   2,<2026-03-04 17:02:05.43 +0400>,<servis>,<DPX200>,
      <Start of raw data processing
       efp BC_mod = 2 LB = 0.05 FT_mod = 6 PKNL = 1 PHC0 = -184.1201 PHC1 = 6.301564 SI = 16K 
       data hash MD5: 16K
       43 C1 9E 11 76 0D AF 88 26 94 15 2C 55 32 E0 76>)
$$ ##END=
$$ 
$$ hash MD5
$$ 90 84 58 57 27 99 32 86 B7 61 E4 74 63 FD 85 02
##$RELAX= 
##$RELAX= 
##$RELAX= 
##$RELAX= 
##$RELAX= 
##$RELAX= 
##$RELAX= 
##$RELAX= 
$$ Bruker specific parameters
$$ --------------------------
##$DU= <F:\spectra>
##$EXPNO= 1
##$NAME= <H1>
##$PROCNO= 1
##$TYPE= <nmr>
##$USER= <av>
##$AMP= (0..31)
100 100 100 100 100 100 100 100 100 100 100 100 100 100 100 100 100 100 
100 100 100 100 100 100 100 100 100 100 100 100 100 100 
##$AQSEQ= 0
##$AQ_mod= 1
##$AUNM= <au_zg>
##$AUTOPOS= <>
##$BF1= 200.13
##$BF2= 200.13
##$BF3= 200.13
##$BF4= 200.13
##$BF5= 500.13
##$BF6= 500.13
##$BF7= 500.13
##$BF8= 500.13
##$BYTORDA= 1
##$CFDGTYP= 0
##$CFRGTYP= 5
##$CHEMSTR= <none>
##$CNST= (0..31)
1 1 145 1 1 1 1 1 1 1 1 1 1 1 1 1 1 1 1 1 1 1 1 1 1 1 1 1 1 1 1 1 
##$CPDPRG= <>
##$CPDPRG1= <>
##$CPDPRG2= <>
##$CPDPRG3= <>
##$CPDPRG4= <mlev>
##$CPDPRG5= <mlev>
##$CPDPRG6= <mlev>
##$CPDPRG7= <mlev>
##$CPDPRG8= <mlev>
##$CPDPRGB= <>
##$CPDPRGT= <>
##$D= (0..31)
0 2 0 0 0 0 0 0 0 0.06 0 0 0 0 0 0 0.0002 0 0 0 0 0 0 0 0 0 0 0 0 0 0 
0 
##$DATE= 1772629058
##$DBL= (0..7)
120 120 120 120 120 120 120 120 
##$DBP= (0..7)
150 150 150 150 150 150 150 150 
##$DBP07= 0
##$DBPNAM0= <>
##$DBPNAM1= <>
##$DBPNAM2= <>
##$DBPNAM3= <>
##$DBPNAM4= <>
##$DBPNAM5= <>
##$DBPNAM6= <>
##$DBPNAM7= <>
##$DBPOAL= (0..7)
0.5 0.5 0.5 0.5 0.5 0.5 0.5 0.5 
##$DBPOFFS= (0..7)
0 0 0 0 0 0 0 0 
##$DE= 6
##$DECBNUC= <off>
##$DECIM= 32
##$DECNUC= <off>
##$DECSTAT= 4
##$DIGMOD= 1
##$DIGTYP= 9
##$DL= (0..7)
0 120 120 120 120 120 120 120 
##$DP= (0..7)
150 150 150 150 150 150 150 150 
##$DP07= 0
##$DPNAME0= <>
$$ [...]
##$SUBNAM4= <"">
##$SUBNAM5= <"">
##$SUBNAM6= <"">
##$SUBNAM7= <"">
##$SUBNAM8= <"">
##$SUBNAM9= <"">
##$SW= 20.6817932712277
##$SWIBOX= (0..15)
0 0 3 0 0 0 0 0 0 0 0 0 0 0 0 0 
##$SW_h= 4139.07284768212
##$TD= 32768
##$TD0= 1
##$TE= 0
##$TE2= 300
##$TE3= 300
##$TEG= 300
##$TL= (0..7)
0 120 120 120 120 120 120 120 
##$TP= (0..7)
150 150 150 150 150 150 150 150 
##$TP07= 0
##$TPNAME0= <>
##$TPNAME1= <>
##$TPNAME2= <>
##$TPNAME3= <>
##$TPNAME4= <>
##$TPNAME5= <>
##$TPNAME6= <>
##$TPNAME7= <>
##$TPOAL= (0..7)
0.5 0.5 0.5 0.5 0.5 0.5 0.5 0.5 
##$TPOFFS= (0..7)
0 0 0 0 0 0 0 0 
##$TUNHIN= 0
##$TUNHOUT= 0
##$TUNXOUT= 0
##$USERA1= <user>
##$USERA2= <user>
##$USERA3= <user>
##$USERA4= <user>
##$USERA5= <user>
##$V9= 5
##$VALIST= <valist>
##$VCLIST= <CCCCCCCCCCCCCCC>
##$VD= 0
##$VDLIST= <DDDDDDDDDDDDDDD>
##$VPLIST= <PPPPPPPPPPPPPPP>
##$VTLIST= <TTTTTTTTTTTTTTT>
##$WBST= 1024
##$WBSW= 30
##$XGAIN= (0..3)
0 0 0 0 
##$XL= 0
##$YL= 0
##$YMAX_a= 2976713
##$YMIN_a= -3051550
##$ZGOPTNS= <>
##$ZL1= 120
##$ZL2= 120
##$ZL3= 120
##$ZL4= 120
##$ABSF1= 0
##$ABSF2= 0
##$ABSG= 0
##$ABSL= 0
##$ALPHA= 0
##$AQORDER= 0
##$ASSFAC= 0
##$ASSFACI= 0
##$ASSFACX= 0
##$ASSWID= 0
##$AUNMP= <proc_1d>
##$AZFE= 0.1
##$AZFW= 0.1
##$BCFW= 0
##$BC_mod= 2
##$BYTORDP= 0
##$COROFFS= 0
##$CY= 18.4799938201904
##$DATMOD= 1
##$DC= 0
##$DFILT= <>
##$DTYPP= 0
##$F1P= 9.9274215381318
##$F2P= -0.165520771350173
##$FCOR= 1
##$FTSIZE= 16384
##$FT_mod= 6
##$GAMMA= 0
##$GB= 0
##$INTBC= 1
##$INTSCL= 4.127829e-11
##$ISEN= 128
##$LB= 0.05
##$LEV0= 0
##$LPBIN= 0
##$MAXI= 10000
##$MC2= 0
##$MEAN= 0
##$ME_mod= 0
##$MI= 50
##$NCOEF= 0
##$NC_proc= -2
##$NLEV= 6
##$NOISF1= 3.799351
##$NOISF2= 2.8
##$NSP= 0
##$NTH_PI= 0
##$NZP= 0
##$OFFSET= 16.48848
##$PC= 4
##$PHC0= -184.1201
##$PHC1= 6.301564
##$PH_mod= 1
##$PKNL= yes
##$PPARMOD= 0
##$PSCAL= 4
##$PSIGN= 0
##$REVERSE= no
##$SF= 200.130005582386
##$SI= 16384
##$SIGF1= 3
##$SIGF2= 2
##$SINO= 400
##$SIOLD= 16384
##$SREGLST= <1H.CDCl3>
##$SSB= 0
##$STSI= 16384
##$STSR= 0
##$SW_p= 4139.07284768211
##$SYMM= 0
##$S_DEV= 0
##$TDeff= 32768
##$TDoff= 0
##$TI= <>
##$TILT= no
##$TM1= 0
##$TM2= 0
##$TOPLEV= 0
##$USERP1= <user>
##$USERP2= <user>
##$USERP3= <user>
##$USERP4= <user>
##$USERP5= <user>
##$WDW= 1
##$XDIM= 16384
##$YMAX_p= 414554019
##$YMIN_p= -320808
$$ End of Bruker specific parameters
$$ ---------------------------------
##NTUPLES= NMR SPECTRUM
##VAR_NAME=  FREQUENCY,     SPECTRUM/REAL,   SPECTRUM/IMAG
##SYMBOL=    X,             R,               I
##VAR_TYPE=  INDEPENDENT,   DEPENDENT,       DEPENDENT
##VAR_FORM=  AFFN,          ASDF,            ASDF
##VAR_DIM=   16384,         16384,           16384
##UNITS=     HZ,            ARBITRARY UNITS, ARBITRARY UNITS
##FACTOR=    0.252644378177508, 1,           1
##FIRST=     3299.83951724647, 0,            0
##LAST=      -839.233330435636, 0,           0
##MIN=       -839.233330435636, -320808,     0
##MAX=       3299.83951724647, 414554019,    0
$$ Real data points
##PAGE= N=1
##DATA TABLE= (X++(R..R)), XYDATA
$$ [...]
9337a58189r14R83k995J676k43j314L991l372Q89j397K883j090l39N10l6q27n26
9320a60310MK517k375J426o26k55K445q5Q8q65J041k158j475p9K873k637K806
9303a57665l01j766J246J10j160j685L258l158J534m78M29nk167K361r06j157
9287a61510RJ70J576j468j215L505l266L175j217J468j042R74J996q12j381P17
9271a58321r79j122k0M9j712j202M892l282N83L051k810N60R57q94K45o21M5j434
9253a62015l76J908J63p97L678k263Q58N01p08k48R0k371K73j431Q67J18O88j323
9235a62388K212q52J000k674J620m52J319j392k172M127j464l10J384O80o14k93
9219a60269J039j982j508J278Q60N46j33o43j612K468K110k245l29M47j406O28
$$ y = [-158189, -159103, -158120, -161115, -159439, -159682, -160996, -157005, -160377, -159488, -160885, -158002, -159092, -159431, -158921, -158957, -159784, -160310, -160306, -157789, -160164, -158738, -159364, -159619, -157174, -157259, -157171, -158036, -156995, -159153, -160628, -160707, -157834, -160471, -157665, -157966, -159732, -158486, -158376, -159536, -161221, -157963, -161121, -159587, -160065, -159636, -159641, -161808, -159447, -160353, -161510, -161501, -161331, -159755, -161223, -162438, -158933, -162199, -159024, -160241, -158773, -159815, -158841, -156845, -157657, -159038, -158321, -159300, -160422, -160442, -160393, -162105, -163307, -158415, -161697, -161114, -158063, -160873, -160313, -159356, -160250, -160005, -160626, -160581, -162015, -162391, -160483, -160320, -161117, -157439, -159702, -158844, -158343, -159051, -159299, -159209, -161580, -161307, -162738, -161871, -161753, -161065, -162388, -160176, -161028, -160028, -162702, -161082, -161534, -160215, -161607, -163779, -159652, -161116, -161426, -160042, -159362, -159976, -160269, -159230, -161212, -162720, -161442, -160582, -160036, -160169, -160812, -162424, -159956, -157846, -160091, -160420, -159973, -161379, -160751]
9203a60751k03J657k232j108J065R57Q5o3q59j58J203J469j556q90j604R92K02
9186a61794O79J939j851K44N30M91j615j18L19j78Q61O23k104q35L15P4Q86J60
9168a61374k72n00J872j477j828K929j416m28j664L518j516J99N48J967k440k262
9152a64144K187Q01M9q53m42K326j828J172q16N89j97l336K691j041J568j487
9136a62761q78J576m81o12M383l498r18J132k204K466l33r13P63k496O68K279
9120a61827J245P03J09j678q83M31K809l225J915k146K35P71L75k686O55n3J381
9103a61869j302K899j402J687l378j285L367j486J054M64J096k604r51J585j23
9088a62248r76P59J621n95M60j369j084O06k06K175j986N97M82j973N41J728J264
$$ y = [-160751, -160954, -159297, -161529, -162637, -161572, -160615, -160530, -160593, -161452, -161610, -160407, -158938, -160494, -161384, -162988, -161996, -161794, -161115, -159176, -161027, -160783, -160253, -159762, -161377, -161495, -161176, -161354, -160493, -159870, -161974, -162809, -162494, -162420, -161534, -161374, -161646, -162146, -160274, -161751, -163579, -160650, -162066, -162494, -164158, -160640, -162156, -161957, -161409, -159442, -161882, -164144, -161957, -161156, -161107, -161960, -162402, -160076, -161904, -160732, -161548, -160959, -161156, -164492, -161801, -162842, -161274, -162761, -163639, -162063, -162544, -163156, -158773, -162271, -163189, -162057, -164261, -161795, -162128, -163041, -162278, -164774, -164106, -161827, -160582, -159879, -159770, -161448, -162331, -161900, -159091, -162316, -160401, -162547, -162312, -161541, -161166, -163852, -163197, -163250, -161869, -163171, -160272, -161674, -159987, -163365, -164650, -161283, -162769, -161715, -161251, -160155, -162759, -163710, -162125, -162248, -163224, -162465, -160844, -161439, -160979, -162348, -163432, -162826, -163032, -160857, -162843, -162246, -161764, -163737, -163196, -161468, -160204]
9071a60204l210J918o64P05l504J377o28R19j685R72L90j318L112l501P52j16
9055a64685J863n0J565k716J702q07J652l83k77k1j168J987o88j330N43q38J129
9038a62522J342j145j483K35J818r37P19k331K154l100K116o91k11M59J772j818
9022a63623J714j225R81j391Q81j75k605J169J69j85J63r10K602j442P4j639N073
9005a60369k159J385m260K293O36n6N10J83o27L26n16j35j260l37L255m44k886
8988a64461q98J783Q0p69r94J318j083J459j781K203J151k601P19J232o63K56
8972a63049k42r7J236m29p62j415J829n4l79j941o21J389j043J993l074L022K5
8955a63612O45j194j61j484J196j137J539r8J254J587l768J36p08L044l099L627
$$ y = [-160204, -163414, -161496, -162160, -161455, -164959, -163582, -164210, -163291, -164976, -164004, -163614, -164932, -161820, -165321, -164569, -164685, -162822, -162872, -161307, -164023, -162321, -163128, -161476, -161859, -162136, -162157, -163325, -161338, -162026, -163356, -162813, -163651, -162522, -161180, -162325, -163808, -163573, -161755, -162692, -161973, -164304, -162150, -165250, -163134, -163825, -164036, -163577, -161805, -163623, -161909, -163134, -162153, -163544, -162663, -162838, -165443, -164274, -164105, -164290, -164127, -165037, -162435, -163877, -163803, -165442, -160369, -162528, -161143, -165403, -163110, -162474, -162530, -162020, -161837, -162464, -162138, -162654, -162789, -164049, -164386, -161131, -161575, -164461, -165359, -163576, -163496, -164265, -165259, -163941, -165024, -163565, -165346, -163143, -161992, -164593, -163874, -162642, -163305, -163049, -163291, -163388, -162152, -162581, -163343, -164758, -162929, -162983, -163362, -165303, -165924, -164535, -165578, -163585, -166659, -163637, -163612, -162967, -164161, -164322, -165806, -164610, -165747, -164208, -164306, -163052, -161465, -165233, -165097, -165805, -162761, -165860, -162233]
8939a62233k616j358N23J089n42q89J404r73P15K12N27j199N74P31J030k225J83
8922a65047J415j073k43O79o17k51K726l007n38Q59K010q45r00J096j894N56K36
8905a64838K123l845J803p89J856j124K3J391j340o8M063l803J156k970K159K058
8889a62145k175r53q65j73K841P90L68l489K854k159K37J534l371K474j743L333
8873a62642j690L60j56n6m85J2K279j731k879M034j721r36O66M15p66R37n68J393
8855a63534m72J64L18q15r73p73J65P45J679r65J431k039J651j040j575N49j303
8838a66787K51j85k16J211K053j460Q98k771K021j425k75P08q10K458N05k174
8822a65998J469j0r97l67o55K129q44j411R78J82p17J127K53j534J243j42j477
$$ y = [-162233, -164849, -166207, -165684, -164595, -165137, -166026, -164622, -165595, -164880, -164668, -164141, -165340, -164766, -164035, -163005, -165230, -165047, -163632, -164705, -164948, -164269, -164886, -165137, -162411, -165418, -165956, -165097, -163087, -163932, -164832, -163736, -165630, -165074, -164838, -162715, -166560, -164757, -165546, -163690, -164814, -164791, -163400, -164740, -164808, -160745, -164548, -163392, -166362, -164203, -162145, -164320, -165273, -166138, -166311, -163470, -162680, -162312, -165801, -162947, -165106, -164869, -163335, -166706, -164232, -165975, -162642, -164332, -163972, -164128, -164184, -164669, -164657, -162378, -164109, -166988, -162954, -164675, -165611, -164945, -164530, -165296, -164359, -164927, -163534, -164006, -163842, -163524, -164339, -165312, -166085, -165920, -165175, -163496, -164461, -163030, -165069, -163418, -164458, -166033, -165484, -166787, -166536, -166721, -166937, -165726, -163673, -165133, -164235, -167006, -164985, -166410, -166685, -165977, -166787, -164329, -163824, -165998, -164529, -164539, -165536, -165903, -166558, -164429, -165273, -166684, -165706, -165524, -166241, -165114, -164861, -166395, -165152, -165294, -166771]
8805a66771J572O66q28J547l835K224j172J681k993L693j800k8J968l737R12K320
8789a64581K865j823J851J0737k3072M985J158j464J304l2N49L87M43n09J372
8774a65830o28j148L23p4J675j034k7J103j236J732j71K26L4k425K51j263Q57
8757a67635k355J414L71K481P84k705n00p11K59J077q48J800j065j725J308k03
8741a68253J0j909J573L49J678o69L36q63j024j157k18L404k739Q58P72j075m81
8724a69408q00M36m49Q92J781k258K544k020K121Q38L11m466l31K77J183P26j789
8707a70412J800J674j664o17O52J322j438n62k70l10m53r0j768K409K226j661
8691a69162K362l881K504l01j495k2j50J598l001J719J278K06j376k33j804K279
$$ y = [-166771, -165199, -164533, -165361, -163814, -167649, -165425, -166597, -164916, -167909, -164216, -166016, -166044, -164076, -167813, -166901, -164581, -161716, -163539, -161688, -150951, -174023, -169038, -167880, -169344, -168040, -168072, -167523, -167136, -166693, -167202, -165830, -166458, -167606, -167283, -167357, -165682, -166716, -166743, -165640, -166876, -165144, -165315, -165089, -165055, -167480, -167229, -168492, -167635, -169990, -168576, -168205, -165724, -164940, -167645, -168145, -168856, -168597, -167520, -168368, -166568, -167633, -169358, -168050, -168253, -168243, -170152, -168579, -168230, -166552, -167221, -166885, -167748, -168772, -169929, -170147, -166743, -169482, -168624, -167852, -168927, -169408, -170208, -169772, -170221, -169329, -167548, -169806, -167262, -169282, -167161, -166323, -166012, -170478, -170809, -170532, -169349, -168623, -170412, -168612, -166938, -168602, -169219, -168567, -167245, -168683, -169245, -169515, -169825, -170278, -170368, -172136, -169727, -167501, -169162, -166800, -170681, -168177, -168478, -169973, -169995, -170145, -168547, -171548, -169829, -168551, -168345, -169721, -169954, -171758, -169479]
8675a69479q37M32j431L74Q42P62l574J552J583o08j670O89o99P36k403O93N05
8658a72533j433J637J884j40L18o26n634J747l903J841m5P44K148K937j030q3
8642a72171J310P48n032J404j965r79J85m66p92L322o21K494l535K016l740n003
8626a82825M205Q48r01K03J567R95P06J680K80k051j137j897m125R74J94J21L196
8609a77967L8k007J001j9r77k768J96m66p53J074j573M414j937K758j603j629
8593a82218N34j389m433k035J13k770l11Q26K88J029M005m68k157j062k141j568
8577a93757R36j066m8K798r5K979K134k783j161k282j888K976j38m541k635J890
8561a96681J861L096M007K366R82l42k308l190k726k943k177J516j998J407N310
$$ y = [-169479, -170316, -169884, -171315, -170941, -170099, -169337, -172911, -171359, -169776, -170384, -172054, -171365, -172064, -171328, -173731, -173038, -172533, -173966, -172329, -170445, -170585, -170267, -170893, -176527, -174780, -178683, -176842, -176887, -176143, -173995, -171058, -172088, -172171, -170861, -170113, -175145, -173741, -175706, -176685, -176500, -176966, -177758, -174436, -175057, -172563, -176098, -174082, -177822, -182825, -178620, -177772, -178673, -178470, -176903, -175908, -175202, -173522, -173242, -175293, -176430, -178327, -182452, -181478, -181284, -181163, -177967, -177929, -179936, -178935, -178954, -179931, -182699, -182503, -182969, -183722, -182648, -184221, -179807, -181744, -178986, -180589, -182218, -181684, -183073, -187506, -189541, -189428, -192198, -192509, -191683, -191395, -190366, -186361, -186829, -188986, -190048, -192189, -193757, -192821, -193887, -193935, -191137, -191232, -188253, -186119, -188902, -190063, -192345, -194233, -191257, -191395, -195936, -198571, -196681, -194820, -191724, -187717, -185351, -184369, -184711, -187019, -190209, -192935, -195878, -198055, -196539, -198537, -197130, -191820]
8546a91820K337J099m551j810m790J947K837M183L208R5j3704J8019N9761l6498
8532a59687l316n321M688q75p83J993m123L000q67J8r7j682j449k787j009m070
8516a76367K594r13M848J438L91P142R57M062j426j314j830m63L68J743J551K956
8500a54263L354o70J180J641K570q70j811k533J78l472j726j133M613L248k83
8485a49977j317o76l061j831J068Q65r27J441J718J573J182L97K651r73j364k268
8469a51499j021k531J549j400J473J352J285k34R17L83M15j345K2k668k04J358
8453a52148J020L94j003p31M260k370k892j719K063o65n544L015j816J609j411
8438a57938L171j637J933j905J595Q3j807J070J932j185J784J644k203j017J918
$$ y = [-191820, -189483, -188384, -192935, -194745, -199535, -197588, -194751, -190568, -187360, -187265, -200969, -182950, -123189, -159687, -163003, -168324, -163636, -164511, -165294, -163301, -167424, -164424, -165291, -165273, -165370, -167052, -168501, -171288, -172297, -176367, -173773, -174686, -169838, -168400, -168009, -160867, -159910, -155848, -157274, -158588, -160418, -160881, -160513, -158770, -157219, -154263, -150909, -151579, -150399, -148758, -146188, -147058, -148869, -151402, -151224, -154696, -156422, -157555, -152942, -149694, -149977, -151294, -151970, -155031, -156862, -155794, -154929, -155856, -154415, -152697, -151124, -149942, -149545, -146894, -147867, -149231, -151499, -152520, -155051, -153502, -154902, -153429, -152077, -150792, -151026, -150109, -149726, -149311, -150656, -150634, -153302, -153506, -152148, -151128, -150734, -151737, -152468, -148208, -150578, -153470, -155189, -153126, -153791, -159335, -156320, -158136, -156527, -157938, -154767, -156404, -154471, -156376, -154781, -154698, -156505, -155435, -153503, -154688, -152904, -151260, -153463, -154480, -152562]
8423a52562k344L21r94k048k494j848J487O86P74R31K705J300J827l925q0L37
8407a55927k158K248j270j251L250k333K433j330m112N06J371j266P07L172k204
8392a58164R49l06R316j0579M605J384j001l621J0r31J386n11l664J216J6j007
8376a60902J091J512M06r99O65k003M45J935n9k495J998l80K474q98j1l35j868
8359a59424J089J319m606L330k15m625J253K49L769n250L814j311K951q90K01
8344a58346J460m159L021J91m49j301j066P76p74q89J37M96l61J232k370K963
8328a59439j915J51j97J590j523n18R93M87M52r13K862j053k204p33J438o83J626
8311a59579l069J559p47J929K894n242P91p97K503R22J120o46k617L584k955k242
$$ y = [-152562, -154906, -154585, -155579, -157627, -160121, -161969, -160482, -159796, -159022, -158091, -155386, -154086, -152259, -156184, -156264, -155927, -158085, -155837, -157107, -158358, -155108, -157441, -155008, -156338, -160450, -159944, -158573, -159839, -159132, -155960, -158164, -157215, -157521, -148205, -158784, -154179, -152795, -153796, -157417, -157407, -158338, -156952, -157463, -161127, -159911, -159895, -160902, -159811, -158299, -157893, -158892, -158227, -160230, -159785, -157850, -157909, -160404, -158406, -158786, -156312, -157210, -157221, -157556, -159424, -158335, -157016, -161622, -158292, -158507, -163132, -161879, -161630, -157861, -163111, -159297, -160608, -157657, -158547, -158346, -156886, -161045, -158024, -157833, -158282, -159583, -160649, -159873, -160647, -161536, -161399, -160903, -161264, -160032, -162402, -159439, -161354, -161203, -161400, -159810, -161333, -161851, -160858, -160371, -159919, -160832, -157970, -159023, -161227, -161960, -160522, -161205, -159579, -162648, -161089, -161836, -159907, -157013, -162255, -161464, -162261, -159758, -158836, -157716, -158362, -160979, -157395, -160350, -162592]
8295a62592L326j827k596K045j759L013p55K30J904k388J377L130k174l130L064
8280a59132k441k472J265P42q47K393l264L533l494J130k1k321J336N94J349K39
8264a61411k908J249J812Q19l933K170K724Q04m819j443J489K234j204k467L005
8249a61879l77J091n90N708j538k318m37K069p584k64K277J239j055l552M590
8234a62620O186p456M70m513J927K716M216n284P0O022n210J169L018k863L287
8219a58865n062n70K390J322L716q688L165k670P36l513R00Q898J102l095l070
8204a63304k990L929j206K520j4079R189L638j6531K1494o124J7567l0639Q4657
8191i1879o1664m938r512J525J4053j6718j898R550j608q97l267O510J765p877
$$ y = [-162592, -159266, -161093, -163689, -161644, -163403, -160390, -161145, -160915, -159011, -161399, -160022, -156892, -159066, -162196, -159132, -161573, -164045, -162780, -162038, -162885, -160492, -163756, -160223, -163717, -162587, -162608, -164929, -163593, -162999, -161650, -161411, -164319, -163070, -161258, -160439, -164372, -162202, -159478, -158674, -163493, -164936, -163447, -161213, -162417, -164884, -161879, -162256, -161165, -161755, -156047, -157585, -159903, -160340, -158271, -165855, -166119, -163842, -162603, -163658, -167210, -162620, -156434, -163890, -163420, -167933, -166006, -163290, -159074, -164358, -164288, -158266, -163476, -162307, -159289, -162152, -158865, -163927, -164497, -162107, -160785, -157069, -165757, -162592, -165262, -164526, -168039, -167139, -158241, -157139, -160234, -163304, -166294, -162365, -163571, -161051, -175130, -165941, -162303, -178834, -157340, -163464, -145897, -176536, -91879, -153543, -158481, -167993, -166468, -152415, -169133, -171031, -161481, -163089, -163986, -167253, -160743, -158978, -166855]
8177a66855J0415n868j446N673m797J693o443M089j352O36n09K86l095L423K903
8162a61247l244L861n054q14K679M95l018K591j243j606N412j444M27j063q71
8147a64139J037J421p40l477M154J580m256J622n80J744j925k622L881K268l485
8132a63517L49k255O51L586m561K276j165L76p70j87k073j58J13J946j83J301
8116a64271k818K459J104k538R66n82j24K212M19l737L064k22k348J640J038l324
8100a67062K655n7K561l551K3L482k973k256p57K584j646K450j220J696q34q3
8084a64988P70K509J417k123l090j032M648k841J979k51O84k260k471K229J429
8069a63391J86j500K272j518j294L107Q1p92m114J500o3L390k901J903q55k284
$$ y = [-166855, -156440, -162308, -163754, -158081, -162878, -161185, -167628, -163539, -164891, -164255, -164764, -164478, -167573, -164150, -161247, -164491, -160630, -165684, -166498, -163819, -163324, -166342, -163751, -164994, -166600, -161188, -162632, -162205, -163268, -164139, -163102, -161681, -162421, -165898, -161744, -160164, -164420, -162798, -163378, -161634, -163559, -166181, -162300, -160032, -163517, -163168, -165423, -164772, -161186, -165747, -163471, -164636, -164260, -165030, -165217, -167290, -167448, -167335, -165389, -165572, -164271, -167089, -164630, -163526, -166064, -165098, -165680, -165804, -163592, -163173, -166910, -163846, -164068, -166416, -164776, -163738, -167062, -164407, -164464, -161903, -165454, -165431, -161949, -164922, -167178, -167935, -165351, -166997, -164547, -165767, -164071, -164905, -164988, -164218, -161709, -160292, -162415, -165505, -166537, -161889, -164730, -162751, -163002, -162318, -164578, -167049, -164820, -163391, -163205, -164705, -162433, -163951, -165245, -162138, -162057, -162849, -166963, -165463, -165526, -162136, -165037, -163134, -163989, -166273]
8053a66273J778J19m080L558P74N79j37O38n90j248P34J094j955n81K252P89l538
8036a66087L831l733L955j022j748k539N54J807K165j374q11k177R11l69J184
8021a65453q33K539l52k609J797q34J06J009l019P48K964k041R39j894K08R91
8005a65734j189O38J576J27O52j279k141o24K242k20J686M485m230m42J523k715
7989a65645j410J712k568Q13J214N77j176j022Q92J792k439N93j067J091R5k053
7973a68601P56j269K544K80k860M536r37P98j90j848K092k112j514j322K18J336
7957a68093J765R88k2j641r11L3oL342m364M012j811K911j964p09k885K840J264
7940a65251l645J902J706j711q82n53M684l585R78O58l953K994j090K59J891j285
$$ y = [-166273, -164495, -164376, -168456, -164898, -164124, -163545, -163682, -163044, -163634, -164882, -164148, -163054, -165009, -165590, -163338, -162549, -166087, -162256, -165989, -162034, -163056, -164804, -167343, -166789, -164982, -162817, -164191, -165002, -167179, -166268, -166637, -165453, -166286, -163747, -164099, -166708, -164911, -165745, -165639, -164630, -167649, -166901, -163937, -165978, -165039, -166933, -166725, -165734, -166923, -166285, -164709, -164582, -163930, -165209, -167350, -167974, -165732, -165952, -164266, -159781, -164011, -164453, -162930, -165645, -167055, -165343, -167911, -167098, -165884, -165307, -166483, -167505, -166613, -164821, -167260, -166667, -167734, -166643, -166548, -168601, -167845, -169114, -166570, -166290, -169150, -164614, -165551, -164753, -164943, -166791, -164699, -166811, -168325, -169647, -169429, -168093, -166328, -165340, -165362, -167003, -167914, -167881, -167887, -164545, -168909, -164897, -166708, -163797, -165761, -166470, -169355, -166515, -165251, -168896, -166994, -165288, -166999, -167881, -168434, -163750, -167335, -166357, -165699, -169652, -166658, -167748, -167489, -165598, -166883]
7924a66883K465n274N737l912J621q54k77O28J342P1r57J649k396k364J579O27
7908a67198j592J937k22m2l11K969k338J226k740R66P17N13k702N54K624J428
7892a64211j902j136j51j34m32o17K60J557p89Q9J016R27k460j76j378J899j169
7875a68807m38L232m17K982k783j658L199k449L43O28p02j96J813j013n38M41
7859a66363K287l259L896n0J94K541J858K869Q906K0597j38242O2000J7663O890
7845a78213K931K371m7K82j44j018J860N53k87L167j154o74l416K408Q96j96J648
7828a69033R13Pk339o82q66M177J413k366J031o64k17q85K304k292LJ186L6m35
7810a68709K752m080N12L58O59J783O23l16N40k674J384p32J880k279p7K457m425
$$ y = [-166883, -164418, -169692, -163955, -167867, -166246, -167100, -167377, -166749, -165407, -165336, -166293, -164644, -167040, -169404, -167825, -167198, -168790, -166853, -167075, -167117, -167428, -164459, -166797, -165571, -168311, -167345, -166628, -166115, -168817, -168263, -165639, -164211, -166113, -167249, -167400, -167534, -167966, -168583, -168323, -166766, -167555, -167466, -166450, -165523, -167983, -168159, -169537, -167638, -168807, -169245, -166013, -166430, -163448, -166231, -167889, -164690, -167139, -166796, -166168, -166870, -167066, -165253, -166266, -166804, -166363, -164076, -167335, -163439, -163489, -163295, -160754, -158896, -156027, -147121, -126524, -264766, -202766, -185103, -178213, -175282, -172911, -172958, -172676, -172820, -173838, -171978, -171425, -171712, -168545, -169699, -170373, -173789, -171381, -170485, -170681, -169033, -168120, -168113, -170452, -171134, -172000, -167823, -166410, -168776, -167745, -168409, -168626, -169511, -167207, -169499, -169496, -168310, -168274, -168709, -165957, -170037, -169525, -169167, -168508, -166725, -166102, -166418, -165878, -168552, -167168, -167900, -166020, -168299, -168376, -165919, -170344]
7793a70344K946N80j762j0n3L57j218J921n63M9J841k128O91k028K361N10k658
7776a69508J289J145l4j688J332p30J741k436K28O72N85n51o63j448k15J568N69
7759a68144R62q0j117K61l10K211j073J62O89j503L69J090k823p35J627L369k123
7742a67168O02j574K357l325K235L63j825J038o67N83l14j936J524K431J807m023
7726a67892P05O95J675k548L210m649K748J25M13k462J777M97R93o62J117n55
7710a64813j870M69n43J983l533Q8l45K99J337l28l44K93J806k026j186K879l26
7693a66160p95J227N47L36k891M30J365l515K682j725R47l65J906j999J994j174
7677a67190K43K227j741j675J491n21J362P89j774p33L885j252K13q68R44K99
$$ y = [-170344, -167398, -166818, -168580, -168590, -168643, -168286, -169504, -167583, -168146, -168097, -166256, -168384, -167693, -169721, -167360, -166850, -169508, -168219, -167074, -167108, -168796, -167464, -168194, -166453, -168889, -168661, -167989, -167404, -167955, -168618, -170066, -170281, -168713, -168144, -167182, -167262, -168379, -168118, -168428, -166217, -167290, -167128, -166439, -167942, -167573, -166483, -169306, -170041, -168414, -165045, -167168, -166566, -168140, -165783, -169108, -166873, -166510, -168335, -167297, -167964, -167381, -167695, -169631, -168107, -165676, -163869, -167892, -167187, -166492, -164817, -167365, -164155, -168804, -166056, -165931, -165518, -167980, -166203, -165706, -164713, -165375, -164258, -164813, -166683, -166214, -166757, -164774, -168307, -168219, -168564, -168265, -166928, -167256, -167600, -167307, -165501, -167527, -168713, -165834, -166160, -166955, -165728, -165181, -164845, -167736, -167306, -165941, -169456, -166774, -168499, -167552, -167917, -166011, -168010, -166016, -167190, -166947, -164720, -166461, -168136, -166645, -167166, -165804, -165015, -166789, -167522, -163637, -164889, -164676, -165544, -164600, -164301]
7661a64301N67n8j169J474j187l436J939K141j453k368J601J020J578l585n06
7646a67743M85K093n051L696K95j43J537r50P49J964p76l111J119k514M614l60
7630a64096l013o42L26l76J498r15L292m60k454K006o39k778J615R32k006J567
7614a66143k382K162l81J132O41j559J943l85M56J402k99j536L052k202J786m643
7598a66956J0558j163J076j611R94J192N84r79n40K256l89J92m20J816k85j273
7582a54948J349J808r50m57J660j311k201r29N84O78j275j120k152j418j339K264
7566a59757j209o89k76o13k397j702L2j014j37j142L125k865J091k527K857j979
7550a69202R29k053l45l51N22J112K125k775l252l66M45J367P77K653l91k592
$$ y = [-164301, -163734, -163792, -164961, -163487, -164674, -168110, -166171, -164030, -165483, -167851, -166250, -165230, -163652, -167237, -167743, -167258, -165165, -170216, -166520, -166225, -166368, -164831, -165781, -165032, -163068, -163844, -166955, -165836, -168350, -163736, -164096, -167109, -167751, -167425, -167801, -166303, -167218, -163926, -164386, -166840, -164834, -165473, -168251, -166636, -165704, -167710, -166143, -168525, -166363, -166744, -165612, -164971, -166530, -164587, -164972, -164516, -163114, -163413, -164949, -161897, -164099, -162313, -166956, -156398, -157561, -156485, -158096, -157102, -155910, -155326, -156305, -156845, -154589, -154978, -154786, -155206, -153390, -153675, -154948, -153599, -151791, -152741, -153198, -151538, -152849, -155050, -155979, -155395, -154717, -155992, -157112, -159264, -160682, -162021, -159757, -160966, -161655, -161931, -162544, -164941, -166643, -166611, -167625, -167762, -168904, -165779, -168644, -167553, -170080, -167223, -169202, -168273, -170326, -170671, -171022, -170500, -169388, -167263, -170038, -173290, -173656, -173211, -171844, -171067, -168414, -168805, -171397]
7534a71397j177j126j690j205K782N683R8j393K407l142l204j28j632o07k898
7519a78629J51O22L899J954Q69k004m334k812P76P051K489R60p13l24m959j598
7503a76602J631P540M585L82L61j918k85j895k236N80k604l914k590K089J241
7488a73635N157J028m221j76l300L195M830N508N180O96m541j682k545J752L113
7473a59641L145N113j751o23K9j969K755k812l479j660n712J717P75K236J770
7458a60107K093k28L12K269L470K01J920K107j105l046L319k502j53K365K744
7443a46341j689j336P95J029n29j929j427J66o00l99P16O41P14M109q20J199K9
7426a45672m308M570J333j183J366m541M675j323r36Q47n80L025j723j372l98
$$ y = [-171397, -172574, -173700, -175390, -176595, -173813, -168130, -168032, -169425, -167018, -170160, -173364, -173492, -175124, -175731, -178629, -178478, -177856, -173957, -172003, -171134, -173138, -177472, -180284, -179508, -172457, -169968, -169008, -169721, -170045, -175004, -176602, -174971, -167431, -162846, -162464, -162103, -164021, -164306, -166201, -168437, -167857, -170461, -174375, -176965, -174876, -173635, -168478, -167450, -171671, -171847, -175147, -171952, -167122, -161614, -156434, -155738, -160279, -161961, -164506, -162754, -159641, -156496, -151383, -153134, -153757, -153728, -155697, -152942, -155754, -159233, -160893, -166605, -164888, -164113, -161877, -160107, -158014, -158242, -157930, -155661, -152191, -151990, -150070, -147963, -149068, -152114, -148795, -151297, -151450, -149085, -146341, -148030, -149366, -148571, -147542, -148071, -150000, -151427, -151261, -151861, -152260, -151544, -150903, -150189, -146080, -146900, -145701, -145672, -149980, -145410, -144077, -145260, -143894, -148435, -143760, -145083, -146019, -145172, -145752, -142727, -144450, -145822, -146220]
7411a46220l153R14p18K516j984J322K169R59k465j34J623j133J101k386k45Q41
7395a46993j999K556K356k744j311K401l104O45N016m015M93j966J315k173K560
7380a46963J570j928N5k45J794R50p78K122j707N24p51l29j439J902j113R14Q1
7363a45341k832J743j82Q1j605J491M60J096k732J410k532K39L957m223k485m48
7347a51903J902J784m69j60j36K396l069l06r57O76R04j233j004J980P16p36K13
7330a49402M23R07j747J558l241k22J265k12J627l750J044Q87l03M96j336K059
7314a49947k64j0P44j215J414Q08j717l84K170j273j151m4M47J307k43m62k219
7297a52039K285j716k639K113J227k462J865l59K609j7p08j220K157q35Q47J156
$$ y = [-146220, -149373, -148459, -149177, -146661, -148645, -147323, -145154, -144195, -146660, -146794, -145171, -146304, -145203, -147589, -147834, -146993, -148992, -146436, -144080, -146824, -148135, -145734, -148838, -148193, -143177, -147192, -146699, -148665, -147350, -149523, -146963, -145393, -147321, -147266, -147511, -145717, -144767, -145545, -143423, -145130, -144606, -145357, -145686, -147125, -145223, -146336, -145422, -145341, -148173, -146430, -146612, -146531, -148136, -146645, -146185, -145089, -147821, -146411, -148943, -148704, -144747, -148970, -151455, -151903, -150001, -148217, -148686, -148846, -148982, -146586, -149655, -149961, -150918, -150242, -149338, -150571, -151575, -149595, -148879, -149615, -149402, -148979, -148072, -149819, -148261, -151502, -151724, -150459, -150671, -149044, -152794, -151750, -150863, -151166, -150670, -152006, -149947, -150211, -150221, -149477, -150692, -149278, -148470, -150187, -150571, -148401, -149674, -150825, -150869, -150422, -149115, -149358, -149820, -152039, -149754, -151470, -154109, -151996, -150769, -153231, -151366, -151725, -149116, -149133, -149841, -151061, -148904, -149739, -148892, -147736]
7281a47736m38k028M36M27O04l201L467J027j950n6q96p91M353l217K908k063
7265a49154j275K475J071J205j516p10r53K877m96M05L83l392J756K19J579k362
7249a47888j097K258j3o86P32j39R45n62j192J646o29m53N14R96j741l03P02K171
7231a44739k039J431n93j119J054j898R2J949j50k414k08J81L53k122J944K764
7215a45514k187j445J891j293J615k615Q51M24p36N70j559R90j3447K2274k294
7200a42475j449o09o89K643q78J257r55p50j719K195L98j025J192j216r87N30
7184a44537J644j206k543K891Q60k821K476k802L500j518p00O77M88j19J26K233
7168a41351k733j81L438n20l805K751j646K66k95n20k58J114j473J43J574K01
$$ y = [-147736, -148174, -150202, -149766, -149339, -148735, -151936, -148469, -147442, -149392, -149448, -150344, -151135, -146782, -149999, -147091, -149154, -150429, -147954, -146883, -145678, -147194, -147904, -148857, -145980, -146476, -146071, -145688, -149080, -147324, -147105, -145526, -147888, -148985, -146727, -146740, -147426, -146694, -146833, -145888, -146450, -147642, -145996, -146625, -147078, -146564, -145568, -147309, -147612, -146910, -144739, -146778, -145347, -145940, -147059, -146005, -147903, -147811, -145862, -146012, -148426, -148634, -148453, -148100, -150222, -148278, -145514, -147701, -149146, -147255, -148548, -146933, -149548, -148697, -148273, -149009, -148439, -149998, -149008, -162455, -140181, -142475, -143924, -144533, -145222, -142579, -143457, -142200, -143155, -143905, -145624, -143429, -143031, -144056, -142864, -144080, -145067, -144537, -142893, -144099, -146642, -143751, -142891, -145712, -143236, -146038, -142538, -144056, -144756, -144079, -143591, -143710, -143584, -141351, -144084, -144265, -140827, -141347, -145152, -142401, -144047, -143781, -144076, -144596, -144854, -143740, -145213, -145070, -143496, -143295]
7152a43295j551l19q18K595k131J587j269k60K315M02q25k543L063l966K23m86
7136a47278J537n30J049l554K260k89K894k412J959Q78l302K2j164R74l94l49
7120a47699J769K664k130j156K274J916k867J96J558m61O11r22Q01k107p27J935
7104a44345q38P83j5m7Q29m18l45n32O97n11Q88k452J498m62K118k937j331K336
7086a45084O91L536n642J035J670P99k13K00J30j525o40m24Q46j566R23K245j657
7069a44676Jj35M02n52r48L549k497K409k75j127O35l57j064P82j398J532p35
7052a44454J781k508J909m12J102m6l72R9J668m79k509L08o6j326L551l257K145
7035a42866R01L45r69k582Q21J687O68l486l75L200p88m17N13K13O6J931k545
$$ y = [-143295, -144846, -145165, -145983, -143388, -145519, -143932, -145201, -145461, -143146, -142744, -143569, -146112, -143049, -147015, -146792, -147278, -145741, -146271, -145222, -148776, -146516, -146805, -143911, -146323, -144364, -143486, -146788, -146766, -147930, -146956, -147350, -147699, -145930, -143266, -145396, -146552, -144278, -142362, -145229, -145033, -143475, -143936, -143325, -144247, -143446, -145553, -146280, -144345, -145183, -144400, -144415, -144462, -143633, -144051, -144396, -144928, -144231, -144742, -143854, -146306, -144808, -145270, -143152, -146089, -147420, -145084, -144393, -140857, -146499, -145464, -143794, -142995, -143208, -143008, -142878, -144403, -145043, -145467, -144621, -146187, -145264, -143019, -144676, -144675, -144810, -144408, -144960, -145908, -142359, -144856, -142447, -142722, -143849, -143214, -143571, -144635, -143853, -145251, -143719, -144454, -142673, -145181, -143272, -143684, -142582, -142628, -143000, -142901, -141233, -141712, -144221, -143913, -143979, -145305, -141754, -145011, -142866, -141965, -141620, -142589, -145171, -144350, -142663, -141995, -145481, -145856, -142656, -143444, -143861, -143348, -143135, -143069, -141138, -143683]
7018a43683K91K940m315J220J375r28j125J160R3p53J181J179n83r28k57K291
7002a40842j361k434L67j71K588J742k067J674k630N17O2N13J381j001j945J753
6986a41854L80j766k000L450o27Q00j094J186J818l453n45l2J678j35J420n76
6970a41350R41r24P17j19k36p46R8Q56o6J000l600K531k877N62O84K52p20K677
6952a40320k40o33q72J95m80J301q16M99o01R20K69j458K988Kn787M009l59P57
6934a40626J289k161K178o30p35L55k94K858k899o36L318l847M71J331n78K959
6918a37647m724J642N7J547j677k99K034j338j007O50J40q66K437N01k447j848
6902a42845K300J127k403K667J211l431J357n21K22J187j244j706R95L31l36J114
$$ y = [-143683, -143392, -140452, -144767, -143547, -142172, -143100, -144225, -143065, -142972, -143725, -142544, -141365, -141948, -142876, -143133, -140842, -142203, -144637, -144270, -144441, -141853, -140111, -142178, -140504, -143134, -142617, -142555, -142042, -140661, -141662, -143607, -141854, -141474, -143240, -145240, -141790, -142417, -141617, -142711, -141525, -139707, -143160, -143705, -143737, -142059, -142194, -140774, -141350, -140409, -141333, -140616, -140735, -140971, -141717, -141619, -140763, -140829, -139829, -143429, -140898, -143775, -143213, -142529, -142277, -142997, -140320, -140560, -141193, -142065, -141870, -142350, -141049, -141865, -141366, -141967, -141047, -140778, -142236, -139248, -139246, -145033, -141024, -141383, -140626, -139337, -141498, -139320, -139950, -140685, -140330, -140624, -137766, -140665, -141301, -137983, -141830, -141359, -140028, -140606, -137647, -142371, -140729, -140672, -139125, -140802, -141101, -139067, -140405, -141412, -140762, -140622, -141488, -139051, -138550, -140997, -142845, -140545, -139418, -141821, -139154, -137943, -141374, -140017, -140538, -140316, -139129, -140373, -142079, -141084, -140753, -141089, -139975]
6886a39975N00k41j591N84J094o14j449l78J600O85j199K87K20J501k228N23j541
6869a42222O53J036J702r82k206k90L59R62o72K29J60M62j494J410j129O01L441
6852a37980k687p70Q21k519K758J559k332P8J330k046J242j541M02Q30j563J151
6836a41267q13O2J150j444P20m99Q78j143J15J475k66r58K19k603M65K438r83
6819a42454L165l194K02j853K407L93J31r37P88p7k861L282m680M941j648l011
6803a45406K530J81j040m32m45K405J234k347O46k086L307j573J5q41r42q11K357
6786a43248J453n35k282J433j616K070j822j31J780j375j614n65J345N78m94L6
6770a44987P06p42j031n52K455o76n9K28l186O47j888K574l987L243r64P27k06
$$ y = [-139975, -139475, -139716, -141307, -140723, -139629, -140243, -141692, -142070, -140470, -139785, -140984, -140697, -140477, -138976, -141204, -140681, -142222, -141569, -140533, -138831, -139813, -142019, -142309, -141950, -140988, -141660, -141431, -141271, -140809, -142303, -140893, -142022, -141421, -137980, -140667, -141437, -140616, -143135, -140377, -138818, -141150, -141072, -139742, -141788, -140546, -142087, -141685, -140855, -142418, -141267, -142080, -142018, -140868, -142312, -141592, -142091, -141213, -142356, -142241, -140766, -141032, -141990, -141771, -144374, -143909, -141471, -142454, -139289, -142483, -142281, -144134, -141727, -141334, -141203, -142140, -141352, -141429, -144290, -141008, -145688, -140747, -142395, -145406, -142876, -142695, -143735, -144167, -144612, -142207, -140973, -143320, -142674, -144760, -141453, -143026, -143011, -143852, -144794, -145605, -143248, -141795, -142330, -144612, -143179, -144795, -142725, -144547, -144678, -142898, -144273, -145887, -146452, -145107, -144529, -145023, -144987, -144281, -145023, -146054, -146606, -144151, -144827, -144886, -144658, -147844, -147197, -149085, -146511, -150498, -147255, -148219, -147492, -147698]
6753a47698r41N76p70K8j021J712R75j849Q79m02n74r40P03l30r90j517J256L472
6735a47431m269J329J53J459l716J564M13n17p01k81k007J817J175j438Q25l799
6719a55424J464J177K826j906l95m25J569q51J312l872K288j494K714j897Q62
6704a52052m01k569p54L409l947j6J29O7J529k275m04L88l54j18J119j695K337
6687a55607m51j291lO18R7j342J097m32k282K589j734k13R72o52m50k470J973
6670a59581k249J793J65j085j586K619k443R58j6o69j094O0m5j392L4J319j11
6653a63323R58J25n27j483N38j911O21k17K347o80Q60j828l64K429j741n76r4
6636a64866k221j850r62J694j275J240L73J157j214o27K90J041m64r64k319J503
$$ y = [-147698, -148639, -148063, -148833, -148805, -149826, -148114, -147139, -148988, -148109, -148511, -149085, -150025, -149322, -149652, -150642, -152159, -150903, -147431, -151700, -150371, -150218, -148759, -152475, -150911, -150498, -151015, -151716, -151997, -154004, -152187, -151012, -152450, -151625, -155424, -153960, -152783, -149957, -151863, -152258, -152683, -151114, -151965, -150653, -154525, -152237, -153731, -151017, -152914, -152052, -152453, -155022, -155776, -152367, -156314, -156330, -156201, -156134, -154605, -156880, -157284, -156896, -157250, -157368, -156249, -157944, -155607, -156058, -157349, -157352, -156734, -156637, -157979, -156882, -157314, -159596, -157007, -158741, -158954, -157982, -158634, -159084, -161554, -159581, -161830, -160037, -159872, -160957, -162543, -159924, -162367, -161409, -161425, -162094, -163188, -163128, -163173, -164565, -164531, -163212, -163323, -162365, -162240, -162767, -164250, -163712, -165623, -165002, -165219, -162872, -163552, -162692, -164520, -164884, -162455, -164196, -164772, -164866, -167087, -168937, -169899, -168205, -169480, -168240, -167867, -166710, -167924, -168551, -168261, -167220, -167684, -168648, -170967, -169464]
6620a69464j46L580j526j59p59K540J028j405K426J559k117j057l340K027P38
6605a66075J159L34K407J161O40j176J495k081Q60p1j339j202K100j656Q2K582
6589a60780r31J209K251J193R88Q65j211K883k095j939J4J462L2L945O44K900
6573a48570k113m96p32J906m62j171j92J3p72R42j313M170O53j219Q06P19O56
6556a47175j267p23p17l18K41J518J601J818l246J119j311l73M22J675p46j209
6540a48691k48J929j452j510L203J002j717k50K516m040M27J5K052j529L11j080
6524a49062J118k220L039p09j516O60J07k018J17L473J213k885j304jn60L123
6508a47425o9L42L92P04l858J381j323k28K234J985r15j576l473L879p02j150
$$ y = [-169464, -169610, -166030, -167556, -167715, -168474, -165934, -164906, -166311, -163885, -162326, -164443, -165500, -168840, -166813, -166075, -164916, -164582, -162175, -161014, -160374, -161550, -160055, -162136, -161276, -161347, -162686, -163888, -161788, -163444, -163362, -160780, -161711, -160502, -158251, -157058, -156070, -155205, -156416, -153533, -155628, -157567, -157553, -156091, -156059, -152114, -151470, -148570, -150683, -151179, -151911, -150005, -150467, -151638, -151830, -151817, -152589, -151647, -152960, -148790, -148137, -149356, -148550, -147831, -147175, -148442, -149165, -149882, -150200, -149959, -148441, -146840, -145022, -148268, -147149, -148460, -148833, -148411, -146736, -147482, -148691, -148939, -147010, -148462, -149972, -146769, -145767, -147484, -147734, -145218, -149258, -148831, -148816, -146764, -148293, -147982, -149062, -147944, -150164, -147125, -147834, -149350, -148690, -148583, -150601, -150484, -147011, -145798, -148683, -149987, -149988, -150548, -147425, -147494, -147152, -146760, -146056, -149914, -148533, -149856, -150084, -147850, -145865, -146780, -148356, -151829, -147950, -148652, -149802]
6492a49802j274o82p52k236M555J374J949m63m724l490J898J749N14R12k34K76
6476a50430j627l6j803L92M779j57j355m63J819l551J836n59P30k710j124J149
6460a53110J140p30N247j218k633l544j344L764L5K400l49M51j813j371L81J211
6444a51483M057j578l11k626J782R42j069k38Q37j329j221M0k561K193L297l86
6428a49654o18m753j303L064K671K563J28j576m586Q56N07K09J545J019p05l740
6412a54373L844r193P890j235R42j278j717N82o66J640J384J557K398m021j142
6397a53388N4L428k91K894j658K08l430O58K299k937l14J984R72l858l25J582
6381a52122J973j612p91Q78p92o14l69Q72L954n284K395J641k605K59K006j299
$$ y = [-149802, -151076, -151758, -152510, -154746, -150191, -148817, -146868, -147331, -152055, -155545, -153647, -151898, -151384, -150472, -150706, -150430, -152057, -152093, -153896, -153504, -148725, -148882, -150237, -150700, -148881, -152432, -150596, -151155, -150425, -153135, -154259, -153110, -151970, -152700, -147453, -148671, -151304, -154848, -156192, -152428, -152393, -149993, -150342, -149891, -151704, -153075, -152694, -151483, -147426, -149004, -149315, -151941, -150159, -149217, -150286, -150524, -149687, -151016, -152237, -152197, -154758, -152565, -149268, -149654, -150272, -155025, -156328, -153264, -150593, -148030, -147902, -149478, -154064, -153208, -152701, -152492, -150947, -149928, -150633, -154373, -150529, -159722, -151832, -153067, -152125, -153403, -155120, -154538, -155204, -153564, -152180, -150623, -148225, -152246, -153388, -153334, -149906, -150197, -147303, -148961, -148753, -152183, -151525, -149226, -152163, -152477, -150493, -149521, -153379, -153704, -152122, -150149, -151761, -152552, -151674, -152466, -153080, -153449, -152577, -148623, -153907, -151512, -149871, -152476, -152217, -150211, -151510]
6365a51510K87j364J24J914j219j562J10J194J88j089j013P84m96R89q52l90q45
6348a54750j77Q35j855L52K7j3m90O21kk477J429K201k037J03l89j64P2J703P13
6329a54298R6Q2lQ59q74l72N88q4J40Mp9j117K521j820J229K04l62o45K486k102
6309a53547k498J592N92r98p69K127k106J421k825K310R94K94N14j092j879O40
6293a55230m45J4J14R15p70K4J308k100Q95O7m9j757L002m54j184L65j331L59
6275a56257j318O46M21j291M99J536l15k029m69m94L83k69%J708R60M05K90p28
6257a56322N52M38k593L20K269k997l4Q90k3O77j938P40K98K98n6p12M2j142j70
6238a59463J184J719l561L44M06n76J931N99j04k232j485K34J440m70l7P63k71
$$ y = [-151510, -151223, -152587, -152463, -150549, -151768, -153330, -153220, -152026, -151838, -152927, -153940, -153156, -153652, -152663, -153515, -153905, -154750, -154927, -154092, -155947, -155595, -155568, -155581, -156071, -155450, -155452, -157929, -156500, -154299, -156336, -156233, -156622, -156786, -156714, -155011, -154298, -154202, -154120, -154123, -153264, -154138, -154510, -153922, -154006, -153866, -153862, -153941, -155058, -152537, -154357, -153128, -152924, -153286, -153931, -151445, -153547, -156045, -154453, -153861, -154859, -155628, -153501, -155607, -154186, -157011, -154701, -153707, -153413, -152899, -153991, -155870, -155230, -155675, -155661, -155547, -154632, -155402, -155378, -154070, -156170, -155275, -155208, -155257, -157014, -154012, -154466, -155650, -155285, -156616, -156257, -157575, -156929, -156508, -157799, -157300, -155764, -156079, -158108, -158577, -159071, -158688, -158957, -158957, -157249, -156289, -155884, -155594, -156322, -155770, -155332, -157925, -157605, -155336, -158333, -158367, -157477, -157500, -156823, -158761, -158021, -157723, -157425, -157481, -158193, -158151, -159293, -159463, -158279, -156560, -160121, -159777, -159371, -159947, -158016, -157417, -157521, -159753, -161238, -161004, -159564, -160034, -160071, -159308, -159579]
6221a59579n36k260L730l66n32N50J464j920P60j171Q80p27j107r2J57P87J0k499
6203a62451K060K15j209j051J488k08j067J618L47j145O42J122l97J252j953K187
6187a58550o34L96J5n87k228M24Q21o34K507j408J111k97L95k787J466K582k023
6170a59431l568L945n83j467K633k297N54M01J228k547J958J156P61m521J968
6155a59810K532j779J585k4n72J170j46L95o84K705l070K06M03n8j04P43J160
6138a55348j843q91J082K053j242p73K118k212Q8K096K98j640N95M64j830J090
6122a55895J859k794J333M3j125J959k283L95q60K018Q08j548K68K144K69k262
6106a55671M85k05J309l55j623K20J281r22j417K052M60j097l24J047J314j089
$$ y = [-159579, -160115, -162375, -158645, -159011, -159543, -158993, -157529, -159449, -158689, -159860, -158980, -159707, -160814, -160906, -160749, -159962, -159952, -162451, -160391, -160176, -161385, -162436, -160948, -161156, -162223, -160605, -160258, -161403, -160761, -159639, -160036, -158784, -160737, -158550, -159184, -158788, -158773, -159360, -161588, -161164, -160343, -160977, -158470, -159878, -158767, -159064, -158669, -161456, -159990, -157408, -159431, -162999, -159054, -159637, -161104, -158471, -160768, -160214, -159813, -158585, -161132, -159174, -158018, -157257, -161778, -159810, -157278, -159057, -157472, -157496, -158068, -156898, -157044, -156649, -157333, -154628, -157698, -157492, -157089, -157147, -157251, -156508, -155348, -157191, -158082, -157000, -154947, -156189, -156962, -154844, -157056, -156968, -154872, -154574, -156214, -155619, -155155, -156985, -155895, -154036, -156830, -155497, -155454, -156579, -154620, -156903, -156508, -157368, -155350, -154542, -156090, -155822, -153678, -153409, -155671, -155186, -155391, -154082, -154437, -156060, -155840, -154559, -155481, -156898, -154846, -154386, -155483, -155807, -154760, -153446, -154535]
6090a54535J706L92o3j159j391p75R90N36j146K946J461j992n06P14j300J438
6074a52684P06k035o0R49l90R01r89n02J38K075q34J91r97J520J108R64l147K613
6056a50473K30k701J578R86L87r23L021l32k191K561k275L282j816J259j825J555
6040a47677Q54L38k14J130k022P0K023J403j277j691K870J696j035n84N14J459
6024a42143l4l795K359K084j994K370P07L1J208M84l764K124L371k265J555j0
6008a37712O43k193K228J299Q64j623K63L233j006k218K879N01p01K102k451K945
5992a30947J111p72J62n93J841O56J017K289j15j979K618n54J252n8J845q86J405
5975a21708M71m82J584M40q2m18L324j625J666R35M21L07L26P20R56p98J197J787
$$ y = [-154535, -152829, -152437, -152500, -153659, -155050, -155825, -154835, -154299, -155445, -152499, -151038, -153030, -153536, -152822, -154122, -152684, -151978, -154013, -154073, -153124, -153514, -152613, -153602, -154104, -153966, -151891, -152725, -152534, -153531, -152011, -150903, -149939, -153086, -150473, -150243, -152944, -151366, -150380, -149993, -150916, -147895, -148227, -150418, -147857, -150132, -146850, -148666, -147407, -149232, -147677, -146823, -146485, -146699, -145569, -147591, -147521, -145498, -144095, -145372, -147063, -144193, -142497, -143532, -144116, -143602, -142143, -142177, -145972, -143613, -141529, -143523, -141153, -140446, -140415, -139207, -138723, -142487, -140363, -136992, -139257, -137702, -137712, -137069, -139262, -137034, -135735, -134871, -136494, -136231, -132998, -134004, -136222, -133343, -132842, -133543, -131441, -133892, -130947, -129836, -130608, -130446, -131039, -129198, -128542, -127525, -125236, -125351, -127330, -124712, -125266, -124014, -124072, -122227, -123113, -121708, -121237, -121719, -120135, -119695, -119777, -120195, -116871, -118496, -116830, -115895, -115474, -115167, -114841, -114121, -113165, -113963, -112766, -110979]
5957a10979K13j194J171O64p65M830l734O47K568O13K889o56K125J334K14K25
5941i9835K336K11L76J978J780P75K053L22J949n5K068O70J412K570j216L201
5925g9405M24o79J590J533L169r61J635N32J514l58P14J982J371M405J109K01
5909f1224K695J459n53K365q31K093O87K375J651K987J309K344j067K169K127
5894c9414J62K903j383K667m68K818J516J863J486K696J113K203R95J984L49L657
5878a4853K491o29L356L056J108M322N68M473L45K276J410J437O069K15L135K951
5862B1730n66M529L615J161n09L176M199K382J873L590L177m26L112J858L600
5847E6501M32K372L691K005M239J360N337J977K763K957N302J390L650M266N016
$$ y = [-110979, -110766, -111960, -110789, -110125, -110890, -106060, -109794, -109147, -106579, -105966, -103077, -103733, -101608, -100274, -100060, -99835, -97499, -97288, -96912, -94934, -93154, -92379, -90326, -90004, -88055, -88110, -86042, -85372, -83960, -81390, -82606, -79405, -78981, -79660, -78070, -76537, -73368, -74329, -72694, -72162, -70648, -71006, -70292, -68310, -66939, -62534, -61425, -61224, -58529, -57070, -57623, -55258, -56089, -53996, -53309, -50934, -49283, -46296, -44987, -42643, -43710, -41541, -39414, -39252, -36349, -37732, -35065, -35533, -32715, -31199, -29336, -27850, -25154, -24041, -21838, -20843, -18859, -18510, -14853, -12362, -12991, -9635, -6579, -5471, -1149, -581, 3892, 4237, 6513, 7923, 9360, 15429, 15644, 18779, 21730, 21164, 25693, 29308, 30469, 29960, 33136, 37335, 39717, 41590, 45180, 48357, 47931, 51043, 52901, 56501, 56933, 59305, 62996, 65001, 69240, 70600, 75937, 77914, 80677, 83634, 88936, 90326, 93976, 98242, 103258]
5832A03258N475J821M290M172L837O052K069N170M080O165K751K990M030N206
5818A61366L554N332K592N829L604N742K554M437N224O770J286O255M503K758
5804B21806O347O543O191M926N707K448Q580L349Q278M546O397P173K724R557
5790C04572N218O219N993P063M871R017O838O941O590R831P528P161R895Q757
5776D06494R569O854J0434J1190R668Q672R893P829R769Q004Q845R087R552J0300
5762E36160R850J0321J1448J0757J1831J1811P810J2897J1102J0878J0441J0605
5750F65911J3687J0942J2473J1531J3393J0250J2250J2476J2702R177J2801J2586
5738H10179J0770R659J4166J0817J4082J1357J4499J3788J3526J5295J5900J6250
$$ y = [103258, 108733, 110554, 114844, 119016, 122853, 128905, 130974, 136144, 140224, 146389, 149140, 152130, 156160, 161366, 164920, 170252, 172844, 178673, 182277, 188019, 190573, 195010, 200234, 207004, 208290, 214545, 219048, 221806, 228153, 234696, 240887, 245813, 251520, 253968, 262548, 265897, 274175, 278721, 285118, 292291, 295015, 304572, 309790, 316009, 322002, 329065, 333936, 342953, 349791, 356732, 363322, 373153, 380681, 387842, 397737, 406494, 416063, 422917, 433351, 444541, 454209, 462881, 472774, 480603, 490372, 498376, 507221, 516308, 525860, 536160, 546010, 556331, 567779, 578536, 590367, 602178, 609988, 622885, 633987, 644865, 655306, 665911, 679598, 690540, 703013, 714544, 727937, 738187, 750437, 762913, 775615, 784792, 797593, 810179, 820949, 830608, 844774, 855591, 869673, 881030, 895529, 909317, 922843, 938138, 954038, 970288]
5726I70288J7326J6133J6912J9056K1265J8934K3155J9692K1678J8349K1026J8682
5714A202496J6571J9161J5973K0392J7400J8000J9755K1579K3080K1974K2490
5703A418871J7664K3906K0670K7346K4763K5248K6903K6121L1645L0106L8533
5692A711776L6586L6609L9867M1322M2970M1962M5754M4390M2625M4132M5298
5681B173291M1406M6481M5597N0729M7447N4952M8531N3838M9558M9516M6943
5670B708289M5714M6633M9039N3507N4750N7593N6497N8140N8669N5711O0951
5659C305493N9664N5864N7654O2847O4716O7076P3825P5840P6047P8521Q3748
5648D061295P9259Q5502Q9181R4475R8357J03044J05162J11428J08438J09620
$$ y = [970288, 987614, 1003747, 1020659, 1039715, 1060980, 1079914, 1103069, 1122761, 1144439, 1162788, 1183814, 1202496, 1219067, 1238228, 1254201, 1274593, 1291993, 1309993, 1329748, 1351327, 1374407, 1396381, 1418871, 1436535, 1460441, 1481111, 1508457, 1533220, 1558468, 1585371, 1611492, 1643137, 1673243, 1711776, 1748362, 1784971, 1824838, 1866160, 1909130, 1951092, 1996846, 2041236, 2083861, 2127993, 2173291, 2214697, 2261178, 2306775, 2357504, 2404951, 2459903, 2508434, 2562272, 2611830, 2661346, 2708289, 2754003, 2800636, 2849675, 2903182, 2957932, 3015525, 3072022, 3130162, 3188831, 3244542, 3305493, 3365157, 3421021, 3478675, 3541522, 3606238, 3673314, 3747139, 3822979, 3899026, 3977547, 4061295, 4140554, 4226056, 4315237, 4409712, 4508069, 4611113, 4716275, 4827703, 4936141, 5045761]
5638E045761J12999J16205J21071J25229J28879J33265J36398J40123J49428J59122
5628F368480J65822J70743J74499J77458J84839J97282K06023K20081K35468K34766
5618H335461K61338K70486K85194K99015L15054L36861L57684L87844M10154M32769
5608A1691860M61610M78756N09353N39755N70250O09136O49313O84530P20582
5599A6915145P62247Q01054Q50639Q99648R58665J024825J103865J190325J271639
5590B5778052J347811J428749J526014J638056J769595J900984K040165K197989
5582C9627415K376194K587764K839662L141511L469299L821582M191866M606813
5574F6662106N035115N477363N946145O504007P168491P991419Q946756J0036560
$$ y = [5045761, 5158760, 5274965, 5396036, 5521265, 5650144, 5783409, 5919807, 6059930, 6209358, 6368480, 6534302, 6705045, 6879544, 7057002, 7241841, 7439123, 7645146, 7865227, 8100695, 8335461, 8596799, 8867285, 9152479, 9451494, 9766548, 10103409, 10461093, 10848937, 11259091, 11691860, 12153470, 12632226, 13141579, 13681334, 14251584, 14860720, 15510033, 16194563, 16915145, 17677392, 18478446, 19329085, 20228733, 21187398, 22212223, 23316088, 24506413, 25778052, 27125863, 28554612, 30080626, 31718682, 33488277, 35389261, 37429426, 39627415, 42003609, 44591373, 47431035, 50572546, 54041845, 57863427, 62055293, 66662106, 71697221, 77174584, 83120729, 89624736, 96793227, 104784646, 113731402, 123767962]
5566A23767962J1290552J2797320J4625223J6886241J9656872K2879385K6065438
5559B47968993K7969285K6852918K2020255J5517773J0857598R289761R719714
5552C70196297J0647018J0891820R731441P290468M355136J441839j524213m764809
5544D08264997q630556j3517385j9038568k4043409k7571112k9221527k9197653
5537B57044787k8091786k6403404k4262927k1712870j9035310j6545440j4410847
5530A06582203j2584725j0957620r469893q134055o928198n832299m874830m086354
5522D3714229l475979k990465k602226k294894k033215j814361j635000j476126
5514B5391963j334638j221089j120886j036184r62953q96766q32266p68732p10908
$$ y = [123767962, 135058514, 147855834, 162481057, 179367298, 199024170, 221903555, 247968993, 275938278, 302791196, 324811451, 340329224, 351186822, 360476583, 370196297, 380843315, 391735135, 401466576, 408757044, 413112180, 414554019, 413029806, 408264997, 399634441, 386117056, 367078488, 343035079, 315463967, 286242440, 257044787, 228953001, 202549597, 178286670, 156573800, 137538490, 120993050, 106582203, 93997478, 83039858, 73569965, 65435910, 58507712, 52675413, 47800583, 43714229, 40238250, 37247785, 34645559, 32350665, 30317450, 28503089, 26868089, 25391963, 24057325, 22836236, 21715350, 20679166, 19716213, 18819447, 17987181, 17218449, 16507541]
5505A6507541o61285o15510n77953n45092n13786m86776m63515m44831m28322
5496A1770471m12526l98423l77104l60406l40761l26447l07786k98915k83629
5487H664474k72356k59169k48629k36906k27656k18131k06963j98796j90873j83637
5477F421358j79817j73328j68543j59635j56740j53226j42142j41445j35063j30275
5467D881144j25328j22159j18425j13850j10336j06670j07779r8629j00717r7438
5457C779813q9245r0035q5349q4552q2211q2277p4144p6511p3369p2551p3372
5446B896197o7683o6769o7604o3661o0370o1469n7288n7461n2998n2713n5625
5435B232556n2257m9953m7232m9486m2140m2223m1148l8379l7067l6516l5544
$$ y = [16507541, 15846256, 15230746, 14652793, 14107701, 13593915, 13107139, 12643624, 12198793, 11770471, 11357945, 10959522, 10582418, 10222012, 9881251, 9554804, 9247018, 8948103, 8664474, 8392118, 8132949, 7884320, 7647414, 7419758, 7201627, 6994664, 6795868, 6604995, 6421358, 6241541, 6068213, 5899670, 5740035, 5583295, 5430069, 5287927, 5146482, 5011419, 4881144, 4755816, 4633657, 4515232, 4401382, 4291046, 4184376, 4076597, 3977968, 3877251, 3779813, 3690568, 3600533, 3515184, 3430632, 3348421, 3266144, 3192000, 3115489, 3042120, 2969569, 2896197, 2828514, 2761745, 2694141, 2630480, 2570110, 2508641, 2451353, 2393892, 2340894, 2288181, 2232556, 2180299, 2130346, 2083114, 2033628, 1991488, 1949265, 1908117, 1869738, 1832671, 1796155, 1760611]
5424A760611l2815l1621l0627k7682k9488k9156k5722k5791k4341k8045k2473
5413A452850k4688k0086k3068j9728k0447k0730j9120j5497k2073k0174k1149
5402A226090k2625k3770k1818k5269k1456k3467k1870k3527j9254k3646k3428
5391I75960k0766k3856k5139k0771k3122j9865j9466k2735j4903j6253j3282j1611
5379G44191j1799j1546j1297q137j1457j1098q457p366j0604q479j1736r791q126
5366F14298j0999r785p735p199r213r112p301q769o605r105q057p023p013o918
5352D99464o384r048p546o877m745q169m563l616n888m057n363n381m989m219
5338D18619m746l119m543l222n285l298m041l698n028m425j532m853l683j827
$$ y = [1760611, 1727796, 1696175, 1665548, 1637866, 1608378, 1579222, 1553500, 1527709, 1503368, 1475323, 1452850, 1428162, 1408076, 1385008, 1365280, 1344833, 1324103, 1304983, 1289486, 1267413, 1247239, 1226090, 1203465, 1179695, 1157877, 1132608, 1111152, 1087685, 1065815, 1042288, 1023034, 999388, 975960, 955194, 931338, 906199, 885428, 862306, 842441, 822975, 800240, 785337, 769084, 755802, 744191, 732392, 720846, 709549, 701412, 689955, 678857, 670400, 663034, 652430, 643951, 632215, 622424, 614298, 603299, 593514, 585779, 578580, 569367, 560255, 552954, 544185, 537580, 528475, 520418, 513395, 506382, 499464, 493080, 484032, 476486, 469609, 464864, 456695, 452132, 448516, 442628, 438571, 433208, 427827, 422838, 418619, 413873, 410754, 406211, 402989, 397704, 394406, 390365, 386667, 381639, 377214, 375682, 370829, 367146, 365319]
5324C65319l425l300r27j944k802l165k966j276l824k887n860j68j562k910o673
5309C21630l215j595l859k894m037o15n846k540m555l504j724n651j062m514j849
5294B74170l051j754k713l412l529l539k314l252k408k892l127j926l335l590
5280B33328j928m772q92j308l447k361k140l083k444p03k479q68l243O79l392
5265B00947L84n052K019k020k007k815j071j610o78k551J81j706k403j267l808
5250A76543j305l712m97n085p70l827J28m058P66l845m773o99m574K74j551j798
5234A41217k301r04k071j484r69L67k392m60k466J904k447k959j494j632k392
5219A19517r58l01m092N86k305J127k978R91j018m777n74k4j505j438k394o14
$$ y = [365319, 361894, 358594, 357667, 355723, 352921, 349756, 346790, 345514, 341690, 338803, 332943, 332775, 331213, 328303, 321630, 318415, 316820, 312961, 310067, 306030, 305415, 299569, 297029, 292474, 288970, 287246, 281595, 280533, 276019, 274170, 271119, 269365, 266652, 263240, 259711, 256172, 253858, 250606, 248198, 245306, 242179, 240253, 236918, 233328, 231400, 226628, 225736, 224428, 220981, 218620, 216480, 213397, 210953, 210250, 207771, 206903, 203660, 204339, 200947, 201331, 196279, 198298, 196278, 194271, 191456, 190385, 188775, 188097, 185546, 185727, 184021, 181618, 180351, 176543, 175238, 171526, 171029, 165944, 165174, 161347, 161475, 157417, 158183, 154338, 149565, 148866, 144292, 144566, 143015, 141217, 138916, 138012, 135941, 134457, 133488, 133855, 131463, 131003, 128537, 130441, 127994, 125035, 123541, 121909, 119517, 118559, 118258, 114166, 114752, 112447, 113574, 110596, 111587, 110569, 105792, 105218, 105194, 103689, 102251, 99857, 99243]
5203I9243j258J438l870M18l274n076L017j240p28l653o73p88j874N49j658k01
5187H0372j434k217N33m757J284j727N80r57k479R20j124k162r49l537K003k059
5171F2290m70J055k693q86j6j823l22J67j930j047j806N02P63n052J606J18J530
5154E1986j681j592j04O97k262J531k757k87p96K279n10r0j170j565k260l11j529
5137C9579L06p31p52M62k433o17L382l957l093J410k841n88q35k071J671n289
5121B3603J687k445J531k209L5j544k754L39K21p30L04N98k691k4j13j801M97
5104A4504j727j410j94M19k878o21J009Q0n11O30l568n23j504K180R9j391J473
5087F067j838l87k494k59O91l518J445q92k288J130j187Q61j969o59N87qj529
$$ y = [99243, 97985, 99423, 95553, 95971, 92697, 87621, 90638, 89398, 88670, 85017, 84344, 83556, 81682, 82231, 80573, 80372, 78938, 76721, 77254, 72497, 73781, 72054, 72634, 71677, 69198, 70118, 68994, 66832, 65883, 62346, 64349, 62290, 61820, 62875, 60182, 59296, 59280, 57457, 57135, 57302, 55372, 54325, 52519, 53021, 53784, 48732, 50338, 50456, 51986, 50305, 48713, 48609, 49306, 47044, 48575, 45818, 45531, 44735, 47014, 46504, 46414, 45244, 43679, 41419, 41108, 39579, 39885, 39154, 38402, 38864, 36431, 35814, 39196, 35239, 32146, 33556, 30715, 30127, 29292, 27221, 28892, 23603, 25290, 22845, 24376, 22167, 22202, 20658, 17904, 18243, 18464, 17734, 18038, 18636, 15945, 15921, 15808, 14007, 14504, 12777, 11367, 11173, 11592, 8714, 8093, 9102, 9182, 8671, 9301, 5733, 5210, 3706, 5886, 5985, 4594, 6067, 4229, 3842, 1348, 1089, 1780, -1738, -293, -1185, -3473, -2343, -3530, -2669, -4638, -5297, -4710, -4718, -6247]
5070f247N19j526k053J528r83j285J65k184L408q27k481L29l3p72o33n74J025
5053a2624o89j812j417J108k100K915m930L42J008j961o08N9K77M06r86Q69j543
5036b1686r20J567J011n780M349j637k828j346N34J486m57j678j671P74o92p31
5020b9705R77n18k411N20J193K62k28l396j89L010l244k84K294p19j185R56k254
5003c4921j324J669j158M88j306J243k806K116R51j600J004j360j079J101j455
4988c8437r66P17m79K88J09j726J78o43J18j665K327j093M48j007m8o09j146M315
4970c9319m282R77j898J480j953J94J711m01j566M97K29J191l789J100J004k440
4954d7265K238p72L98j415P29l90K01o30J138j65j125J767j754J945j473K230
$$ y = [-6247, -5728, -7254, -9307, -7779, -8762, -10047, -9882, -12066, -8658, -9485, -11966, -11637, -11670, -12442, -13075, -13649, -12624, -13313, -15125, -16542, -15434, -17534, -14619, -19549, -19207, -18199, -20160, -20768, -20709, -20432, -20026, -21012, -20143, -21686, -22606, -21039, -20028, -25808, -21459, -23096, -25924, -27270, -26736, -25250, -25707, -27385, -29056, -28282, -28974, -29705, -28728, -29246, -31657, -31137, -29944, -29682, -29910, -33306, -33495, -30485, -33729, -34013, -31719, -32438, -33623, -32667, -34921, -36245, -34576, -35734, -35246, -36552, -35309, -38115, -35999, -35048, -36648, -35644, -37004, -38083, -36982, -38437, -39403, -38686, -39165, -38877, -38768, -40494, -40316, -40959, -40841, -42506, -40179, -41272, -40824, -41831, -41879, -42488, -43634, -39319, -43601, -42624, -44522, -43042, -44995, -44801, -43090, -43491, -45057, -44560, -44331, -43140, -46929, -45829, -44825, -47265, -45027, -45799, -45401, -46816, -46087, -46477, -46276, -46906, -45768, -45933, -47058, -45291, -47045, -45100, -46573, -44343]
4938d4343j008Q05J709j708M97J160m80K68L81n1m65R21M8N02l15j992o7M98j83
4919d3823k391J292N04Q60l077Q74Q83K602l19J067l32K539J169O87P16j772J557
4902c6964J474j941J735J375J652j651n51J890j589j594J252n48k354L70j649
4887c9093r33r79J851q52j745N333j481M452k061K400J148n45J499r81L684P39
4871b7564l350L788M75L51K310k994O93J700Jj423j776k571J500P21J075o5K329
4854b4800K762J393J473J485J600L203J071K515K248K043O203M365K653L556M890
4839A6660P220R231Q986J2881J2077J1004L646K414O181Q039L620J2942J653O223
4825A22777K883O129L452p62P37l169l684m827k596l430J475K048O953Q669J3091
$$ y = [-44343, -45351, -44546, -42837, -44545, -44048, -42888, -43368, -43100, -42719, -42770, -43235, -42314, -42266, -41764, -42079, -44071, -44138, -43640, -43823, -46214, -44922, -44418, -43558, -46635, -45761, -44878, -42276, -42595, -41528, -41860, -39321, -38152, -37465, -36749, -38521, -36964, -35490, -37431, -35696, -34321, -32669, -34320, -34871, -32981, -34570, -36164, -34912, -35460, -37814, -37444, -39093, -40026, -41005, -39154, -40006, -41751, -36418, -37899, -33447, -35508, -33108, -31960, -32505, -31006, -31987, -28303, -27564, -30914, -27126, -26651, -26300, -23990, -26984, -26291, -24591, -24590, -26013, -27789, -30360, -28860, -28139, -27064, -27129, -24800, -22038, -20645, -19172, -17687, -16087, -12884, -11813, -9298, -7050, -5007, 1196, 5561, 8214, 11770, 16660, 23880, 33111, 42097, 54978, 67055, 78059, 81705, 84119, 90300, 98339, 101959, 114901, 116554, 122777, 125660, 131789, 135241, 134479, 135216, 132047, 128363, 123536, 120940, 117510, 118985, 121033, 127986, 136655, 149746]
4810A49746J5879K7037L4655L7239K4984J1945N730Q231J0938J5215K1348J6086
4798C79033P531P232L651l105k683q166k1068k3989l0303k7849k3083j4179j3425
4785B29597q229k340O470Q427J8540L2737K8096K1981Q497J545P031Q042J5572
4772C75966J5650J6287O761N30J775j830p000j3303k0086l0846l8087k9663l0422
4759B45732k0135k0379j4618j1585o229k276J294L761P122O582l001K95L90L168
4745A90121M557L616M602L618J325q15J73l298l241n933j2622j1800r096q670
4731A52537q793m523o816k584m966k136P44J189j317J758N89Q90J127L667R50
4716A32316L872K336L381L071J201M791J558j25K862M461k55L409K930L271K311
$$ y = [149746, 165625, 192662, 227317, 264556, 289540, 301485, 307215, 315446, 326384, 341599, 362947, 379033, 386564, 393796, 397447, 394342, 391659, 383493, 362425, 338436, 308133, 280284, 257201, 243022, 229597, 221368, 219028, 225498, 233925, 252465, 285202, 313298, 335279, 343776, 345321, 352352, 360394, 375966, 391616, 407903, 414664, 415194, 416969, 415139, 408139, 394836, 374750, 343904, 305817, 276154, 245732, 225597, 205218, 190600, 179015, 172786, 170510, 171804, 175565, 182687, 189269, 186268, 186563, 186953, 190121, 194678, 198294, 202896, 206514, 207839, 207024, 207197, 203899, 200658, 194725, 182103, 170303, 161207, 152537, 143744, 139221, 132405, 129821, 124855, 122719, 123463, 124652, 123335, 125093, 125682, 126572, 127699, 131366, 132316, 136188, 138524, 141905, 144976, 146177, 150968, 152526, 152401, 155263, 159724, 159469, 162878, 165808, 169079, 171390]
4701A71390K926O445K380M012L977L385M213O477L361P534N805M483M803P438
4687B38629N551P837K851M278O672K381N841M653L085M647Q156N154N477N880
4673C11092O290O808N408O579O079O619P790P142Q603R409J0602J1421J0569R482
4659D23893Q739J0562Q182Q338J0226J0124R221Q541R757J3895Q958J0225J2975
4646E53636J0238R227J2929J3401J0381J5955J0870J1805J4134J3908J6806J6570
4634G09860J9448J5658J8444J5966J8870J5402J9392J7201J5671K0751J8205J5973
4622I20841K4434K1858K2747K3346K4180K4829K6642K5565K8196K8334K9347L2493
4610A232812K8115L5005L7931L7940L8296M2040M0383M4037M5977M3864N1371
$$ y = [171390, 174316, 180761, 183141, 187153, 191130, 194515, 198728, 205205, 208566, 216100, 221905, 226388, 231191, 238629, 244180, 252017, 254868, 259146, 265818, 268199, 274040, 278693, 281778, 286425, 294581, 299735, 305212, 311092, 317382, 324190, 329598, 336177, 342256, 348875, 356665, 363807, 372410, 381819, 392421, 403842, 414411, 423893, 432632, 443194, 451376, 459714, 469940, 480064, 489285, 497826, 507583, 521478, 530436, 540661, 553636, 563874, 573101, 586030, 599431, 609812, 625767, 636637, 648442, 662576, 676484, 693290, 709860, 729308, 744966, 763410, 779376, 798246, 813648, 833040, 850241, 865912, 886663, 904868, 920841, 945275, 967133, 989880, 1013226, 1037406, 1062235, 1088877, 1114442, 1142638, 1170972, 1200319, 1232812, 1260927, 1295932, 1333863, 1371803, 1410099, 1452139, 1492522, 1536559, 1582536, 1626400, 1677771]
4599A677771M9838N4356N5585N9152O0547O5660O8249P1217P7646Q0913Q7932
4588B408866R3847R6437R8882J10068J16019J23369J28922J40757J49768J62896
4578C629831J74706J91042K11259K30384K50126K75087K96655L17799L36411L63073
4568F276373L97487M40835M97438N51996O24808P17017Q29355R91447J214322
4559A2541078J541218K016725K407417K293159J461566P61530O77972Q54901J097723
4550B5653289J367584J414977J155391Q65077P11412N69199L94326K29236j19612
4541C2240879p00305j074464j027626o99147k83152J34553N65016J076450J737284
4532C1969488K574624L690837N185172O454465O201468L641961J268205J047829
$$ y = [1677771, 1727609, 1781965, 1837550, 1896702, 1957249, 2022909, 2091158, 2162375, 2240021, 2320934, 2408866, 2502713, 2599150, 2698032, 2808100, 2924119, 3047488, 3176410, 3317167, 3466935, 3629831, 3804537, 3995579, 4206838, 4437222, 4687348, 4962435, 5259090, 5576889, 5913300, 6276373, 6673860, 7114695, 7612133, 8164129, 8788937, 9505954, 10335309, 11326756, 12541078, 14082296, 16099021, 18506438, 20799597, 22261163, 23022693, 23700665, 24555566, 25653289, 27020873, 28435850, 29591241, 30456318, 31167730, 31736929, 32131255, 32360491, 32240879, 31540574, 30466110, 29438484, 28739337, 28456185, 28590738, 29155754, 30232204, 31969488, 34544112, 38234949, 43420121, 49874586, 56076054, 59718015, 60986220, 62034049]
4524F2034049J646341K372935L143308L275356K365265J321996P36931K30295
4516G7126476m40582j020607k087089m002978n434754n585438m891868l926698
4508D9736462l015888k235170j363150l02263R44834K377766M086984N500713
4500E5730288N342771K843115M98547L59131J062859J874365K691689K819106
4492G3221871J863979P74932J51773m06931j121186j747783k880831m893103o411781
4483E8550940o634231n998836n099079m278182l638661k967142k181092j338763
4475B6414954n47325K47889Q48097Q67148J37680m64108m18354r5104K72794N94232
4465B7857903O34258L22625k0541k22547m19373o50813q74687j295514j977253
$$ y = [62034049, 63680390, 66053325, 69196633, 72471989, 74837254, 76159250, 76896181, 77126476, 76685894, 75665287, 73578198, 69575220, 64140466, 58555028, 53663160, 49736462, 46720574, 44485404, 43122254, 42819991, 43764825, 46142591, 50229575, 55730288, 61073059, 63916174, 64414721, 64773852, 65836711, 67711076, 70402765, 73221871, 75085850, 75860782, 76012555, 75605624, 74484438, 72736655, 69855824, 64962721, 58550940, 51916709, 45917873, 40818794, 36540612, 32901951, 29934809, 27753717, 26414954, 25867629, 26115518, 26963615, 27830763, 27968443, 27504335, 27085981, 26990877, 27263671, 27857903, 28492161, 28814786, 28794245, 28571698, 28152325, 27501512, 26626825, 25331311, 23354058]
4456B3354058k437175k489477k269593j976682j720468j523762j318868j106665
4448H511368q95375p49168o44847n73763m94533m19096l61153l09730k56424k11247
4438C596032j85123j58458j47634j32828j19665j13813j00388j04988q7985q2972
4428B362178q0372p4423p1307o5546o6769o0642n8325n3778n1184n1116m8783
4417A679933m7251m6495m4937m1674l8028l9341l9627m0457l7101l4955l5952
4406A234115l5426l1519k8244k9609k8996l0045k4972k6273k2910k5448k1692
4395I28981k5312j9462k1999j8908k2131j7383j7918j6711j9539j4867j7011j2150
4383G05590j7625j6180j3855j4841j4696j1089j5674j0680j2700j3197j2801j1555
$$ y = [23354058, 20916883, 18427406, 16157813, 14181131, 12460663, 10936901, 9618033, 8511368, 7615993, 6866825, 6221978, 5648215, 5153682, 4734586, 4373433, 4063703, 3807279, 3596032, 3410909, 3252451, 3104817, 2971989, 2852324, 2738511, 2638123, 2533135, 2445150, 2362178, 2281806, 2207383, 2136076, 2070530, 2003761, 1943119, 1884794, 1831016, 1779832, 1728716, 1679933, 1632682, 1586187, 1541250, 1499576, 1461548, 1422207, 1382580, 1342123, 1305022, 1270067, 1234115, 1198689, 1167170, 1138926, 1109317, 1080321, 1050276, 1025304, 999031, 976121, 950673, 928981, 903669, 884207, 862208, 843300, 821169, 803786, 785868, 769157, 749618, 734751, 717740, 705590, 687965, 671785, 657930, 643089, 628393, 617304, 601630, 590950, 578250, 565053, 552252, 540697]
4371E40697j3145j1641r744j0555j1399j1287j0483p229j3830n188j1282p651
4359D17263r138q642r782q780m220r280l709p710n582l715n336o245n114o643
4345C23367m865q965l151n522m714n283p066q045l766p288m461o626q084m243
4331B41288m991m815m206m905n167l914j206m136j418n87m324j371j376k070j038
4316A95764m406j978m288j844j524l171j731r98j956l082l23k004j640j687j216
4301A63916j56j199P83p52j363L664J774O72N146M845L750Q40L129N19K167O189
4285A93924L785O682L253O747J081M638L747O704Q011L584Q247R745O337L994
4271B70479J9J586k64r15M159J699L428J088O92k69n65n48p43m182l820m181m334
$$ y = [540697, 527552, 515911, 506167, 495612, 484213, 472926, 462443, 455214, 441384, 436196, 424914, 417263, 408125, 399483, 389701, 380921, 376701, 367421, 363712, 356002, 350420, 346705, 341369, 335124, 330010, 323367, 318502, 309537, 306386, 300864, 296150, 290867, 283801, 275756, 271990, 264702, 260241, 253615, 245531, 241288, 236297, 231482, 227276, 222371, 217204, 213290, 212084, 207948, 206530, 205943, 201619, 200248, 198872, 196802, 195764, 191358, 189380, 185092, 183248, 181724, 178553, 176822, 175824, 173868, 170786, 170463, 168459, 166819, 165132, 163916, 163760, 162561, 163344, 162592, 161229, 164893, 166667, 167339, 172485, 177330, 181080, 181920, 185049, 185568, 187735, 193924, 197709, 204391, 207644, 214391, 215472, 220110, 223857, 230561, 238572, 242156, 250403, 260148, 266485, 270479, 270498, 272084, 271820, 270905, 275064, 276763, 280191, 281279, 281971, 281702, 281137, 280589, 279846, 275664, 271844, 267663, 263329]
4254B63329n35O24L928N708J0344J6315K2303K8848L2926K8503J2194M431J142
4241D30060Q855Q468J3947J1414P927P828j271j612n731q511j6808k5702k9910
4228C98954k9066k6564k1019j4942j0669r077M24O559J4839K4810K7348K4202
4216C85799J0896Q58M124M511J1178J4152J3389P583L282j293l024r187r421k0539
4202D12308k8562l5436l7121l0950k7429k1286j8973j4685j0569o847j522M186
4190A83114M54L264j62m162k395k9O81M170K256n95r46j181k326n499m926q591
4174A63127j1729j0941j6801j2103r672r540p173q929o786m147l942n106k645
4161E3613j592l286l975j800n217J982k970j038J035m245N2O27j358k154k598
$$ y = [263329, 262794, 263418, 267346, 273054, 283398, 299713, 322016, 350864, 383790, 412293, 424487, 428918, 430060, 438915, 447383, 461330, 472744, 480671, 488499, 487228, 485616, 479885, 471374, 454566, 428864, 398954, 369888, 343324, 322305, 307363, 296694, 287617, 288041, 294600, 309439, 334249, 361597, 385799, 396695, 397553, 401677, 406188, 417366, 431518, 444907, 452490, 455772, 454479, 451455, 442268, 432847, 412308, 383746, 348310, 311189, 280239, 252810, 231524, 212551, 197866, 187297, 180450, 178928, 183114, 183568, 186832, 186670, 182508, 180113, 180084, 180765, 184935, 187191, 186596, 185650, 184469, 182143, 176644, 171718, 163127, 151398, 140457, 123656, 111553, 101881, 92341, 85168, 76239, 69453, 65306, 61364, 56258, 53613, 52021, 48735, 44760, 42960, 37743, 39725, 36755, 35717, 36752, 32507, 32559, 33186, 31828, 29674, 27076]
4146B7076O34r89r92k143o35N8M58p35k126m01r14k61j621j117j311m5k389L32
4128A2879j493k189K88j836m36J669j114N64l576M55n09n50p50j307r13P69R52
4111B903k284M97j261j915J729n61j814J88q38l546J761j145k61K193j585O40
4095e299om03l473J035p46J97j000J476k31l362K359L48k281K1j221m34L88N55
4077a2077K24j492M11R8j283k49L39K325j626r56J623l113K362j960o11M63l1
4060a5553p64k002J49J835J337j564O4j24j747j47r60j027P35J287j55j177J905
4043a7908k169m10Q30q13LJ079N55k136L260j744j619Q92J431l323O01m7n61j231
4025b3310j052Q68k687O76J237qk478k80P67m16J82p94K677j729j283J744j701
$$ y = [27076, 27710, 26721, 25729, 23586, 22951, 23009, 23467, 22732, 20606, 20205, 19291, 19030, 17409, 16292, 14981, 14936, 12547, 12879, 11386, 9197, 9485, 7649, 7213, 8882, 7768, 8332, 4756, 5211, 4702, 4152, 3402, 2095, 1182, 1951, 2903, 619, 1116, -145, -2060, -331, -892, -2706, -2518, -3356, -6902, -5141, -6286, -6547, -4354, -5939, -5299, -5305, -5708, -9181, -8146, -8892, -8695, -9695, -8219, -8450, -11812, -9453, -9105, -11386, -11365, -12586, -13020, -12632, -12077, -11853, -13345, -12934, -12836, -14119, -14368, -14029, -11704, -13330, -14286, -12663, -15776, -13414, -15374, -15985, -15522, -15553, -16317, -18319, -18170, -16335, -14998, -16562, -16498, -16622, -18369, -18516, -19476, -20503, -19768, -18481, -18636, -19813, -17908, -20077, -20487, -19657, -20470, -20467, -19388, -18833, -20969, -17709, -19453, -21072, -20180, -18749, -22072, -21471, -21518, -22079, -23310, -24362, -23494, -26181, -25505, -24268, -24276, -26754, -27034, -26267, -26683, -26501, -27295, -24618, -26347, -27630, -25886, -27587]
4008b7587p98k66N19J659k299q72l22M17K228l655j8M1Mj573K58J226j077r76
3990c3091J306k447J166l196K4J100j389K284j102Jk01K70O20j023K3j082m01
3973c7138O31L90j051L25k404N68l02n04J713J218k263N85q07j268J714j632p92
3956d1017k79l59R87K9j806o71J597L06J586l360K697p42k199J823l012J868j033
3939d3585J020L74k804K85k64K817j373j173J797J25j947M52j039O85J425j308
3923d4513p69K45j37J79P33m84J62k583K025k087K815j702M2l39j81j258L74N21
3905d6957N9Q00l796K815q49J248Q02r89n51J25Q70J706K65j864kj93r29j688
3887d9128L351l133K082l94O32N83j603J543p19j241R99K34J04j362J648Pk808
$$ y = [-27587, -28385, -28651, -28132, -26473, -28772, -29644, -29966, -29549, -27321, -30976, -30994, -30953, -30949, -32522, -32264, -31038, -32115, -33091, -31785, -34232, -33066, -36262, -36238, -35138, -36527, -34243, -35345, -35344, -35545, -35275, -34655, -35678, -35655, -36737, -37138, -36507, -36117, -37168, -36843, -39247, -38679, -38981, -39485, -37772, -36554, -38817, -38232, -39039, -40307, -38593, -40225, -41017, -41296, -41655, -40668, -40639, -42445, -43116, -41519, -41213, -39627, -42987, -40290, -41032, -43231, -41408, -44420, -42552, -43585, -42565, -42191, -44995, -44710, -44974, -42157, -43530, -44703, -42906, -42781, -44728, -44276, -45315, -44630, -43205, -44513, -45282, -45037, -45174, -44995, -44262, -44746, -44584, -47167, -45142, -47229, -44414, -46116, -46074, -46413, -46594, -47852, -47478, -46957, -46898, -46098, -49894, -47079, -47928, -46680, -45878, -46867, -47418, -47293, -46423, -44717, -44452, -46316, -46318, -46511, -47440, -49128, -45777, -48910, -46828, -47222, -46590, -46007, -47610, -46067, -46786, -48027, -47028, -46794, -46690, -48052, -46404, -46397, -49205]
3870d9205K549J5k937J152K514J60j782k393L063o49r22L017L92k425q88Q3K556
3853d5700j125k015O13n67l30R42N6j157j721o63K944n431L905j262K567l507
3837e2451K394k005J884k481J198j245M44j650J423j113j250K312k904R99r26
3822e5371q57O6J35j583J906j542j700n96j290K426o01r28P82q07J91O12j233
3805f0390J636l025J248j548J59k095L612l026K0k09k90N1R90n88J165j880q28
3788f4998O27q75J193q92j57N56r75k634L142m03R24k160j272j128J092O63l05
3771f7602M73O92k664K241j983j688J612k41K286k942J446k872L16r10K32p69
3755g2373K2j862J384k358J220j676M96J924o11J093M02j773j568J497J53m72
$$ y = [-49205, -46656, -46641, -49578, -48426, -45912, -45752, -47534, -49927, -46864, -47513, -48435, -45418, -45026, -47451, -48339, -48256, -45700, -46825, -48840, -48227, -48794, -49124, -48182, -48126, -49283, -51004, -51667, -48723, -54154, -50249, -51511, -48944, -52451, -50057, -52062, -50178, -52659, -51461, -52706, -52262, -53912, -52489, -53602, -54852, -52540, -55444, -54445, -55371, -56228, -56162, -56027, -57610, -55704, -57246, -58946, -59542, -60832, -58406, -59007, -59935, -59153, -59960, -59769, -59157, -60390, -58754, -61779, -60531, -62079, -61920, -64015, -60403, -63429, -63409, -63618, -63908, -63857, -62867, -63455, -62290, -64170, -64998, -64371, -65246, -64053, -64945, -65102, -64546, -65521, -68155, -65013, -65416, -64492, -66652, -67924, -69052, -67960, -67297, -67602, -67129, -66437, -69101, -66860, -68843, -70531, -68919, -69160, -66874, -69816, -68370, -71242, -70926, -71836, -71604, -72373, -72351, -74213, -72829, -75187, -73967, -75643, -75147, -73223, -73834, -72741, -72339, -74112, -75680, -74183, -74030, -74502]
3739g4502j251j365R86q41K139k918j247O85N47l78j309J664k620J230j187K797
3723g7570k629j69R57q98m89M31p90r32K425j258K12M56j270Q70j173j576j370
3706h4773J324j5J96k135o57K047j396M40R62n30j290l075L645L25l446q00K774
3689h6404k369k359Q27Q63R50J746l681L26m18l30r11j326J971j217R40J672m27
3672i0147k903J270k860n41j714J589k372K611L106j260k262l815K904o80L103
3657i3971K251k646q48m35k734O05N00J699L249L121n70k369m02j877j688k034
3641i8149l340Q49k785J413J280M560l11m48p968J73o92N223M405K491N25m705
3625i7479j388k636J868J853O773K932L93k909n10l890J199j300n197n63j75m019
$$ y = [-74502, -75753, -77118, -76132, -76973, -74834, -77752, -78999, -78314, -77767, -78145, -79454, -77790, -80410, -79180, -80367, -77570, -80199, -80368, -79411, -80309, -80798, -80367, -81157, -82089, -79664, -80922, -80710, -80254, -81524, -80654, -81827, -83403, -84773, -83449, -83464, -83268, -85403, -86060, -84013, -85409, -84969, -84007, -84537, -85827, -88902, -85257, -84932, -88378, -89178, -86404, -88773, -91132, -90305, -89442, -88492, -86746, -90427, -90101, -90519, -90849, -91760, -93086, -91115, -92332, -91392, -89720, -90147, -93050, -91780, -94640, -95181, -96895, -95306, -97678, -95067, -91961, -93221, -95483, -99298, -96394, -97074, -93971, -91720, -94366, -95214, -95649, -98383, -97778, -97278, -95579, -92330, -89209, -89779, -92148, -92550, -94427, -96115, -98149, -101489, -100640, -103425, -102012, -100732, -96172, -96483, -96931, -104899, -104726, -105418, -100195, -95790, -93299, -92774, -97479, -98867, -101503, -99635, -97782, -91009, -88077, -87684, -90593, -91103, -94993, -93794, -95094, -100291, -100854, -101029, -105048]
3609a05048K662L738J284L51l971j03j486Q274M835L853m3j033k013l471J943
3594i0228J713M650K539O19j507Q09r45j207j668j200k208l218j782j207K763
3579i2077N78J860O42j632J363K705M220O61L07L61k979r62M15m47M271K58K46
3562h0210k623O34j93k9j43l086n52p64p37k348L451p50K258k276O60o12o98J633
3544h6385J075Mq0o78j823K290j382PK95q33n76j734j39o04k20N261m021n97r25
3525i1065K991J131k320N0k077J305l07j864n78J755j441k153L223M89j348J630
3509i0579j403m5m90q6k174J445K44J308j874J928j843K10k651M906J883k663
3493i1884P89l054k41m66l92m78M29J86N17p79M6j309k17J104o53m67J55K749
$$ y = [-105048, -102386, -98648, -97364, -97013, -100984, -101087, -102573, -94299, -89464, -85611, -85654, -86687, -88700, -92171, -90228, -88515, -83865, -81326, -80707, -82214, -81405, -82350, -83557, -85225, -86425, -88633, -91851, -93633, -94840, -92077, -91499, -89639, -88997, -90629, -89266, -86561, -82341, -81680, -81373, -81012, -83991, -84953, -84538, -84985, -80714, -80456, -80210, -82833, -82199, -82392, -82421, -82564, -85650, -86202, -86966, -87703, -90051, -86600, -87350, -85092, -87368, -86708, -87320, -88018, -86385, -85310, -85306, -85386, -86064, -87887, -85597, -86979, -86972, -86677, -87510, -88086, -89820, -89959, -90563, -90783, -85522, -89543, -90140, -91065, -88074, -86943, -89263, -89213, -91290, -89985, -90292, -92156, -92734, -90979, -92420, -94573, -91350, -90861, -92209, -90579, -91982, -92027, -92517, -92603, -94777, -93332, -93088, -91780, -93654, -91726, -93569, -93359, -96010, -91104, -89221, -91884, -91095, -94149, -94390, -94856, -95248, -95726, -95297, -95111, -94594, -95373, -95327, -96636, -96853, -95749, -96402, -96869, -96714, -93965]
3475i3965O64j266n40N79j011o66o59J747j8P18P78r04L61k483K966k886J714
3458i4871o4R78j096J287k430o09P88K67k362l98K522J016K93mj406j756J02J278
3440i6465J151R03j296k98J358k343K956l31k3O89J846k751k161l53L372r96j212
3423i5954J091k123p19K602J28J266J885m349K072m546L485J416M43o89L07L377
3407i0308k891p08K052K053l175L289j287r64L356j341o4j781J30p06J237K221
3391h8887j537k41j662K41o8j801O03j01q4k375L091j623l165L118j612k144O68
3374i7579J007j523q65J524k528K94k75J094o64m45o47j763J415q22j510J571
3358a01716m175K372j328J671l124l77L060n74N4l32K49J35N99k589K101k504
$$ y = [-93965, -93301, -94567, -95107, -94528, -95539, -96205, -96864, -95117, -95135, -94417, -93639, -94543, -94182, -96665, -93699, -96585, -94871, -94935, -93957, -95053, -93766, -96196, -96805, -96017, -95750, -98112, -98510, -95988, -94972, -94679, -94683, -96089, -97845, -97743, -96465, -95314, -94411, -95707, -96005, -94647, -96990, -94034, -94365, -94388, -93699, -91853, -94604, -96765, -97118, -93746, -94742, -95954, -94863, -96986, -97705, -95103, -94975, -93709, -91824, -96173, -94101, -98647, -95162, -93746, -93303, -93992, -93685, -90308, -93199, -93907, -91855, -89802, -92977, -89688, -90975, -91939, -88583, -89924, -89988, -91769, -91639, -92345, -91108, -88887, -90424, -90665, -92327, -92086, -92154, -93955, -93352, -93453, -93537, -95912, -92821, -94444, -97609, -94491, -96103, -98247, -97579, -96572, -98095, -98960, -97436, -99964, -99670, -99945, -98851, -99515, -99960, -100607, -102370, -100955, -101777, -103287, -101716, -105891, -103519, -104847, -103176, -106300, -106677, -103617, -104191, -104137, -104469, -104220, -104085, -103486, -106075, -103974, -106478]
3342a06478O06p33N3K890j703M81j085L84j596R4k02p69r04J492j477L642m444
3325a09749L012j879J861j701J800j164k256K245j174J887j183k11J050j261r35
3310a09658J825j727K567j866O15j062K275k400Q58J79J475j461j195J095l95
3295a08875J959m48k623Q86K505l423L052k89K428j519l22k190L973J103j099
3280a04882J594q95K356N01J300J589J349J47L23K027N551j051N490J691M676
3265g8234M730P213Q738N604O019J274M961L201P317R874J2434J0286P829M071
3251A5317J186p57J466j866p68j638k696n705m782o380m469n576p711q933r078
3236d2390j3606q482q788o224o502n166o178k812l499k534k318R99m485l93j081
$$ y = [-106478, -105872, -106605, -106552, -103662, -105365, -104884, -105969, -105585, -107181, -107087, -107289, -108058, -108962, -107470, -108947, -105305, -109749, -106737, -108616, -106755, -108456, -106656, -107820, -110076, -107831, -109005, -107118, -108301, -108512, -107462, -108723, -109658, -107833, -109560, -106993, -108859, -108244, -109306, -107031, -109431, -108573, -108394, -106919, -108380, -109575, -108480, -108875, -106916, -107364, -109987, -109101, -106596, -110019, -106967, -107256, -104828, -106347, -106669, -108859, -104886, -103783, -104882, -103288, -104183, -101827, -101326, -100026, -98437, -97088, -96941, -96618, -94591, -89040, -90091, -84601, -82910, -78234, -73504, -66291, -57553, -51949, -45930, -44656, -39695, -36494, -29177, -19303, -6869, 3417, 11246, 15317, 16503, 15746, 17212, 15346, 14578, 12940, 10244, 4539, -243, -6623, -11092, -16668, -24379, -33312, -42390, -55996, -64478, -73266, -79490, -85992, -91158, -97336, -100148, -103647, -106181, -108499, -107500, -111985, -112378, -113459]
3221a13459j144l162J078O41j929O07j042k65j760j67J390k935J696l77j057l65
3205a22250P67q53L2j29j583J457Q2j941k208R78j84Q99P95j643J354k557J627
3188a25357%l367J127j195O49J613l680J084K084l429K772k31k183m79J866j670
3172a30396n03K244l166L284q52j041j132Q93K31j212J149l453L945p15N54K61
3156a29909j276j11q65Q85K008k005q44p66J095p23M382m285K689m041Q95K06
3140a32665m09r40n55K46K786l279K583o87N27JO27p13k372J658j053K093K105
3123a30047l175r13Q48K43L933k521M22j091J75K54j931R86N90O1j614J263j125
3106a33642J623p46j274K76j23L49n35l44K491l517L580j195j343K015k460j457
$$ y = [-113459, -114603, -117765, -116687, -116046, -117975, -117368, -118410, -118675, -120435, -120602, -119212, -122147, -120451, -120828, -121885, -122250, -121483, -122336, -122304, -122433, -124016, -122559, -122477, -124418, -126626, -125648, -125832, -124933, -124138, -125781, -124427, -126984, -125357, -125357, -128724, -127597, -128792, -128143, -126530, -130210, -129126, -127042, -130471, -127699, -127930, -130113, -130592, -128726, -130396, -130899, -128655, -131821, -128537, -129389, -130430, -131562, -130669, -130438, -131650, -130501, -133954, -130009, -130724, -130170, -129909, -131185, -131296, -132161, -131276, -129268, -131273, -132117, -132883, -131788, -132511, -128129, -132414, -129725, -133766, -132871, -132665, -133074, -134014, -134569, -134323, -131537, -134816, -132233, -132920, -132393, -132392, -131765, -132478, -134850, -133192, -134245, -132152, -130047, -133222, -134135, -133287, -133044, -129111, -131632, -131210, -132301, -132126, -131872, -133803, -132817, -132227, -132166, -133780, -132517, -133642, -132019, -132765, -134039, -133763, -133886, -133537, -134072, -134416, -131925, -135442, -131862, -133057, -134400, -132385, -134845, -136302]
3090a36302M32j214l8K88k28j348J641p37K291l381J146O66o02J511k035k87q60
3073a39057M67j97K25J374k297J200j168j30J522j972R65k244K578k537L139j462
3057a39594j62R48K33p58K483k377K466k428L187j102O4J87j831L497l723l09
3041a39219J653l30J87J71J571j405O50j654L585ok205o41J703K137k64o33J360
3024a33340P1J198k893L384O82j20l97N22P86k647K881O29k095J585p2N82J27
3007a29117J082j30j64P32J308J255p69K05k142o0J394J621J256n69L912k226
2991a22412J515M46j479J209J205J745J595k766K10J173l35Q27j79j88N74J756
2975a15104j484n15k353K536k153J52J881p53K360l90L227j701L071o08N48n52
$$ y = [-136302, -135870, -137084, -137122, -136834, -137062, -138410, -136769, -137506, -135215, -138596, -137450, -136784, -137386, -135875, -137910, -138197, -139057, -138590, -138787, -138562, -137188, -139485, -138285, -139453, -139583, -138061, -140033, -139068, -141312, -138734, -141271, -138132, -139594, -139756, -138808, -138575, -139333, -136850, -139227, -136761, -139189, -136002, -137104, -137040, -136853, -138684, -135187, -138910, -139219, -137566, -137896, -137709, -137538, -135967, -137372, -136722, -138376, -134791, -134797, -137002, -137643, -135940, -133803, -134067, -134700, -133340, -133269, -132071, -134964, -131580, -130898, -131018, -131415, -130893, -130107, -132754, -129873, -129244, -131339, -129754, -129826, -129244, -129117, -128035, -128165, -128329, -127597, -126289, -125034, -125803, -125598, -127740, -127800, -126406, -124785, -123529, -124098, -120186, -122412, -120897, -120451, -121930, -120721, -119516, -117771, -116176, -118942, -118732, -117559, -117894, -117067, -117246, -117434, -116860, -115104, -116588, -117103, -119456, -116920, -119073, -118921, -117040, -117793, -115433, -115823, -112596, -114297, -111226, -111834, -111286, -111838]
2959a11838M27K42J596K99J633M68p81N1k680J529M21j873j636k53j61j208R99
2942a12765n51Q21K604q18K011R53J58l64R7L070l99q25K305Q13l267M108j729
2925a03778j337J238k388n62K43J043j433J721k704J332J592j039m1L799j219
2910a03533K363J894j123J365Q42Q55J640N51j784K613Q40J616J479j458J645
2895i0195J347p2J185R47K131j52m80L150o98L024k215J936N000p66L130J642
2879g1086J431L030L621K316O051K076L180L115K989K860N577L701M920N060P412
2864a3747L093N438O401O014P733J0026Q623P394J4248J2971J3591J9791K4475
2851A26051L4293M1165M2802K6951J6274J2805J1787J8059K0326K4030K0469J1625
$$ y = [-111838, -111411, -111169, -109573, -109274, -107641, -107173, -107954, -107903, -110583, -109054, -108633, -110506, -112142, -112395, -112556, -113764, -112765, -113316, -112495, -109891, -110709, -108698, -107745, -107587, -107951, -107854, -104784, -105183, -106008, -103703, -102890, -106157, -102049, -103778, -105115, -103877, -106265, -106827, -106584, -105541, -106974, -105253, -107957, -106625, -105033, -106072, -106113, -102314, -103533, -101170, -99276, -100399, -99034, -98192, -97337, -95697, -95146, -96930, -94317, -93477, -91861, -90382, -91840, -90195, -88848, -88920, -87735, -86788, -84657, -84809, -85289, -82139, -82837, -79813, -82028, -80092, -75092, -75858, -72728, -71086, -69655, -66625, -63004, -60688, -54637, -52561, -49381, -46266, -43277, -40417, -34840, -31139, -26219, -21159, -13747, -10654, -5216, 1185, 7199, 14932, 24958, 33581, 40975, 55223, 68194, 81785, 101576, 126051, 160344, 201509, 244311, 271262, 287536, 300341, 312128, 330187, 350513, 374543, 395012, 406637]
2839D06637J1039Q631L973K246m252j6092k2073k5995j8250j5761r620k209M561
2826C22835Q832K1505L2957N1457P2026O9024M5070J4966R196J6384K0048L8811
2814G23111L6179L0140J7642Q570N290l068p153k1688m1283o2377o5988n8019
2802E61356n2338l9141l1955k7741j4893l884j006J5341K0680K3108J3710j700
2790D61537j032M522Q957J4106J7037J2392Q859N210K044K725r80p512k1126l0514
2776D76225l1026k7445k4611j9079j4141j1458j2817p652p821m837m141l684o297
2763C01216l332k711m817N79J408J475J902O227L739M525O798R009M559P338L652
2748C41567O398N829N123Q080P571M014R424O684R364M032O845P103N448N180
$$ y = [406637, 417676, 426307, 430280, 432526, 428274, 412182, 390109, 364114, 345864, 330103, 320483, 318274, 322835, 331667, 353172, 386129, 437586, 509612, 578636, 623706, 638672, 647868, 664252, 684300, 723111, 759290, 789430, 807072, 815642, 820932, 817864, 810711, 789023, 747740, 685363, 619375, 561356, 509018, 469877, 437922, 410181, 395288, 391404, 390398, 405739, 426419, 449527, 463237, 461537, 460505, 465027, 473984, 488090, 505127, 517519, 526378, 531588, 533632, 536357, 535377, 527865, 506739, 476225, 445199, 417754, 393143, 374064, 359923, 348465, 335648, 327996, 320175, 315338, 311197, 307513, 301216, 297884, 295173, 290356, 290935, 292343, 293818, 295720, 301947, 305686, 310211, 317009, 326018, 330577, 337915, 341567, 347965, 353794, 358917, 366997, 374568, 378582, 388006, 394690, 404054, 408086, 414931, 422034, 427482, 432662]
2734D32662N477N939N587Q482O809P696O875J0946O442Q751J0123J0331J1736
2721E37856J0496Q814J0376J0846J1080J2264J1789Q823J3643J3756J4011J2566
2709F76320J7238J8608J5692J6198J9003J5839K1170J8696J8869J5551J6167J9961
2697H89312J9056J9761K1561K4576K2832K3955K4784K1924K4340K4262K4940K4031
2685A165334K2810K5292K6462K7643L1513L1254L1596L2587L4365L1740L1421
2674A492017L4931L6263L6727L7579L8493L7163M2877M6338M3997N2257M6728
2663A945370N2635N2588N4326N8603N8360O2428O4919O7062P1521P4572P9053
2652B641437Q7559Q5076Q7203R2514R7495J06207J13151J21902J29880J32750
$$ y = [432662, 438139, 444078, 449665, 458147, 464956, 472652, 479527, 490473, 496915, 505666, 515789, 526120, 537856, 548352, 557166, 567542, 578388, 589468, 601732, 613521, 622344, 635987, 649743, 663754, 676320, 693558, 712166, 727858, 744056, 763059, 778898, 800068, 818764, 837633, 853184, 869351, 889312, 908368, 928129, 949690, 974266, 997098, 1021053, 1045837, 1067761, 1092101, 1116363, 1141303, 1165334, 1188144, 1213436, 1239898, 1267541, 1299054, 1330308, 1361904, 1394491, 1428856, 1460596, 1492017, 1526948, 1563211, 1599938, 1637517, 1676010, 1713173, 1756050, 1802388, 1846385, 1898642, 1945370, 1998005, 2050593, 2104919, 2163522, 2221882, 2284310, 2349229, 2416291, 2487812, 2562384, 2641437, 2728996, 2814072, 2901275, 2993789, 3091284, 3197491, 3310642, 3432544, 3562424, 3695174]
2642C695174J37468J39633J49651J57413J68413J82344J96026K09009K23056K34894
2632E493081K48052K68743K84870L06106L24145L51653L77419M04026M43615M94702
2622H996412N47499N98449O56434P31091P91436Q49894R03666R70952J064542
2613A6110375J204816J375250J541752J725081J958961K276926K728522L369779
2605C2291462M364992N878547P372144P450935M919288K068067J496744K026465
2597F7868644K777012L682455M044335L241509K134401J503022J041923L86677
2589H6679978j36915j090633l024480m646347m880908m089380k953883j831735
2581F4025697q41370K83546J732999L557355N959542R267312J2395462J2572769
$$ y = [3695174, 3832642, 3972275, 4121926, 4279339, 4447752, 4630096, 4826122, 5035131, 5258187, 5493081, 5741133, 6009876, 6294746, 6600852, 6924997, 7276650, 7654069, 8058095, 8501710, 8996412, 9543911, 10142360, 10798794, 11529885, 12321321, 13171215, 14074881, 15045833, 16110375, 17315191, 18690441, 20232193, 21957274, 23916235, 26193161, 28921683, 32291462, 36656454, 42535001, 49907145, 57358080, 62277368, 64345435, 65842179, 67868644, 70645656, 74328111, 78372446, 81613955, 83748356, 85251378, 86293301, 86679978, 86543063, 85452430, 82427950, 77781603, 72900695, 68811315, 65857432, 64025697, 63184327, 63467873, 65200872, 68758227, 74717769, 83985081, 96380543, 108953312]
2573A08953312P198653J862890J202993K380669L918758N716616O296618M483960
2565A42014469K275330J085082M7127j326442k322906m238247q334203j1707898
2557A17492312j2545005j1508868r771171q102904o847007n512765l915627k098069
2549E7190896k87946J713504L517233L986281J991640m13309p30696N1190R90135
2540F8008928J972215K357632J585193N07117j34108o47504j328745j882364k837490
2531F7600874m767363o458315o886782o403998n586302m807216m245477l709415
2523B4736006l116136k512786k079235j778922j567210j366392j154628r80905
2515A0179792q41137o87541n54151m61636l89314l50053l13049k83031k62965
$$ y = [108953312, 116151965, 118014855, 119217848, 121598517, 125517275, 131233891, 137530509, 142014469, 144289799, 145374881, 145422008, 144095566, 141772660, 137534413, 129200210, 117492312, 104947307, 93438439, 83667268, 75564364, 68717357, 63204592, 59288965, 57190896, 56902950, 58616454, 62133687, 66119968, 68111608, 67698299, 66967603, 67018793, 68008928, 69981143, 72338775, 73923968, 74431085, 74296977, 73649473, 72320728, 70438364, 67600874, 62833511, 56375196, 49488414, 43084416, 37498114, 32690898, 28445421, 24736006, 21619870, 19107084, 17027849, 15248927, 13681717, 12315325, 11160697, 10179792, 9338655, 8651114, 8096963, 7635327, 7246013, 6895960, 6582911, 6299880, 6036915]
2506F036915k42604k25597k08713j95037j80736j71972j64326j54240j47127j36952
2496D209611j27633j20346j14219j10697j08545j04617r9936r6386r1723q7027
2486C148482q8685q2409q4444p8536p8352p1448o9949p0591o6398o0441o3014
2475B334215n7504n6545n1976n3420n0734m8871m5688m5205m4810m2266l9441
2464A797755l9093m0546m0612l6860l6841l3944l3666l4534l1409l1262l0841
2453A408147k9312k8264l0375k3090k5206k4155k5590k7055k2957k4382k0790
2442A126971k4735k1749k0705j9651j6419j8604k0004j5847j6125j8996j8215
2431I15921j4673j6623j8012j0869j3058j5226r382j3303q011j4440r339j2037
$$ y = [6036915, 5794311, 5568714, 5360001, 5164964, 4984228, 4812256, 4647930, 4493690, 4346563, 4209611, 4081978, 3961632, 3847413, 3736716, 3628171, 3523554, 3423618, 3327232, 3235509, 3148482, 3059797, 2977388, 2892944, 2814408, 2736056, 2664608, 2594659, 2524068, 2457670, 2397229, 2334215, 2276711, 2220166, 2168190, 2114770, 2064036, 2015165, 1969477, 1924272, 1879462, 1837196, 1797755, 1758662, 1718116, 1677504, 1640644, 1603803, 1569859, 1536193, 1501659, 1470250, 1438988, 1408147, 1378835, 1350571, 1320196, 1297106, 1271900, 1247745, 1222155, 1195100, 1172143, 1147761, 1126971, 1102236, 1080487, 1059782, 1040131, 1023712, 1005108, 985104, 969257, 953132, 934136, 915921, 901248, 884625, 866613, 855744, 842686, 827460, 818078, 804775, 796764, 782324, 772985, 760948]
2419G60948j1751j3608j4229j1259j0683j3644r462r660r733q092j0136j0828
2407F27863j0081j0262j2341p978j1731p578r064o528o546m597m304m117n305
2394E27431k224m125l622o654j252n288m864r87m159l397k860m904l250l19n599
2379D73927J354j781m926K52n53q69L324J644N037L864P427L786R574Q684J0220
2364E20964Q602J2871J2865J7878J8881J9394K1163L3004M2939N1161O2757O3166
2352H85645N3276L1198K1633K5236L3732L9415L9419L5336J8796J6797J3315Q658
2340A222456j817o109k4888l6567m4453l9603l6253k5663j8580j2313n90J6737
2328I92357K9814L7316M7916O3475N9636L8330J9265J7673K1939K6407L0579L2009
$$ y = [760948, 749197, 735589, 721360, 710101, 699418, 685774, 676312, 666652, 656919, 648827, 638691, 627863, 617782, 607520, 595179, 587201, 575470, 567892, 558828, 552300, 545754, 541157, 536853, 532736, 527431, 525207, 521082, 517460, 510806, 509554, 504266, 499402, 498415, 494256, 490859, 487999, 483095, 479845, 479526, 473927, 475281, 473500, 468574, 468826, 468273, 467404, 470728, 472372, 477409, 481273, 488700, 492486, 502060, 510744, 520964, 529566, 542437, 555302, 573180, 592061, 611455, 632618, 665622, 708561, 759722, 822479, 885645, 938921, 970119, 991752, 1016988, 1050720, 1090135, 1129554, 1164890, 1183686, 1200483, 1213798, 1222456, 1220639, 1214530, 1189642, 1153075, 1108622, 1069019, 1032766, 1007103, 988523, 976210, 975620, 992357, 1022171, 1059487, 1107403, 1170878, 1230514, 1268844, 1288109, 1305782, 1327721, 1354128, 1384707, 1416716]
2316A416716J5094K969m065j9877k9305m3336n0951p3144q8918r1870q0185p5661
2304H77467o3790n5717m7187l7354k6956j4678l592Q850R524M49j0535r855p032
2291F19594j235P134N923J868j480m657r473j0389j2670k0480k9791l9845l7507
2278D66992l6359l3170k7034k5451k0129j8868j3509j2717j2976p572j1178o833
2266B41196p163n467n677n340m000k584m551k444k019k166l197k471k675k939
2252A88503k033k601r89l371n26j562l509j075r94l325M54k216r06j595m843k49
2236A59163p8l560j852N39k541J228m522j473k378J182j532l633J374j050J348
$$ y = [1416716, 1431810, 1434779, 1430714, 1410837, 1381532, 1338196, 1287245, 1214101, 1125183, 1033313, 953128, 877467, 813677, 757960, 710773, 673419, 646463, 631785, 628193, 637043, 646567, 647016, 636481, 626626, 619594, 618359, 625493, 631416, 633284, 631804, 627147, 617674, 607285, 594615, 574135, 544344, 504499, 466992, 430633, 397463, 370429, 344978, 324849, 305981, 292472, 279755, 266779, 259207, 248029, 241196, 234033, 228566, 222889, 217549, 213549, 210965, 206414, 203970, 201951, 199785, 196588, 194117, 191442, 188503, 186470, 183869, 182880, 179509, 178983, 177421, 173912, 172837, 171843, 168518, 168972, 166756, 165850, 164255, 159412, 159163, 159085, 155525, 153673, 154212, 151671, 152899, 148377, 146904, 144526, 145708, 144176, 140543, 141917, 140867, 142215]
$$ [...]
##END NTUPLES=NMR SPECTRUM
##END=
