##TITLE=abcd
##JCAMPDX= 6.0         $$ Bruker NMR JCAMP-DX V2.0
##DATA TYPE= NMR SPECTRUM
##DATA CLASS= NTUPLES
##ORIGIN= UXNMR, Bruker Analytische Messtechnik GmbH
##OWNER= root
$$ XWIN-NMR		Version 3.5
$$ Mon May 18 18:41:39 2026 Russian Standard Time (UT+4h)  servis@DPX200
##.OBSERVE FREQUENCY= 200.131235884673
##.OBSERVE NUCLEUS= ^1H
##.ACQUISITION MODE= SIMULTANEOUS
##.ACQUISITION SCHEME= undefined
##.AVERAGES= 32
##.DIGITISER RES= 18
##SPECTROMETER/DATA SYSTEM= spect
##.PULSE SEQUENCE= zg
##.SOLVENT NAME= CDCl3
##.SHIFT REFERENCE= (INTERNAL, CDCl3, 0, 16.4885)
##AUDIT TRAIL= $$ (NUMBER, WHEN, WHO, WHERE, WHAT)
$$ ##TITLE= Audit trail, XWIN-NMR		Version 3.5
$$ ##JCAMPDX= 5.01
$$ ##ORIGIN= Bruker BioSpin GmbH
$$ ##OWNER= servis
$$ F:\spectra/data/av/nmr/H1/1/pdata/1/auditp.txt
$$ ##AUDIT TRAIL=  $$ (NUMBER, WHEN, WHO, WHERE, WHAT)
(   1,<2026-05-18 18:32:17.50 +0400>,<servis>,<DPX200>,
      <created by zg, POWCHK disabled, PULCHK disabled
       configuration hash MD5:
       00 E9 B6 7A A2 85 ED C7 34 08 36 98 17 FE 4E 26
       data hash MD5: 32K
       45 29 E9 E9 6D 9C E3 38 F2 4C AA 4C 19 19 80 1F>)
(   2,<2026-05-18 18:40:51.53 +0400>,<servis>,<DPX200>,
      <Start of raw data processing
       efp BC_mod = 2 LB = 0.05 FT_mod = 6 PKNL = 1 PHC0 = -409.19 PHC1 = 3.101563 SI = 16K 
       data hash MD5: 16K
       BB 1F 6A F9 DB E9 CE 32 71 F8 D4 2B 1C B5 A2 40>)
(   3,<2026-05-18 18:41:05.31 +0400>,<servis>,<DPX200>,
      <pk PHC0 = -3.000001 PHC1 = 0 
       data hash MD5: 16K
       2E 06 20 D2 74 6F FB C0 11 C8 72 2E 3E 8F CF 6C>)
$$ ##END=
$$ 
$$ hash MD5
$$ 87 DA D3 14 61 4D B5 F9 CF FA C3 EF FD 8C 26 0E
##$RELAX= 
##$RELAX= 
##$RELAX= 
##$RELAX= 
##$RELAX= 
##$RELAX= 
##$RELAX= 
##$RELAX= 
$$ Bruker specific parameters
$$ --------------------------
##$DU= <F:\spectra>
##$EXPNO= 1
##$NAME= <H1>
##$PROCNO= 1
##$TYPE= <nmr>
##$USER= <av>
##$AMP= (0..31)
100 100 100 100 100 100 100 100 100 100 100 100 100 100 100 100 100 100 
100 100 100 100 100 100 100 100 100 100 100 100 100 100 
##$AQSEQ= 0
##$AQ_mod= 1
##$AUNM= <au_zg>
##$AUTOPOS= <>
##$BF1= 200.13
##$BF2= 200.13
##$BF3= 200.13
##$BF4= 200.13
##$BF5= 500.13
##$BF6= 500.13
##$BF7= 500.13
##$BF8= 500.13
##$BYTORDA= 1
##$CFDGTYP= 0
##$CFRGTYP= 5
##$CHEMSTR= <none>
##$CNST= (0..31)
1 1 145 1 1 1 1 1 1 1 1 1 1 1 1 1 1 1 1 1 1 1 1 1 1 1 1 1 1 1 1 1 
##$CPDPRG= <>
##$CPDPRG1= <>
##$CPDPRG2= <>
##$CPDPRG3= <>
##$CPDPRG4= <mlev>
##$CPDPRG5= <mlev>
##$CPDPRG6= <mlev>
##$CPDPRG7= <mlev>
##$CPDPRG8= <mlev>
##$CPDPRGB= <>
##$CPDPRGT= <>
##$D= (0..31)
0 2 0 0 0 0 0 0 0 0.06 0 0 0 0 0 0 0.0002 0 0 0 0 0 0 0 0 0 0 0 0 0 0 
0 
##$DATE= 1779114737
##$DBL= (0..7)
120 120 120 120 120 120 120 120 
##$DBP= (0..7)
150 150 150 150 150 150 150 150 
##$DBP07= 0
##$DBPNAM0= <>
##$DBPNAM1= <>
##$DBPNAM2= <>
##$DBPNAM3= <>
##$DBPNAM4= <>
##$DBPNAM5= <>
##$DBPNAM6= <>
##$DBPNAM7= <>
##$DBPOAL= (0..7)
0.5 0.5 0.5 0.5 0.5 0.5 0.5 0.5 
##$DBPOFFS= (0..7)
0 0 0 0 0 0 0 0 
##$DE= 6
##$DECBNUC= <off>
##$DECIM= 32
$$ [...]
##$SUBNAM4= <"">
##$SUBNAM5= <"">
##$SUBNAM6= <"">
##$SUBNAM7= <"">
##$SUBNAM8= <"">
##$SUBNAM9= <"">
##$SW= 20.6817932712277
##$SWIBOX= (0..15)
0 0 3 0 0 0 0 0 0 0 0 0 0 0 0 0 
##$SW_h= 4139.07284768212
##$TD= 32768
##$TD0= 1
##$TE= 0
##$TE2= 300
##$TE3= 300
##$TEG= 300
##$TL= (0..7)
0 120 120 120 120 120 120 120 
##$TP= (0..7)
150 150 150 150 150 150 150 150 
##$TP07= 0
##$TPNAME0= <>
##$TPNAME1= <>
##$TPNAME2= <>
##$TPNAME3= <>
##$TPNAME4= <>
##$TPNAME5= <>
##$TPNAME6= <>
##$TPNAME7= <>
##$TPOAL= (0..7)
0.5 0.5 0.5 0.5 0.5 0.5 0.5 0.5 
##$TPOFFS= (0..7)
0 0 0 0 0 0 0 0 
##$TUNHIN= 0
##$TUNHOUT= 0
##$TUNXOUT= 0
##$USERA1= <user>
##$USERA2= <user>
##$USERA3= <user>
##$USERA4= <user>
##$USERA5= <user>
##$V9= 5
##$VALIST= <valist>
##$VCLIST= <CCCCCCCCCCCCCCC>
##$VD= 0
##$VDLIST= <DDDDDDDDDDDDDDD>
##$VPLIST= <PPPPPPPPPPPPPPP>
##$VTLIST= <TTTTTTTTTTTTTTT>
##$WBST= 1024
##$WBSW= 30
##$XGAIN= (0..3)
0 0 0 0 
##$XL= 0
##$YL= 0
##$YMAX_a= 529114
##$YMIN_a= -763028
##$ZGOPTNS= <>
##$ZL1= 120
##$ZL2= 120
##$ZL3= 120
##$ZL4= 120
##$ABSF1= 0
##$ABSF2= 0
##$ABSG= 0
##$ABSL= 0
##$ALPHA= 0
##$AQORDER= 0
##$ASSFAC= 0
##$ASSFACI= 0
##$ASSFACX= 0
##$ASSWID= 0
##$AUNMP= <proc_1d>
##$AZFE= 0.1
##$AZFW= 0.1
##$BCFW= 0
##$BC_mod= 2
##$BYTORDP= 0
##$COROFFS= 0
##$CY= 18.4799938201904
##$DATMOD= 1
##$DC= 0
##$DFILT= <>
##$DTYPP= 0
##$F1P= 9.9274215381318
##$F2P= -0.165520771350173
##$FCOR= 1
##$FTSIZE= 16384
##$FT_mod= 6
##$GAMMA= 0
##$GB= 0
##$INTBC= 1
##$INTSCL= 4.127829e-11
##$ISEN= 128
##$LB= 0.05
##$LEV0= 0
##$LPBIN= 0
##$MAXI= 10000
##$MC2= 0
##$MEAN= 0
##$ME_mod= 0
##$MI= 50
##$NCOEF= 0
##$NC_proc= -6
##$NLEV= 6
##$NOISF1= 3.799351
##$NOISF2= 2.8
##$NSP= 0
##$NTH_PI= 0
##$NZP= 0
##$OFFSET= 16.48848
##$PC= 4
##$PHC0= -412.19
##$PHC1= 3.101563
##$PH_mod= 1
##$PKNL= yes
##$PPARMOD= 0
##$PSCAL= 4
##$PSIGN= 0
##$REVERSE= no
##$SF= 200.130005582386
##$SI= 16384
##$SIGF1= 3
##$SIGF2= 2
##$SINO= 400
##$SIOLD= 16384
##$SREGLST= <1H.CDCl3>
##$SSB= 0
##$STSI= 16384
##$STSR= 0
##$SW_p= 4139.07284768211
##$SYMM= 0
##$S_DEV= 0
##$TDeff= 32768
##$TDoff= 0
##$TI= <>
##$TILT= no
##$TM1= 0
##$TM2= 0
##$TOPLEV= 0
##$USERP1= <user>
##$USERP2= <user>
##$USERP3= <user>
##$USERP4= <user>
##$USERP5= <user>
##$WDW= 1
##$XDIM= 16384
##$YMAX_p= 339751802
##$YMIN_p= -6242955
$$ End of Bruker specific parameters
$$ ---------------------------------
##NTUPLES= NMR SPECTRUM
##VAR_NAME=  FREQUENCY,     SPECTRUM/REAL,   SPECTRUM/IMAG
##SYMBOL=    X,             R,               I
##VAR_TYPE=  INDEPENDENT,   DEPENDENT,       DEPENDENT
##VAR_FORM=  AFFN,          ASDF,            ASDF
##VAR_DIM=   16384,         16384,           16384
##UNITS=     HZ,            ARBITRARY UNITS, ARBITRARY UNITS
##FACTOR=    0.252644378177508, 1,           1
##FIRST=     3299.83951724647, 0,            0
##LAST=      -839.233330435636, 0,           0
##MIN=       -839.233330435636, -6242955,    0
##MAX=       3299.83951724647, 339751802,    0
$$ Real data points
##PAGE= N=1
##DATA TABLE= (X++(R..R)), XYDATA
$$ [...]
9707H01971k232411L72426O80993K64512L17994o03307Q6839q00124N72229r50652
9697a489530O68437n00046J223533p32946Q33981k83077K495K95347k10065L21719
9687A29848p53669L25429r00486P82844M92706O03706q57812l22250J429331p30902
9677A98745q80561K68111j30516k27647k150437K540275n56251p95468N34943
9668a198806K67481O10716o4500P398q79656J206039j390131J121146O87665n97191
9658b29839L3638Q06904k298540J035434n31853o9393Q65125m75213J596667m06522
9648C26408o55269k47549o1489j28903J369438k352056J024625l66977O13651
9639d78121j2898k3596l12241J266845j389420R41715J23121l71656j231802O92583
$$ plain form
9707 801971 -1430440 -1058014 -377021 -112509 205485 -397822 -310983 -1111107 -538878 -1489530
9697 -1489530 -821093 -1321139 -97606 -830552 3429 -279648 -277153 18194 -191871 129848
9687 129848 -623821 -298392 -1198878 -416034 76672 680378 -177434 -499684 929647 198745
9677 198745 -681816 -413705 -544221 -771868 -2922305 -382030 -938281 -1733749 -1198806
9668 -1198806 -931325 -320609 -385109 -377711 -1257367 -51328 -1441459 -320313 367352 -229839
9658 -229839 -196201 610703 -1687837 -652403 -1184256 -1253649 -388524 -863737 732930 326408
9648 326408 -328861 -576410 -637899 -766802 602636 -1749420 -724795 -1091772 -478121
9639 -478121 -491019 -514615 -826856 439989 -949431 -7716 115405 -256251 -1488053 -795470
9629g95470L49609L34348j098861r0005k80489J211314k01110j50711J285640
9620E64265j158210K6027J54663k97916j42547Q63458K95963p92742Q66708q2593
9610B97076j040573P9562L89528N14438J89858j970701J190840o29839O80836
9601b98975q02788l5145j40880j69529J121101l16426j113943J215321k61952
9592h03216L45946J99874l19060r23706J103168m68951L25691j216678J298362
9583d58570n5123q53728J311776o94460P14695j80130n85176j382301J815183
9574c67834j792862J935398j133248M61460M85422j13793J95954j11084m16730
9565h57317m64O16725j064250R29253j114748o9959J77732O28742k16957L40452
$$ plain form
9629 -795470 -445861 -111513 -1210374 -1300379 -1580868 -369554 -570664 -721375 564265
9620 564265 -593945 -567918 -413255 -711171 -853718 9740 305703 -487039 379669 297076
9610 297076 -743497 -663935 -274407 240031 429889 -1540812 -349972 -979811 -298975
9601 -298975 -1101763 -1136908 -1277788 -1447317 -326216 -642642 -1756585 -541264 -803216
9592 -803216 -457270 -257396 -576456 -1500162 -396994 -865945 -540254 -1756932 -458570
9583 -458570 -513693 -1367421 -55645 -750105 -35410 -215540 -800716 -2183017 -367834
9574 -367834 -2160696 -225298 -1358546 -897086 -411664 -525457 -329503 -440587 -857317
9565 -857317 -857781 -241056 -1305306 -376053 -1490801 -1560760 -1383028 -754286 -971243 -630791
9555f30791K93585j7930l58210J038726j360119O57719k48610N5138K99163p72906
9545a044235R66962J99274q17555n16811M21927k6692r13266R73224k29772K85562
9535g01382N30211k44990j22148j017819J220405J653489j322290j303302J886153
9526E78327k047931J652203r50389o14565Q28582k17146L75093m28567O96475
9517a27918l38819n20034O02791j59394l99640R28128o30901P72848k99145J31519
9507d0565M12181l74499j591280O08606M41456M34004M71685L63098k26268q94883
9497c96465J2240Q84570j621813J593802k53953j103638K00910J00949J08528
9488d74870J066422k873466J903142j29417L39043L5933R27227r54667j19412
$$ plain form
9555 -630791 -337206 -355136 -713346 325380 -1034739 -377020 -625630 -570492 -271329 -1044235
9545 -1044235 -77273 122001 -695554 -1212365 -790438 -817130 -1730396 -757172 -986944 -701382
9535 -701382 -171171 -416161 -538309 -1556128 -335723 1317766 -4524 -1307826 578327
9526 578327 -1469604 182599 -767790 -1382355 -553773 -770919 -395826 -824393 -127918
9517 -127918 -466737 -986771 -383980 -543374 -943014 -14886 -645787 127061 -172084 -40565
9507 -40565 371616 -2883 -1594163 -985557 -544101 -110097 361588 724686 498418 -396465
9497 -396465 -384225 500345 -1121468 472334 218381 -885257 -684347 -583398 -474870
9488 -474870 591552 -2281914 -378772 -508189 -169146 -133213 794014 -160653 -280065
9479b80065P76122j922245N09751J774051K09070j884329P07590p63472O5699
9470h07828O78275j003355P39381N51084L34095m09347m56551J004857p20664
9461i0053J433558n98468M94533k67644K60804j821584Q37704p49727O0879P46755
9451C06757J70075m64612m3071o30006R61002o29558j42641P34191j363907R19878
9441a81892J711095r04552K67046K18950j571895J727017o89952P8018J251611
9432A905446J552152J222686o35588J155347l26951q13996j406685n75117q05474
9423A271820n4237Q57353j408804N20225R66069j267847M41179n89987N21924
9414A257695p30352J010882j232840O19992J89945j04783L86948k68190R55914
$$ plain form
9479 -280065 496057 -1426188 -916437 857614 1066684 -817645 -110055 -873527 -807828
9470 -807828 -129553 -1132908 -393527 157557 491652 82305 -374246 630611 -90053
9461 -90053 1343505 745037 1239570 971926 1232730 -588854 248850 -500877 -439998 306757
9451 306757 476832 12220 -30851 -660857 300145 -329413 -472054 262137 -1101770 -181892
9441 -181892 1529203 624651 891697 1110647 -461248 1265769 575817 653835 1905446
9432 1905446 3457598 4680284 4044696 5200043 4873092 4059096 2652411 2077294 1271820
9423 1271820 1217583 2074936 666132 1186357 2152426 884579 1325758 735771 1257695
9414 1257695 527343 1538225 305385 925377 1115322 1010539 1397487 1129297 2085211
9405B085211r28447J102387Q32111N63507j439881J768829j365304j542861K008220
9396C083772j364096j77435q57705R77312n02781q40092J129255J1708j202347
9387B57591L50369l35844J98779r93202Q65393Q09628k95016j331134q21123J803719
9377E09160j41529J56524q56700J330209j783666L06088R5690J35896q33699J23021
9367i59006P9628j25564L02265R90432q31899P36353r14001J452293p26538R65705
9357I69668o99982k84240n10250r0861K03802K65497K25832K27790l05916O58904
9347F60244o32961J932322p25644j095090K105898M11794p63497J776833m51967
9338C217932Q46746R28873J995538j417108n45508L38938k83165k043189J810444
$$ plain form
9405 2085211 1156764 2259151 3091262 3654769 2214888 3983717 2618413 1075552 3083772
9396 3083772 1719676 1542241 684536 1661848 1159067 318975 1448230 1459938 257591
9387 257591 607960 272116 470895 -522307 343086 1152714 857698 -473436 -1294559 509160
9377 509160 367631 524155 -332545 997664 -786002 -479914 -384224 -248328 -1082027 -959006
9367 -959006 -879378 -1004942 -702677 287755 -544144 192209 -721792 730501 3963 969668
9357 969668 269686 -14554 -524804 -615665 -411863 -146366 79466 307256 1340 660244
9347 660244 27283 1959605 1233961 138871 2244769 2656563 1893066 3669899 3217932
9338 3217932 4064678 4993551 6989089 5571981 5026473 5365411 5082246 3039057 4849501
9329D849501J87475o92489j612407N4728n02165j601785J252347n80278j30675
9320A224252J87583o3951k28639N77871J45329M08098k24990J086181p67963K962536
9310E306307p62963O94944O61678O40192R85702J843901j74321O56033p97246
9301I054227q07175o36348j744138o48805j434335o43082K00916n67596Q3691
9292B857355M54735j822869l3754m28991L16999J35063j075052r37229L459243
9283B925500j880494R7409Q59814N18125j28992O5994j181730J986119p79477
9274B482268J520121q76795Q62371p94171J15989n65896j104150r01841j85773
9265E52123J241224L82380k055001o67528J006802k8845O05067j525841J462141
$$ plain form
9329 4849501 5036976 4344487 2732080 2786808 2284643 682858 1935205 1354927 1224252
9320 1224252 1411835 1347884 1119245 1697116 1842445 2250543 2025553 3111734 2343771 5306307
9310 5306307 4543344 5238288 5899966 6540158 7525860 9369761 9195440 9851473 9054227
9301 9054227 8247052 7610704 5866566 5217761 3783426 3140344 3341260 2773664 2857355
9292 2857355 3312090 1489221 1455467 1026476 1343475 1478538 403486 -533743 2925500
9283 2925500 1045006 1142415 2002229 2520354 2391362 2457356 1275626 3261745 2482268
9274 2482268 4002389 3125594 3987965 3193794 3309783 2743887 1639737 737896 552123
9265 552123 1793347 2175727 120726 -546802 460000 431155 1036222 -489619 972522
9256I72522j96664r81303J058129N4663j328363R29068L76870k322744J149986
9247b87836N55451j265068K55811m04541j13686J249518J70508J28601K6719q53010
9237e37533k35520J159728j188477l11514R34206l57186R4054J239149j62697
9228F34210Q80366j997738R09250j289993J479255q42675o85549J221485o50413
9219c41802k28158j83748R76506n3927k01853N66070j120843j830309J386008
9210a032056j15771J369471l69397p93298J079888j730179J088604j200137J390311
9201c12564M44801q38022P69897P98402k127035J679570j021413L6854P02902
9192A33392P55765j553978K59806N0301R15739j361060M05150N50316m16996k85031
$$ plain form
9256 972522 775858 -205445 852684 907347 -421016 508052 884922 -1437822 -287836
9247 -287836 267615 -997453 -741642 -1146183 -1259869 -10351 160157 288758 315477 -537533
9237 -537533 -773053 386675 -801802 -1113316 -179110 -536296 -442242 796907 634210
9228 634210 1514576 -483162 426088 -863905 615350 -227325 -912874 308611 -341802
9219 -341802 -569960 -753708 222798 168871 -32982 533088 -587755 -2418064 -1032056
9210 -1032056 -1147827 221644 -147753 -941051 138837 -1591342 -502738 -1702875 -312564
9201 -312564 132237 -705785 64112 862514 -1264521 415049 -606364 -569510 133392
9192 133392 889157 -664821 -405015 -354714 561025 -800035 -394885 155431 -261565 -546596
9182e46596O90347j002975q4050J119722j175791J169186j116271Q76047o09682
9173f80063J649404j503091n68098q3032K50897m12142L47958J330601j287071
9164i54637N70271J061088j458714O65518o06032k28741J279385j416229Q47604
9155b40487q63228K97158o28102R86172L02600R35093j351874Q23813n69747k119
9145c10721Q03522j029850J334812j351725M00748k02099N7742N70410l88381
9136a15542M32106L9682m52516R8322m0593K43904p71804O23661j29127n86429
9126f58336l72891P93559N60512P39560q51261p18464J002701p82910J246626
9117I59096l68659L79801j308480k22868J732822m58382j242442M2290r7771J689847
$$ plain form
9182 -546596 143751 -859224 -943274 176448 -999343 169843 -946428 -70381 -680063
9173 -680063 969341 -533750 -1101848 -1184880 -933983 -1346125 -998167 332434 -954637
9164 -954637 -384366 676722 -781992 -116474 -722506 -951247 328138 -1088091 -240487
9155 -240487 -1103715 -806557 -1434659 -448487 -145887 789206 -562668 261145 -308602 -310721
9145 -310721 492801 -537049 797763 -553962 -153214 -355313 -297571 272839 -115542
9136 -115542 316564 356246 -96270 2052 -38541 205363 -566441 57220 -71907 -658336
9126 -658336 -1031227 -237668 322844 1062404 211143 -507321 495380 -287530 959096
9117 959096 590437 970238 -338242 -561110 1171712 713330 -529112 -486822 -584593 1105254
9107A105254j162779P75678l05840O87123p53512k96760J496922r79631J130515
9098A696970j061163J056914P15271p99966K110576j39128n95204K965981J164945
9089G115196L912083P465278J0552937J1819938N913338l24656q294598r175780
9081B8983736o733761n630560n029161j994386m205328K07541j468472r41976
9073C187633M99657j199381M7348K93879j304026J102909j183189k28780J103837
9064B319887j398088J416685j240362J044395j951975J171294j541003P73471
9056E94304J132653n61632P33145j709217P32554p15051q53599J493066r69696
9047a23473R40555r14046P35254q2418n81003m94232J514134O43315j312927K01774
$$ plain form
9107 1105254 -57525 718153 412313 1099436 345924 49164 1546086 566455 1696970
9098 1696970 635807 1692721 2407992 1608026 3718602 3579474 2984270 5950251 7115196
9089 7115196 11027279 18492557 29045494 40865432 46778770 46454114 38159516 28983736
9081 28983736 22249975 16619415 11590254 9595868 5390540 5598081 4129609 3187633
9073 3187633 3687290 2487909 2535257 2829136 1525110 2628019 1444830 1216050 2319887
9064 2319887 921799 2338484 1098122 2142517 190542 1361836 -179167 594304
9056 594304 1726957 1165325 1898470 189253 921807 206756 -646843 846223 -123473
9047 -123473 817082 -96964 638290 555872 -25131 -519363 994771 1638086 325159 526933
9037E26933q1963J28305l19069j162300K60447J537476k45798j75924n07596j70691
9027b10180N26099r19588O90263j34476M19191p06588M11106Q86059m90938o98762
9017b27814N44427q90037J284218j436005K52072L38757m29453R18127n54161
9008a99869j69590K39541j274819M09043J12033K94269P75034p4762Q88800k321101
8998a321421P70214P65439j741011J045586J482529j236566P63371k23169j264999
8989i60027J521170j32135j532944J385349K42008j335457R00426j735891O62533
8980i84968j078080K487360p68469J475685k723472K692998k18298j46427j974562
8971a238233J355721k127903K344395m33863j199469K658m07859J662133J50176
$$ plain form
9037 526933 444970 573275 254206 -908094 -647647 889829 644031 468107 -39489 -210180
9027 -210180 315919 -603669 86594 -47882 371309 -335279 75827 961886 470948 -227814
9017 -227814 316613 -573424 710794 -725211 -473139 -134382 -563835 354292 -199869
9008 -199869 -369459 -129918 -1404737 -995694 -883661 -589392 185642 110880 999680 -1321421
8998 -1321421 -551207 214232 -1526779 -481193 1001336 -235230 528141 304972 -960027
8989 -960027 561143 429008 -1103936 281413 523421 -812036 88390 -1647501 -984968
8980 -984968 -2063048 424312 -344157 1131528 -1591944 1101054 882756 736329 -1238233
8971 -1238233 117488 -2010415 333980 -99883 -1299352 -1296694 -1704553 -42420 107756
8962A07756j87252Q2346N88033l7150J90831j915493N64215J04082M98675j77482
8952a81439N60042o12664J72211r54308l37435q9648J091445j367347J390366
8943c28777P45887q81179J060209o74008K43147j011921O3617K02068n08460N53656
8933e35761n95567n27602N37418J527945R1304p14606j397881K122864j341772
8924h33658o0797J666554k216778K42083k8839j14904M56571o15471L04406Q98488
8914c02345n84983L13267o8714r89749K041772q56178J107304j803790L59505
8905g83911J843918j576478K27439j055299Q76407j390174R98037K59711j235004
8896a835354J075678K77984O41415j636848M71220R85321q21425k14652J74694
$$ plain form
8962 107756 -79496 2850 590883 553733 744564 -1170929 -606714 -502632 -3957 -181439
8952 -181439 378603 -234061 -61850 -1016158 -1353593 -1443241 -351796 -1719143 -328777
8943 -328777 417110 -464069 596140 -77868 165279 -846642 -783025 -580957 -1089417 -535761
8933 -535761 -1131328 -1658930 -1121512 406433 497737 -216869 -1614750 508114 -833658
8924 -833658 -894455 772099 -1444679 -1202596 -1231435 -1346339 -889768 -1505239 -1200833 -302345
8914 -302345 -887328 -574061 -642775 -1632524 409248 -446930 660374 -1143416 -783911
8905 -783911 1060007 -516471 -289032 -1344331 -467924 -1858098 -860061 -600350 -1835354
8896 -1835354 -759676 -481692 159723 -1477125 -1005905 -20584 -842009 -1056661 -881967
8887h81967L90088J55689j659968R29346P74421k377185K267600m64627o79027
8878a545630J561635l80908N83010q57220R1997l39587J110402j568935J308586
8869c6650q03690j104223n08747J456018m12992J143513K0290l54168p85063J289418
8859i6294j744688J482679j272716P48607J838160q60782q47715j413542R21390
8850a244901m71732n72884K264852m12992J88521O62410j532351J010142J11322
8841B387j6385o50490P8794n88127k29285J845981N87423j621893L50680k63442
8831e04357j253601J04379O80148l89693O55204O0098m56133R16448N2762L92243
8821B57498j347588p78606J196547J136778n84005J9257j040038P51910L75607
$$ plain form
8887 -881967 -491879 -336190 -1996158 -1066812 -292391 -2669576 -401976 -866603 -1545630
8878 -1545630 16005 -364903 218107 -639113 -547116 -886703 223699 -1345236 -36650
8869 -36650 -840340 -1944563 -2453310 -997292 -1410284 -266771 -246481 -600649 -1385712 -96294
8859 -96294 -1840982 -358303 -1631019 -882412 955748 94966 -752749 -2166291 -1244901
8850 -1244901 -1716633 -2289517 -24665 -437657 -249136 413274 -1119077 -108935 2387
8841 2387 -13998 -664488 -585694 -1173821 -1403106 442875 1030298 -591595 -240915 -504357
8831 -504357 -1757958 -1653579 -973431 -1363124 -707920 -647822 -1103955 -187507 -134745 257498
8821 257498 -1090090 -1868696 -672149 464629 -119376 -100119 -1140157 -388247 -12640
8812a2640p66106k77717j190227N07999J646365j04068N9897m00130m42930j096263
8802b075820J240005P28750J74973j724034J475645j689260J906744k89384J25640
8793a26741j465838l10928L09024M03746L55060Q68346k041432K135638j101846
8784i74971L00835Q39187j55223l57840Q056j213257K86989j0727J189651n49983
8774f37283o92709O30055M77814j07323n36111n7507k10584n12704Q24029n60540
8764a382863R44053l36921M16260j282678J876094j102913k25959P60372j26983
8755d61538M12977M9215o57366j171782J634335j209455R69798J345549k04035
8746G07698l52136j432001p19574J972949L02638j120432P65819o29931P13199
$$ plain form
8812 -12640 -778746 -1056463 -2246690 -1738691 -92326 -196394 -136497 -536627 -979557 -2075820
8802 -2075820 -835815 -107065 67908 -1656126 -180481 -1869741 37003 -252381 -126741
8793 -126741 -1592579 -1903507 -1594483 -1190737 -835677 32669 -2008763 126875 -974971
8784 -974971 -674136 165051 9828 -348012 -339956 -1553213 -1266224 -1276951 -87300 -637283
8774 -637283 -1329992 -699937 -222123 -329446 -865557 -923064 -1133648 -1646352 -822323 -1382863
8764 -1382863 -438810 -775731 -359471 -1642149 233945 -868968 -1094927 -334555 -461538
8755 -461538 -48561 654 -656712 -1828494 -194159 -1403614 -433816 911733 707698
8746 707698 355562 -1076439 -1796013 176936 479574 -640858 124961 -504970 208229
8737B08229k017761R76851r43534N79680l22244J016662K25922m44535r41338
8728a662068K024799j090956l23355K63533n4729K61413p5560O50431j204551
8719a211043L57125P61654q58963m17075J23108Q91285m65429M81949k09377k87603
8709h34369J41527L13732o22326J368231k606597J095228L44095j140843P83476
8700a157846r3250L76125j50707q21375J104342l1504j44353Q88128j38467O43048
8690D74141j017345O4127k91107j305972J134423R7974p5554J061659j07436k96560
8680b61650J36109j259096J515648j962926Q24756J418457j701514l04573J409387
8671a85402m51355O017q10229O89594M17022q4121m59351J292493r20533k20871
$$ plain form
8737 208229 -1809532 -832681 -1776215 -1196535 -1518779 -502117 -276195 -720730 -1662068
8728 -1662068 362731 -728225 -1051580 -788047 -842776 -581363 -656923 -6492 -1211043
8719 -1211043 -853918 -92264 -951227 -1368302 -1245194 -353909 -819338 -337389 -546766 -834369
8709 -834369 -692842 -379110 -1001436 366795 -2239802 -1144574 -800479 -1941322 -1157846
8700 -1157846 -1251096 -874971 -1025678 -1847053 -742711 -774215 -918568 -30440 -168907 474141
8690 474141 -543204 -479077 -770184 -2076156 -941733 -843759 -919313 142346 34910 -261650
8680 -261650 -125541 -1384637 131011 -1831915 -1007159 411298 -1290216 -1594789 -185402
8671 -185402 -636757 -630740 -1440969 -751375 -334353 -418474 -877825 414668 -505865 -726736
8661g26736R5750m46991q45381J368898j2162M15923P79410j85123j107391l53664
8651a017467r11748R26826N69106M00598N67083k539230N26459J624669j407518
8642a261222J935446j541015p98450O35786O27995R9571M49748j961715J239724
8633e74132o50333J222226j05331q72119J12091p65423J972646N9006k45568j962237
8623a809174K289855k440990J970466k98488j287790J499354j238750L58776p40106
8614a696847r27824J666644L5488J234148j595990N10152Q40488j936060Q87234
8605i82567M03433j61661O20501j89925j480700J934097j041246q14120o6342
8596a778530J494699p6472Q83661n57612j047529N97701p61522R4920P72741m59612
$$ plain form
8661 -726736 -630986 -1077977 -1923358 -554460 -566622 -150699 628711 443588 -663803 -1017467
8651 -1017467 -1929215 -1002389 -433283 -32685 534398 -2004832 -1478373 146296 -1261222
8642 -1261222 674224 -866791 -1665241 -1029455 -401460 -301889 147859 -1813856 -574132
8633 -574132 -1224465 -2239 -107570 -979689 -867598 -1633021 339625 398631 153063 -1809174
8623 -1809174 480681 -1960309 10157 -288331 -1576121 -76767 -1315517 -956741 -1696847
8614 -1696847 -2624671 -958027 -922539 311609 -1284381 -774229 66259 -1869801 -982567
8605 -982567 -579134 -740795 -120294 -310219 -1790919 143178 -898068 -1712188 -1778530
8596 -1778530 -283831 -360303 523358 -34254 -1081783 -484082 -1245604 -1150684 -377943 -837555
8586h37555M98309N48973p69654r60742N67448L88678o58958P82318l75064L2854
8576g83393n72824N49022K57983J9771P22488p74991n62623L52218J215577q41159
8566d17931q49140J208049r56361j69050L17476j32469k36235J077093j076293
8557a234861Q60177k69518M83637L07752l84029k63185N87967j672328Q91579
8548f92809r40500j0676J52532L23025J80600o84619N81236J020338m02459j25841
8538e99173l42836m14573J054418N4692p33067P50806j00608l24868q84571J538902
8528h78r41087J06363p53756p32167J009143K97689m85155Q24523o58942N07720
8518h26547J65167R94460o14694j740671J272378Q1432m9318O63627j624751J141246
$$ plain form
8586 -837555 -339246 209727 -559927 -1520669 -953221 -564543 -1223501 -441183 -816247 -783393
8576 -783393 -1356217 -807195 -549212 -529441 193047 -581944 -1144567 -792349 423228 -417931
8566 -417931 -1267071 -59022 -1015383 -1184433 -866957 -999426 -1235661 -158568 -1234861
8557 -1234861 -374684 -644202 -160565 147187 -236842 -500027 87940 -1584388 -692809
8548 -692809 -1633309 -1643985 -1491453 -1168428 -987828 -1672447 -1091211 -70873 -473332 -599173
8538 -599173 -942009 -1356582 -302164 -247472 -980539 -229733 -330341 -655209 -1539780 -878
8528 -878 -941965 -835602 -1589358 -2321525 -1312382 -1014693 -1499848 -675325 -1334267 -826547
8518 -826547 -661380 333080 -281614 -2022285 -749907 -668475 -717793 -54166 -1678917 -537671
8508e37671p70619J053281L76734j434634J02951q05007M44365J189015j349758
8499a731343Q92704R70541k542031Q96337j023043J196665m35534L06582N48662
8490i20460j242134M10159O26270j61713J020680q22458O07805M4p63255K62648
8480i82414J085771J53829j705801J15230q37169J713667p22674P39954n24818
8471i64425l4969j04545M24851J20105n66912J510940j759098j88983L14553L57344
8461h91139O28416J222462j160778K78984q12788j9860O07991M27181m95877j151740
8451a367148m29524J196673j198874J532296l3114O72881k547623J833751n9763
8442d00445j203904J871232p45952j10014j219213K277611j017566k4069J90145
$$ plain form
8508 -537671 -1308290 -255009 121725 -1312909 -1209958 -2014965 -1570600 -381585 -1731343
8499 -1731343 -838639 131902 -2410129 -1513792 -2536835 -1340170 -1775704 -1469122 -920460
8490 -920460 -2162594 -1752435 -1126165 -1287878 -267198 -1089656 -481851 -481807 -1245062 -982414
8480 -982414 103357 257186 -1448615 -1333385 -2170554 -456887 -1179561 -439607 -964425
8471 -964425 -999394 -1103939 -679088 -558983 -1125895 385045 -1374053 -1563036 -1248483 -891139
8461 -891139 -262723 959739 -201039 77945 -734843 -754703 -146712 280469 -215408 -1367148
8451 -1367148 -1796672 -599999 -1798873 -266577 -299691 373190 -2174433 -340682 -400445
8442 -400445 -1604349 266883 -479069 -589083 -1808296 469315 -548251 -572320 -382175
8433c82175o07103K40025j297808N81904O31537J088309j112573N65657j300176
8424a592403J22954J912720p30518p4913j15397J54012l58938J012019j388224
8415a058688q59162J593536o22039J318881p75246m56481J97607o19604O70762
8406f10434o0564L91700L18268j158623P46664k535267K032758J73942P43675
8397D2119j184192P49804j186646N30499R8458J135111j30506j367197m8346L31200
8387a029696P00417j153234L71228J131892k054959K149877K82295n39038m16029
8378e57247K96021L84882J124330k183115J344870n7958k262601J753340o50516
8369h07994j3400k77702l61448P30111k88202N64417j097218k29309J278280m17416
$$ plain form
8433 -382175 -989278 -749253 -2047061 -1465157 -833620 254689 -857884 -292227 -1592403
8424 -1592403 -1469449 443271 -287247 -362160 -477557 -323545 -682483 329536 -1058688
8415 -1058688 -1917850 -324314 -946353 372528 -402718 -859199 -661592 -1281196 -610434
8406 -610434 -670998 -279298 38970 -1119653 -372989 -2908256 -875498 -701556 42119
8397 42119 -1142073 -392269 -1578915 -1048416 -949958 185153 54647 -1312550 -1360896 -1029696
8387 -1029696 -329279 -1482513 -1111285 20607 -2034352 115525 397820 -141218 -557247
8378 -557247 -261226 123656 1247986 -935129 409741 351783 -1910818 -157478 -807994
8369 -807994 -821394 -1099096 -1460544 -730433 -1018635 -454218 -1551436 -1780745 -502465 -919881
8359i19881j167386J603944n70133K02037O91004K32890r53330N6145J118556
8350B93846k330275O88138N12386j37240n07612P17519L59604l38907r70831L63540
8340a349832l9305k87780M34445J226816J096329k263106J850728j406509k07569
8331i45783j71972m72869m03242J028963L33324J112740J95895p58986j406941
8322a488871K496008k605251J191923k27024J25762L88410J30016j255883R88609
8313b56301o93135q05766O42937J43641P55982o77455K78355q57949J038191n21860
8303i53360K66904L01531o72520J0197J452914j001273j346047N60618K243043
8294H62007j951755J114114j301791J48099O86419O1824K20799j018889J913493
$$ plain form
8359 -919881 -2087267 -483323 -1053456 -851419 -160415 72475 -880855 -824710 293846
8350 293846 -2036429 -1348291 -835905 -973145 -1480757 -763238 -403634 -742541 -1713372 -1349832
8340 -1349832 -1389137 -1676917 -1242472 -15656 1080673 -1182433 668295 -738214 -945783
8331 -945783 -1117755 -1590624 -1993866 -964903 -631579 481161 677056 -81930 -1488871
8322 -1488871 1007137 -1598114 -406191 -633215 -507453 -119043 10973 -1244910 -256301
8313 -256301 -949436 -1755202 -1112265 -968624 -212642 -890097 -611742 -1469691 -431500 -953360
8303 -953360 -686456 -384925 -1057445 -1047248 405666 -595607 -1941654 -1381036 862007
8294 862007 -1089748 24366 -1277425 -1129326 -442907 -381083 -160284 -1179173 734320
8285G34320j170322l56739J83496j122921K41291P13704j221088J27832R29587
8276i40840M36119o83598J02387l76046Q10097O19654o21313r33152J818466j012840
8266g81066J942657r81367n73482M3713q92830J008578j073931M40494J865949
8257I98715k001209J45690k93652L53578l27722M10230r08251O59824j10843P30927
8247c42713j679039N40250J083742J74009r7033N13007r28333k74291R47246o43070
8237g06225l18225J329218k82113q6793K09606j533911j40882P62201m7923N33280
8227b81767o81285J101789q88536J303613q93236m00267R52835j899022K038017
8218C52141m82409j052952k02823J138175l57365Q46625p48850M86045k178315
$$ plain form
8285 734320 -436002 -792741 -609245 -1732166 -1490875 -777171 -1998259 -1870427 -940840
8276 -940840 -504721 -1188319 -1085932 -1461978 -651881 -32227 -653540 -1586692 231774 -781066
8266 -781066 1161591 180224 -393258 -349545 -1242375 -233797 -1307728 -867234 998715
8257 998715 -1002494 -856804 -1150456 -796878 -1124600 -714370 -1622621 -962797 -1073640 -342713
8247 -342713 -2021752 -1481502 -397760 -223751 -320784 192223 -736110 -1010401 -63155 -706225
8237 -706225 -1024450 304768 22655 -64138 145468 -1388443 -1529325 -767124 -815047 -281767
8227 -281767 -963052 138737 -749799 553814 -339422 -739689 213146 -1685876 352141
8218 352141 -130268 -1183220 -1386043 -247868 -605233 241392 -507458 -21413 -2199728
8209b199728J057197J90576j176680K882132j303805l91168J274290j612536n2310
8200a332032J296970p85112M6331N78650m48993J952294r35168O26094p241989
8191f242955N255959j003758J604747O2689K89428j208978q63487J15338J326560
8182f64457j599671Q44093J170668n52110j108706N70236p17052R40004J361615
8173B44620j224489p28576R1350k61271J346275P55270j204827q035j22147O20240
8163d91590j120241J11972K004142m17892q0699r9141l25008j158916n67987K251104
8153A05744j279544J609300o04605r4284k451382J535074J07584Q01597J97923
8144g2593l45962r62470P7611p0432J011236m29836n07989n09047J073847m49137
$$ plain form
8209 -2199728 -1142531 -951955 -2128635 753497 -550308 -941476 332814 -1279722 -1332032
8200 -1332032 -35062 -820174 -773843 -195193 -644186 1308108 372940 999034 -6242955
8191 -6242955 -986996 -1990754 -386007 -323318 -33890 -1242868 -2106355 -1991017 -664457
8182 -664457 -2264128 -1420035 -249367 -801477 -1910183 -1339947 -2056999 -1116995 244620
8173 244620 -979869 -1708445 -1617095 -1878366 -532091 223179 -981648 -989683 -1111830 -491590
8163 -491590 -1611831 -1499859 504283 86391 5692 -93449 -418457 -1577373 -2145360 105744
8153 105744 -1173800 435500 -169105 -263389 -2714771 -1179697 -1072113 -270516 -72593
8144 -72593 -418555 -1381025 -1303414 -1373846 -362610 -792446 -1300435 -1809482 -735635 -1184772
8134a184772p5047J295595J66345q60001j332896K525488j299711Q70064o19575
8125e14510M33686j504834P68754m29907J168240q99918n87202K64865Q9318N55
8115a210953Q11950p06761O63878j376389J685396n9001j173319p36834L94454
8106a707579J284024j253375N99238j31744P73875j258965k32379J71349K55798
8097a499758N67318o13377R6987p0192Q7786P59002R17597q56489L40061p67046
8087a038111J09947o74025O91628J322892j269862m6175L87784J123707j403552
8078g95767p08793Q18326k93192m01066Q21311O61125j01686j684180J907341
8069B23419p12203o89218J18101Q15115o30163J514682j291936q66666Q19820
$$ plain form
8134 -1184772 -1259819 35776 202121 -657880 -1990776 534712 -764999 105065 -514510
8125 -514510 -80824 -1585658 -816904 -1246811 -78571 -978489 -1565691 -1300826 -1211508 -1210953
8115 -1210953 -399003 -1105764 -441886 -1818275 -132879 -191880 -1365199 -2102033 -1707579
8106 -1707579 -423555 -1676930 -1077692 -1209436 -435561 -1694526 -1926905 -1755556 -1499758
8097 -1499758 -932440 -1545817 -1448830 -1519022 -1431236 -672234 245363 -611126 -271065 -1038111
8087 -1038111 -928164 -1602189 -910561 412331 -857531 -903706 -515922 607785 -795767
8078 -795767 -1504560 -686234 -979426 -1380492 -559181 101944 258 -1683922 223419
8069 223419 -488784 -1178002 -1059901 -244786 -874949 639733 -652203 -1518869 -699049
8060f99049n81180L5218O86260j31321j7837J420228r20797p01846j30443p37142
8050a777909J092297o16711J210368o49389J75999j91212M07666n51793R79484
8041G8800n09560p28952J496385o35962n66829R67809o92677j233364J224691
8032e99659q86157M99619J23375p6916m27225R29215L60782j449298J106087m20969
8022h41146m94320J36579J39744J04364o91718n27700Q15341R67155j129179J306593
8012b14287j232436M90862J362051j485569R7247p4831L61136L5807j420228J083878
8002i96370N4800k17654M18195J560984o92877j480684O29804q15678K44252k89922
7992a585150R11558O77956o54143O64L92022m57664j008932J210891P6646k157439
$$ plain form
8060 -699049 -1280229 -1245011 -558751 -690072 -707909 712319 -208478 -910324 -1040767 -1777909
8050 -1777909 -685612 -1302323 -91955 -741344 -565345 -756557 -348891 -900684 78800
8041 78800 -430760 -1159712 336673 -299289 -866118 101691 -590986 -1824350 -599659
8032 -599659 -1485816 -986197 -862822 -939738 -1366963 -437748 -76966 -1526264 -420177 -841146
8022 -841146 -1335466 -1198887 -1059143 -954779 -1646497 -2174197 -1358856 -391701 -1520880 -214287
8012 -214287 -1446723 -955861 406190 -1079379 -982132 -1056963 -695827 -660020 -2080248 -996370
8002 -996370 -941570 -1159224 -741029 819955 127078 -1353606 -723802 -1539480 -1295228 -1585150
7992 -1585150 -673592 4364 -649779 -649115 -257093 -714757 -1723689 -512798 -436152 -2593591
7982b593591K512771j748408J830369k347303Q64943J89092l35013O20619L82175
7973f24346Q1864j071575J248586N37249p80208j42003p82622K36923O21847J46777
7963e27508j06319O47316o7573o55233m36992k72974p60502J585973N46456n38167
7953e85523Q7662O22016l90642L62307R1480j376964l06675J74367J708775j701338
7943a314535M44526l65668J38819l42784P65265k67464K8532r55447J78095P37574
7933i53087K49670o39472N25386J81260j878414r78468L001557k22237j133199
7924a847004R34576k96968J6201j86207R079K77190o26559J211681J155080o21578
7914B5491l51914L8924p47411l32816n79334J073096M39731j132302J028989R61
$$ plain form
7982 -2593591 -80820 -1829228 1141 -2346162 -1481219 -1292127 -1627140 -1006521 -624346
7973 -624346 -542482 -1614057 -365471 171778 -608430 -750433 -1533055 -1296132 -674285 -527508
7963 -527508 -633827 13489 -54084 -709317 -1146309 -1419283 -2179785 -593812 -47356 -585523
7953 -585523 -497861 124155 -266487 95820 187300 -1189664 -1496339 -1321972 386803 -1314535
7943 -1314535 -870009 -1235677 -1096858 -1439642 -674377 -941841 -913309 -1868756 -1690661 -953087
7933 -953087 -703417 -1342889 -817503 -636243 -2514657 -3493125 -491568 -713805 -1847004
7924 -1847004 -912428 -1209396 -1193195 -1379402 -1370323 -1093133 -1719692 -508011 647069 25491
7914 25491 -326423 -287499 -1034910 -1367726 -1947060 -873964 -434233 -1566535 -537546 -536585
7904e36585r1012j521533R48767m14133J407777o77773N73755n47747N0347n36285
7894a344422o79467M26536l09830q81437J896524r3691N50388l17038Q80795j700955
7884a572597Q98866m71275L79904o70300J126960J19101j144167m17637J908437
7875A57292j004842M88532k06202q98433L76556n63733M71487M02763n71900n81850
7865a930330J207114r72961J103832r10857P20868J30888o51033Q17953N59942
7856G5416k437414J109352k059884J721059k4548r53544J275856N5150N08807
7847g29750J375655j513768N37408m40340R21530p14013p63948n1328J321963
7838e6591j868652Q68199j000287J661090q48322l70391o84479P93909J184737
$$ plain form
7904 -536585 -627597 -2149130 -1200363 -1614496 -206719 -884492 -310737 -858484 -808137 -1344422
7894 -1344422 -2023889 -1597353 -1907183 -2788620 -892096 -985787 -435399 -752437 128358 -1572597
7884 -1572597 -673731 -1145006 -765102 -1435402 -308442 -189341 -1333508 -1751145 157292
7875 157292 -847550 -359018 -565220 -1463653 -1087097 -1650830 -1179343 -776580 -1348480 -1930330
7865 -1930330 -723216 -1696177 -592345 -1503202 -782334 -651446 -1302479 -484526 75416
7856 75416 -2361998 -1252646 -3312530 -1591471 -1616019 -2569563 -1293707 -1238557 -729750
7847 -729750 645905 -867863 -330455 -770795 150735 -563278 -1327226 -1378554 -56591
7838 -56591 -1925243 -1057044 -2057331 -396241 -1244563 -1614954 -2299433 -1505524 -320787
7829c20787r63111J850473j317738Q6867o41455m0157m26883R35359M4958p7260
7819h69734M70072n90054J302679n51002j021575m65780J473470j568450k45218
7810b065592J441039k07942M4238m1956N55656L48093j371689P73295o82603k99903
7800a507364q84912J701714R94343m78139o77303n54765n67388J542900n87231
7791a018145M89377P2921p8506j31934M97424m73521p81364Q04460J28243m14161
7781i05206j215314J418619j155640J717579j286415M28430K79282N02390n19610
7772g35885p27883R34365N666o2039q86041J117840q36222J782806l90817j187549
7762i85759L79549j355294J442452L15167q47546O07392k266954K088975J42986
$$ plain form
7829 -320787 -1283898 566575 -751163 -664296 -1305751 -1345908 -1772791 -837432 -792474 -869734
7819 -869734 -399662 -989716 312963 -238039 -1259614 -1725394 -251924 -1820374 -2065592
7810 -2065592 -624553 -832495 -788257 -830213 -274557 73536 -1298153 -524858 -1207461 -1507364
7800 -1507364 -2392276 -690562 303781 -174358 -851661 -1406426 -1973814 -430914 -1018145
7791 -1018145 -528768 -455847 -534353 -666287 -168863 -642384 -1423748 -619288 -491045 -905206
7781 -905206 -2120520 -701901 -1857541 -139962 -1426377 -997947 -718665 -216275 -735885
7772 -735885 -1463768 -529403 -523737 -585776 -1471817 -353977 -1190199 592607 201790 -985759
7762 -985759 -606210 -1961504 -519052 -203885 -1051431 -444039 -2710993 -622018 -479032
7753d79032j635217J875539k383421J227658J096705j510610J004589J54793n15541
7744a164537j399806K500160j941348J010819P68934P24059k89808j640706K90570
7735a141663K44531p11340N1555K96610Q277j66641k91921J750712j452332K59534
7725a152678P00864j609544J026646J82070j09462L62984M98865m18507J20380
7716c98382J69569l98798M60479j745111J029354J66378O9295K73796k79823o33081
7706a286324n22904J294231m72789J029819q20061l66417O27362N15080J18550
7697A16547p99853r43724q90490P72788J320441o3844N54365k110315L97859J91775
7687a454451N90784m35350J366944j565914L46599j96672j21647P82178j054779
$$ plain form
7753 -479032 -2114249 -238710 -2622131 -1394473 -297768 -1808378 -803789 -648996 -1164537
7744 -1164537 -2564343 -64183 -2005531 -994712 -225778 498281 208473 -1432233 -1141663
7735 -1141663 -897132 -1608472 -1556917 -1260307 -1252030 -1418671 -1710592 40120 -1412212 -1152678
7725 -1152678 -451814 -2061358 -1034712 -852642 -962104 -599120 -100255 -518762 -398382
7716 -398382 -228813 -627611 -167132 -1912243 -882889 -716511 -647216 -373420 -653243 -1286324
7706 -1286324 -1809228 -514997 -987786 42033 -778028 -1144445 -517083 -2003 116547
7697 116547 -683306 -1627030 -2517520 -1744732 -424291 -488135 66230 -2044085 -1646226 -1454451
7687 -1454451 -863667 -1299017 67927 -1497987 -1151388 -1348060 -1469707 -687529 -1742308
7678a742308J068974j97992o61998L96209M66287l43828L12613k17176M21069
7669d98150q9072n75106L50611o60393m151J22258O89521J77187K91002q31092
7659a027385o2123r73401J128935r84141K087798j661572J305685o00202q8711
7650h75117o80638J293179N63432o46310n29375q3109r52555J869349l22175J091794
7640G28475j093100j771L32921j718150J423326l42350p48076P36750p30636k87414
7630a700025L50347J44306J283898k433020J707781k183515K278769j982410K641887
7621A08018r74869N51962o83178K95665P05921r79878J95505o13379N99075N6109
7611g39049j216966J088726J92543o55317O40446l06372j78686j137268J236441
$$ plain form
7678 -1742308 -673334 -871326 -1533324 -1137115 -670828 -1014656 -702043 -919219 -498150
7669 -498150 -587222 -1162328 -811717 -1472110 -1476261 -1354003 -664482 -487295 -196293 -1027385
7659 -1027385 -1089508 -2062909 -933974 -1918115 169683 -1491889 -186204 -786406 -875117
7650 -875117 -1555755 -262576 300856 -345454 -874829 -957938 -1910493 -41144 -363319 728475
7640 728475 -364625 -366396 -33475 -1751625 -328299 -670649 -1418725 -681975 -1412611 -1700025
7630 -1700025 -1349678 -1205372 78526 -2354494 -646713 -2830228 -551459 -2533869 108018
7621 108018 -866851 -314889 -998067 -702402 3519 -976359 -780854 -1394233 -795158 -739049
7611 -739049 -1956015 -867289 -674746 -1330063 -689617 -995989 -1174675 -2311943 -1075502
7602a075502J174990j723309O72961n15090l03523K197560j936451J780265j946411
7593a674510J074049m1232n10912k11954m41281J090452J92833N29606n48017
7584e40966J058544j045962j029452p20520J373099N57027k15996j64533k42054
7575i70813o29739O68279n49383O91691m03033J212173j589955J816604p29698
7566d83874k39206M06480p1078n06625l17038R16619o79199P02437j087371N82124
7556g76731r27499J057661n48737J936379j808261j339017J035016J170075M0077
7547a61037p75542O8998n3055L75841p40531M25118j572949J911415J741165j573605
7537c54182N47534n02509N24509j597359m4382K9140j47800J361341r49751O26059
$$ plain form
7602 -1075502 99488 -1623821 -950860 -1465950 -1769473 428087 -1508364 271901 -1674510
7593 -1674510 -600461 -641693 -1152605 -1364559 -1805840 -715388 -522555 7051 -540966
7584 -540966 517578 -528384 -1557836 -2278356 -905257 -348230 -564226 -728759 -970813
7575 -970813 -1600552 -932273 -1481656 -789965 -1192998 19175 -1570780 245824 -483874
7566 -483874 -723080 -316600 -387678 -894303 -1211341 -294722 -973921 -271484 -1358855 -776731
7556 -776731 -1704230 -646569 -1195306 741073 -1067188 -2406205 -1371189 -201114 -161037
7547 -161037 -936579 -867581 -920636 -544795 -1285326 -860208 -2433157 -521742 1219423 -354182
7537 -354182 193352 -309157 215352 -1382007 -1426389 -1397249 -1545049 -183708 -1133459 -507400
7527e07400L92320q69866J87959q85925n88488J821989J13626P05309j220762
7518h51238J152403j233798k43306R39174n08733M00168r7724j12119k80768q70128
7508a706069M97580O07280j241066J980304q09517j832228J247224N2318K2342
7499a181832k23496o39874R18409j47903N45567j674882J825135J09115j343777
7490a813538K40749J042117k92705M14698j492751L90486l37665r10240J230483
7481a528366j04811J255718j32114o67258j77727M69786J63325n22535O34737
7472f09245K71886j996356R61809k59063J504175j344265k14441J684472J24193
7463A23165j971169o69734K010321r73662O45596L44163j340401J023637k87373
$$ plain form
7527 -507400 -115080 -984946 -796987 -1682912 -2271400 -449411 -335785 369524 -851238
7518 -851238 301165 -932633 -1175939 -236765 -745498 -345330 -443054 -555173 -835941 -1706069
7508 -1706069 -1208489 -601209 -1842275 138029 -671488 -2503716 -1256492 -1204174 -1181832
7499 -1181832 -1405328 -2045202 -1126793 -1274696 -729129 -2404011 -578876 -469761 -1813538
7490 -1813538 -1572789 -530672 -823377 -408679 -1901430 -1510944 -1848609 -2758849 -1528366
7481 -1528366 -1633177 -377459 -509573 -1176831 -1354558 -884772 -721447 -1243982 -609245
7472 -609245 -337359 -2333715 -1371906 -1630969 -126794 -1471059 -1685500 -1028 123165
7463 123165 -1848004 -2517738 -507417 -1481079 -835483 -491320 -1831721 -808084 -1095457
7454a095457p2105o41850L90481n9051L25537j335069K805475j527392P70115
7445d39316q99014k92903J601379o22376L83385n81238p94257R74024m14302M74840
7435f09778l84146l90738M60367k56862q56884R63567Q04499K04235R633j770044
7425a826151N18911n36269q47788J569457k53223L66993q17986J610871k96456
7416e11641P57318j163004J017793j70522K21825j96699l52092p95911J081557
7407a11376j534363J410920r57523L09792r5429j265528J967713N00148j024433
7398h00079m06514J15118J168502p19441j218055J791536j753343Q60618K00586
7389g61072P46867M09097j337620K64456m67517P30878o50957J302701M07801
$$ plain form
7454 -1095457 -1167562 -1809412 -1418931 -1477982 -1152445 -2487514 317961 -1209431 -439316
7445 -439316 -1338330 -1631233 -29854 -652230 -268845 -850083 -1644340 -670316 -1084618 -609778
7435 -609778 -993924 -1384662 -924295 -1181157 -2038041 -1074474 -269975 -65740 -56107 -1826151
7425 -1826151 -1307240 -1843509 -2691297 -1121840 -1375063 -1008070 -1826056 -215185 -511641
7416 -511641 245677 -917327 100466 -70056 151769 -44930 -397022 -1192933 -111376
7407 -111376 -1645739 -234819 -1192342 -882550 -977979 -2243507 -275794 224354 -800079
7398 -800079 -1206593 -1091475 77027 -642414 -1860469 -68933 -1822276 -961658 -761072
7389 -761072 -14205 394892 -942728 -678272 -1145789 -414911 -1065868 236833 644634
7380F44634j144704j058369J490071L12376p71180r92337J216377J1765j64057
7371d55424p91733R79629k857617J673876n67677J603009r15407J603750j952961
7362a680555Q98093Q64586p63235J11245n79648j194987J526879l69912q88192
7353b075726P00885M69647J320533p73725L79473N48678j171112q48059P78425
7344f70981J035580j291216L55079j010815Q38024r19974P10210n1822J897800
7335H91885r31383j95606j170959N42233R24236j611588J261579j343938J120267
7326e13274l54519M85467q48098K09380p99015J408058J81498o01917K33023o06768
7316a206165J333821j820813P14285j128276K084959j575958J142657j014408
$$ plain form
7380 644634 -500070 -1558439 -68368 244008 -527172 -1519509 -303132 -291367 -455424
7371 -455424 -1247157 -267528 -3125145 -1451269 -2018946 -415937 -1331344 272406 -1680555
7362 -1680555 -782462 82124 -681111 -569866 -1149514 -2344501 -817622 -1187534 -2075726
7353 -2075726 -1374841 -905194 415339 -358386 21087 569765 -601347 -1449406 -670981
7344 -670981 364599 -926617 -571538 -1582353 -744329 -1664303 -954093 -1005915 891885
7335 891885 -39498 -235104 -1406063 -863830 60406 -1551182 -289603 -1633541 -513274
7326 -513274 -867793 -382326 -1230424 -1021044 -1820059 -412001 -230503 -832420 -599397 -1206165
7316 -1206165 127656 -1693157 -978872 -2107148 -22189 -1598147 -455490 -1469898
7308a469898K52654J460788j571868K39005J88066n99471M47435r8317Q23084
7299c28522r53662j013891J405113j78431j37212K068370m26813j426037J082477
7290I1392q37282O02158q83269o69699K24052N76269J10504p34188M23879M24406
7280f71778j022903J33744J292158k36389L3149j055340R54033p21000J43002
7271a151324o08359K05350O70613j737720J576224p93174J265827K53748r47903
7262a266718n38842m7123J774576j047914K32505J27836L07598J60387p74495
7253a072190j62968q49117K313674K60752K96715j147607j08730J501403j914164
7244h82232J87498K43565j036706J113879M99528j554657J410633p95325k75154
$$ plain form
7308 -1469898 -1217244 243544 -1328324 -1089319 -901253 -1500724 -1053289 -1151606 -328522
7299 -328522 -1282184 -2296075 -890962 -1069393 -1206605 861765 434952 -991085 91392
7290 91392 -745890 -143732 -1027001 -1696700 -1472648 -896379 -785875 -1520063 -1096184 -671778
7280 -671778 -1694681 -1560937 -268779 -505168 -472019 -1527359 -573326 -1294326 -1151324
7271 -1151324 -1759683 -1554333 -883720 -2621440 -1045216 -1838390 -572563 -318815 -1266718
7262 -1266718 -1805560 -1852683 -78107 -1126021 -893516 -765680 -458082 -297695 -1072190
7253 -1072190 -1235158 -2084275 229399 490151 786866 -360741 -469471 1031932 -882232
7244 -882232 -694734 -451169 -1487875 -373996 125532 -1429125 -18492 -813817 -1088971
7235a088971J795538q38795q92041J112528J42547J53246j849364K271703j159260
7226c52869J011602M64501n85946K60083o54325O91031M38199j527120Q80497
7217F25653l08510m00859N20574p83557j81295J57588o688K36896J18399m05396
7207d27195j50980q1147L1133R98782j001190O6335q5153J716301j739138J367370
7197F95118m15900j24098p81584l17262P34990Q31161j950171J147948o5711k59339
7187e04848P67624M96829n73099m35991k82667N58067j079952Q83934J43655J84997
7177A58549o85218O81818l70112j274370n71184K100087o39790M44424P369q85677
7167a034104N37590q14796N60000J262594m98047j190338N2142k67332Q11915
$$ plain form
7235 -1088971 706567 -132228 -1024269 88259 230806 384052 -1465312 806391 -352869
7226 -352869 658733 1123234 537288 797371 143046 834077 1272276 -254844 625653
7217 625653 317143 -83716 436858 -346699 -527994 -370406 -377094 -140198 -21799 -427195
7207 -427195 -578175 -659322 -628189 370593 -630597 -564262 -649415 1066886 -672252 695118
7197 695118 279218 155120 -626464 -943726 -208736 622425 -1327746 -179798 -245509 -504848
7187 -504848 262776 759605 186506 -249485 -532152 25915 -1054037 -170103 -26448 158549
7177 158549 -526669 155149 -214963 -1489333 -2060517 39570 -600220 -155796 -148427 -1034104
7167 -1034104 -496514 -1311310 -751310 511284 13237 -1177101 -1124959 -1392291 -580376
7158e80376M49019n72344m81895K20333m89636J360071n15435q637Q34681r87820
7148g72039j91179P22724j236467J322989m96132l21778k73950Q06513r89346
7139a428665J89463K823357j957897q99046J032084j853741R07249J541311j83880
7130A70235J310760k320845j78254Q04957l70322J014507n01716o23902N36840
7121a57740j158042K386643j469575Q40880o18519J428827j398451n93153K78100
7112d61030J163082o27358l25839K13408n06850J033086O193p66682o49020L48358
7102e72652O12675O11195L61647j759839J689178j182816Q77870J48873j858996
7093a072865J018278k06641P5779L5463n2767N7392J080757l21084p00991K199159
$$ plain form
7158 -580376 -131357 -703701 -1185596 -965263 -1454899 -94828 -610263 -618900 215781 -772039
7148 -772039 -963218 -240494 -1476961 -153972 -650104 -971882 -1245832 -439319 -1428665
7139 -1428665 -1239202 1584155 -373742 -1272788 -240704 -2094445 -1187196 354115 170235
7130 170235 1480995 -839850 -1018104 -213147 -583469 431038 -70678 -694580 -157740
7121 -157740 -1315782 1070861 -398714 442166 -176353 1252474 -145977 -739130 -461030
7112 -461030 702052 74694 -251145 -37737 -544587 488499 494692 -271990 -921010 -572652
7102 -572652 40023 651218 1012865 -746974 942204 -240612 637258 786131 -1072865
7093 -1072865 -54587 -261228 -185449 -149986 -202753 -145361 935396 614312 -86679 2112480
7083B112480k057790J191445k434988J441440o51418J091661n95810O57504N35674
7074A290198p76345M14215q70236Q95662k07399k58708q99975k56062J759370
7065A090720m59534M92406M00387p40716P5878K80884J478418j571088q29014
7056B18341N57196N01266q60188M46577P64298O58856L46010o95506j38049K5784
7046A824585m32436N45262J254403j149283J513014j129702n94551j303168N75038
7037A103162J089400p71540J369452J50817j127546J189918j204751o54263N31981
7028A676630R07258n83037K310206j482843R61204k8839m22917r12158J148383
7019C573887m7030j066136K712932j574937J324229l2597j399494Q60934Q75180
$$ plain form
7083 2112480 54690 1246135 -1188853 252587 -398831 692830 97020 754524 1290198
7074 1290198 513853 928068 57832 953494 746095 487387 -412588 -668650 1090720
7065 1090720 631186 1123592 1523979 783263 859141 1140025 2618443 1047355 218341
7056 218341 775537 1276803 416615 863192 1627490 2286346 2632356 1936850 1798801 1824585
7046 1824585 1392149 1937411 3191814 2042531 3555545 2425843 1831292 528124 1103162
7037 1103162 2192562 1421022 2790474 2941291 1813745 3003663 1798912 1144649 1676630
7028 1676630 2583888 2000851 4311057 2828214 3789418 3760579 3337662 2425504 3573887
7019 3573887 3526857 2460721 5173653 3598716 4922945 4890348 3490854 4351788 5226968
7010E226968P88102Q7150o36391J508635J07997L71762J514630J126954J230816
7001A1326623J582205R4944j178439J10173p63546o17532N43583j264249j140962
6992H692800K82233K13695L69772k58210J576981q26325M21616k7615J499587
6983A1944534p67994K156735r99945K520988K943167J339427K415462L575178
6975B5127552K922598J255763M01938o86639k67299l21279J357813L15574R17794
6966C1023815L459300L944410M390905Q286571J1720014J8090979J9043179K1467129
6958A21426302J7482602J2048058L437877M162621L295423M480537J795824m897850
6950A63231394j3539945j6292545j7952296j4059373r610294j0728276n179375
$$ plain form
7010 5226968 6015070 6102220 5465829 6974464 7082461 7454223 8968853 10095807 11326623
7001 11326623 12908828 13003772 11825333 11935506 11171960 10554428 11098011 9833762 8692800
6992 8692800 8975033 9188728 9558500 9300290 10877271 10050946 10472562 10444947 11944534
6983 11944534 11176540 13333275 12333330 14854318 17797485 19136912 21552374 25127552
6975 25127552 28050150 29305913 29707851 29021212 28753913 28432634 29790447 30106021 31023815
6966 31023815 34483115 38427525 42818430 51105001 62825015 80915994 99959173 121426302
6958 121426302 138908904 150956962 154394839 158557460 161852883 166333420 168129244 163231394
6950 163231394 149691449 133398904 115446608 101387235 91776941 81048665 75869290
6943G5869290m054758j383085J857771J810332N181787Q466135J3674965J8794991
6935A20217428L1107309L8924111M4857139M0576586K7969182J3713504R589029
6928C26954288P477277N320237m356877k2375786l5510638m1064041m0440455
6921A96004005l0725786k7131447j7958040j7543142r052741p857122n051614
6914H0684113k519061K33997J473562N646499P479283J4061300J6685945K0708917
6906A44454555J9238403J6653295Q542476M754912M557970n99045o681209j3793010
6898A77128347k1662068k2918109k1394947j7034272j3515860j0871851q328203
6891F1403037p715556l417265n597699l309634P60489j320150M20944L26390Q06143
$$ plain form
6943 75869290 71814532 70431447 72289218 74099550 79281337 87747472 101422437 120217428
6935 120217428 151324737 190248848 235105987 275682573 303651755 317365259 326954288
6928 326954288 334431565 339751802 335394925 313019139 277508501 236444460 196004005
6921 196004005 165278219 138146772 120188732 102645590 93592849 85735727 80684113
6914 80684113 78165052 78399049 79872611 85519110 92998393 107059693 123745638 144454555
6906 144454555 163692958 180346253 188888729 193643641 198201611 197602566 190921357 177128347
6898 177128347 155466279 132548170 111153223 94118951 80603091 69731240 61403037
6891 61403037 53687481 50270216 44672517 41362883 42123372 40803222 41224166 41550556 42356699
6882D2356699j425549j942999m204610l409460j587949p27932l131340j075705
6874B4851155q99174j674545r8663j487360p33260N13127k391409k39013J223098
6865A9063956j110969k11715j909079N20404J154185M64265O03677J327812o48243
6856A9254293j411517k86808n64759r58257j689895j308965j27111j657383j46561
6847A1103037m30566l3390j108387n79074p96004M82905j010556J298598k26765
6838H699798p18691K80426k568457N68494J256872j194912J836487K03819j342976
6829G020860r9779N98172j297001J377455j921246L26224L6953J108133j168985
6820E980786n07393K53533p99374J77104j078782J23623K11955M78375j117899
$$ plain form
6882 42356699 40931150 38988151 34783541 31374081 29786132 29058200 25926860 24851155
6874 24851155 23951981 22277436 22178773 20691413 19958153 20471280 18079871 17840858 19063956
6865 19063956 17952987 17741272 15832193 16352597 17506782 17971047 18574724 19902536 19254293
6856 19254293 17842776 17555968 16991209 16032952 14343057 13034092 12906981 11249598 11103037
6847 11103037 10672471 10639081 9530694 8951620 8155616 8638521 7627965 8926563 8699798
6838 8699798 7981107 8261533 5693076 6261570 7518442 6323530 8160017 8363836 7020860
6829 7020860 6921081 7519253 6222252 7599707 5678461 6004685 6041638 7149771 5980786
6820 5980786 5473393 5726926 4927552 5104656 4025874 4149497 4361452 4839827 3721928
6811C721928j071855J288290L6513p94599L52095l33919J96079J08514j66136
6802C336910j79929j655356J927179j85472n67228O97750j346432J062009M25044
6793C514475j423169J560250j078358o9891l87054n55159O79225J010283O24387
6784C874989j580283L07480j178931M68625K55520m4540Q43668q90747j653541
6775D02240K332303q08067Q79443o90250p8923r58800J201301N598M13941o94651
6765B004135m50281P44130m74238q7250L04017o31580n67663J186653K23519j926122
6755C25320J537940J25122n52074M88148j741630J259333n86731M63346M37110
6746A755884p29415J799115j017892j11833O37143o53358p80257J442724j449545
$$ plain form
6811 3721928 2650073 3938363 3974876 3180277 3532372 3198453 3394532 3503046 3336910
6802 3336910 3156981 1501625 3428804 3243332 2676104 3373854 2027422 3089431 3514475
6793 3514475 2091306 3651556 2573198 2503307 2116253 1561094 2240319 3250602 3874989
6784 3874989 2294706 2602186 1423255 1891880 2147400 2102860 2946528 2055781 402240
6775 402240 2734543 1926476 2805919 2115669 2036746 1077946 2279247 2284845 2698786 2004135
6765 2004135 1553854 2297984 1823746 1736496 2040513 1408933 841270 2027923 2251442 325320
6755 325320 1863260 1988382 1436308 1924456 182826 1442159 855428 1318774 1755884
6746 1755884 1026469 2825584 1807692 1695859 2333002 1679644 899387 2342111 892566
6737H92566J462014l8179m03631K06142k109802M28526J563760j872565J367034
6728A495865M13133o17627m23095K40666p87033J545177j983870O649R04703l95551
6718C99017j024811K249692j619702N46803L09827r06519J72849n35481J408718
6709A000393j041544P97751Q57211k48575j57409k69178j689526J723669J13924
6700A086716j44306k31886J012243j142601O00346Q23387j904849L74840j07966
6691C65924k03676M83570M185M98986j017756K68696k11155J477878j360031O90539
6681I97160p45147L59372O79154k334395K126795j268897r70285J529700l71099
6672B358N60215J128301j296295m7448N09560m21235n97622N55245Q75766j107996
$$ plain form
6737 892566 2354580 2316401 1912770 2118912 9110 437636 2001396 128831 1495865
6728 1495865 1908998 1291371 868276 1108942 321909 1867086 -116784 -110135 794568 399017
6718 399017 -625794 1623898 4196 550999 860826 -45693 127156 -408325 1000393
6709 1000393 -41151 756600 1613811 1365236 1207827 938649 -750877 972792 1086716
6700 1086716 942410 710524 1722767 580166 1180512 2003899 99050 473890 365924
6691 365924 162248 645818 650003 1148989 131233 399929 188774 1666652 306621 997160
6681 997160 252013 611385 1290539 -1043856 1082939 -185958 -1156243 373457 2358
6672 2358 562573 1690874 394579 347131 856691 435456 -162166 393079 1268845 160849
6662A60849r3762Q05978r73840j52941J280083j101087P73441k01779J147401
6653A644343q77283J154530j479888L26437j341641J955635n88454p5972o25184
6644I2523r66626Q88208J35567N87089K89159p01195J164343N81552j867061k53447
6634d9888J038134J67332n31290R38763N5549J324418j129508R25317j667939
6625A070888n46162p60774J893653N16099k447063Q50002J25586N12663j762368
6616e47476K041139q34159P15353n23786J42326P12400J45637j859977O00656
6607E92113L26252m97760R89085R6421O43138Q9532j927286J384683J104049k127462
6597F72765j09416O15335j773675J16451n02285J059367R99918j103947n43143
$$ plain form
6662 160849 67087 873065 -100775 -253716 1026367 -74720 698721 496942 1644343
6653 1644343 767060 1921590 441702 768139 -573502 1382133 793679 717707 92523
6644 92523 -874103 14105 149672 736761 1025920 324725 1489068 2070620 203559 -49888
6634 -49888 988246 1155578 624288 1563051 1618600 2943018 1813510 2738827 1070888
6625 1070888 524726 -236048 1657605 2173704 -273359 576643 702229 1214892 -547476
6616 -547476 1493663 659504 1374857 851071 993397 1705797 1851434 -8543 592113
6607 592113 918365 420605 1409690 1506111 2149249 2238781 311495 1696178 2800227 672765
6597 672765 563349 1178684 -594991 -478540 -980825 78542 1078460 -25487 -568630
6588e68630J984491j597593l58792J502649j572078R61790q38514J872918j724874
6579c38633J685509j248445m08207Q9002P92879j456171J358789j705882K064001
6570H32842o03914j90586L37728q23544j038475K450129j303061M72276k40086
6561a06691N70238O29242l01643j011924J38823L27206L66840r21304J156139
6552H46926j817773K254953q12447k94422n03147L68706M39148J81652n78606
6543H4990o5876J27085K3126J270244j199891J049884p5486j567825m1288k12319
6533f07356L79177j33620K507357j281907N61046j729188Q52968p91375Q42076
6524E99178M71699K03672O39103o71352j005175M39378J285639j047710J76668
$$ plain form
6588 -568630 1415861 -181732 -540524 962125 -609953 351837 -486677 1386241 -338633
6579 -338633 1346876 98431 -309776 -220774 572105 -884066 474723 -1231159 832842
6570 832842 228928 38342 376070 -447474 -1485949 964180 -338881 133395 -106691
6561 -106691 463547 1092789 791146 -220778 -81955 245251 612091 -309213 846926
6552 846926 -970847 1284106 471659 177237 -325910 42796 481944 663596 84990
6543 84990 19114 146199 169325 1439569 239678 1289562 1214076 -353749 -395037 -607356
6533 -607356 -228179 -361799 2145558 863651 1424697 -304491 548477 -242898 599178
6524 599178 1070877 1274549 1913652 1242300 237125 676503 1962142 914432 1091100
6515A091100P28925j152627l73971R45504j618431J745879j247076Q30967n8974
6506H91296n16669J973303j034768K0801j155765q19501J963207j141432L87854
6497E68326j47100o40095J083671j10882P30231j755100J068797N98757r71437
6488D25168r8958J947763r86417m04552K51631Q8564j935637P39083J523282l33329
6478A216598l6554O90840r14948M14123q22571L13290j84076O1548k47750K465245
6468B955745j119735l79810n66274r95728J302643j640924k34354L077085j443812
6459I54836M26014j676211q7949P99679o57492L20292J253453j564028J79197
6450e2209n29455P20553J244218k491576J630545j184773R39523j010888l5871
$$ plain form
6515 1091100 1820025 667398 293427 1238931 -379500 1366379 119303 950270 891296
6506 891296 374627 2347930 1313162 1333963 178198 -641303 1321904 180472 568326
6497 568326 421226 -218869 864802 753920 1484151 -270949 797848 1396605 425168
6488 425168 326210 2273973 1287556 883004 1134635 1223199 -712438 26645 1549927 1216598
6478 1216598 1180044 1870884 955936 1370059 547488 860778 676702 738250 490500 2955745
6468 2955745 1836010 1456200 889926 -105802 1196841 -444083 -678437 2398648 954836
6459 954836 1380850 -295361 -383310 416369 -241123 79169 1332622 -231406 -52209
6450 -52209 -581664 138889 1383107 -1108469 522076 -662697 276826 -734062 -769933
6441g69933Q84933k62943l743o95058M2135J474096j475380J520837k32858q88702
6431d06616K131862j265155o95248R48193k59678Q86740j553008q3570n12883
6422h09363M44353J8240J02680j76173J351806j54209j99984j053227m97263O17343
6412c55797J191348j395154J522355j329145k36996J295663n37200o54420J128292
6403F28946j420678M15731J026155j009272j38133r25307K109483j377189l96384
6394a086648l58274K288678j147766P99927K4003j165888o62320O05091N20139
6385a83058o08898N24082J84022j141715J181447j893126L366885j089583q36324
6376d96268M41843J555459r38423J2502L4012n05095j397330J039317j60651J515288
$$ plain form
6441 -769933 115000 -147943 -151686 -846744 -804609 669487 -805893 714944 482086 -406616
6431 -406616 1725246 460091 -235157 713036 453358 1340098 -212910 -296480 -809363
6422 -809363 -365010 -346770 -244090 -420263 931543 777334 577350 -475877 -973140 -355797
6412 -355797 835551 -559603 962752 -366393 -603389 692274 155074 -499346 628946
6403 628946 -791732 -376001 650154 -359118 -497251 -1422558 686925 -690264 -1086648
6394 -1086648 -1444922 843756 -304010 495917 519920 -645968 -1308288 -703197 -183058
6385 -183058 -791956 -267874 -83852 -1225567 -44120 -1937246 1429639 340056 -496268
6376 -496268 -54425 1501034 562611 575113 609125 104030 -1293300 -253983 -414634 1100654
6366A100654j404913l8087J04165J141651m16912l87632J722126k625453J096010
6357B91609n35209J223162p27185P08181q09620P19590j094607L87915L24809
6348D88645R10573r83351N8801j6998M51257q47139P67775Q01762r82967J064088
6338A712446j449581j108306N80129K2271J466908j45253P00535j822826J54316
6329A10639M63442M52639L27934L44666j729387Q15066J76332k3227K94060O75204
6319A907368r78725Q5439j796367J885962m40667Q96385l628196K617636j020942
6310d72107K093041j167167j17337J97753m22114J02788K65772n0176Q6648p12469
6300a95368J0925K95351l94674J141324m19052N2853Q95499j406342O91453J40572
$$ plain form
6366 1100654 -304259 -342346 -238181 903470 486558 98926 1821052 -804401 291609
6357 291609 -243600 979562 252377 960558 150938 870528 -224079 163836 488645
6348 488645 1399218 415867 474668 457670 908927 61788 829563 1631325 648358 1712446
6338 1712446 262865 -845441 -265312 -243041 1223867 1078614 1779149 -43677 110639
6329 110639 574081 1026720 1354654 1699320 -30067 784999 961331 938104 1232164 1907368
6319 1907368 928643 1014082 -782285 1103677 663010 1559395 -2068801 548835 -472107
6310 -472107 1620934 453767 336430 534183 112069 214857 480629 430453 517101 -195368
6300 -195368 -184443 110908 -283766 857558 438506 491359 1386858 -19484 671969 812541
6290H12541j144383O45900q14965J727886o63885k56687j08705m23715M52830
6281B26817q48730P67710l53487L92251J678107j989635n29991J346767o45580
6272D4229j47709j35482K94156k77823L5644J020237l46783m24846k39529l64544
6262e42450J174657r38853J937752p24269j133720O34245j01045n35463Q17025
6253E87879m02704J346876j851107L54942M68363j74809M91285Q89547j606080
6244A04192O33547j93456m53913J136492M21454m56611J83705M61434r4198j606091
6234A36555J214347P35230j633749p13119J086973j062523M96350O70475K73708
6225A204247p27289L40300J334445l81174m25448J062982P52623k007363K089462
$$ plain form
6290 812541 -331842 314058 -500907 1226979 563094 306407 197702 -226013 226817
6281 226817 -621913 145797 -207690 184561 1862668 -126967 -656958 689809 44229
6272 44229 -103480 -238962 55194 -222629 -186985 833252 486469 61623 -177906 -542450
6262 -542450 632207 -306646 1631106 906837 -226883 407362 306317 -229146 587879
6253 587879 185175 1532051 -319056 35886 504249 329440 820725 1710272 104192
6244 104192 737739 544283 90370 1226862 1648316 1191705 1375410 1836844 1742646 136555
6234 136555 1350902 2086132 452383 -260736 826237 -236286 260064 930539 1204247
6225 1204247 476958 817258 2151703 1770529 1345081 2408063 3160686 1153323 3242785
6216C242785k21292j14352J134640q8984j350410R52442j971060J377271j038159
6207A922881P43814q11304K09451l78429l38991O57442q27864Q1188J911029r47056
6197B222161P80409j279010k05037o15600J216643m16313O20750J214377k418974
6188A119406J612319k34875j163266M5253K41645m69758J506943q52263O73282
6179B478686j752107P30249p60516n19892J286885N84250j777977K268361k61711
6170B276228m59617k70928J483564j460425R38272k66959P7551j257677N81578
6161A641587p16220O35404J93173o66257J404178r4435n44088j54749J53895K65804
6151B118292l78380o63368O77620j45402l1087m29629K037863k551261K209499
$$ plain form
6216 3242785 3021493 2907141 4041781 3952797 2602387 3554829 1583769 2961040 1922881
6207 1922881 2666695 1855391 2064842 1686413 1347422 2004864 1177000 1258188 3169217 2222161
6197 2222161 3002570 1723560 1518523 902923 2119566 1703253 2324003 3538380 1119406
6188 1119406 2731725 2496850 1333584 1378837 1620482 1150724 2657667 1805404 2478686
6179 2478686 726579 1456828 696312 176420 1463305 2047555 269578 2537939 2276228
6170 2276228 1816611 1545683 3029247 1568822 2507094 2240135 2317686 1060009 1641587
6161 1641587 925367 1560771 1753944 1087687 2491865 2397430 1853342 1698593 1852488 2118292
6151 2118292 1739912 1076544 1754164 1608762 1577675 1148046 3185909 634648 2844147
6142B844147l171801K495708k87259J56680r79948J622149k044989J045370J71264
6133A851321o22370j83040l64051M70161q64012L18684J267263j524711K73968
6124F23213M19109O47361o83820Q87303q75403R80284j012358Q22023j77424j515488
6114A14800P82108r2216P94696l82983L51382q74889J214628j933743K319918
6105B293701j789665L40694J005012o17813P21871k590593R0256J586769j137711
6096i7479o96053L056690k436004N72925j410927K48659J055921r38144Q29469
6087A85057J15371n4029J537283j876345K08711J768929k889818J206459M81524
6078F83142p62027R19070r5630j342746J163648J087882j939264J334469n00251
$$ plain form
6142 2844147 -327654 2168054 1880795 2037475 1057527 2679676 634687 1680057 1851321
6133 1851321 1228951 1045911 681860 1152021 288009 606693 1873956 349245 623213
6124 623213 1042322 1689683 1005863 1893166 1017763 1998047 985689 1807712 1630288 114800
6114 114800 896908 804692 1599388 1216405 1567787 692898 1907526 -26217 2293701
6105 2293701 504036 844730 1849742 1231929 1953800 -636793 -546537 1040232 -97479
6096 -97479 -793532 2263158 -172846 400079 -1010848 -762189 293732 -644412 185057
6087 185057 300428 246399 1783682 -92663 116048 1884977 -1004841 201618 683142
6078 683142 -78885 840185 744555 -598191 565457 1653339 -285925 1048544 548293
6069E48293J2339p66201M57292P18122j199115Q58306Q05223l54446j786874M11941
6059b95120L22978q77256J379859n20283K55492J210876j955262k87476K08640
6050e57552K38074L08376K34850k28923M39316j80851J294663m45306q22125n95301
6040c14779R21215k44068M55256m27j009662J798127k058058J078942L56173j270772
6030b88053K4076N30560q13546J002678o29995j21594k6948J63138j1523R32857
6020G61650m53574J59218j29956M92344q25485J168168j872729K39547Q48691
6011C87874J54911P06688j426172J79499L66353j044821J073462Q87978j749292
6002d63520J010836j239649K053513j136819l61901J204190l79144m80293q84912
$$ plain form
6069 548293 560632 -205569 251723 969845 -229270 629036 1434259 1079813 -707061 -295120
6059 -295120 27858 -849398 530461 10178 265670 1476546 -478716 -766192 -557552
6050 -557552 -319478 -11102 223748 -5175 434141 253290 1547953 1102647 280522 -314779
6040 -314779 606436 362368 817624 817197 -192465 1605662 -452396 626546 982719 -288053
6030 -288053 -263977 266583 -546963 455715 -174280 -295874 -322822 -159684 -171207 761650
6020 761650 308076 467294 337338 829682 4197 1172365 -700364 -460817 387874
6011 387874 542785 1249473 -176699 2800 369153 -675668 397794 1285772 -463520
6002 -463520 547316 -692333 1361180 224361 -137540 1066650 687506 207213 -677699
5993f77699J991498j681401J640608m64894j59945j289838J067235j068500J419395
5984G76459r59370R3590J616356j700543m23266J48673q58038O28010L22323N84560
5974B28754j669o81930j8258L43645p2948j100525J789926r23974n1207P18999
5964B30813l30159R17230r60663k34549j07559l27688q79304J005766j576145
5955b262258K139584L65627p73839J52518R8864l42199M11549o09764J428254
5946F08336l85052m87154J21781j880861J489514o43610O62068j21885p57592
5937a394455J813633m06669j28053K86596n59031J9861O94987m09893R22085k16053
5927F23008J44185k96967m67038o05986J135868p87614k99449O15202o63983k10602
$$ plain form
5993 -677699 1313799 -367602 1273006 808112 648167 -641671 425564 -642936 776459
5984 776459 -182911 -89321 1527035 -173508 -596774 -448101 -1306139 -678129 -355806 228754
5974 228754 227085 -454845 -473103 -129458 -202406 -1302931 486995 -436979 -488186 230813
5964 230813 -99346 817884 -142779 -377328 -484887 -812575 -1691879 -686113 -2262258
5955 -2262258 -122674 242953 -530886 -378368 -279504 -621703 -210154 -819918 608336
5946 608336 223284 -263870 -142089 -2022950 -533436 -1177046 -514978 -636863 -1394455
5937 -1394455 419178 12509 -115544 171052 -387979 -368118 326869 -83024 839061 623008
5927 623008 767193 470226 3188 -602798 533070 -254544 -553993 61209 -602774 -813376
5917h13376N88209J265633j793180N07845L8024J1004l51646N15196j65554R97972
5907H00127r55155p15285P36893K44509J46742r70198P66959m66444J021688J15832
5897G25668k114168R06563m27657J204202O09937K4907r92421J32791L51427J433145
5887A854394j854023N26295j113107K295369j675391P85872j285496J193823M8693
5878G76429k24144L93851J84535k07577P62211j443097j90645P65874P62665j643195
5868f3093Q35725l8049p0536N2463m62684Q64317m04745R88591j230634J442855
5858A914210j353142K034288j491753N05577q64523P15595j611618J253114P86557
5849A888305l90784J68575l12462k4071l28169J128992J6175J048059k18957j083461
$$ plain form
5917 -813376 -225167 1040466 -752714 -244869 -206845 -195841 -547487 -32291 -197845 800127
5907 800127 -155028 -870313 -133420 111089 257831 -712367 54592 -411852 609836 725668
5897 725668 -1388500 -481937 -909594 294608 904545 929452 -62969 69822 421249 1854394
5887 1854394 371 526666 -586441 1708928 33537 819409 -466087 727736 776429
5878 776429 552285 946136 1130671 923094 1685305 242208 51563 817437 1580102 -63093
5868 -63093 772632 734583 664047 716510 253826 1118143 713398 1701989 471355 1914210
5858 1914210 561068 2595356 1103603 1609180 744657 1460252 -151366 1101748 1888305
5849 1888305 1497521 1666096 1353634 1329563 1001394 2130386 2146561 3194620 2975663 1892202
5839A892202O13520m42196K50005k1428l54704L20114N86597M31526j052425M38957
5829B662168p3199J149447j996946P69599J236095j710634K021103q36004k12429
5820C009200J89933N1239Q66043p56632J601477j517228M4664J072567j412248
5811C149015J634153J010717q22864J010059j69173l75696J101961o22975K904099
5802H819296j932645J313609L69463J319364K064226R68366J622030L399513J363763
5793A9306985N084689M768441M154481L794758K251922K982591N552914K403987
5785E0300768N608059K933551L396526K549021K086744K321482R96878K860382
5777G3053411K552278J923543M113959J728804o87656j272100J65191r35565n82216
$$ plain form
5839 1892202 2505722 2063526 2313531 2292103 1937399 2257513 2844110 3275636 2223211 2662168
5829 2662168 2588969 3738416 1741470 2511069 3747164 2036530 4057633 3221629 3009200
5820 3009200 3199133 3250372 4116415 3359783 4961260 3444032 3488696 4561263 3149015
5811 3149015 4783168 5793885 4971021 5981080 5811907 5436211 6538172 5915197 8819296
5802 8819296 6886651 8200260 8569723 9889087 11953313 12921679 14543709 17943222 19306985
5793 19306985 24391674 29160115 33314596 37109354 39361276 42343867 47896781 50300768
5785 50300768 55908827 58842378 62238904 64787925 66874669 69196151 70193029 73053411
5777 73053411 75605689 77529232 81643191 83371995 82684339 81412239 81577430 80641865 80059649
5768H0059649l20488k301631r87642n036582n798454k985955m471734m925610
5760E3231553j694828l042900l985552k870834l737395k996069l588719l558114
5752B7757142j365244J88291o90847l53449R47117J618391L569984M466741M188134
5743D0326260N296053O689613M252521K154035N961531N197027P083009O036659
5735H2996708Q420576P649460M392145J245831j041464j594843l169896j937751
5727I6960766m60212O39282L35413J377367J641698K682750K598430N64059j967465
5718A04372088j839224m536567m821551p281716o462047p340154o811755o032736
5710E9246338n293512m345232p034815n140978l614432m026591l539472j751647
$$ plain form
5768 80059649 79739161 77437530 76449888 71413306 65614852 62628897 58157163 53231553
5760 53231553 51536725 48493825 44508273 41637439 37900044 34903975 31315256 27757142
5752 27757142 26391898 26580189 25889342 25535893 26483010 28101401 31671385 36138126 40326260
5743 40326260 45622313 52311926 56564447 58718482 64680013 69877040 76960049 82996708
5735 82996708 91417284 99066744 103458889 104704720 103663256 102068413 98898517 96960766
5727 96960766 96500554 97139836 97475249 98852616 100494314 103177064 105775494 106339553 104372088
5718 104372088 102532864 97996297 93174746 85893030 79430983 72090829 65279074 59246338
5710 59246338 53952826 49607594 42572779 37431801 33817369 29790778 26251306 24499659
5702B4499659l509317l63608j488968k554158r33649R47277j878308j577100J377854
5693A4519682r17700j64992l79140J58191j391707j382061L65055O7337k447333
5684H427332J860237p4052j681243J40488N19815k51102L61666r12766l29564
5675H060811O36752l7061k07661L45802K65998j539923J548252j747463p08712
5666F616795J438751P8625j913254m2465J846682r20278K43189K95166p34466
5657F908745K5032q13656m53480k53155M82048j297055J069871P0938j24365l64314
5647E250609J75961L76021k84831L32306r74249J312368n50707r82305Q11540
5638E466713p39496M99694q78794O25770N96500p97690N23608O3046n78309m21451
$$ plain form
5702 24499659 20990342 20626734 19137766 16583608 15649959 16597236 14718928 13141828 14519682
5693 14519682 13601982 13436990 13057850 13216041 11824334 10442273 10807328 10874665 8427332
5684 8427332 10287569 10213517 8532274 8672762 9192577 8941475 9303141 8390375 8060811
5675 8060811 8697563 8660502 8452841 8798643 9064641 7524718 9072970 7325507 6616795
5666 6616795 8055546 8134171 6220917 6178452 8025134 7104856 7348045 7643211 6908745
5657 6908745 6933777 6120121 5666641 5413486 5895534 4598479 5668350 5739288 5614923 5250609
5647 5250609 5426570 5802591 5517760 5850066 4875817 6188185 5637478 4655173 5466713
5638 5466713 4727217 5226911 4348117 4973887 5570387 4772697 5296305 5359351 4781042 4359591
5628D359591k34036J118377j707245R23273L59366n28496p82045M70661r37295
5619C042151N06433j09578R66694k17407N32959p44717j312581J497318r14096
5610C247176J75052J344505j432142J00294O11834r97775L560P15847n28916n0631
5600C188804k97441J088591j074039K34500J132732k499225Q41044R09444m86396
5591C038014J500747p56416m12237M52417r40972l98599J565630k185896J559358
5582C422046q49945n96880J84180j24630L46435m40967M10817Q64757o80129o46891
5572A888793M9656R30991l12081L55773j848560K128092O2018l04376r57054O65122
5562B658374q11343M33778P47475q39995K87605n86201J479107K86601n81890
$$ plain form
5628 4359591 4125555 5243932 3536687 4459960 4819326 4290830 3508785 3979446 3042151
5619 3042151 3548584 3439006 4405700 4188293 4721252 3976535 2663954 4161272 3247176
5610 3247176 3422228 4766733 3334591 3434885 4046719 3048944 3052504 3768351 3239435 3188804
5600 3188804 2891363 3979954 2905915 3140415 4273147 1773922 2614966 3524410 3038014
5591 3038014 4538761 3782345 3370108 3822525 2881553 2482954 4048584 1862688 3422046
5582 3422046 2572101 1975221 2159401 2034771 2381206 1940239 2351056 3215813 2535684 1888793
5572 1888793 1938449 2869440 2557359 2913132 1064572 3192664 3254682 2950306 1993252 2658374
5562 2658374 1847031 2280809 3028284 2188289 2475894 1889693 3368800 3655401 3073511
5553C073511j95902k73756N7207J88610n3798N81282j57858o06379Q88884p87204
5543B714597O4819J83886p81886J267970o34503m14341M34761j352930J157919
5534B640292l8842O90256m10864L10790P4013K20314M43069q26773K6184L75765
5524C504204k64675j77549M46000m0808J266194n6569j200557P48801M45341j122555
5514C547827Q68426L49201J193430q71940k12586J186822j169896J432466q79482
5505E444268p87949O83272L23746O8835R12349j262426l89321N72693O54842R6918
5495F317227O79808O65930n52114Q84961j091970J639441j394732Q26309N80328
5486H555188j37116J55469J407910J85775J188458j03231M74206K001027k282732
$$ plain form
5553 3073511 2877609 2603853 2661060 2849670 2795872 3377154 3219296 2612917 3501801 2714597
5543 2714597 2779416 2963302 2181416 3449386 2814883 2400542 2835303 1482373 2640292
5534 2640292 2601450 3291706 2880842 3191632 3265645 3485959 3929028 3102255 3128439 3504204
5524 3504204 3239529 3061980 3507980 3467172 4733366 4676797 3476240 4225041 4670382 3547827
5514 3547827 4416253 4765454 5958884 5086944 4874358 6061180 4891284 6323750 5444268
5505 5444268 4656319 5339591 5663337 5732172 6644521 5382095 4992774 5565467 6220309 6317227
5495 6317227 6997035 7662965 7110851 7995812 6903842 8543283 7148551 7974860 8555188
5486 8555188 8418072 8573541 9981451 10167226 11355684 11252453 11726659 13727686 11444954
5477A1444954K168410j47782l30358n6741P8117K024289J25465P8183K357852
5468A7742389J043904J041277L766228L928824M714308N765622L156026K509943
5460D3668521K012570J731266K811245N613020R010878J1109580R038084Q169574
5452I3164738J445860k738855m857165n552833m234197l739552j544278J778851
5444G3722569M285956N143052O992650L424167M269254K64844K254919K077698
5436A02435109r3886j94061m2624k769355j608933k921195k35962J316414m8865
5427I5836642K041451J657948K63590M098971Q09774J236963J796061r70927l632817
5418A03137656k13005k172318o11736K514701N393647P295956J1152708J4515763
$$ plain form
5477 11444954 13613364 13465582 13135224 13078483 13156600 15180889 15306354 15384537 17742389
5468 17742389 18786293 19827570 23593798 27522622 32236930 38002552 41158578 43668521
5460 43668521 45681091 47412357 50223602 55836622 64847500 75957080 84995164 93164738
5452 93164738 94610598 91871743 87014578 81461745 77227548 73487996 71943718 73722569
5444 73722569 78008525 83151577 90144227 93568394 97837648 98102492 100357411 102435109
5436 102435109 102341223 102147162 102104538 99335183 97726250 94805055 94569093 95885507 95836642
5427 95836642 97878093 99536041 99799631 103898602 104708376 105945339 107741400 106770473 103137656
5418 103137656 102924651 100752333 100140597 102655298 108048945 115344901 126497609 141013372
5410A41013372J2039281J3157346J0035041L990236j563722l297807o563539q033099
5402A60777109o285806l055212j080948J898885K404331N342916M887233M191019
5394A69079527j698480l601116n915249p349839r695935p896518r000329n676967
5386A18245094l396289m606902o63016j823959k135784m665834l023655o803686
5378I1125969q398331q044623n215204l444524k719787k167553J642974L852254
5370F6631175N067067M742292N475667R94875Q9583j80540J03633L481979K851808
5361H9257539O581305O218078M185299R4888m321424o924710p200248j0028225
5353G7862502q421990l730911l328817n46711k71074n53349J59940m438349m660787
$$ plain form
5410 141013372 153052653 166209999 176245040 180235276 178671554 175373747 168810208 160777109
5402 160777109 154491303 151436091 150355143 152254028 154658359 160001275 164888508 169079527
5394 169079527 167381047 163779931 157864682 150514843 140818908 132922390 123922061 118245094
5386 118245094 114848805 110241903 109578887 107754928 105619144 100953310 97929655 91125969
5378 91125969 82727638 74683015 69467811 66023287 63303500 61135947 62778921 66631175
5370 66631175 71698242 76440534 81916201 82911076 83000659 82820119 82923752 86405731 89257539
5361 89257539 95838844 102056922 106242221 106337109 102015685 95090975 87890727 77862502
5353 77862502 69440512 65709601 62380784 61834073 61562999 61009650 61169590 56731241 52070454
5344E2070454o146714n679402m541712m109574k327609k036234l133921m26596
5336B3668692j881800j563629j200419R76000k463927m5140m63462k38564K44812
5327A7032563r55613l56308M96876j930969k10571Q04092k184396j01345J70623
5318A2764952k16452P87242k925689J437832N23747P2422k44698m25615r96675
5309A0777066j60464r97675J261385j34004n38360M88155K89745k143988R21320
5300I763180j442564O35494q6837l9276p9791j465549N95996K01933j248508K19025
5290G053103r43029l25987J453970j271255J243504j044388O42561J71658j534390
5281E445747o76054J856248L41754L32202j0780j699271J050974j342757N11761
$$ plain form
5344 52070454 45923740 40244338 35702626 31593052 29265443 27229209 24095288 23668692
5336 23668692 21786892 20223263 19022844 19998844 17534917 17489777 17026315 16787751 17032563
5327 17032563 16076950 15720642 16217518 14286549 14075978 14880070 12695674 12594329 12764952
5318 12764952 12548500 13335742 10410053 11847885 12371632 12444054 12199356 11773741 10777066
5309 10777066 10616602 9618927 10880312 10746308 10207948 10696103 10985848 8841860 9763180
5300 9763180 8320616 8956110 8869273 8829997 8750206 7284657 7880653 8082586 6834078 7053103
5290 7053103 6110074 5784087 7238057 5966802 7210306 6165918 6808479 6980137 5445747
5281 5445747 4769693 6625941 6967695 7299897 7289117 5589846 6640820 5298063 5809824
5272E809824P91143j657368O63984m94438o97347J52182J428790j697923Q64598
5263E163445l19154j099898j3710k75935N02596m95381J044010L14326o44717
5254D175582n52154m2622Q42498o81128J71364l1923P46045l34538j238713J18584
5244C172995l33997J906994j722206K44355Q77617m54920L2671j483558m51730
5235A788221J240553j473198J781764N94209r8053j038833P36191j390000q64537
5226A276317J804214J37924J60262N67587m19382r42266p57748O22122P85621
5217C234651k238886J559158j149648J249541O96336j152390j189001M43172O83825
5208B136758N19920p27400p0692o49402P41102N11322j288201J425014n30327
$$ plain form
5272 5809824 6600967 4943599 5607583 5113145 4415798 4567980 5996770 4298847 5163445
5263 5163445 4844291 3744393 3730683 3454748 3957344 3461963 4505973 4820299 4175582
5254 4175582 3623428 3580806 4423304 3742176 3913540 3881617 4627662 4293124 3054411 3172995
5244 3172995 2838998 4745992 3023786 3268141 4145758 3690838 3723509 2239951 1788221
5235 1788221 3028774 1555576 3337340 3931549 3833496 2794663 3530854 2140854 1276317
5226 1276317 3080531 3218455 3378717 3946304 3526922 2584656 1826908 2449030 3234651
5217 3234651 995765 2554923 1405275 2654816 3351152 2198762 1009761 1452933 2136758
5208 2136758 2656678 1929278 1858586 1209184 1950286 2461608 1173407 2598421 2068094
5199B068094k02074Q83785k89670K6356M47056j167385r6948J58265p74901J736288
5189B788866j21057J35708q27512J35122J194555L66139l016133J836689j721669
5180G70708K229613r11737J245246j437335q92560Q66200P4132p61690K42635
5171A425212P23951m81319N35927k4792o19253N15442r35092O73479J349028k124055
5161A038528J197300r56111J240802o02929j34917J48917N15207M79565K64747
5152C191109q24297j024520J705180m40728R50260j304837l17858p58895K012369
5143C187783j540650R55336n88259J081443j470603J010036j29865l90104L15047
5134B430164J153433j302112Q13396l27132q66648N92129O43840p02747j905186
$$ plain form
5199 2068094 1866020 2749805 2460135 2486491 2933547 1766162 1669214 1827479 1052578 2788866
5189 2788866 2667809 2803517 1976005 2111127 3305682 3671821 655688 2492377 770708
5180 770708 3000321 2088584 3333830 1896495 1003935 1870135 1944267 1182577 1425212
5171 1425212 2149163 1667844 2203771 2178979 1559726 2075168 1140076 1813555 3162583 1038528
5161 1038528 2235828 1279717 2520519 1917590 1782673 1931590 2446797 2926362 3191109
5152 3191109 2366812 1342292 3047472 2606744 3557004 2252167 1934309 1175414 3187783
5143 3187783 1647133 2602469 2014210 3095653 1625050 2635086 2505221 2115117 2430164
5134 2430164 3583597 2281485 3094881 2767749 1901101 2493230 3137070 2434323 529137
5125E29137K33753J144181j677477L14955J458230l94204J013355r50045M41943
5116B113828L72214j096347P16316N54190n22118K67383J159973j61236J12429
5107C516632j063624R08459P54684j206866j032089P60854j87022P9955q52861
5098A678122P06092k69488N8636j095078R8601J484174k57965j050876l62554
5089I89664N80250O57233n30975O34538l18408j122772q90510K088691n95992
5080A491719L8244J40101M4426L97855O47821k252445J527065m41016n7589L32134
5070A868315P3844L82154j743050J823502k98396p4224l37286P79838M4485m38290
5060B080892p99433J465279m72429R45973l86519l46921j171483J063639N20325
$$ plain form
5125 529137 762890 1907071 229594 544549 2002779 1608575 2621930 1671885 2113828
5116 2113828 2486042 1389695 2106011 2660201 2138083 2405466 3565439 3404203 3516632
5107 3516632 2453008 3361467 4116151 2909285 1877196 2638050 2451028 2530983 1678122
5098 1678122 2384214 2114726 2173362 1078284 1176885 2661059 2403094 1352218 989664
5089 989664 1569914 2227147 1696172 2330710 2012302 889530 -980 2087711 1491719
5080 1491719 1529963 1670064 1714490 2112345 2760166 507721 2034786 1593770 1536181 1868315
5070 1868315 1942159 2324313 581263 2404765 2106369 2032145 1694859 2474697 2519182 2080892
5060 2080892 1281459 2746738 2274309 3220282 2833763 2486842 1315359 2378998 2899323
5051B899323J820471J969034K637396K427960L472369K006441k1782p24709k156625
5042A4329878j269050n111385j95353n56611j972142l50297N90710k254150J143269
5033D354869q00426J49388j55247m71081O46587o37412k38001m6915n5439k183192
5023E63131K288721j675232O62577R56125j81638N51376j344159P38647n7481
5014B502067M79498N54602j041601j498919J037971J200377m43006n08983k2392
5005B259614P82508j018466J10475L56155q83357N52657Q92706m95936P69667
4996C326023j574689O71145J36589M19152l08750L35926j071906J229378l60942
4987B801926O50289n67193J491353m22648l14725m11056O46395j335450N35167
$$ plain form
5051 2899323 4719794 6688828 9326224 11754184 15226553 17232994 17211212 16486503 14329878
5042 14329878 13060828 7949443 7754090 7197479 5225337 4875040 5465750 3211600 4354869
5033 4354869 3554443 3703831 3548584 3077503 3724090 3086678 2848677 2801762 2746323 563131
5023 563131 2851852 1176620 1839197 2795322 2613684 3165060 1820901 2559548 2502067
5014 2502067 2981565 3536167 2494566 995647 2033618 3233995 2790989 2282006 2259614
5005 2259614 3042122 2023656 2134131 2490286 1606929 2159586 3052292 2556356 3326023
4996 3326023 1751334 2422479 2559068 2978220 2669470 3005396 1933490 3162868 2801926
4987 2801926 3452215 2885022 4376375 3953727 3639002 3227946 3874341 2538891 3074058
4978C074058O77506j097022p42219R94375j40699J998296j077060p61014Q26419
4969C752640n80645R60850r75796M41604m55594K351m59316J15585O0193m03994
4959B457878J29406K24691o70950Q34658O18212r57169J337560k239570Q33513
4950B568229N69473q55199Q88180Q2004k13035k3241M08937j269569K088151j71136
4940D072794j09709M57338k23071n89483l50210j738753J623065l18552L32740
4931C156159R03715k99786n96000k25174J70677J54991J661910j182202k7222
4922C717068p23744K88894J165948j05710l57590M66771j090326k73094N44916
4913C633133J745117p69139j09801O90532p29853j666468J378626J13395q21751
$$ plain form
4978 3074058 3751564 2654542 1912323 2906698 2765999 4764295 3687235 2926221 3752640
4969 3752640 3171995 4132845 3157049 3598653 3143059 3145410 2686094 2801679 2861872 2457878
4959 2457878 2587284 2811975 2141025 2975683 3593895 2636726 3974286 1734716 2568229
4950 2568229 3137702 2282503 3170683 3252687 3039652 3016411 3425348 2155779 4243930 4072794
4940 4072794 3963085 4420423 4197352 3607869 3257659 1518906 3141971 2823419 3156159
4931 3156159 4059874 3760088 3164088 2938914 3109591 3264582 4926492 3744290 3717068
4922 3717068 2993324 3282218 4448166 4342456 3984866 4451637 3361311 3088217 3633133
4913 3633133 5378250 4609111 4499310 5189842 4459989 2793521 4172147 4285542 3463791
4904C463791J164722j590460J241406N87329r5417J45611o70068j1694Q99352
4895E134572p19917R31710o81313j229725J343716J3377p09298P71877J44946
4886D999945P07837P74473j013263R38112p5588j061150J048161r42250M48383
4877E824660J135997l38903o88554M28656J398126j270714L92674j338526J586769
4868G130185m60987N37243J084602j894119O35195M37130J875335Q00295r77183
4859I167696O86209P54890o71825n79780K8686o69468j97296j153504R87219O24253
4849H977080j032922m5210R92467j607047J752982L10378J053029j638876J531394
4840A0293275N47039L54525L20182k55448N10502q38354J048007N53488l7117
$$ plain form
4904 3463791 4628513 3038053 4279459 4866788 4771371 4916982 4246914 4235220 5134572
4895 5134572 4414655 5346365 4665052 3435327 4779043 4792420 4083122 4854999 4999945
4886 4999945 5707782 6482255 5468992 6407104 6331516 5270366 6318527 5376277 5824660
4877 5824660 6960657 6621754 5933200 6361856 7759982 6489268 6881942 5543416 7130185
4868 7130185 6669198 7206441 8291043 6396924 7032119 7469249 9344584 10144879 9167696
4859 9167696 9853905 10608795 9936970 9357190 9385876 8716408 8519112 7365608 8352827 8977080
4849 8977080 7944158 7898948 8891415 7284368 9037350 9347728 10400757 8761881 10293275
4840 10293275 10840314 11194839 11515021 11259573 11770075 10931721 11979728 12533216 12496099
4831A2496099K70546Q19115k41158K082725j311706N52786Q75659j580047K197593
4822A6161612J329986P24878j151357J646046Q52670r517J733724J266479L484617
4813B6039138N2891J203054L97539j107926j097454K31578q7302P55353J060661
4804B7447532J104326J537673J435640K633988n69863K153760J888684P8085N29124
4795C8238949J258604J305134N063102L379720L964881O084227K716131O355812
4787F8366560L394772K124709R58208k802813j665758j173874j705376q68095
4779F6628333J480993R62193J544642J211311J454687K796407L592352K422555
4771H2093473L490760J870166M565268L856634M824433P204404L769746M203203
$$ plain form
4831 12496099 12766645 13585760 13344602 15427327 14115621 14668407 15544066 13964019 16161612
4822 16161612 17491598 18216476 17065119 18711165 19563835 19554318 21288042 22554521 26039138
4813 26039138 26092029 27295083 27692622 26584696 25487242 25718820 25631518 26386871 27447532
4804 27447532 28551858 30089531 31525171 34159159 33589296 35743056 37631740 37709825 38238949
4795 38238949 39497553 40802687 45865789 49245509 53210390 59294617 62010748 68366560
4787 68366560 71761332 73886041 74844249 72041436 70375678 69201804 67496428 66628333
4779 66628333 68109326 69071519 70616161 71827472 73282159 76078566 79670918 82093473
4771 82093473 85584233 87454399 92019667 95876301 100700734 107905138 111674884 115878087
4763A15878087K291134J340768J403743M081715P573849Q556338J1614200N917998
4755A58657832J701195m887236m352497n139204k400946n5048L697365O416311
4747A53637772R983523J3413845Q077195M655424q37039o462310n943630m662184
4739A71862596m051174N75529M766212O990260J3382323J7694232K2556622K0245299
4731B54021899J7143448M369882p590778j7522721k3100971k0714201j6577503
4724A90029055j0637350l219205N964561J6113636K2088403K3705074J4305316
4717B58349490J554959j3132433k1310538k1607607j9553370j4482430j631630
4710A68186441N589123J3589537J7427001J6132876Q573609o31424r898083j3777877
$$ plain form
4763 115878087 118169221 119509989 120913732 124995447 132569296 141125634 152739834 158657832
4755 158657832 160359027 155471791 151119294 145980090 143579144 143524096 147221461 153637772
4747 153637772 163621295 177035140 185112335 189767759 188930720 182468410 176524780 171862596
4739 171862596 167811422 168386951 173153163 180143423 193525746 211219978 233776600 254021899
4731 254021899 271165347 275535229 267944451 250421730 227320759 206606558 190029055
4724 190029055 179391705 176172500 182137061 198250697 220339100 244044174 258349490
4717 258349490 259904449 246772016 225461478 203853871 184300501 169818071 168186441
4710 168186441 173775564 187365101 204792102 220924978 229498587 228867163 218969080 205191203
4702B05191203j5918360j8542635j4628152j0352087o045506R29212O090061J4863255
4694A61586991K1559248K6739851K4189577J7549720J792941r224629j6719568
4687B27474131j9105151j5149031r731702l923452K150798M777989M638453K145519
4679A93277554k602184o502146o169788n219327l234044l384624j976664l340619
4671A60848158j003178j517540M483743L736417O616171Q714546R308746M268417
4663A95455480j142350m956708r511299j0523647r732383j1946193p697213q057656
4655A31888031n577309m599192n270456o270575p27144j828735l570276k045232
4647A01999112j317587j612104J257955J712301L947270M866691N190595K805393
$$ plain form
4702 205191203 189272843 170730208 156102056 145749969 139704463 140633675 146723736 161586991
4694 161586991 183146239 209886090 234075667 251625387 253418328 244193699 227474131
4687 227474131 208368980 193219949 183488247 179564795 181715593 186493582 191132035 193277554
4679 193277554 190675370 184173224 178003436 172784109 169550065 166165441 164188777 160848158
4671 160848158 159844980 158327440 162811183 166547600 173163771 181878317 191187063 195455480
4663 195455480 194313130 189356422 179845123 169321476 159589093 147642900 139945687 131888031
4655 131888031 126310722 121711530 116441074 110170499 109443355 107614620 104044344 101999112
4647 101999112 100681525 99069421 100327376 102039677 105986947 110853638 116044233 118849626
4639A18849626N410017M638975P295977P665159Q277297Q153105Q602534N118662
4631A74011352Q183014O793428N896400M176060M443024K721204K403187J941719
4623B10569388L811484K407269O458028P594797Q450853J0225117P108712P358789
4615B63984437M419154K620715R45896l033816l329833j984965l765279k100013
4607B57756296O32592m323238n45k266318k763535l338237m968449p366094o004141
4598B27358331p614359n738057l713933o637647l911600m841385l645654m094137
4590A87161559j516851k46485O38635J354309K061898J510983k25307l853688
4582A86885053j997354m160945k851403j575369k552934r15377l965811m894486
$$ plain form
4639 118849626 124259643 128898618 136194595 143859754 152137051 160290156 168892690 174011352
4631 174011352 182194366 188987794 194884194 199060254 203503278 206224482 208627669 210569388
4623 210569388 214380872 216788141 223246169 230840966 239291819 249516936 256625648 263984437
4615 263984437 268403591 271024306 271970202 268936386 265606553 263621588 259856309 257756296
4607 257756296 258388888 254065650 254065105 251798787 249035252 245697015 240728566 233362472 227358331
4598 227358331 219743972 214005915 210291982 203654335 199742735 194901350 191255696 187161559
4590 187161559 185644708 185398223 186036858 187391167 189453065 190964048 190738741 186885053
4582 186885053 184887699 180726754 177875351 176299982 173747048 172831671 168865860 163971374
4574A63971374l716186m488156m020512l392761n83458j268913q61940m239679
4566A41399769m380604p287708m780775q272248m390573n367727m252975l729766
4558I8937393l895057j342999l48851k661997q56718l016464m337542j362544
4550H1115221k884080l850737j556660k985608j926116l62596j314700k229564
4542F4005160j427538L44022k387616N18286l026457m5458o66933P50570j458204
4533E6605832M71758q79553n44720k022196J621687j158890j009966j478923P24431
4524E2329460l152774q04798j446526k084886o65264q3844m47292l7794l43724
4515D3262558O41751j381192k28125L38328K025460J421948M773426R70639J633752
$$ plain form
4574 163971374 160255188 155767032 151746520 148353759 147770301 146501388 145639448 141399769
4566 141399769 137019165 129731457 124950682 116678434 112287861 106920134 102667159 98937393
4558 98937393 95042336 93699337 93350486 90688489 89831771 86815307 82477765 81115221
4550 81115221 78231141 74380404 72823744 69838136 67912020 67549424 66234724 64005160
4542 64005160 62577622 62921644 60534028 61052314 58025857 57980399 57313466 58064036 56605832
4533 56605832 57077590 56198037 55653317 53631121 55252808 54093918 53083952 51605029 52329460
4524 52329460 49176686 48371888 46925362 44840476 44175212 44091368 43644076 43606282 43262558
4515 43262558 43904309 42523117 42294992 42633320 44658780 46080728 50854154 51824793 53458545
4506E3458545r44994j722915l557736k513233k396441j88578m82695J339127J347957
4497D4339037L370961K820237K074626J682717m81734j836483l096454l540278
4489D5332629j028685k700446k691076k24768j50047K82393Q06966K228620m16938
4480D1438648j780286M95306r49331k82349L60218r07225k05619K19009j258633
4471C7129738q810R87182N32182J150802K276500L897410M164222O033172O413291
4462F2575689Q189542N147942K669459O03173j072258k289430j702563J521975
4454G5643529J855612N252377P032307Q070809R173600P009159N455000M58094
4446A19950487j048049k986906m962899p449047m291727q088754j892167J580686
$$ plain form
4506 53458545 52513551 50790636 47232900 44719667 42323226 42134648 41651953 42991080 44339037
4497 44339037 47709998 50530235 52604861 54287578 53805844 51969361 48872907 45332629
4489 45332629 44303944 41603498 38912422 38687654 38537607 38820000 39626966 41855586 41438648
4480 41438648 39658362 40153668 39204337 38921988 39282206 38374981 38169362 38388371 37129738
4471 37129738 37120928 38108110 38640292 39791094 42067594 45965004 50129226 56162398 62575689
4462 62575689 70765231 75913173 78582632 79185805 78113547 75824117 74121554 75643529
4454 75643529 77499141 82751518 89783825 97854634 107028234 114037393 119492393 119950487
4446 119950487 118902438 115915532 110952633 103503586 99211859 91123105 89230938 90811624
4438I0811624L197989L855186L480472J504860m829935k586858n836507j518678
4430H8078153o08640J072336M0004Q73122n49352Q72239K459396K825250L351978
4421I8414486K406048M096914M225035M292376O977581Q653567R175372R894112
4413A48135491J2379616Q684463N150543J575586j556103k089628k014079J40062
4405A70405951O464J937939k337090J323453o85807j585228o33501l799746l742468
4396A60889967p326865j0709036q261375r033892p624344l323594o493246J186815
4388A09304430L76029m80061M7549k734150m529605l540915k941877O74681O79071
4379I6855152K965103J214587r13753j200790m613353k325658k770800l21662
$$ plain form
4438 90811624 94009613 97864799 101345271 102850131 98020196 95433338 89596831 88078153
4430 88078153 87469513 88541849 88581853 89454975 88905623 89777862 92237258 95062508 98414486
4421 98414486 100820534 104917448 109142483 113434859 120412440 129066007 138241379 148135491
4413 148135491 160515107 169199570 174350113 175925699 174369596 172279968 170265889 170405951
4405 170405951 170412415 172350354 170013264 171336717 170650910 169065682 168432181 164632435 160889967
4396 160889967 153563102 142854066 134592691 125558799 117934455 114610861 108117615 109304430
4388 109304430 109680459 109200398 109247947 106513797 101984192 98443277 95501400 96176081 96855152
4379 96855152 99820255 101034842 100121089 98920299 94306946 91981288 89210488 88888826
4371H8888826J425147L034435N666369P248557P808219N800867M014912p52216
4363A23135116o477982o004034r974879n898887n024874m326224m372009l975237
4355G7080990l967452m128872j688584j224911K054586k444953q91756k740686
4347F2048362m523318n285486k325282l370211j539898r56570k94955r9397J81140
4338D3834385n96891Q28523p51909j049710M92512J209749N09556Q66534O18841
4329D5961590N8696j092505J89215r97070o43484J640064J04588J968593L594740
4320E0784427L466319L796206M426793L924916K423624N994919P376496J0945208
4312I3138908J0400925O255632R88933k726505n906487p915782q311363p602793
$$ plain form
4371 88888826 90313973 93348408 99014777 106263334 114071553 119872420 123887332 123135116
4363 123135116 116657134 110653100 100678221 94779334 89754460 85428236 81056227 77080990
4355 77080990 73113538 68984666 67296082 66071171 68125757 65680804 64789048 62048362
4347 62048362 57525044 52239558 49914276 46544065 45004167 44047597 43752642 43653245 43834385
4338 43834385 43237494 44066017 43314108 42264398 42756910 43966659 44476215 45342749 45961590
4329 45961590 46020286 44927781 45116996 44119926 43476442 45116506 45221094 47189687 50784427
4320 50784427 54250746 58046952 62473745 66398661 68822285 74817204 82193700 93138908
4312 93138908 103539833 109795465 110784398 108057893 102151406 94235624 85924261 78321468
4304G8321468o324553p487045o229465m002178m267242l273326k992100l265280
4296D0480279l741527K28204j892833j330465j519581j833320K72838j87885j002071
4287B9473639O22660p1655o65010R87432p22153O84728K989259J507909L711516
4278C8518325L555242L956498K925764K218030o72720j814619r21523k856541
4270D4908456l378084o4642k612379K002512R79475K88478L924797K615477M803976
$$ plain form
4304 78321468 71996915 64509870 58280405 54278227 50010985 46737659 43745559 40480279
4296 40480279 36738752 36966956 35074123 33743658 32224077 30390757 30663595 30475710 29473639
4287 29473639 30096299 30024644 29359634 30347066 29624913 30309641 33298900 34806809 38518325
4278 38518325 42073567 46030065 48955829 51173859 50501139 48686520 47764997 44908456
4270 44908456 41530372 41465730 38853351 40855863 41835338 42123816 46048613 48664090 53468066
$$ [...]
##END NTUPLES=NMR SPECTRUM
##END=
