##TITLE=abcd
##JCAMPDX= 6.0         $$ Bruker NMR JCAMP-DX V2.0
##DATA TYPE= NMR SPECTRUM
##DATA CLASS= NTUPLES
##ORIGIN= UXNMR, Bruker Analytische Messtechnik GmbH
##OWNER= root
$$ XWIN-NMR		Version 3.5
$$ Wed Mar  4 16:53:26 2026 Russian Standard Time (UT+4h)  servis@DPX200
##.OBSERVE FREQUENCY= 200.131235884673
##.OBSERVE NUCLEUS= ^1H
##.ACQUISITION MODE= SIMULTANEOUS
##.ACQUISITION SCHEME= undefined
##.AVERAGES= 32
##.DIGITISER RES= 18
##SPECTROMETER/DATA SYSTEM= spect
##.PULSE SEQUENCE= zg
##.SOLVENT NAME= DMSO
##.SHIFT REFERENCE= (INTERNAL, DMSO, 0, 16.4885)
##AUDIT TRAIL= $$ (NUMBER, WHEN, WHO, WHERE, WHAT)
$$ ##TITLE= Audit trail, XWIN-NMR		Version 3.5
$$ ##JCAMPDX= 5.01
$$ ##ORIGIN= Bruker BioSpin GmbH
$$ ##OWNER= servis
$$ F:\spectra/data/av/nmr/H1/1/pdata/1/auditp.txt
$$ ##AUDIT TRAIL=  $$ (NUMBER, WHEN, WHO, WHERE, WHAT)
(   1,<2026-03-04 16:53:04.90 +0400>,<servis>,<DPX200>,
      <created by zg, POWCHK disabled, PULCHK disabled
       configuration hash MD5:
       00 E9 B6 7A A2 85 ED C7 34 08 36 98 17 FE 4E 26
       data hash MD5: 32K
       F9 8C C4 F8 3E 9A 27 D7 CC 6E E7 33 B1 E6 4D 89>)
(   2,<2026-03-04 16:53:06.40 +0400>,<servis>,<DPX200>,
      <Start of raw data processing
       efp BC_mod = 2 LB = 0.05 FT_mod = 6 PKNL = 1 PHC0 = -184.1201 PHC1 = 6.301564 SI = 16K 
       data hash MD5: 16K
       17 8B 8F 48 E1 00 89 23 EB 38 73 C8 46 C4 58 2B>)
$$ ##END=
$$ 
$$ hash MD5
$$ 7C B8 F9 F9 D9 0C C7 53 7B 4F 1E 74 6B 66 2B 22
##$RELAX= 
##$RELAX= 
##$RELAX= 
##$RELAX= 
##$RELAX= 
##$RELAX= 
##$RELAX= 
##$RELAX= 
$$ Bruker specific parameters
$$ --------------------------
##$DU= <F:\spectra>
##$EXPNO= 1
##$NAME= <H1>
##$PROCNO= 1
##$TYPE= <nmr>
##$USER= <av>
##$AMP= (0..31)
100 100 100 100 100 100 100 100 100 100 100 100 100 100 100 100 100 100 
100 100 100 100 100 100 100 100 100 100 100 100 100 100 
##$AQSEQ= 0
##$AQ_mod= 1
##$AUNM= <au_zg>
##$AUTOPOS= <>
##$BF1= 200.13
##$BF2= 200.13
##$BF3= 200.13
##$BF4= 200.13
##$BF5= 500.13
##$BF6= 500.13
##$BF7= 500.13
##$BF8= 500.13
##$BYTORDA= 1
##$CFDGTYP= 0
##$CFRGTYP= 5
##$CHEMSTR= <none>
##$CNST= (0..31)
1 1 145 1 1 1 1 1 1 1 1 1 1 1 1 1 1 1 1 1 1 1 1 1 1 1 1 1 1 1 1 1 
##$CPDPRG= <>
##$CPDPRG1= <>
##$CPDPRG2= <>
##$CPDPRG3= <>
##$CPDPRG4= <mlev>
##$CPDPRG5= <mlev>
##$CPDPRG6= <mlev>
##$CPDPRG7= <mlev>
##$CPDPRG8= <mlev>
##$CPDPRGB= <>
##$CPDPRGT= <>
##$D= (0..31)
0 2 0 0 0 0 0 0 0 0.06 0 0 0 0 0 0 0.0002 0 0 0 0 0 0 0 0 0 0 0 0 0 0 
0 
##$DATE= 1772628784
##$DBL= (0..7)
120 120 120 120 120 120 120 120 
##$DBP= (0..7)
150 150 150 150 150 150 150 150 
##$DBP07= 0
##$DBPNAM0= <>
##$DBPNAM1= <>
##$DBPNAM2= <>
##$DBPNAM3= <>
##$DBPNAM4= <>
##$DBPNAM5= <>
##$DBPNAM6= <>
##$DBPNAM7= <>
##$DBPOAL= (0..7)
0.5 0.5 0.5 0.5 0.5 0.5 0.5 0.5 
##$DBPOFFS= (0..7)
0 0 0 0 0 0 0 0 
##$DE= 6
##$DECBNUC= <off>
##$DECIM= 32
##$DECNUC= <off>
##$DECSTAT= 4
##$DIGMOD= 1
##$DIGTYP= 9
##$DL= (0..7)
0 120 120 120 120 120 120 120 
##$DP= (0..7)
150 150 150 150 150 150 150 150 
##$DP07= 0
##$DPNAME0= <>
$$ [...]
##$SUBNAM4= <"">
##$SUBNAM5= <"">
##$SUBNAM6= <"">
##$SUBNAM7= <"">
##$SUBNAM8= <"">
##$SUBNAM9= <"">
##$SW= 20.6817932712277
##$SWIBOX= (0..15)
0 0 3 0 0 0 0 0 0 0 0 0 0 0 0 0 
##$SW_h= 4139.07284768212
##$TD= 32768
##$TD0= 1
##$TE= 0
##$TE2= 300
##$TE3= 300
##$TEG= 300
##$TL= (0..7)
0 120 120 120 120 120 120 120 
##$TP= (0..7)
150 150 150 150 150 150 150 150 
##$TP07= 0
##$TPNAME0= <>
##$TPNAME1= <>
##$TPNAME2= <>
##$TPNAME3= <>
##$TPNAME4= <>
##$TPNAME5= <>
##$TPNAME6= <>
##$TPNAME7= <>
##$TPOAL= (0..7)
0.5 0.5 0.5 0.5 0.5 0.5 0.5 0.5 
##$TPOFFS= (0..7)
0 0 0 0 0 0 0 0 
##$TUNHIN= 0
##$TUNHOUT= 0
##$TUNXOUT= 0
##$USERA1= <user>
##$USERA2= <user>
##$USERA3= <user>
##$USERA4= <user>
##$USERA5= <user>
##$V9= 5
##$VALIST= <valist>
##$VCLIST= <CCCCCCCCCCCCCCC>
##$VD= 0
##$VDLIST= <DDDDDDDDDDDDDDD>
##$VPLIST= <PPPPPPPPPPPPPPP>
##$VTLIST= <TTTTTTTTTTTTTTT>
##$WBST= 1024
##$WBSW= 30
##$XGAIN= (0..3)
0 0 0 0 
##$XL= 0
##$YL= 0
##$YMAX_a= 3016913
##$YMIN_a= -3017885
##$ZGOPTNS= <>
##$ZL1= 120
##$ZL2= 120
##$ZL3= 120
##$ZL4= 120
##$ABSF1= 0
##$ABSF2= 0
##$ABSG= 0
##$ABSL= 0
##$ALPHA= 0
##$AQORDER= 0
##$ASSFAC= 0
##$ASSFACI= 0
##$ASSFACX= 0
##$ASSWID= 0
##$AUNMP= <proc_1d>
##$AZFE= 0.1
##$AZFW= 0.1
##$BCFW= 0
##$BC_mod= 2
##$BYTORDP= 0
##$COROFFS= 0
##$CY= 18.4799938201904
##$DATMOD= 1
##$DC= 0
##$DFILT= <>
##$DTYPP= 0
##$F1P= 9.9274215381318
##$F2P= -0.165520771350173
##$FCOR= 1
##$FTSIZE= 16384
##$FT_mod= 6
##$GAMMA= 0
##$GB= 0
##$INTBC= 1
##$INTSCL= 4.127829e-11
##$ISEN= 128
##$LB= 0.05
##$LEV0= 0
##$LPBIN= 0
##$MAXI= 10000
##$MC2= 0
##$MEAN= 0
##$ME_mod= 0
##$MI= 50
##$NCOEF= 0
##$NC_proc= -1
##$NLEV= 6
##$NOISF1= 3.799351
##$NOISF2= 2.8
##$NSP= 0
##$NTH_PI= 0
##$NZP= 0
##$OFFSET= 16.48848
##$PC= 4
##$PHC0= -184.1201
##$PHC1= 6.301564
##$PH_mod= 1
##$PKNL= yes
##$PPARMOD= 0
##$PSCAL= 4
##$PSIGN= 0
##$REVERSE= no
##$SF= 200.130005582386
##$SI= 16384
##$SIGF1= 3
##$SIGF2= 2
##$SINO= 400
##$SIOLD= 16384
##$SREGLST= <1H.CDCl3>
##$SSB= 0
##$STSI= 16384
##$STSR= 0
##$SW_p= 4139.07284768211
##$SYMM= 0
##$S_DEV= 0
##$TDeff= 32768
##$TDoff= 0
##$TI= <>
##$TILT= no
##$TM1= 0
##$TM2= 0
##$TOPLEV= 0
##$USERP1= <user>
##$USERP2= <user>
##$USERP3= <user>
##$USERP4= <user>
##$USERP5= <user>
##$WDW= 1
##$XDIM= 16384
##$YMAX_p= 271947699
##$YMIN_p= -166331
$$ End of Bruker specific parameters
$$ ---------------------------------
##NTUPLES= NMR SPECTRUM
##VAR_NAME=  FREQUENCY,     SPECTRUM/REAL,   SPECTRUM/IMAG
##SYMBOL=    X,             R,               I
##VAR_TYPE=  INDEPENDENT,   DEPENDENT,       DEPENDENT
##VAR_FORM=  AFFN,          ASDF,            ASDF
##VAR_DIM=   16384,         16384,           16384
##UNITS=     HZ,            ARBITRARY UNITS, ARBITRARY UNITS
##FACTOR=    0.252644378177508, 1,           1
##FIRST=     3299.83951724647, 0,            0
##LAST=      -839.233330435636, 0,           0
##MIN=       -839.233330435636, -166331,     0
##MAX=       3299.83951724647, 271947699,    0
$$ Real data points
##PAGE= N=1
##DATA TABLE= (X++(R..R)), XYDATA
$$ [...]
12056 -69629 -69534 -70365 -69940 -70170 -68911 -69467 -69127 -70293 -70009 -69679 -69863 -69010 -69854 -71094 -70287 -70367 -70023 -70473 -70532
12037 -70532 -69865 -69596 -70302 -70263 -70858 -70186 -70149 -69603 -70919 -70210 -70406 -70139 -70306 -68957 -69052 -69952 -70303 -70548 -70537 -69646
12017 -69646 -69680 -69371 -70719 -70003 -70682 -69427 -69736 -70571 -70266 -70887 -70558 -69483 -70246 -70272 -69459 -70192 -69840 -70041 -70197
11998 -70197 -69106 -69024 -70780 -69650 -69726 -70797 -70064 -69582 -70315 -70199 -71021 -70504 -70449 -68926 -69368 -71361 -70009 -69548
11980 -69548 -69160 -69702 -69360 -70525 -70303 -69001 -70316 -69857 -69055 -70235 -69990 -70185 -70785 -70064 -69903 -70809 -69450
11963 -69450 -70004 -69564 -69529 -70249 -70396 -70226 -70408 -70658 -70238 -70707 -69380 -70050 -70518 -70351 -68783 -69483 -68554 -69970
11945 -69970 -70841 -70751 -70406 -70863 -71384 -70532 -69904 -70502 -71266 -70564 -70041 -70024 -70576 -70690 -70027 -70239 -70151 -70214 -69577 -70117
11925 -70117 -70132 -70075 -70419 -70222 -70091 -70093 -70351 -69631 -69588 -70284 -70750 -70079 -69114 -69817 -69267 -70548 -70086 -70143 -70778 -70142 -69193
11904 -69193 -69367 -68917 -68475 -69294 -69425 -69732 -70271 -70455 -68871 -69745 -70158 -70334 -70755 -70016 -70336 -69556 -68927 -69337 -70336
11885 -70336 -69605 -68982 -69176 -69728 -69465 -69374 -69872 -69230 -69087 -69978 -69486 -69196 -69277 -69630 -69674 -68884 -68619 -68845 -70426 -71235
11865 -71235 -70909 -71990 -71181 -70846 -69603 -69227 -69852 -69793 -70636 -68943 -69791 -69893 -70542 -70588 -71323 -69318 -70120 -70526
11847 -70526 -69389 -70230 -70927 -68903 -70050 -69254 -70184 -68702 -71312 -72107 -71390 -73093 -71628 -71416 -71165 -69852
11831 -69852 -70941 -70511 -69634 -70998 -70203 -70453 -70363 -70642 -69724 -70479 -69949 -70295 -70150 -69811 -69815 -71009 -70822 -69717 -69974
11812 -69974 -69362 -70938 -71251 -71216 -71916 -71267 -71239 -69601 -70664 -70170 -70592 -69528 -70310 -69713 -70007 -69920 -69603 -71463
11794 -71463 -70048 -71125 -69981 -69744 -70340 -70077 -69777 -70203 -69470 -69232 -68626 -69758 -69507 -69652 -69604 -70328 -69076 -69585
11776 -69585 -69694 -69940 -69905 -69971 -69317 -70413 -70361 -69547 -70022 -70444 -70862 -70406 -69680 -70328 -70182 -70179 -69104 -69836 -69636 -69985
11756 -69985 -69948 -69846 -69741 -70284 -70342 -69662 -70195 -70039 -70659 -70624 -70037 -69744 -69474 -69782 -69643 -70038 -70497 -70124 -70068 -69716
11736 -69716 -69414 -70350 -70925 -70046 -71398 -70445 -70846 -70308 -70139 -69628 -69914 -70833 -70478 -70878 -69907 -69548 -70737 -71754
11718 -71754 -71196 -70170 -69849 -69701 -70555 -71038 -70082 -71089 -69796 -70370 -70306 -69393 -70223 -70508 -69101 -70881 -69613
11701 -69613 -70897 -70011 -70666 -70696 -69867 -70662 -71053 -70604 -71046 -69775 -69581 -70561 -70710 -70238 -70325 -69981 -70107 -69083 -69661
11682 -69661 -70368 -69916 -70661 -70006 -70748 -69207 -69940 -69857 -69633 -70156 -71285 -71498 -70321 -70098 -70424 -70117 -70492 -70425 -70725
11663 -70725 -69296 -70272 -70494 -71145 -70613 -70762 -70735 -71210 -71118 -70988 -71033 -71187 -70655 -70095 -70510 -71129 -70672 -69745 -69950 -69678
11643 -69678 -69629 -70526 -69378 -70188 -69264 -69847 -69766 -69440 -70370 -71017 -70822 -69545 -70921 -70314 -70457 -69993 -70022 -69301 -69940
11624 -69940 -69974 -69783 -68803 -69507 -69158 -69886 -71755 -70148 -71637 -70061 -70427 -70877 -70145 -70031 -69876 -71023 -70620 -70027
11606 -70027 -68950 -69025 -69597 -69733 -68758 -70150 -69414 -71007 -69775 -69240 -69761 -70627 -69333 -68638 -69852 -70423 -70205
11589 -70205 -69906 -70876 -70914 -70455 -70615 -70696 -70654 -69860 -70203 -70267 -69914 -70343 -70690 -70364 -70592 -69870 -70173 -69583 -70000 -69866
11569 -69866 -70508 -70958 -70015 -71075 -70056 -69600 -71182 -69454 -70552 -70567 -70401 -70284 -71618 -70925 -69303 -69995 -71053
11552 -71053 -70527 -71145 -71245 -71345 -71008 -69908 -72061 -71398 -71899 -71289 -71319 -70681 -71759 -72136 -70536 -69467 -70116 -71458
11534 -71458 -71337 -69865 -69949 -69713 -70965 -70392 -69877 -70198 -69427 -71238 -70760 -71054 -70116 -71970 -69834 -71241 -71428
11517 -71428 -70250 -70851 -69925 -70720 -71638 -71746 -71410 -69628 -69730 -70185 -70016 -70049 -71145 -70624 -69947 -70842 -70710 -71172
11499 -71172 -71185 -70686 -70535 -70132 -69786 -70081 -70592 -71520 -70272 -70125 -70426 -70796 -70216 -70422 -70593 -71032 -69955 -70411 -71022
11480 -71022 -70692 -71341 -70249 -70498 -70505 -70363 -70158 -69737 -70351 -70587 -70623 -70168 -69923 -70238 -70856 -71262 -70686 -70935 -71271 -70563
11460 -70563 -69730 -70122 -69762 -70003 -70062 -70319 -69910 -70145 -70866 -69876 -70006 -70096 -70087 -70750 -71331 -70943 -70804 -70942 -70950 -71795 -70437
11439 -70437 -71437 -71686 -71455 -70666 -70243 -70336 -71309 -71098 -71207 -70800 -69253 -70135 -70023 -71245 -70472 -69371 -69454 -69841
11421 -69841 -70775 -70023 -70504 -70746 -70102 -70210 -70774 -71412 -70277 -70774 -70854 -70491 -70994 -72105 -70068 -69396 -69611 -70962
11403 -70962 -70395 -71421 -70944 -71259 -70755 -72110 -71730 -71441 -71002 -70615 -69833 -70862 -70007 -69676 -70769 -70009 -70707 -71012
11385 -71012 -70546 -72676 -71351 -71417 -71589 -69677 -69472 -69373 -69740 -71320 -71344 -70945 -71419 -71338 -71210 -72040 -71987 -70430 -69849
11366 -69849 -69987 -70254 -70619 -71342 -70690 -71433 -70934 -71376 -70861 -70074 -70707 -70646 -71144 -70774 -71258 -69283 -69476 -70108 -70755
11347 -70755 -70934 -70562 -70459 -70582 -70167 -71758 -70607 -70039 -71034 -70425 -70119 -71696 -69868 -70658 -70380 -71481 -70689
11330 -70689 -71128 -70702 -69791 -71173 -71712 -70882 -70716 -71699 -70862 -70574 -70377 -71473 -70440 -70785 -70168 -69952 -70601 -70871
11312 -70871 -71339 -71031 -69836 -70952 -71012 -70198 -70276 -70316 -70257 -70480 -70042 -71031 -71108 -71628 -70093 -70469 -71411 -71173 -71602 -71672
11292 -71672 -70421 -69746 -70416 -70645 -71050 -71381 -71286 -70170 -70517 -70635 -69975 -71943 -70129 -70421 -70247 -69916 -69452 -69992
11274 -69992 -70856 -71091 -69802 -70250 -70697 -69755 -71568 -70938 -70495 -70202 -70399 -70798 -71030 -70098 -70608 -69902 -70472 -70308
11256 -70308 -70750 -69940 -70794 -69786 -70256 -71102 -69993 -71522 -71473 -71151 -70562 -69934 -70694 -71057 -70749 -70273 -68980 -70362
11238 -70362 -71307 -71143 -70799 -69859 -69165 -70389 -71690 -70710 -69489 -70649 -70571 -70203 -70999 -69445 -69891 -70187 -71452
11221 -71452 -71370 -71601 -70491 -71157 -70144 -70592 -70074 -70968 -71339 -71096 -70519 -70922 -71047 -69568 -70375 -71136 -69917 -70817
11203 -70817 -71786 -70562 -69925 -70509 -71275 -70796 -70553 -70620 -70903 -71001 -71127 -70465 -70979 -70820 -72303 -71145 -70759 -70874 -70785
11184 -70785 -69606 -70294 -71686 -70253 -71034 -70409 -71691 -70636 -70532 -71158 -68878 -70345 -70965 -70228 -70243 -70914 -71000
11167 -71000 -69121 -71551 -70541 -70147 -69261 -71027 -69178 -70802 -70835 -70429 -71019 -69499 -71122 -70728 -70977 -71526 -71680
11150 -71680 -70723 -70774 -69293 -69861 -70900 -70938 -69277 -70574 -69530 -70966 -69921 -69695 -70193 -71037 -69791 -69738 -70587
11133 -70587 -68530 -69513 -70821 -69898 -70020 -70342 -69983 -69681 -70628 -70072 -70265 -70068 -71144 -72078 -70331 -69558 -71217
11116 -71217 -71746 -71377 -71169 -70751 -70758 -70790 -70331 -70284 -70109 -70559 -69519 -70344 -70440 -70132 -70323 -70481 -70502 -70105 -70054 -69428 -71170
11095 -71170 -69720 -69636 -69662 -71193 -71422 -69995 -70414 -70462 -70901 -70601 -70489 -71826 -70996 -71410 -72104 -71193 -69835 -71876
11077 -71876 -71965 -70751 -71366 -70543 -70723 -70981 -71131 -71346 -71175 -71264 -71056 -71133 -69464 -71326 -72019 -71183 -70172 -69744 -70247
11058 -70247 -70116 -70846 -70437 -70795 -71502 -70809 -70978 -70713 -73064 -70891 -70089 -71975 -70361 -70193 -70660 -71160 -71173 -70880
11040 -70880 -70919 -71389 -70268 -70792 -71068 -71458 -70777 -70732 -71818 -70743 -71456 -70806 -71100 -70908 -70991 -70224 -70814 -71043 -70210
11021 -70210 -70077 -70430 -70748 -70358 -71031 -70876 -72351 -70685 -70842 -71194 -71316 -71034 -70885 -72240 -71251 -71814 -71178 -71647
11003 -71647 -70883 -71040 -71692 -71210 -69549 -70777 -72022 -70597 -70876 -70298 -70883 -71008 -70265 -70789 -71662 -70762 -70465 -70842
10985 -70842 -71025 -70529 -70529 -70898 -70806 -69818 -71510 -70981 -69773 -70906 -71412 -71453 -70260 -72353 -71021 -71145 -71024 -70721
10967 -70721 -70418 -70843 -70991 -70699 -70167 -71465 -70580 -71495 -70555 -70069 -70341 -71303 -70823 -71550 -71489 -71884 -70668 -70247 -71580
10948 -71580 -70871 -70851 -69708 -70930 -70617 -70486 -71758 -70600 -70785 -70888 -70510 -70189 -70823 -71672 -72136 -70983 -71389 -71089
10930 -71089 -71567 -70845 -70582 -70920 -70952 -71108 -70945 -70697 -71957 -71283 -71429 -71704 -71275 -69902 -71261 -70929 -71009 -72042
10912 -72042 -71771 -71602 -71230 -70814 -71337 -70564 -70845 -71679 -71260 -72064 -70938 -70786 -70747 -72218 -71967 -70421 -71218 -70747
10894 -70747 -70943 -71536 -70402 -70364 -70281 -70159 -71422 -70679 -70119 -71393 -69828 -70404 -70514 -70190 -71494 -70011 -70666 -70887
10876 -70887 -70613 -70747 -72644 -71268 -71104 -71332 -70577 -71509 -69923 -70473 -70897 -70808 -70125 -70743 -70674 -70968 -70612 -70785 -71226
10857 -71226 -71206 -69926 -70969 -70135 -70629 -71458 -70543 -71012 -70772 -72050 -71051 -71713 -71336 -71485 -71520 -69831 -71954 -72410
10839 -72410 -70966 -71594 -71141 -70906 -70735 -71627 -72016 -71683 -72631 -71709 -72664 -71807 -71543 -72219 -72339 -72656 -72450 -71493 -72881
10820 -72881 -73468 -73484 -74487 -74734 -74274 -75450 -75374 -74635 -76260 -74816 -73001 -68852 -67540 -66532 -64378 -62745
10804 -62745 -62484 -62795 -64199 -65394 -66345 -66849 -69836 -69819 -69780 -71863 -70593 -70417 -71050 -71182 -71172 -70664 -71684 -70275
10786 -70275 -71870 -70613 -70751 -70512 -69907 -71106 -71816 -71718 -71405 -70765 -70772 -72342 -71476 -70594 -71154 -71359 -71082 -71187 -71704
10767 -71704 -70943 -69085 -72460 -70232 -71172 -72422 -72278 -70332 -71140 -71237 -72337 -71262 -71048 -71098 -71189 -71347 -71177 -71194
10749 -71194 -71179 -71800 -70863 -70359 -71876 -71957 -71247 -71174 -72211 -70410 -70744 -70879 -71160 -71860 -71180 -71788 -70857 -71296 -71335
10730 -71335 -70437 -71118 -71835 -71362 -71559 -71406 -71103 -70251 -70830 -72504 -71386 -71394 -71523 -71071 -70400 -70788 -71011 -70913 -71747
10711 -71747 -72202 -71553 -71052 -71659 -70937 -71963 -71891 -71786 -71158 -71823 -70953 -71094 -71241 -70025 -71354 -70748 -71844 -72273
10693 -72273 -71554 -71495 -70867 -71129 -70779 -71080 -71461 -71259 -70845 -71543 -70200 -70068 -70964 -71909 -71531 -70942 -72026 -71146 -73079
10674 -73079 -71162 -71951 -71616 -70275 -70606 -70347 -70942 -70924 -71069 -71066 -71758 -71323 -71650 -71190 -70717 -71833 -71713 -71771 -71099
10655 -71099 -71848 -71205 -71813 -70421 -72232 -71497 -71331 -71761 -71013 -70434 -70836 -71107 -70372 -72123 -70775 -70527 -71178 -71833
10637 -71833 -71111 -70483 -71062 -70953 -70545 -71277 -72047 -71013 -71086 -71174 -72103 -71979 -71476 -70770 -71598 -70773 -71478 -71690 -71946
10618 -71946 -72199 -72610 -72278 -71977 -70983 -71341 -70653 -71180 -70808 -71902 -71263 -71172 -71168 -72109 -71648 -70906 -71408 -71064 -71459 -72317
10598 -72317 -71812 -71456 -71106 -71348 -70316 -70823 -70579 -71212 -70894 -71098 -70411 -71391 -71630 -71168 -71384 -70919 -71825 -71688 -72049
10579 -72049 -72179 -71818 -71518 -71777 -71175 -70923 -71255 -70747 -70582 -70041 -71678 -71246 -70850 -70924 -71440 -71607 -72326 -71995 -71576
10560 -71576 -71522 -71747 -71404 -71946 -70617 -71545 -71237 -70745 -71343 -70642 -71699 -71418 -71784 -71539 -70375 -71317 -70298 -71666
10542 -71666 -71568 -71598 -72330 -72646 -71050 -72744 -71433 -72224 -72045 -71139 -72464 -72789 -70491 -71424 -70906 -72150 -70368
10525 -70368 -70007 -70534 -70048 -70105 -70503 -70662 -71628 -70968 -72410 -71873 -72969 -72999 -73197 -73855 -73011 -72334 -72479 -72107 -72402
10506 -72402 -72151 -72605 -72175 -72263 -71156 -71678 -71863 -71733 -70706 -71256 -71529 -71494 -70282 -70589 -71980 -71818 -72072 -72783
10488 -72783 -72399 -72434 -72421 -72999 -72002 -72019 -71878 -71649 -70972 -71794 -71228 -71567 -70435 -70382 -71070 -71544 -71025 -69982 -70896 -71884
10468 -71884 -71717 -71818 -72168 -72514 -70890 -72107 -72503 -72238 -71685 -71693 -71936 -71872 -72062 -71447 -70911 -70786 -71722 -70873 -71089
10449 -71089 -70511 -71419 -71264 -71783 -72078 -70266 -70822 -71009 -71807 -71686 -72325 -72445 -71061 -71435 -71569 -71120 -71442 -72046
10431 -72046 -71806 -70880 -71688 -71028 -71932 -72482 -71813 -70882 -70978 -71097 -71502 -72044 -71674 -71043 -71494 -72261 -72013 -71881 -71002
10412 -71002 -71104 -70869 -71010 -72045 -72614 -71728 -71221 -71704 -71582 -72514 -71382 -71044 -70901 -72009 -72664 -73298 -71627 -70305
10394 -70305 -71630 -72064 -73019 -72493 -70894 -70546 -70941 -72497 -72557 -71917 -71647 -71322 -70683 -72901 -72305 -72284 -71668 -71882
10376 -71882 -72257 -71559 -72480 -71288 -71064 -71098 -72712 -73721 -72352 -71163 -71220 -71261 -72654 -71389 -70437 -70286 -70705 -71403
10358 -71403 -72440 -72456 -70157 -70582 -70776 -71608 -72992 -73671 -72219 -71824 -72050 -72229 -70974 -70892 -70571 -72434 -72580 -72650
10340 -72650 -72653 -70842 -71719 -72086 -71986 -73335 -70740 -71302 -69787 -71652 -72282 -73009 -71424 -70716 -71102 -71521 -73489
10323 -73489 -72737 -72366 -72030 -72145 -71934 -72451 -71833 -70972 -72769 -72608 -72791 -71729 -70863 -70605 -71544 -71967 -72769 -72172
10305 -72172 -69797 -69920 -70107 -72326 -72349 -71981 -70784 -70790 -70947 -73299 -72529 -71250 -71060 -70738 -71001 -72900 -71183 -71374
10287 -71374 -71316 -71642 -72514 -71528 -71234 -71322 -71585 -71185 -71395 -70951 -69709 -71603 -71983 -71879 -72435 -71460 -71362 -71270 -71780 -72905
10267 -72905 -72865 -72473 -71605 -72032 -72153 -72374 -72961 -72136 -71769 -71463 -72847 -71542 -70873 -72404 -71403 -71576 -72513 -70560
10249 -70560 -71108 -72050 -71635 -71492 -71225 -71011 -71539 -72404 -72398 -71884 -72561 -73120 -71945 -71386 -71460 -72112 -71183 -71806 -71014 -71758
10229 -71758 -69665 -71609 -71919 -72103 -72175 -70977 -71153 -71574 -71127 -71294 -71588 -71928 -71360 -71554 -71725 -72028 -70905 -71457
10211 -71457 -71224 -71964 -72386 -72747 -71759 -70783 -72722 -72813 -71935 -71534 -71273 -71088 -72003 -71743 -70650 -71656 -69906 -70816
10193 -70816 -71001 -71092 -71805 -71005 -70503 -70638 -72281 -71106 -70447 -71462 -70842 -71414 -72695 -72682 -71726 -71163 -71370 -71253
10175 -71253 -71987 -72692 -72885 -72148 -72071 -72017 -72473 -71425 -71795 -72141 -71725 -71608 -71411 -71190 -71981 -72146 -71592 -70646 -72017
10156 -72017 -71486 -71569 -73055 -72268 -71569 -71306 -71031 -71016 -72167 -71747 -71028 -72745 -72202 -71945 -71673 -71329 -71757 -72534 -71237
10137 -71237 -72098 -72767 -71798 -72153 -71456 -71998 -71844 -70915 -71970 -72116 -72590 -72259 -73257 -71634 -71310 -72190 -72795 -72174
10119 -72174 -71488 -71858 -71702 -71920 -71202 -72958 -72142 -71728 -71432 -70694 -71889 -71221 -71717 -71863 -71467 -71978 -72256 -71782
10101 -71782 -71711 -72174 -72064 -71535 -71868 -71196 -71426 -71532 -71555 -71700 -71502 -71900 -71829 -71900 -71768 -71975 -72588 -71297 -71359 -72321
10081 -72321 -72175 -72227 -71488 -72348 -70852 -71118 -72092 -72122 -71951 -70695 -71057 -71573 -70879 -71737 -70682 -71435 -70071 -71254
10063 -71254 -70679 -72258 -71526 -71972 -71834 -72171 -70935 -71162 -71712 -71577 -71870 -72195 -72495 -72936 -71921 -70747 -72660
10046 -72660 -70990 -72984 -71562 -70868 -71384 -71598 -71694 -71903 -72277 -71929 -71234 -71674 -71514 -71520 -71722 -71413 -72150 -72508 -72066
10027 -72066 -70876 -71481 -71535 -71582 -71907 -71500 -71012 -71819 -71176 -71606 -72441 -72798 -72410 -72015 -72125 -71915 -72502 -72387 -73204
10008 -73204 -73214 -72542 -73438 -72428 -73333 -72227 -70886 -71112 -71294 -72863 -71784 -72541 -72334 -72456 -73617 -72070 -73473
9991 -73473 -72308 -72712 -72777 -72610 -72081 -72072 -73233 -71851 -72743 -72890 -72573 -71660 -71691 -72028 -73530 -72895 -72749 -74804 -70519
9972 -70519 -71706 -72634 -71866 -72398 -72729 -72471 -71979 -72042 -73693 -72051 -73366 -72901 -72882 -72969 -72999 -72631 -71931 -72714 -72140
9953 -72140 -72499 -73547 -71711 -73219 -73031 -71574 -71441 -72038 -72012 -72613 -70848 -73579 -72080 -72670 -71703 -71576 -72107
9936 -72107 -71815 -72287 -73265 -73240 -72518 -71600 -72898 -71899 -72797 -72379 -71314 -71883 -72815 -73362 -73347 -72404 -72270 -72084 -71323
9917 -71323 -71896 -71880 -72079 -71296 -72129 -71813 -72182 -71975 -72250 -71858 -72590 -71372 -72499 -72237 -72547 -71109 -72052 -71602 -71947
9898 -71947 -72397 -73191 -72903 -72817 -72209 -71771 -72019 -72171 -72581 -72594 -72562 -72422 -72640 -73508 -72405 -72292 -72992 -71734 -73497
9879 -73497 -72854 -72605 -73601 -73194 -72744 -72716 -73063 -72177 -72593 -73000 -73755 -72949 -71457 -72735 -71882 -72767 -72750 -72755 -72528 -73110
9859 -73110 -72540 -72619 -73199 -71550 -71300 -71643 -70964 -71896 -72161 -72699 -72073 -72005 -72181 -72319 -72814 -73537 -73022 -71385 -72748
9840 -72748 -71948 -72130 -72780 -73069 -71186 -73165 -72288 -71372 -71767 -72420 -72024 -72692 -73459 -72267 -72191 -72646 -71696 -72440 -72904
9821 -72904 -72176 -71912 -71565 -72292 -72713 -72936 -73117 -73250 -72210 -71868 -72852 -72578 -72363 -72025 -72007 -72677 -72501 -71665 -73633
9802 -73633 -73096 -72227 -73022 -72089 -73114 -72864 -72383 -72300 -72653 -72684 -72546 -72290 -71891 -71776 -72111 -72125 -73738 -72778 -72308 -71438
9782 -71438 -71627 -71515 -72269 -72167 -72934 -72138 -72223 -71944 -71553 -72662 -71444 -72597 -72702 -72750 -72415 -71993 -71924 -71957 -71207 -71822
9762 -71822 -72312 -71535 -71886 -71740 -72286 -71002 -71071 -71465 -72254 -71970 -73032 -72790 -72521 -71898 -72187 -71683 -71274 -71681 -71552
9743 -71552 -72946 -72328 -72711 -71762 -73329 -73502 -72377 -72221 -72151 -72523 -72563 -72714 -71863 -71445 -72560 -72456 -72834 -72355 -71610
9724 -71610 -72478 -72389 -72797 -72087 -72425 -72364 -72263 -72109 -71716 -71727 -70988 -71967 -71768 -72246 -72294 -73108 -72873 -72867 -72057 -71886 -73238
9703 -73238 -72209 -72752 -72061 -72699 -71219 -71654 -71638 -71955 -72427 -73143 -71962 -73471 -72154 -71942 -72230 -71971 -71346 -72462
9685 -72462 -71346 -72913 -72740 -72890 -71743 -71800 -73651 -73335 -72975 -72687 -72176 -71129 -71253 -71614 -71843 -72704 -71802 -72370
9667 -72370 -73418 -71471 -71763 -73016 -72158 -71775 -73110 -72442 -72484 -72494 -72399 -72996 -71989 -72037 -72315 -72010 -71459 -72703 -72735
9648 -72735 -73035 -72421 -72183 -73018 -73343 -73430 -74636 -73514 -73449 -71376 -72007 -71520 -73643 -72868 -72926 -73315 -72051 -73049 -73090
9629 -73090 -72316 -72412 -72924 -73647 -72727 -73925 -72826 -73527 -73058 -72948 -73036 -74507 -74171 -72731 -73423 -72587 -72704 -74040
9611 -74040 -72852 -72645 -72119 -72990 -73409 -72989 -73170 -73254 -72376 -72906 -73853 -72473 -73322 -73780 -72803 -73775 -72999 -73498 -73443
9592 -73443 -73269 -73261 -73558 -72400 -72446 -72472 -72130 -72889 -73381 -73028 -72881 -73456 -73303 -74877 -75508 -73870 -72408 -73569 -73286
9573 -73286 -73225 -72511 -73786 -73160 -72958 -73198 -72932 -73646 -73289 -72360 -72847 -72566 -70873 -71774 -72358 -72619 -71814 -73563 -73047
9554 -73047 -72637 -72195 -74001 -72604 -73075 -73268 -72616 -72951 -72775 -72631 -73149 -73402 -72260 -72307 -71817 -72425 -72132 -72570 -72382
9535 -72382 -72966 -72092 -72153 -72737 -72226 -72757 -72101 -73486 -73188 -73151 -73126 -72625 -72540 -71916 -72013 -72304 -73288 -70893 -72992 -72918
9515 -72918 -73157 -73056 -73268 -73196 -73104 -72985 -72700 -72055 -72679 -73156 -73780 -72929 -72819 -71713 -72100 -72610 -72607 -72661 -73108 -71060
9495 -71060 -71789 -71832 -71334 -72889 -71590 -71688 -71880 -71683 -72470 -71843 -72168 -72995 -72975 -74818 -74021 -73784 -72881 -73289 -72879
9476 -72879 -73209 -73529 -72373 -73014 -71333 -72408 -72250 -72300 -73262 -72544 -72400 -72776 -72626 -71461 -70313 -71006 -71763 -71447
9458 -71447 -71306 -71313 -72693 -75165 -74339 -73384 -73749 -73558 -73860 -72944 -72317 -72175 -70633 -72082 -71420 -71612 -72398 -73045 -73224
9439 -73224 -72239 -72442 -72930 -72165 -72274 -72630 -72401 -71972 -72510 -72677 -72677 -73355 -73720 -73529 -73371 -73118 -73734 -72528 -73326 -72937
9419 -72937 -72127 -72268 -71717 -72250 -72588 -71569 -72998 -71567 -72076 -72140 -73286 -71915 -72955 -73155 -72284 -72286 -73689 -72092
9401 -72092 -72521 -72928 -72414 -72484 -71796 -72259 -72208 -73222 -73339 -72880 -72467 -72702 -72007 -72444 -71665 -71059 -71940 -72215 -72480 -73071
9381 -73071 -72834 -72741 -72762 -74145 -72016 -73126 -73576 -71714 -71958 -71442 -73044 -71619 -72389 -71218 -73003 -72068 -72349
9364 -72349 -71078 -71663 -72190 -73068 -72672 -72769 -72392 -71648 -72579 -71468 -71234 -70506 -71946 -71557 -70961 -71306 -71206 -72723
9346 -72723 -71688 -71742 -71733 -72050 -71566 -70147 -71544 -71959 -71620 -71554 -71716 -72205 -72407 -72664 -71961 -71757 -72996 -72108 -71256
9327 -71256 -72296 -72195 -72138 -71704 -72186 -71909 -71936 -73650 -72258 -71793 -71608 -72835 -72749 -74121 -71867 -72361 -73258 -72816
9309 -72816 -73141 -74286 -73517 -71850 -72857 -72367 -71738 -72935 -72003 -74666 -72077 -72565 -72116 -72651 -73379 -72951 -73049 -72871
9291 -72871 -72800 -72687 -71979 -72570 -71799 -71870 -73255 -72707 -72752 -72561 -72709 -72807 -72301 -72013 -72757 -72627 -72670 -73056 -72683 -73049 -73399
9270 -73399 -73418 -72993 -72760 -72825 -72281 -72710 -73298 -72777 -71755 -71583 -72946 -72739 -72488 -73234 -72687 -72525 -70882 -72563 -73385
9251 -73385 -72325 -72129 -72616 -74603 -73031 -73091 -73366 -72343 -72190 -72196 -72719 -72965 -72477 -72816 -72199 -71996 -71729 -73014 -72042
9232 -72042 -72464 -73495 -73201 -72841 -73204 -72437 -72938 -72581 -73618 -72966 -73435 -71506 -73366 -73317 -72632 -72824 -73778 -71614
9214 -71614 -71606 -72188 -72260 -73302 -72755 -72969 -72961 -72983 -73328 -73165 -73486 -73216 -73178 -73025 -72689 -73103 -72216 -72639 -72740 -73033 -72635
9193 -72635 -72178 -72292 -72411 -72002 -71831 -72341 -71436 -72428 -72146 -73300 -72252 -71054 -73282 -73690 -73936 -74308 -74901 -73254
9175 -73254 -73520 -73564 -72279 -73479 -73736 -73425 -72662 -72657 -72954 -72830 -73518 -73986 -72001 -73006 -73274 -72681 -73424 -72219 -73553
9156 -73553 -73478 -72873 -72914 -73273 -73093 -72708 -72447 -73428 -74453 -74549 -74042 -72848 -74062 -72101 -71659 -73318 -72524 -73417 -72216
9137 -72216 -72724 -73455 -71856 -72979 -73615 -72289 -73321 -72999 -73628 -72598 -72515 -72740 -73619 -71875 -72651 -72855 -72375 -72823
9119 -72823 -72717 -71957 -73807 -72687 -72138 -73622 -74243 -73696 -73198 -71683 -73405 -73220 -72368 -72725 -74123 -73297 -73207 -72537
9101 -72537 -73063 -73448 -72154 -72408 -71849 -73171 -72164 -72222 -71628 -71728 -72910 -72627 -71909 -72237 -72083 -73740 -72625 -73211
9083 -73211 -72415 -72558 -72415 -72905 -73156 -72489 -72225 -72510 -72571 -73054 -72812 -72825 -72341 -72691 -73203 -72854 -72632 -72860 -73506 -73313
9063 -73313 -73250 -74511 -72431 -73307 -73920 -73153 -73057 -73011 -72644 -72657 -73329 -72296 -73470 -73456 -73439 -72763 -73217 -73788 -73697 -72510
9043 -72510 -73124 -73539 -72999 -73886 -73652 -74118 -72865 -73081 -73546 -74371 -74407 -73747 -73217 -72703 -73168 -73479 -74561 -73219 -73369
9024 -73369 -73859 -73582 -73489 -72792 -74107 -73475 -73635 -73512 -72295 -73821 -72837 -74286 -73550 -74097 -73465 -74239 -73549 -73308
9006 -73308 -73052 -73998 -71667 -73861 -73315 -73850 -74122 -73087 -72891 -72489 -73161 -72890 -73419 -72521 -71925 -73122 -73049 -72765
8988 -72765 -73557 -74180 -73556 -72263 -71978 -72871 -73472 -73714 -74155 -73892 -73046 -72791 -73916 -73064 -73213 -73429 -73628 -73240 -72925
8969 -72925 -73545 -73307 -73434 -74077 -73572 -73382 -73733 -73314 -73069 -74228 -73458 -73278 -73150 -72872 -74001 -73817 -74497 -73576 -73471
8950 -73471 -74978 -74153 -74549 -74323 -73157 -75080 -74053 -74037 -74177 -74292 -73205 -75231 -73624 -74121 -74638 -74198 -75214
8933 -75214 -73566 -73494 -72748 -74391 -73555 -73565 -73947 -73550 -73674 -73425 -73349 -73169 -73225 -73542 -72791 -74312 -73626 -72842 -73731 -73334
8913 -73334 -73924 -73217 -73558 -74736 -73630 -74082 -74333 -73608 -73365 -74881 -73571 -75141 -75055 -73205 -73374 -75169 -74803
8896 -74803 -74184 -72758 -74660 -73746 -74559 -73939 -74475 -74025 -73865 -74012 -72809 -73156 -74458 -73800 -73382 -74350 -73711 -73311
8878 -73311 -73804 -74398 -74897 -75187 -74670 -74796 -74339 -74364 -73769 -75264 -74353 -74099 -74503 -74306 -73949 -75584 -74248 -73979 -75271
8859 -75271 -73750 -73820 -73069 -73915 -75296 -74512 -73075 -73203 -72774 -73722 -74703 -73666 -72720 -74178 -74845 -74217 -74238 -74114
8841 -74114 -75134 -73634 -74820 -73580 -73697 -75242 -74378 -72791 -73536 -74118 -73831 -73990 -73097 -73866 -73261 -74015 -74795
8824 -74795 -73613 -74988 -74115 -74801 -75014 -74122 -74478 -74423 -74718 -73815 -74429 -73756 -75165 -75261 -74858 -75672 -75960 -74912 -75577
8805 -75577 -74914 -73928 -75006 -75015 -73412 -73752 -75072 -75228 -74772 -74162 -75608 -75375 -75289 -74682 -73605 -73906 -76299 -75882
8787 -75882 -77583 -80467 -72280 -74181 -73901 -74708 -75221 -72927 -74197 -73734 -74462 -74227 -74788 -75956 -75560 -75725 -74588
8770 -74588 -73389 -74488 -75866 -75872 -74067 -75104 -74476 -74651 -75966 -75927 -74871 -74794 -74965 -75362 -75357 -75684 -74710 -75124 -76397
8751 -76397 -76404 -75762 -75424 -75586 -75015 -75511 -75664 -76402 -74885 -75486 -75090 -75869 -75537 -75828 -75770 -75674 -75032 -75162 -75977 -75378
8731 -75378 -75681 -76415 -75461 -75082 -75257 -75424 -75373 -76409 -76684 -74968 -77587 -75368 -75998 -74981 -75168 -74277 -73548 -75297
8713 -75297 -75450 -75708 -75843 -76163 -75580 -75308 -76041 -75718 -75599 -76312 -76292 -77426 -76595 -77305 -76251 -76338 -77413 -76066 -76361
8694 -76361 -76116 -76892 -76486 -76892 -78052 -77447 -77507 -77607 -78213 -77236 -76394 -77704 -76310 -76399 -76613 -76751 -78063 -76688
8676 -76688 -76656 -76595 -77752 -77266 -77871 -77455 -77188 -76932 -76315 -77003 -78100 -77357 -78168 -77801 -77715 -76250 -77055 -77904 -78278
8657 -78278 -78434 -78006 -79113 -78837 -78472 -78918 -77184 -77630 -78298 -76349 -77070 -77259 -77995 -78122 -78257 -78911 -79090 -78865
8639 -78865 -78855 -79734 -79907 -78850 -79553 -79356 -80268 -80118 -79842 -80177 -78731 -78596 -78092 -79151 -79054 -78594 -79693 -80347 -82366
8620 -82366 -83059 -81409 -83647 -82921 -82196 -80906 -82416 -82744 -83135 -83345 -83143 -82888 -83134 -82681 -82873 -84031 -84710 -84569
8602 -84569 -85305 -83841 -85241 -84347 -85110 -85572 -84748 -85369 -84513 -84914 -83298 -84441 -85040 -84915 -84787 -84319 -82713 -83248
8584 -83248 -83489 -82697 -82378 -82263 -82268 -82644 -82647 -83847 -84070 -83293 -84851 -84958 -86157 -85751 -84969 -84871 -84085 -83354 -83665 -81833
8564 -81833 -78369 -79819 -77809 -76211 -76403 -76334 -77601 -76434 -77486 -77636 -76961 -77176 -77061 -76901 -77401 -77258 -75223
8547 -75223 -75494 -75255 -74139 -74671 -73654 -73461 -73737 -73854 -73510 -74678 -74775 -76421 -73878 -59132 -69442 -68738 -70587
8530 -70587 -70847 -69895 -69314 -69016 -69001 -69451 -69916 -70631 -70077 -68210 -68330 -69604 -69880 -69211 -68109 -65950 -67138 -69556
8512 -69556 -68920 -69150 -68163 -69139 -70510 -68936 -70077 -69882 -69752 -69595 -69531 -67556 -68701 -67195 -69455 -69331 -68319
8495 -68319 -68380 -67055 -65727 -66476 -68788 -68990 -68520 -69084 -68375 -68746 -70466 -70861 -69967 -69468 -68777 -68489 -68504 -66367
8477 -66367 -68473 -68335 -69399 -67870 -68701 -69773 -69191 -69525 -68549 -69033 -68857 -68988 -69817 -71408 -68827 -69196 -68906
8460 -68906 -69350 -69844 -68960 -70199 -68874 -67473 -68674 -69408 -69979 -69889 -71464 -71663 -71089 -68918 -68595 -69295 -69746 -70482
8442 -70482 -69964 -69879 -69632 -69366 -70695 -72688 -70170 -69516 -68875 -69557 -71147 -72493 -70937 -68814 -68285 -68372 -69169 -70406
8424 -70406 -71011 -69877 -71038 -72037 -70158 -70189 -69452 -69092 -68612 -70758 -70536 -68849 -68143 -67824 -69009 -71934 -71348
8407 -71348 -69980 -68121 -67888 -70683 -71708 -71262 -70261 -67969 -67903 -69457 -70429 -69537 -69842 -71259 -72996 -71973
8391 -71973 -70568 -69955 -70044 -70104 -71952 -71830 -71034 -70611 -68830 -71300 -71698 -71870 -71225 -68665 -68701 -70196 -71607 -72169
8373 -72169 -69246 -69684 -69622 -70572 -69675 -71243 -71485 -71516 -70940 -70711 -69996 -70564 -68973 -71083 -71467 -71678 -70839 -69138
8355 -69138 -70018 -70509 -71266 -73362 -70308 -70189 -70020 -70325 -70594 -71320 -72198 -70923 -71435 -71642 -71322 -71261 -71240 -70203 -70147
8336 -70147 -70691 -71575 -70869 -71266 -71471 -70442 -70338 -69147 -69503 -69902 -72690 -69878 -69604 -72540 -71521 -71744 -71129
8319 -71129 -70462 -70452 -70285 -71273 -72513 -71533 -69794 -72514 -70962 -71522 -71836 -71842 -71781 -71309 -71477 -72561 -69631 -68915 -70199
8300 -70199 -71630 -71303 -71821 -71031 -71401 -70298 -71416 -71479 -71312 -71191 -70742 -70857 -71460 -72635 -69415 -71290 -72175 -71757
8282 -71757 -71567 -71826 -70385 -69787 -71839 -71026 -70973 -70956 -70392 -70590 -72316 -71981 -70682 -71174 -70454 -71858 -70591 -71387
8264 -71387 -70754 -71696 -70662 -71587 -71937 -72602 -71587 -69693 -71402 -68463 -70581 -71733 -74696 -71338 -71540 -70275
8248 -70275 -72160 -71664 -73090 -71206 -71734 -70716 -73284 -72295 -71041 -73356 -72999 -70611 -68927 -68967 -72549 -70225
8232 -70225 -70103 -70125 -70404 -70466 -70018 -71063 -72057 -72655 -70672 -70938 -72289 -70927 -72319 -72355 -71775 -73078 -72836 -70750
8214 -70750 -72200 -71635 -69411 -71271 -72168 -73215 -70023 -71408 -73769 -72769 -68563 -70912 -68704 -71199 -72171
8199 -72171 -72970 -69829 -70639 -67298 -73780 -66772 -64105 -27541 -73613 -67394 -73137 -73837 -75737 -73531 -75626
8184 -75626 -75348 -70536 -72058 -73852 -73478 -73334 -73254 -71639 -72684 -72069 -74739 -72134 -70988 -70038 -71050 -72288
8168 -72288 -70562 -72426 -70028 -72480 -72782 -73255 -69727 -71384 -72481 -72836 -72235 -72501 -72484 -70840 -71298 -73811 -72623
8151 -72623 -70308 -70431 -71949 -72089 -73402 -70907 -73058 -71603 -71111 -71533 -72076 -71170 -71972 -71754 -72113 -72426 -72410 -70042
8133 -70042 -72177 -70758 -71815 -71910 -71626 -71165 -73298 -70718 -70740 -71469 -72597 -71820 -71701 -72093 -72158 -72012 -72623 -74715
8115 -74715 -73334 -72289 -72305 -70271 -71879 -70563 -72409 -72970 -70941 -70951 -71806 -72945 -70885 -70752 -72207 -70599
8099 -70599 -73580 -71670 -71714 -72655 -71472 -70708 -71678 -70080 -70038 -71926 -72455 -71557 -70510 -70543 -72616 -71823 -71517 -71711
8081 -71711 -71896 -71833 -71325 -72738 -71862 -73021 -71435 -71895 -72841 -72704 -72041 -73501 -74168 -72054 -71390 -72910 -72676 -72618
8063 -72618 -71782 -72061 -73254 -72406 -73523 -73964 -72237 -72917 -72778 -72740 -72719 -71455 -72577 -72261 -71148 -72903 -71539
8046 -71539 -71798 -73118 -72933 -73035 -71515 -73808 -72373 -72445 -72663 -73351 -71683 -71675 -72178 -72626 -71303 -72100 -73531 -72641
8028 -72641 -73678 -72769 -72308 -73123 -72561 -73181 -72092 -72230 -71307 -72710 -73184 -71659 -71526 -72324 -73470 -72109 -72304
8011 -72304 -71824 -72973 -72351 -72434 -72251 -72158 -73829 -72752 -73553 -72565 -71872 -73832 -73262 -72264 -73090 -71317 -72168 -76786
7993 -76786 -72640 -72144 -73112 -71817 -73115 -73514 -71809 -72713 -72808 -72458 -73068 -72767 -73225 -72880 -70681 -72223 -71688 -72265
7975 -72265 -72641 -74078 -73339 -73409 -72180 -71848 -73415 -72586 -71990 -71986 -71533 -72551 -72403 -72396 -72468 -73403 -72363 -73434 -72741
7956 -72741 -73370 -71739 -72881 -72375 -71934 -73252 -72979 -72600 -72620 -73030 -74020 -73167 -70896 -72767 -73999 -73224 -73913 -73469
7938 -73469 -74081 -73327 -72500 -73019 -73288 -73378 -73363 -73635 -71899 -72127 -73197 -72884 -71816 -71914 -72255 -73864 -72884 -73346 -74010
7919 -74010 -72950 -71778 -73432 -73337 -73051 -72036 -73438 -73261 -73517 -73393 -72365 -72042 -73250 -72525 -73580 -73804 -73343
7902 -73343 -73287 -73657 -72406 -73643 -74175 -73677 -72785 -71994 -73097 -71860 -73214 -73506 -71694 -74294 -71977 -73149 -72711
7885 -72711 -73514 -73131 -72466 -72368 -72462 -73968 -72281 -73053 -71127 -72443 -72246 -72772 -72933 -72664 -72277 -72459 -71707 -72945
7867 -72945 -72781 -73025 -72619 -72547 -74320 -74709 -74722 -72591 -73359 -72734 -74459 -75131 -75977 -76503 -75898 -78701 -86383 -133211
7849 -133211 -71949 -66930 -68964 -68338 -69457 -71739 -70638 -69869 -71238 -71088 -71074 -71769 -71712 -71127 -71096 -72424 -70630
7832 -70630 -71514 -70301 -71328 -72666 -71605 -70139 -70894 -70408 -71122 -71466 -70248 -72987 -72055 -72541 -72496 -70618 -73676
7815 -73676 -72441 -72147 -72367 -71716 -72967 -72245 -72065 -72650 -72444 -72225 -70955 -72560 -73117 -72767 -71412 -72411 -72588 -70868
7797 -70868 -71919 -70564 -72469 -71697 -71382 -72113 -71616 -70652 -72270 -70920 -71421 -71309 -71490 -73356 -71443 -71562 -71507
7780 -71507 -71264 -70801 -72325 -71725 -71475 -71623 -73146 -71806 -71628 -72196 -71388 -71518 -71559 -70737 -71605 -70532 -70896 -72328
7762 -72328 -71851 -71998 -71905 -71051 -71285 -70950 -71989 -71502 -71293 -71385 -71668 -71564 -71425 -70838 -71533 -72634 -71425 -70896 -71655
7743 -71655 -69576 -71404 -71627 -71073 -71342 -72341 -71786 -70612 -70972 -71516 -71905 -72017 -72436 -71643 -71334 -71009 -71362 -71236
7725 -71236 -71780 -72070 -71337 -71465 -72324 -71295 -71433 -71502 -71239 -71106 -71733 -71736 -71745 -71773 -72362 -71443 -71206 -70560 -70602 -71949 -71127
7704 -71127 -70699 -72381 -71094 -72075 -71452 -71725 -71324 -71823 -71377 -71144 -72364 -70745 -71966 -71095 -71328 -71370 -71654 -71760
7686 -71760 -72797 -73159 -72285 -71935 -71391 -72349 -71575 -72829 -72272 -71478 -71071 -71733 -71468 -72497 -72021 -71481 -72964 -73494
7668 -73494 -71281 -70260 -70217 -70470 -71317 -72482 -72728 -71702 -72175 -72065 -71199 -71891 -71509 -72248 -73961 -72758 -73252 -72897
7650 -72897 -72708 -72644 -72373 -72891 -72059 -71650 -71857 -71858 -71834 -71710 -70633 -72177 -72650 -71723 -71571 -72202 -72949 -71925 -71699 -72853
7630 -72853 -72528 -72433 -71715 -72041 -72509 -71592 -71674 -72014 -72927 -73373 -73110 -73173 -72913 -73103 -72674 -72198 -71742 -72546 -71812 -73262
7610 -73262 -73238 -72728 -73664 -72615 -73554 -73503 -73800 -73223 -72527 -73652 -73320 -71614 -65141 -72018 -71782 -72334 -71753 -72062
7592 -72062 -71625 -73039 -73230 -72748 -73784 -73793 -74284 -73705 -73236 -73842 -73343 -74374 -74569 -73934 -74138 -73989 -72917 -73404 -73791
7573 -73791 -73532 -74518 -75242 -75545 -76061 -76396 -74497 -74558 -75355 -75639 -75225 -75470 -74582 -76024 -75406 -76496 -75703 -75718 -75996
7554 -75996 -74258 -73998 -74758 -74182 -73995 -74613 -74685 -74050 -73474 -74988 -75793 -76165 -75120 -76146 -76431 -77704 -78244 -79711
7536 -79711 -79622 -78700 -77415 -75387 -73585 -72949 -71147 -71628 -72519 -73697 -71036 -72522 -73051 -74030 -72820 -73314 -73419
7519 -73419 -72605 -70872 -70805 -70983 -71111 -70671 -71320 -72865 -72948 -74031 -74994 -74885 -74142 -71885 -71486 -68727 -66472 -65607
7501 -65607 -65587 -66005 -65948 -66944 -67167 -67925 -67121 -68551 -69383 -67573 -67059 -65721 -64811 -65852 -64803 -65803 -65930 -65935 -65349
7482 -65349 -65420 -64484 -65763 -65033 -64833 -65095 -63802 -64241 -64939 -64306 -64291 -62836 -62749 -61882 -62421 -61390 -62284 -62158 -61117
7463 -61117 -62378 -62432 -61781 -61937 -61437 -62476 -62353 -60150 -59762 -62224 -60633 -60873 -60178 -61306 -62754 -62755 -61198 -62971
7445 -62971 -61128 -60983 -60827 -59747 -61270 -60368 -60007 -60069 -60289 -60820 -59769 -60263 -61887 -60653 -60757 -59599 -59824
7428 -59824 -59789 -61726 -62549 -60957 -61457 -61516 -60277 -60797 -60915 -60904 -59709 -60688 -59612 -60810 -60036 -61235 -61006 -60045
7410 -60045 -61570 -60394 -60456 -60685 -60181 -60356 -60495 -61725 -60850 -60354 -61475 -60675 -61192 -60527 -61186 -59686 -60904 -59100
7392 -59100 -59292 -59214 -59926 -60343 -60061 -60556 -59600 -59180 -60679 -58511 -60253 -60503 -61713 -60331 -61702 -60778 -60663 -60610
7374 -60610 -60926 -62062 -61346 -60196 -60510 -60521 -58551 -59551 -59098 -60873 -60182 -60652 -59905 -60431 -60714 -60127 -60070 -59463
7356 -59463 -60661 -60027 -61048 -61224 -60613 -60623 -60635 -60369 -61435 -60218 -60945 -61191 -60892 -61385 -61996 -60702 -61432 -60284
7338 -60284 -60323 -59482 -61461 -59602 -60678 -60544 -61127 -62026 -60634 -60119 -59624 -59288 -60012 -60541 -61279 -60434 -60928 -60993 -61157
7319 -61157 -59874 -60934 -60553 -60291 -60981 -60211 -59946 -62374 -61278 -61346 -61197 -60706 -59923 -61572 -61167 -61010 -60960 -61169
7301 -61169 -59476 -60184 -59229 -59853 -60297 -60606 -61137 -60422 -59902 -60637 -60421 -61755 -61032 -61509 -61008 -60385 -59812 -59234 -59846
7282 -59846 -58491 -59731 -60101 -59727 -59488 -60584 -59729 -59720 -59682 -59463 -59178 -61141 -60040 -61346 -60342 -60406 -59919 -59995 -59632
7263 -59632 -60066 -61129 -61365 -60624 -60665 -60654 -59706 -60861 -60828 -58592 -59283 -60044 -60244 -59648 -60142 -59505 -60542 -59019 -59773
7244 -59773 -60901 -59527 -59812 -59844 -59169 -60226 -60628 -59622 -61103 -60194 -60402 -59751 -59991 -58721 -59764 -59723 -58865 -60020
7226 -60020 -58535 -59584 -59769 -59720 -59882 -59689 -58233 -59051 -59171 -59008 -58842 -58672 -58196 -57945 -59271 -59388 -59278 -58932
7208 -58932 -59722 -59103 -59230 -58229 -59325 -58232 -61231 -58672 -58529 -59255 -59538 -58397 -58691 -58746 -59513 -58419 -58949
7191 -58949 -58646 -59193 -58481 -57981 -58489 -58999 -58312 -59737 -58780 -58754 -57582 -59243 -59357 -59541 -58421 -58288 -58816 -58634
7173 -58634 -58911 -57644 -58186 -59032 -58146 -58703 -57702 -56904 -58636 -57838 -58626 -58038 -58330 -59608 -58440 -58131 -57583 -57918
7155 -57918 -57581 -58328 -57991 -58622 -57889 -58579 -57616 -58511 -58873 -58444 -58819 -59108 -58637 -58367 -58211 -56964 -57983 -57335 -58045
7136 -58045 -58023 -57588 -57063 -58324 -59071 -57547 -58719 -57572 -57987 -58752 -57587 -57792 -58231 -58397 -58063 -58281 -58468 -58273
7118 -58273 -58967 -58264 -57579 -57853 -59163 -57656 -58350 -57956 -59137 -56603 -57687 -57748 -58218 -56279 -56910 -58135 -58026
7101 -58026 -58380 -57799 -58332 -58120 -56747 -58190 -58045 -56731 -56471 -56418 -57203 -57471 -56757 -57636 -56157 -56859 -56352 -57514
7083 -57514 -58066 -56862 -57825 -56722 -58124 -57915 -57521 -57147 -57146 -57501 -57061 -56921 -58470 -57038 -57919 -57575 -57122 -55873
7065 -55873 -56806 -56558 -57134 -56630 -56469 -56843 -57293 -56869 -56920 -57172 -56594 -57189 -56850 -56333 -57712 -57438 -57025 -56813 -56542
7046 -56542 -57181 -55857 -56793 -56461 -56654 -55727 -55502 -57204 -56418 -56290 -57288 -57344 -56841 -56279 -55532 -56208 -56327 -57560 -56979
7027 -56979 -56402 -55886 -57017 -57575 -56165 -57105 -56410 -56375 -56152 -56741 -55611 -56643 -55772 -56494 -55820 -56444 -55439 -55649
7009 -55649 -56608 -55916 -55224 -55866 -56669 -55115 -55732 -56147 -56378 -56335 -57262 -55493 -57167 -56151 -57049 -56865 -55775 -56497
6991 -56497 -56134 -55871 -56584 -56609 -55980 -55376 -55084 -55470 -56263 -56602 -56306 -55537 -56128 -57275 -55849 -56855 -56018 -56508 -56124
6972 -56124 -55047 -55657 -54870 -56182 -55925 -55866 -54820 -55694 -55407 -55762 -55419 -55656 -56521 -55562 -55426 -55235 -55596 -54911 -56281
6953 -56281 -55559 -56007 -55653 -56184 -55442 -55277 -55766 -55774 -57104 -54555 -55503 -55902 -54327 -55769 -55800 -55221 -56014 -56098 -54728
6934 -54728 -55548 -55272 -56850 -54946 -55008 -54779 -56079 -55249 -55317 -57130 -55245 -55803 -56235 -56346 -54509 -56575 -55222
6917 -55222 -56415 -55961 -55943 -55033 -56157 -55256 -55989 -55514 -55978 -55308 -55700 -55778 -55530 -56869 -55818 -55350 -55220 -56088 -56495
6898 -56495 -55054 -55375 -55061 -55541 -55951 -56188 -55879 -55385 -54717 -55164 -55613 -56337 -55137 -55627 -55235 -55786 -55775 -56870 -56084
6879 -56084 -55526 -56180 -54480 -55092 -55917 -55515 -55652 -55603 -55818 -55162 -56842 -55551 -54569 -55692 -55490 -56517 -55883 -55133
6861 -55133 -55250 -56414 -55509 -55854 -55590 -55244 -55324 -55372 -55485 -55246 -55196 -56163 -55584 -56711 -56595 -56528 -55934 -56712 -56055 -56828
6841 -56828 -56249 -56035 -56442 -55938 -56143 -57321 -56405 -56908 -56950 -57429 -57032 -57981 -57547 -57324 -57574 -56130 -57296 -56763 -57224
6822 -57224 -57918 -58074 -56868 -58098 -58108 -58146 -57554 -57853 -57079 -57346 -58328 -58501 -57783 -57984 -57753 -60492 -55359 -57315
6804 -57315 -57384 -57508 -57289 -57358 -56745 -57671 -58200 -58155 -59327 -59961 -58963 -57193 -58026 -58133 -57184 -57380 -58580 -57401 -57216
6785 -57216 -57076 -58274 -58524 -59144 -57539 -57697 -57447 -58349 -59045 -59208 -58590 -58929 -59118 -59361 -59016 -58734 -59150 -58671 -59380
6766 -59380 -58895 -58338 -59849 -58137 -58947 -58342 -59470 -59194 -60539 -59134 -59221 -59180 -60176 -59252 -60062 -59081 -58637 -59741
6748 -59741 -60016 -60099 -60893 -59900 -60013 -59175 -60214 -59728 -60398 -59582 -59833 -59559 -60532 -60392 -60512 -59644 -60877 -60685 -60491
6729 -60491 -60937 -60028 -60789 -60245 -60538 -59244 -60766 -59409 -60466 -59833 -59758 -59758 -59665 -59828 -61181 -60132 -61197 -60984
6711 -60984 -61140 -60282 -60157 -60450 -61088 -61081 -60626 -61222 -61230 -60439 -61052 -62011 -61855 -62477 -62359 -61269 -60890 -61586 -61819 -61147
6691 -61147 -61205 -61355 -62349 -62810 -62307 -61663 -62837 -62286 -61347 -62711 -63165 -62691 -62695 -62232 -61983 -62237 -63134 -62909 -63344 -62477
6671 -62477 -63661 -64004 -63504 -63962 -63981 -64725 -63803 -64362 -63940 -64451 -64574 -64766 -64612 -62919 -63531 -62186 -64107 -65485
6653 -65485 -65079 -63376 -63201 -64088 -63933 -64236 -64992 -64493 -64361 -63468 -62952 -62157 -63524 -63669 -63381 -63530 -61596 -62730
6635 -62730 -62565 -62336 -61451 -60883 -62215 -60691 -61508 -61578 -60638 -60471 -60504 -60273 -60582 -60283 -59870 -60384 -59694 -60208 -61047
6616 -61047 -60205 -60416 -61092 -59945 -58776 -59730 -59650 -59442 -59068 -58965 -59062 -57840 -56949 -56722 -57619 -58255 -56577 -56016 -56152
6597 -56152 -54940 -55835 -55744 -56948 -55819 -55308 -54869 -55012 -56472 -56241 -56190 -55048 -56363 -55375 -55198 -55299 -55352 -54945
6579 -54945 -55946 -54158 -53989 -55376 -55382 -53485 -53141 -52015 -53069 -54911 -53293 -55216 -53201 -51989 -53460 -54512
6563 -54512 -54338 -54988 -55352 -52934 -54603 -54400 -53400 -53769 -52987 -54681 -53573 -53184 -53304 -51644 -52443 -54718 -54887
6546 -54887 -54377 -51515 -51922 -53245 -56471 -57052 -55294 -53082 -52804 -55018 -56269 -56467 -54920 -53500 -53908 -54425
6530 -54425 -55988 -54629 -53636 -54594 -52797 -53319 -54273 -52848 -53921 -53457 -53534 -54676 -55511 -54243 -54345 -54573 -55725
6513 -55725 -54909 -54612 -52934 -55000 -56475 -56250 -54968 -52782 -54084 -55980 -56824 -57024 -55556 -53872 -52120 -50402
6497 -50402 -51829 -54305 -55094 -56378 -54906 -53704 -53014 -53281 -54855 -55525 -54536 -55140 -52962 -51639 -53524 -55280
6481 -55280 -56308 -56272 -53619 -51610 -55232 -58077 -58808 -58321 -56377 -53901 -50447 -47555 -50340 -53882 -56785 -57053
6465 -57053 -55611 -53809 -53123 -52865 -54690 -54512 -55008 -53807 -52551 -50922 -52943 -54360 -54342 -55513 -54008 -52823
6449 -52823 -52576 -56549 -56410 -56719 -55147 -53303 -49580 -49027 -50077 -53709 -54710 -54299 -52400 -51099 -51561 -51890
6433 -51890 -53882 -53535 -51921 -53074 -53150 -52049 -51882 -52062 -51856 -54106 -52245 -51988 -50375 -51422 -51320 -52633 -53468
6416 -53468 -52070 -50018 -49780 -51917 -52632 -52308 -52888 -48873 -48969 -51098 -52968 -52056 -50655 -49843 -50301 -51915 -52665
6399 -52665 -51087 -49917 -48620 -49679 -50994 -50509 -50822 -50721 -49632 -49624 -49582 -50180 -49341 -50786 -50064 -51133 -50433 -48610
6381 -48610 -48437 -48870 -50157 -51052 -50553 -49215 -48412 -49230 -50870 -50774 -51027 -50524 -51160 -49980 -50354 -51607 -50854 -51935
6363 -51935 -51212 -51532 -51046 -52044 -52019 -51265 -50955 -50487 -51617 -52444 -52734 -51797 -52053 -50483 -49789 -50762 -51554 -50947 -51568
6344 -51568 -49972 -50542 -51522 -51465 -51948 -52414 -51006 -51704 -51592 -51738 -52234 -51999 -51957 -53010 -52132 -50820 -51902 -51854 -50586
6325 -50586 -52550 -51835 -51702 -49953 -51585 -50902 -52133 -52654 -50830 -51215 -51054 -51350 -51692 -50633 -52358 -51303 -51201
6308 -51201 -51178 -50323 -51294 -51256 -52004 -50867 -51341 -51902 -50396 -50752 -50118 -50841 -50990 -51031 -50278 -51633 -51237 -52426 -51023
6289 -51023 -51441 -51245 -51840 -51539 -51057 -49278 -51360 -50451 -50617 -51372 -50325 -51197 -50901 -50588 -49864 -50567 -50303 -51511
6271 -51511 -50978 -50728 -49520 -49851 -50919 -50787 -49913 -49754 -50125 -48971 -51158 -50804 -50771 -49350 -50168 -50279 -50308 -49817
6253 -49817 -50293 -49686 -48562 -49525 -49782 -50839 -49113 -48035 -50191 -48966 -50534 -51931 -49781 -49812 -49117 -49333 -49956
6236 -49956 -48747 -49599 -49839 -49403 -48929 -48479 -48893 -49177 -49883 -49666 -50001 -48417 -49098 -49008 -49465 -49602 -48783 -48268 -49323
6217 -49323 -47933 -48450 -48676 -47564 -49089 -47899 -47311 -49593 -48184 -47819 -48560 -47680 -48719 -49339 -47951 -47324 -49018
6200 -49018 -46584 -48274 -48625 -48848 -48253 -47943 -49025 -48010 -47424 -46290 -47796 -47425 -48300 -47534 -45926 -46773 -47371
6183 -47371 -47152 -47257 -45303 -47276 -47063 -45529 -46668 -45809 -45916 -46173 -44734 -44621 -46110 -45240 -45176 -44394 -45373 -45526
6165 -45526 -44644 -46013 -45253 -45485 -43636 -44074 -44677 -45842 -46060 -44750 -44980 -45828 -44580 -45395 -45403 -45571 -44998 -45411
6147 -45411 -45294 -46062 -45429 -43196 -44826 -45363 -44627 -44774 -43938 -44312 -45028 -44320 -43730 -42757 -43009 -43627 -43637 -44612 -42645
6128 -42645 -42941 -42994 -42674 -43020 -42598 -42692 -43780 -43270 -42427 -42851 -42444 -43005 -42271 -41469 -42190 -41985 -41701 -41739 -41616 -41010
6108 -41010 -42313 -42197 -41251 -41814 -41995 -41392 -40934 -41892 -40771 -40593 -41017 -41135 -40063 -41314 -39896 -40173 -40317 -39759
6090 -39759 -38961 -40002 -39380 -39270 -38330 -37862 -39078 -39129 -39378 -38337 -37990 -37187 -38764 -37820 -38807 -37611 -37488 -37487 -37546
6071 -37546 -36503 -37009 -36346 -36125 -36014 -35774 -35440 -35944 -35099 -35872 -34661 -34166 -34968 -34735 -34266 -33768 -33073 -33796 -33865
6052 -33865 -33759 -32767 -31783 -32454 -33012 -32209 -32477 -31986 -31715 -31917 -31999 -30863 -30899 -30719 -30981 -30416 -29955 -30495 -29777 -29588
6032 -29588 -30683 -28279 -28566 -28584 -27716 -28300 -27183 -26991 -28270 -26768 -26099 -26782 -26621 -27096 -25650 -24594 -24278
6015 -24278 -22629 -26018 -25579 -25188 -24425 -23432 -22860 -23279 -23608 -23544 -22538 -22566 -21904 -21075 -21512 -21522 -20099 -19237 -19139
5996 -19139 -18767 -17949 -17349 -17681 -17082 -16784 -17064 -15909 -15747 -15666 -15321 -14936 -15823 -15292 -15566 -16705 -15727 -15942 -16685
5977 -16685 -15841 -15621 -15359 -15562 -14542 -13990 -11414 -10528 -10426 -9890 -7586 -8123 -6684 -5718 -4684 -5476 -3193
5960 -3193 -2465 -2897 -2563 -1209 119 -608 1075 477 1810 1958 2847 4869 4044 3843 4863 5583 7071
5943 7071 7479 8070 8261 8897 10272 11146 11605 12270 13270 13724 15249 16083 16250 17410 17567 18806 18612 19926
5925 19926 20824 21151 21703 23669 24403 25818 28795 28742 28800 30690 31469 32664 32418 34520 35471 36811 36782 36857
5907 36857 38721 39017 40564 41927 42554 44389 45340 46230 47391 49034 49299 49938 50648 53031 53348 54359 55434
5890 55434 58132 59079 59890 60770 63077 64150 65085 67012 68612 70722 71921 72058 74652 76808 77257 80118
5874 80118 82714 83744 85170 87604 88807 90221 91350 92566 92761 94747 95795 96447 99602 102185 104956
5859 104956 108404 109217 109290 111298 112959 113843 114932 117225 118779 120892 123741 126650 128867 131985 132741 136458
5843 136458 137112 139702 141004 143887 146414 150567 154049 157686 162039 163951 167566 169974 173565 174851 177238
5828 177238 178992 182128 183058 186027 187615 189933 192551 194578 197371 199980 202463 205130 207619 210185 214093
5813 214093 217846 221690 225576 230538 233232 237404 241908 246571 250124 251948 256544 259266 263740 266722
5799 266722 270120 273636 277562 280967 285607 290419 295469 299918 304876 309826 315624 321278 327138 333405
5785 333405 337300 341927 345561 351676 356878 361981 367191 371919 377860 382258 388345 394278 400640 405936
5771 405936 411068 417055 422080 428475 433416 438867 445983 450518 457865 466353 473965 481736 488526 495223
5757 495223 500680 506051 511986 520751 528924 536671 544898 554896 563624 574809 585129 597320 612015
5744 612015 627062 645493 665606 686775 709888 732139 755862 775880 792634 804815 811668 811895
5732 811895 807872 803494 800701 798815 800900 804546 810635 821305 832205 846567 862145 881216 898926
5719 898926 917005 936308 953234 971980 989874 1008787 1025201 1041960 1056148 1071157 1085911 1102926
5707 1102926 1119910 1140779 1161575 1182800 1204554 1224039 1244341 1262840 1281182 1300264 1320363
5696 1320363 1342565 1366125 1392374 1419190 1448739 1479460 1509469 1540017 1571458 1602008 1632219
5685 1632219 1664430 1695365 1727776 1762683 1795856 1832204 1865270 1900326 1937178 1972517 2007171
5674 2007171 2043008 2081766 2122071 2164502 2207377 2251648 2297551 2342899 2388977 2435154 2481865
5663 2481865 2528961 2580159 2631995 2686690 2742737 2803026 2861780 2922644 2986024 3050795 3118368
5652 3118368 3187589 3257011 3327857 3401815 3477360 3554823 3637654 3724818 3815955 3909402 4007315
5641 4007315 4108986 4213869 4322637 4437209 4557056 4679194 4808544 4941684 5081226 5228792
5631 5228792 5382949 5546362 5714767 5891448 6073238 6263719 6462673 6670768 6890985 7123803
5621 7123803 7371548 7633433 7910138 8200145 8505409 8827112 9166124 9530023 9918957 10336666
5611 10336666 10785347 11269866 11792072 12357871 12968886 13632251 14354998 15141298 16004889
5602 16004889 16959882 18023472 19212121 20548733 22063268 23803777 25828113 28207600
5594 28207600 31032045 34394396 38397803 43163402 48855752 55717968 64093264 74455761
5586 74455761 87452545 103888008 124553494 149695526 178217393 207489167 234137853
5579 234137853 255040684 267981754 271947699 267058022 254419907 235838578 213435337
5572 213435337 189318425 165351282 142960992 123015155 105851804 91410686 79394315
5565 79394315 69424008 61150028 54280188 48576529 43831968 39864373 36518143 33670673
5557 33670673 31222078 29100464 27245874 25610005 24153319 22847463 21668793 20597588
5549 20597588 19617254 18717415 17886727 17119591 16409759 15750135 15136964 14564416 14028096
5540 14028096 13520850 13042507 12589310 12159367 11749853 11361723 10991368 10637797 10300545
5531 10300545 9979470 9670172 9372339 9086577 8811150 8548377 8296448 8052477 7819523
5522 7819523 7593943 7378054 7170342 6970462 6780038 6596195 6418681 6247326 6080891 5918605
5512 5918605 5759335 5606531 5457830 5314136 5177627 5044579 4917360 4792486 4671052 4551776
5502 4551776 4440859 4330727 4225941 4122887 4027806 3934848 3846709 3759515 3678168 3598459 3520840
5491 3520840 3443485 3366435 3291027 3217612 3145593 3076352 3008588 2944660 2881664 2819526 2759990
5480 2759990 2701870 2645362 2588136 2533983 2480997 2429127 2381603 2336840 2292137 2249763 2208383
5469 2208383 2169334 2129211 2088991 2051188 2012853 1974059 1935331 1899075 1862058 1827826 1792376
5458 1792376 1758718 1723002 1688676 1653329 1619070 1583766 1550750 1519861 1488890 1461307 1432267
5447 1432267 1405368 1376624 1348716 1322063 1295745 1269601 1245391 1222016 1196906 1174430 1151053
5436 1151053 1130220 1108757 1089420 1070516 1052369 1033160 1013389 989102 965155 937513 908357
5425 908357 878724 846909 814763 783187 751396 727211 706206 691912 683367 680659 681107 683333 685563
5412 685563 683351 682566 676379 669570 660675 650147 638121 626277 612836 600008 589064 577954 565422
5399 565422 554687 542096 531273 519937 509036 499851 490212 479723 470443 460694 450736 441889 432385
5386 432385 422112 412364 403549 392824 384299 376680 365987 359135 353268 344025 337793 332141 326120 320834
5372 320834 315244 307294 301870 294254 287629 280629 276780 269906 263018 258161 252545 246451 241052 236494
5358 236494 232169 227528 223687 218340 214139 208441 204616 199364 194762 191300 187063 183669 178896 175555
5344 175555 172774 169146 165965 161912 156737 153330 149014 143964 141433 136149 132470 129741 126918 122590
5330 122590 120242 115810 112180 108992 106958 103586 101625 97987 93969 91927 90977 87701 87792 86638 85977
5315 85977 84763 83687 81716 80711 79142 75757 75472 72323 69821 67044 66255 62200 61817 59971 59346 57676
5299 57676 56324 53421 52283 49471 47941 45404 44176 44060 43247 40435 40634 37315 36643 35279 32794 31036
5283 31036 30056 28888 28488 26935 26224 24692 25163 23974 23235 23353 21601 21142 20959 19413 19648 18652 17756
5266 17756 16944 16018 14857 13818 12680 13116 12064 11710 11323 9353 8428 9051 8276 7938 5648 5799 5034
5249 5034 4701 4054 3329 2637 1362 414 270 -553 -1467 -1023 -1002 -1842 -2421 -2954 -1921 -3457 -2882 -2784 -3529
5230 -3529 -3866 -5210 -4939 -5345 -5449 -5403 -5578 -6405 -6670 -7269 -7132 -7989 -8641 -8017 -8905 -9752 -10036 -10865 -10858 -12164
5210 -12164 -10971 -12454 -12319 -13829 -12922 -14008 -13834 -13135 -14636 -14582 -15096 -13927 -14769 -15066 -15325 -15850 -14872 -15753
5192 -15753 -14624 -14735 -15697 -15570 -16295 -15536 -14812 -14427 -13970 -13830 -13566 -15032 -14693 -15701 -17039 -17707 -17774 -18702
5174 -18702 -19761 -19941 -20116 -20567 -21447 -20937 -22285 -23037 -23134 -22457 -23403 -23512 -24935 -25197 -25418 -25689 -24797 -25689 -25831
5155 -25831 -26237 -25983 -25625 -26694 -27522 -26955 -26749 -27162 -27337 -27773 -28408 -28520 -28143 -28500 -28844 -29546 -28621 -29079 -30011
5136 -30011 -29725 -30455 -30886 -29313 -31323 -31935 -31226 -31565 -32909 -32252 -32651 -32456 -31966 -32170 -32739 -33768 -33355 -33647
5118 -33647 -34236 -34208 -32881 -33252 -36087 -34294 -34180 -33555 -34704 -34906 -34886 -35617 -35206 -35414 -36116 -36557 -36432 -36414 -36141
5099 -36141 -36068 -36943 -37893 -37462 -38351 -38066 -38132 -38040 -37437 -37171 -37751 -38161 -38352 -38325 -37639 -38429 -38254 -37866 -38792 -38558 -38576
5078 -38576 -39013 -39035 -40182 -38924 -39713 -40837 -40144 -39835 -40298 -39127 -40755 -39893 -40593 -40512 -40678 -40432 -40504 -42028
5060 -42028 -41433 -41285 -41054 -40900 -42252 -42205 -41989 -41455 -42313 -43105 -42319 -42307 -42535 -41505 -42038 -42757 -42018 -42988 -42993 -43162
5040 -43162 -42848 -43514 -43542 -44295 -44211 -44249 -44596 -44670 -45086 -45333 -44582 -45906 -45743 -45051 -44979 -45075 -45297 -44645 -44992 -45482 -45960
5019 -45960 -44083 -44708 -44291 -44540 -44308 -43701 -45021 -45192 -45717 -45937 -44801 -45343 -44344 -46193 -46128 -45684 -45555 -45975
5001 -45975 -46193 -45922 -46085 -45627 -47269 -48115 -46604 -47950 -47545 -45705 -46394 -46235 -46648 -47007 -46131 -46680 -46168 -46631
4983 -46631 -47123 -46497 -46957 -46620 -47143 -47572 -47747 -47319 -46283 -45656 -46593 -46147 -47238 -47467 -47323 -46100 -46764 -46409
4965 -46409 -47123 -45414 -45061 -45172 -43484 -43670 -43128 -41714 -40087 -37658 -37102 -37439 -37653 -39729 -40693 -40701 -42329 -43105
4947 -43105 -43074 -45084 -44081 -44668 -45428 -45372 -45253 -44307 -43582 -43367 -42580 -43027 -40855 -41536 -39209 -39256 -36376 -33448
4929 -33448 -26816 -21512 -18623 -17473 -21115 -24337 -27994 -30888 -32727 -34766 -36478 -37102 -37536 -38327 -39395
4914 -39395 -39368 -39198 -38202 -37871 -37392 -37355 -35893 -35988 -35549 -35484 -34289 -31784 -27795 -22876 -16854 -11907 -10323 -11478
4896 -11478 -16535 -19485 -21847 -27321 -26949 -29347 -28803 -30614 -29902 -30084 -30012 -29789 -29037 -29897 -28820 -28271 -28631
4879 -28631 -26728 -27156 -25343 -24617 -23735 -22903 -21232 -18577 -15443 -14566 -13220 -14085 -14288 -14679 -15111 -14975 -13769
4862 -13769 -11774 -9954 -7293 -4094 2964 11826 31758 65636 107634 138973 146029 132878 109897
4849 109897 85599 62999 48247 36989 28301 22481 18674 17013 15828 16164 17092 17738 19110 22083
4835 22083 23339 28622 32225 41245 51248 67546 95285 153153 263321 390261 485885 503745
4823 503745 457987 382773 299734 233060 181973 144716 114590 93966 80043 72276 65467 60294
4811 60294 57512 55803 55997 57395 59623 61927 67246 76044 86768 102287 129985 190299 302714
4798 302714 431002 524612 539344 489839 410422 325607 255484 203403 164619 134667 113842
4787 113842 99269 89399 81308 74101 68509 64643 63239 63609 66109 67638 69504 72776 75762 79804
4773 79804 90912 113497 152723 195380 223459 226539 210226 182336 154788 131290 115216 101581
4761 101581 94575 89064 83950 81002 78024 76867 75155 73095 72167 72907 75181 75904 77381 78992 79160
4746 79160 82470 83085 85309 85022 85551 86234 85053 87159 89059 92566 96734 102470 106911 111206 114308 116456
4730 116456 115965 117530 118602 117152 116646 114427 114210 115802 117442 120783 124550 129552 133062 137144 139324
4715 139324 139919 141743 141109 140854 144543 151531 161646 174022 186630 195962 203246 208606 213537 216716
4701 216716 214813 212318 207500 203285 198826 198843 200839 203621 208988 214306 221942 228674 235236 241708 245322
4686 245322 248394 251708 254691 259715 269200 283822 298267 311735 323654 333953 341493 346680 351241
4673 351241 352772 353521 353325 353476 350870 353052 355340 359842 366181 376125 388578 400847 410465 420624
4659 420624 428605 436770 444680 455806 468640 482038 491633 502779 515802 529727 542403 552532
4647 552532 561512 568296 576851 588262 602625 611960 619064 625561 634768 648041 663950 681035 696610
4634 696610 714616 731370 747702 764924 780092 796784 818615 844447 868441 885745 902945 921439
4622 921439 943123 964223 987831 1011096 1033886 1057330 1082626 1110464 1135595 1162283 1191501 1224609
4610 1224609 1259327 1295482 1328539 1365686 1407157 1450917 1492891 1537372 1580444 1623461 1672425
4599 1672425 1725652 1779711 1841173 1905128 1971424 2036379 2103740 2179603 2269262 2376757 2506384
4588 2506384 2666072 2850879 3058500 3288503 3554728 3872502 4271554 4807774 5573560 6843412
4578 6843412 9653156 15494627 23292188 30125748 32924214 31301084 27218729 22247404
4570 22247404 17901474 14599512 12125131 10293194 8951663 8074550 7531750 7208486 7038479
4561 7038479 7019350 7159394 7433461 7823613 8323543 8953324 9771958 10880234 12481497
4552 12481497 14917496 19077333 27952893 46038954 68918901 87747281 95041825 90009414
4544 90009414 78180962 63163955 49533716 39008045 30950963 24904408 20368773 17333403
4536 17333403 15326442 13923633 12882249 12159265 11725455 11535771 11582160 11831081 12260637
4527 12260637 12910983 13888512 15397954 17805577 22036660 31204493 49797124 73041948
4519 73041948 91822136 98603434 92874362 80347512 64690975 50564516 39644639
4512 39644639 31259174 24931228 20163541 16938481 14752451 13155736 11894321 10912489
4504 10912489 10158398 9599294 9243210 9041328 8938541 8930124 9046469 9350416 9963194 11221190
4494 11221190 14324096 20735956 28935360 35577929 37506318 34806695 29738671 23994913
4486 23994913 19112920 15388983 12555165 10396821 8768385 7633203 6826332 6205515
4478 6205515 5699907 5282576 4934397 4645349 4413385 4217965 4039628 3872776 3715453 3563863
4468 3563863 3422952 3300539 3192058 3089182 2992453 2905010 2818949 2734136 2650051 2571906 2501546
4457 2501546 2434198 2367216 2300896 2234257 2168576 2109914 2053849 2000866 1949139 1900230 1856235
4446 1856235 1811777 1769355 1727005 1683947 1641446 1598029 1554817 1517330 1481271 1444742 1410238
4435 1410238 1376027 1342498 1309251 1277990 1252791 1230005 1206237 1180213 1150178 1123334 1097267
4424 1097267 1073381 1047797 1020970 992576 967504 947553 930552 911799 891903 872826 851497
4413 851497 831297 811848 797859 784987 770613 752689 734950 719692 703827 689398 678029 670146
4401 670146 659995 650347 640650 631757 620019 604624 585915 567435 548498 530384 514205 496856
4389 496856 481774 466595 454525 446298 437619 430910 428947 427847 424604 417778 410465 400953 393411 384953
4375 384953 380782 378195 378140 376963 375180 370432 362971 351397 336899 320608 307672 293136 277894
4362 277894 263505 250114 241776 234411 231246 231075 231197 233417 236604 238026 236141 232022 229290 226892
4348 226892 224451 220859 214892 208827 202717 197031 193202 188025 183646 178984 172102 162976 155011 149409
4334 149409 144441 141132 137118 133756 131279 131263 131964 132865 136724 137931 137478 135072 129779 126769 122457 118042
4318 118042 115283 113331 110875 110501 114813 128588 139896 146734 143166 134317 123828 116746 113209 116389
4304 116389 127798 143943 159196 165262 163025 153804 145119 137436 138359 153861 186255 216765 228463
4291 228463 220216 197242 171482 145890 126025 112789 103793 96619 91714 89456 87062 87752 90133
4278 90133 100798 117512 132999 141678 138978 133134 125362 121508 121939 132877 163364 238028 355113
4265 355113 469175 529077 513619 449943 367124 289782 231238 188518 155250 129548 109620
4254 109620 96965 86422 77455 70124 65807 62717 62016 62345 62619 67345 71308 77625 88025 106838
4240 106838 145352 226045 349253 466673 526606 508702 441532 356570 275546 212772 165273
4229 165273 129479 101458 81744 67715 58333 49544 44150 39819 36133 34358 33241 31175 29910
4216 29910 30255 32630 35027 40842 53032 82448 124123 161692 179076 169973 146556 116493 89861
4203 89861 67159 50950 37897 26471 19391 14562 10263 7551 3904 1832 760 -1719 -2810 -4216
4189 -4216 -5034 -6417 -6906 -7484 -9069 -9338 -10607 -10115 -10609 -11985 -11786 -13523 -13393 -11967 -13840 -13948 -14630
4172 -14630 -15016 -15495 -15972 -16182 -17851 -17359 -18726 -17760 -17925 -20135 -19461 -19350 -20406 -20624 -21033 -22288 -21784 -21787
4154 -21787 -21591 -22355 -22523 -23404 -21521 -21204 -22603 -22618 -23701 -22558 -24239 -24277 -24502 -25864 -26029 -25665 -27024 -26430
4136 -26430 -26341 -27127 -27507 -28809 -28342 -27337 -28440 -28480 -27487 -27508 -27675 -28524 -28111 -28252 -28228 -27458 -27164 -29152 -29182 -29338
4116 -29338 -28824 -29052 -29997 -30939 -31133 -31199 -31411 -31093 -31393 -32212 -32740 -32331 -32628 -32681 -31635 -32277 -32774 -33180 -33878 -32499
4096 -32499 -33703 -31327 -31674 -32575 -32616 -32353 -33144 -33511 -33887 -33169 -33274 -33794 -34409 -34159 -35038 -34537 -35650 -34779 -34558
4077 -34558 -34462 -35343 -35392 -36132 -34021 -34701 -34795 -34406 -35171 -36309 -35918 -34617 -36166 -35045 -35954 -34814 -36567 -35747
4059 -35747 -35632 -36323 -36118 -36107 -36007 -36170 -36551 -37365 -36922 -37124 -37696 -36755 -37778 -37419 -37637 -37167 -34991 -37119 -36979
4040 -36979 -37337 -37564 -37328 -38040 -38738 -37076 -38300 -37228 -38659 -37896 -37891 -37718 -38528 -38883 -38415 -38950 -39193 -39546 -39550
4021 -39550 -40088 -39320 -39849 -39053 -39550 -39943 -40373 -40761 -40395 -40250 -40089 -38783 -38598 -38821 -40203 -40881 -39724 -40055
4003 -40055 -40561 -40674 -40384 -40528 -40327 -40084 -41350 -40547 -40684 -40181 -40521 -41406 -40790 -41353 -40154 -39961 -40051 -41226 -38839
3984 -38839 -40097 -41330 -39696 -39780 -40280 -40306 -41100 -39854 -40497 -41494 -40669 -41565 -41338 -42321 -41661 -40855 -41863 -41031
3966 -41031 -41222 -41970 -41949 -42649 -41433 -41736 -41849 -42273 -41092 -42002 -42867 -41294 -42947 -42999 -43037 -42768 -42273 -43406 -42706
3947 -42706 -42132 -42403 -43414 -43850 -42577 -43349 -43766 -42923 -42714 -42572 -43523 -42564 -42588 -42096 -43077 -42775 -43304 -42782 -43409
3928 -43409 -42470 -43471 -43645 -44080 -43578 -43529 -44295 -43957 -43647 -44469 -44022 -43310 -44106 -44054 -44227 -43855 -45146 -43341 -44817
3909 -44817 -43671 -43632 -43717 -44335 -44095 -44238 -45012 -44579 -43403 -43562 -44320 -44734 -45016 -45024 -44164 -44308 -45535 -43273 -44606
3890 -44606 -45609 -45248 -45988 -45925 -44829 -44709 -45875 -44683 -44931 -45002 -45159 -45392 -46885 -45709 -45110 -44635 -45113 -44507
3872 -44507 -44445 -46002 -45965 -45335 -45655 -45566 -45473 -46435 -46438 -47533 -46644 -46241 -47673 -46042 -47012 -45428 -47167 -46991 -46273
3853 -46273 -47296 -46963 -46678 -46560 -46891 -46160 -47283 -47313 -48393 -48148 -47244 -47378 -48317 -48637 -48868 -49672 -48150 -49123
3835 -49123 -47634 -48614 -47594 -47807 -48288 -48037 -47433 -48706 -48898 -48674 -48553 -48758 -49004 -48036 -49298 -50190 -49306 -48936
3817 -48936 -49645 -49578 -48899 -49886 -50550 -49278 -50041 -50236 -50352 -49509 -49391 -49797 -50684 -50380 -49572 -50661 -49892 -50442 -50459
3798 -50459 -50302 -51275 -52311 -51851 -51367 -52402 -51969 -52932 -51108 -52319 -51054 -52293 -51261 -50732 -50864 -52038 -51719
3781 -51719 -52781 -52226 -53967 -52107 -52754 -52589 -53490 -53251 -53800 -53866 -53322 -52771 -52758 -52442 -52467 -52696 -52736 -53962 -54004 -53193
3761 -53193 -54695 -53517 -52980 -53086 -54614 -54317 -55134 -54662 -53788 -55487 -53699 -54466 -54705 -55088 -55334 -55575 -56543 -55550
3743 -55550 -55422 -55589 -56276 -55725 -55894 -55109 -55234 -55592 -55024 -55266 -54806 -55588 -55657 -56020 -57606 -56811 -57139 -57893 -57497
3724 -57497 -57085 -57667 -57382 -58272 -57390 -58786 -57546 -56872 -57227 -58064 -57918 -59071 -60297 -59654 -60675 -60530 -60135 -61238
3706 -61238 -60160 -59937 -60311 -59721 -58584 -60319 -59811 -59787 -60656 -60468 -61804 -61847 -63085 -62536 -62450 -62135 -61525 -61583 -61785
3687 -61785 -62653 -61989 -61654 -61951 -62938 -63974 -63339 -63624 -61426 -62575 -61283 -61822 -60772 -61817 -62200 -62330 -61598
3670 -61598 -61981 -61328 -61787 -63469 -61928 -62451 -63280 -66085 -65951 -65820 -66073 -65733 -66494 -64719 -62338 -59817 -59949
3653 -59949 -60079 -59364 -60250 -60283 -60450 -62119 -62176 -62063 -61197 -61189 -60901 -59770 -59952 -60488 -59827 -59631 -60754 -60452 -62059
3634 -62059 -62029 -61716 -63649 -62546 -63618 -61100 -59240 -56828 -55319 -56367 -55365 -55928 -56132 -56567 -57590 -56725
3618 -56725 -56009 -55525 -56834 -56825 -56225 -55105 -55707 -56088 -56033 -55558 -56144 -55053 -55549 -55262 -55447 -54993 -56196 -55426 -55570
3599 -55570 -55628 -55936 -55990 -55535 -55685 -53797 -53084 -53150 -53071 -52956 -52923 -53903 -54020 -54562 -53238 -52179 -51684 -52201 -54388 -53566
3579 -53566 -53226 -54013 -53553 -54547 -54195 -54173 -54538 -54802 -55219 -54178 -53957 -55108 -53567 -54374 -54210 -55128 -53957 -54127
3561 -54127 -54084 -53523 -53693 -53840 -54164 -54127 -53620 -54467 -53969 -55141 -54717 -54267 -54975 -56153 -56411 -56470 -55074 -55459 -55650
3542 -55650 -55528 -54850 -55699 -55591 -55480 -57164 -55591 -56555 -56953 -56697 -55809 -56039 -56702 -55474 -57264 -55827 -56944
3525 -56944 -56238 -55569 -54938 -55855 -56434 -56317 -56154 -56667 -56187 -54991 -56793 -57600 -57505 -56445 -57168 -56681 -57173 -55923
3507 -55923 -55868 -56603 -58061 -57698 -57834 -58008 -57154 -57706 -57515 -56897 -56847 -57804 -57236 -57329 -55800 -56761 -57000 -57130 -56718 -58457
3487 -58457 -57795 -58055 -57728 -56446 -56730 -57354 -56477 -55286 -56237 -55792 -56185 -55583 -55744 -56206 -57884 -55921 -56205 -56674
3469 -56674 -57090 -56103 -57286 -57384 -57267 -56424 -55956 -55764 -57137 -57648 -57386 -55673 -57243 -55800 -56711 -55233 -56796
3452 -56796 -56617 -55375 -55473 -55985 -55947 -55946 -56520 -57524 -56327 -55338 -55829 -55814 -56086 -57225 -56737 -56434 -57248 -57418 -56888 -56527
3432 -56527 -55861 -55824 -55640 -54623 -53547 -51368 -49574 -48667 -49976 -50881 -52563 -52933 -53222 -53945 -53745 -52777 -51413
3415 -51413 -49418 -48787 -49976 -51259 -51498 -52034 -51233 -49077 -48369 -49192 -50706 -52676 -53414 -53613 -53939 -54547 -56483
3398 -56483 -56997 -57049 -56979 -56928 -56756 -57419 -56573 -57491 -56642 -56961 -57448 -57194 -56417 -56684 -57667 -58539 -58940 -58951 -59009 -58333 -58414
3377 -58414 -59259 -59414 -59133 -59492 -59026 -60520 -59448 -59288 -60348 -59735 -60503 -60428 -60684 -60383 -59462 -59998 -60556 -60378 -60254
3358 -60254 -59029 -59260 -60384 -60810 -60261 -60563 -59858 -60112 -60568 -61042 -60210 -60329 -60950 -61012 -60896 -61266 -60099 -59924 -60535
3339 -60535 -61313 -61151 -61932 -61471 -61329 -60928 -60300 -61644 -61590 -60370 -61124 -61681 -61243 -61810 -61284 -61016 -61067 -60585 -61956
3320 -61956 -60812 -61345 -61213 -60884 -61233 -61925 -60450 -61195 -62314 -61214 -61582 -61054 -61797 -61700 -60487 -61612 -60961 -59694
3302 -59694 -60762 -61176 -60616 -61085 -59564 -60459 -59601 -59090 -58146 -59073 -57788 -58381 -57043 -56412 -56494 -54891 -54020 -52125
3284 -52125 -49050 -38518 -16906 13907 38569 46469 40012 23242 4443 -11598 -22564 -29599 -35995
3271 -35995 -38997 -37112 -27751 -8381 11249 24109 22063 11009 -2409 -17952 -28012 -36026 -42927
3258 -42927 -46534 -50159 -52808 -53855 -56244 -56585 -56517 -58739 -57332 -58712 -58642 -60226 -60668 -61116 -61322 -61789 -62517
3241 -62517 -61585 -62308 -61488 -62564 -63295 -63648 -63247 -63745 -65130 -64475 -65109 -65027 -64509 -64716 -65224 -65749 -64727 -64736 -65526
3222 -65526 -64932 -64827 -66587 -65854 -66325 -64634 -65311 -65758 -66378 -66379 -66598 -66715 -67699 -66403 -67524 -66497 -67128 -67744
3204 -67744 -67248 -66764 -67881 -68813 -67903 -69097 -68686 -67540 -67359 -68201 -68045 -68720 -68144 -67399 -67942 -68045 -67714 -67924
3186 -67924 -68468 -68475 -68352 -69680 -69730 -68661 -68844 -69797 -69612 -68637 -69244 -69447 -68254 -68697 -68828 -69980 -69168 -70290 -69682
3167 -69682 -69801 -70031 -70034 -69812 -69983 -68707 -69192 -69544 -69231 -70240 -70689 -69835 -69942 -69879 -70532 -70906 -70414 -69793 -70981
3148 -70981 -71021 -69693 -69698 -70906 -70817 -71130 -71198 -70933 -71856 -71907 -71819 -70541 -71233 -71940 -70748 -71614 -71606 -72144 -71972 -72071 -72105 -72179
3126 -72179 -71792 -71746 -70942 -70391 -71490 -71702 -71317 -71097 -72579 -71982 -71679 -72107 -71185 -71193 -71069 -71163 -71092 -71717 -71881 -70720
3106 -70720 -70027 -69549 -70659 -70667 -70171 -70602 -71108 -71770 -71655 -71381 -71888 -71993 -72107 -71984 -71418 -71311 -71543 -71865 -71963 -71725
3086 -71725 -71344 -72270 -71020 -69873 -69881 -70661 -67606 -66859 -65953 -65698 -65396 -66887 -67318 -67831 -67690 -67714 -68231 -68179 -67859
3067 -67859 -69132 -68488 -69221 -69605 -70352 -68754 -69916 -69063 -69553 -69429 -69170 -66708 -66026 -64121 -61550 -59486 -57627
3050 -57627 -57833 -57289 -57170 -57730 -57391 -57499 -56065 -58731 -59448 -59933 -61318 -63271 -63952 -64502 -64126 -64076 -63694 -64543
3032 -64543 -64227 -63656 -62759 -60835 -58429 -54944 -52885 -48911 -47775 -45961 -47043 -45396 -44770 -44512 -43757 -43869
3016 -43869 -44156 -45818 -48061 -51327 -52690 -55332 -58112 -58453 -59353 -60681 -60240 -59454 -58585 -56324 -54709 -52594
3000 -52594 -49438 -45372 -43687 -41552 -40977 -39603 -37238 -34932 -34738 -34046 -35445 -37521 -39810 -41712 -45291
2985 -45291 -47825 -50771 -52691 -54811 -55481 -54874 -54370 -54504 -53501 -52608 -51202 -49116 -47650 -45896 -44477 -41861
2969 -41861 -39767 -37310 -35190 -32166 -31264 -29911 -30419 -31558 -37022 -39812 -42877 -45145 -46579 -47654 -47685 -48180
2953 -48180 -48408 -48268 -47537 -48308 -48637 -46578 -46536 -44430 -44264 -41172 -40135 -39782 -37581 -35079 -32747 -32258 -30839
2936 -30839 -32679 -34355 -35728 -36373 -37354 -38478 -39859 -39031 -38978 -37656 -37743 -36998 -35983 -34681 -34688 -32761 -31774 -31529
2918 -31529 -30712 -30550 -29784 -28189 -27108 -25768 -25920 -26223 -26517 -25628 -26148 -25110 -23068 -22076 -22028 -20940 -20468 -20106
2900 -20106 -19283 -18116 -15134 -11720 -8170 -5618 -1822 -392 -58 634 1403 2530 3335 4639 5229 6068
2884 6068 5733 6547 9369 15110 21459 28645 37511 43248 51261 62294 78453 111842 190680 320860
2870 320860 454774 537232 537371 481085 398069 317044 252845 204774 168140 140487 120156 108178
2858 108178 97462 92388 91334 91200 94945 98179 106519 114857 125593 136278 150643 170001 198075
2845 198075 263241 426474 684503 944594 1087292 1062299 939549 768434 608942 485731
2835 485731 393888 327152 280229 251986 238472 227798 217325 206173 195472 187094 179870 174335
2823 174335 173383 175494 178368 184109 191089 205008 237307 314568 434540 554615 619821 608640
2811 608640 549593 471285 395852 340585 300884 281168 279671 291757 307531 311524 300772 280169
2799 280169 257295 235498 219892 210771 205633 201679 197847 195705 192323 190799 186607 184027 184355 188545
2785 188545 200054 212223 226208 238929 251561 263342 275748 292389 309846 325386 333320 332222
2773 332222 321906 306861 293981 282628 272966 269915 267179 266228 269160 273584 276451 276098 273575 271014
2759 271014 276192 288350 307692 330566 351241 371478 388288 401914 411806 419776 423727 424209 419437
2746 419437 410725 400166 392188 386374 382790 384256 390278 402730 416129 428901 440954 448747 453334
2733 453334 458795 465556 477740 488836 505331 524385 543526 564728 578624 590150 600603 609214
2721 609214 614505 623253 633998 641148 641434 639851 642674 651891 666506 687040 711057 729917 748146
2708 748146 767726 788819 810462 831984 856599 879684 898587 907864 917942 933559 950378 970635
2696 970635 991509 1014908 1037229 1060091 1086702 1110823 1131412 1150067 1171192 1199875 1235183 1269833
2684 1269833 1295171 1315974 1337623 1364234 1397532 1428810 1457230 1483291 1518296 1564179 1614150
2673 1614150 1662656 1710399 1754098 1794419 1830369 1867706 1908210 1951460 1998010 2045011 2095535
2662 2095535 2151457 2212152 2278359 2346027 2412465 2474632 2540581 2629928 2732890 2833305 2926030
2651 2926030 3025217 3133327 3244618 3357007 3471427 3594133 3732573 3881142 4031829 4177902
2641 4177902 4314193 4469288 4664957 4911122 5224048 5643267 6168053 6789695 7522691 8355790
2631 8355790 9275871 10318537 11658958 13617201 16893867 24248685 41518616 66408744
2623 66408744 89353250 100866257 97937974 86195339 70132108 54900816 43182746
2616 43182746 34434953 28064320 23393919 20299263 18323996 16975557 16004343 15398665
2608 15398665 15207778 15375913 15919531 16838116 18033422 19464853 21232211 23720741 27580540
2599 27580540 34350357 50458166 86830948 131863973 167971197 183349561 177632275
2592 177632275 159269804 132036576 104475450 81881877 64106661 50717562 40623047
2585 40623047 33848225 29285664 25940363 23248235 21103182 19467014 18266674 17543268
2577 17543268 17237378 17203478 17363306 17717360 18395130 19691343 22243789 28691324 44545446
2568 44545446 67598675 88873345 99211196 95820134 84099314 68344265 53488553
2561 53488553 41973836 33268322 26817103 21999128 18702145 16434103 14702822 13257747
2553 13257747 12035372 11001852 10130613 9446051 8919967 8485278 8104364 7760217 7433494
2544 7433494 7136506 6887760 6674813 6465347 6261528 6066654 5880426 5691802 5511577 5334635
2534 5334635 5163943 5004188 4856422 4718079 4582967 4450334 4324284 4205137 4092255 3985911
2524 3985911 3879573 3776392 3675635 3576733 3483393 3397392 3316170 3232584 3145320 3064131 2992811
2513 2992811 2923944 2862671 2801344 2736284 2664415 2597650 2540187 2490323 2439164 2386730 2330105
2502 2330105 2274790 2217845 2165504 2115208 2067952 2020126 1978924 1941703 1904755 1863319 1818022
2491 1818022 1776336 1737616 1700771 1665319 1634754 1605377 1570405 1536752 1505567 1478091 1448166
2480 1448166 1420749 1399010 1380809 1360888 1336707 1311476 1289823 1265887 1242161 1213033 1181687
2469 1181687 1149960 1118029 1088065 1064274 1038082 1015967 995241 975178 956583 939656 929429
2458 929429 924240 915316 898964 880306 863433 849359 834896 823564 814239 806730 798366 791165 785465
2445 785465 774737 758205 737265 713312 690333 661855 633359 606731 581429 562269 549623 541174
2433 541174 537960 538150 542784 545345 547607 544999 539151 528783 517612 508031 499092 493361 487124 484738
2419 484738 480337 477370 470734 463146 451745 438597 424454 410151 394555 382041 368750 359665 353438
2406 353438 348637 349526 353177 357772 361498 362920 363672 361913 358611 355421 350353 346612 342710 339656 337744
2391 337744 339512 345629 351729 358958 365283 369061 372086 374229 380293 394230 423292 491415 616547
2378 616547 764218 885078 954728 1010670 1070030 1114522 1125444 1097921 1042238 956158 859736
2367 859736 770285 681489 605317 541766 494954 461652 440346 432130 430354 431137 430638 432651 448839
2354 448839 498054 601062 727149 827758 867458 862660 883268 1020422 1245906 1462246 1541715
2343 1541715 1472654 1312764 1111031 925940 770432 643507 541176 464650 408460 370753
2333 370753 343215 319665 299984 284592 270895 260434 251362 244365 237936 234778 233093 240101 253888
2320 253888 299352 395447 519260 618568 643975 599417 519732 428959 353587 297005 254422
2309 254422 221370 198698 182273 169350 161900 151665 142575 134662 127067 121745 117415 113041 110207
2296 110207 106153 105394 101852 100217 98255 96825 94439 92445 89382 86299 83651 80488 78924 77641 75646
2281 75646 75186 74097 73332 72044 71316 67982 66668 64247 63192 61302 61785 59544 58487 58359 57272 54821
2265 54821 53581 54334 53156 51663 50519 49247 48734 48190 46982 46733 45291 44673 43745 44837 42565 42879
2249 42879 41648 41146 40852 40616 39030 39266 38419 37214 36032 35495 34619 34242 34186 33329 33365 32636 33634 31232
2231 31232 30847 30165 30218 30564 30669 30582 30640 29597 31163 29388 28080 28070 26871 26188 25530 24857 24558 23727 23883
2212 23883 23764 22722 23078 22889 20847 21825 21122 21855 21211 20220 20628 20842 19846 21066 21944 22614 21672 20941
2194 20941 19241 18121 17422 17711 17667 15762 15201 15065 14931 13366 13387 12503 13914 12797 13008 12033 11129 12030
2176 12030 12825 12136 11272 12167 11056 12743 11422 11239 12712 11870 11253 10386 10648 10555 9452 9642 7997 8436
2158 8436 7794 8167 7579 6707 7042 6362 6493 7687 7109 7635 5624 6540 5559 6669 6799 6697 5657 5853
2140 5853 6247 5537 5144 4966 4974 4416 4371 4917 4903 6306 6140 6333 6073 6096 4149 3976 3605 3358 3619 3659 4799
2119 4799 3507 3260 3797 1823 2004 1898 1174 1421 961 818 1496 1505 1320 2143 2559 1866 1819 1692 656 703
2099 703 -125 -1077 -888 -836 92 -1221 -1144 -1655 8 -875 -2661 -2855 -2867 -2105 -2808 -3236 -3764 -2732 -3120 -3988
2079 -3988 -4154 -3493 -3327 -3579 -5567 -4851 -4797 -4765 -4536 -4513 -4997 -4786 -5891 -5248 -5487 -6124 -5910 -6204 -6811 -6457
2059 -6457 -6574 -5903 -6543 -6332 -7167 -6486 -7566 -6372 -7179 -6950 -6867 -7413 -7729 -7129 -8255 -8090 -7552 -8381 -8734
2040 -8734 -8763 -8352 -8401 -8300 -8199 -8233 -8726 -9923 -8471 -8537 -9284 -9913 -9468 -10328 -10029 -9798 -10183 -8987 -8843 -8974
2020 -8974 -10428 -9096 -9537 -9707 -9609 -9813 -9145 -9493 -10676 -10590 -11659 -11004 -11052 -10299 -10802 -11220 -12071 -11413 -12381
2001 -12381 -12319 -12992 -13448 -12254 -12511 -12321 -12286 -12617 -13319 -12088 -13501 -12737 -12228 -13160 -12619 -12815 -13043 -12784 -13583
1982 -13583 -12918 -12927 -13001 -13862 -13788 -14129 -13942 -13403 -15059 -15018 -14891 -15489 -14673 -14511 -15498 -14248 -14823 -15008 -13838 -14316
1962 -14316 -14476 -15146 -14858 -14667 -14631 -14835 -14971 -15058 -13983 -14632 -15118 -15288 -15062 -15784 -15501 -15430 -15135 -15201 -15796 -15069
1942 -15069 -14826 -16111 -16094 -15604 -15617 -15735 -15583 -16852 -17239 -16119 -15845 -16116 -15860 -16148 -15860 -16879 -16535 -15887 -16481
1923 -16481 -15339 -16138 -17105 -16238 -15755 -16081 -17251 -15976 -16780 -16428 -16948 -17096 -17773 -17634 -17403 -17713 -17474 -17254
1905 -17254 -17335 -18087 -18075 -18006 -18092 -18183 -16602 -18028 -18692 -18603 -19018 -19141 -18102 -18440 -18314 -18887 -18924 -18004 -18606 -19032 -18773
1884 -18773 -19644 -19191 -18660 -18469 -19192 -18545 -19617 -19833 -18878 -19321 -19890 -19707 -19202 -19102 -19459 -19370 -19678 -20167 -20195 -19779
1864 -19779 -19911 -20388 -21031 -20740 -21020 -20053 -20596 -19911 -19150 -20232 -21138 -20011 -20562 -21208 -20642 -20132 -20556 -21386 -20758
1845 -20758 -20622 -20529 -20836 -22074 -21175 -21023 -22019 -21395 -20474 -21423 -21887 -22489 -21678 -20984 -21487 -20642 -21376 -22763 -22856
1826 -22856 -21124 -23467 -23375 -22351 -22744 -23131 -22333 -23374 -22306 -22678 -22348 -22779 -22116 -22465 -23169 -22462 -21220 -22279
1808 -22279 -21975 -21153 -22293 -22212 -22155 -22825 -22562 -24022 -23077 -23595 -23387 -24310 -24320 -23750 -23943 -24314 -23308 -24079 -24858
1789 -24858 -23738 -24321 -23423 -23206 -23333 -23596 -24317 -22838 -23813 -23872 -22876 -24568 -23706 -23393 -23599 -23590 -23587 -23415 -23215 -23488
1769 -23488 -24680 -24256 -23999 -24601 -24184 -24377 -24879 -24604 -25195 -25520 -24747 -23753 -24873 -23837 -26076 -25445 -26210 -25559
1751 -25559 -24523 -25294 -25293 -25514 -25556 -25693 -25806 -25460 -25016 -25562 -25143 -24201 -24224 -24179 -24635 -25383 -25203 -25335 -25905 -26295 -26399
1730 -26399 -26873 -27143 -27946 -26318 -26217 -27496 -25994 -25564 -24928 -25254 -23861 -24805 -25844 -25550 -25814 -26411 -26941 -26548
1712 -26548 -26240 -26273 -26316 -25908 -25877 -25586 -24813 -27180 -27909 -27961 -29672 -27874 -28387 -28285 -27595 -26748 -27060 -27059 -26663 -27552
1692 -27552 -26611 -26436 -27443 -27984 -27876 -28227 -28096 -28250 -28873 -28713 -27825 -28408 -28085 -28352 -28294 -28136 -29617 -29825 -30717
1673 -30717 -29783 -29506 -29720 -28894 -29142 -29977 -28873 -28770 -28196 -28760 -30001 -30920 -29776 -30413 -29715 -29470 -29828 -29818 -30139
1654 -30139 -30427 -31692 -31628 -31665 -31711 -31310 -30832 -31289 -30827 -30474 -31161 -31705 -30789 -33203 -32637 -32371 -32058 -32630 -32893 -31958
1634 -31958 -31902 -31838 -31220 -32040 -32654 -31357 -31138 -32193 -32748 -32855 -32793 -34031 -33061 -33408 -33127 -34605 -34807 -35356 -34128
1615 -34128 -35354 -34335 -33899 -33692 -33882 -34879 -33743 -34371 -34536 -35327 -34829 -34191 -36825 -36157 -36255 -36108 -37032 -36023
1597 -36023 -35750 -35769 -34567 -35608 -35528 -36388 -36381 -36014 -36410 -36108 -36394 -35851 -35455 -34906 -34501 -34693 -34641 -35595 -35480 -37266
1577 -37266 -37132 -36836 -37722 -37984 -38730 -37822 -39305 -40680 -39371 -38650 -37976 -38049 -37646 -35955 -33589 -33267 -33111 -32422
1559 -32422 -32709 -33604 -34435 -35864 -35325 -34539 -34546 -33971 -33884 -34301 -33827 -34280 -33896 -34594 -33951 -35024 -35792 -35317 -35873 -35964
1539 -35964 -35420 -34786 -33040 -31772 -31304 -29608 -29814 -29373 -30217 -29210 -30488 -30178 -29864 -30526 -29899 -30110 -30413 -30148
1521 -30148 -28548 -29190 -29013 -29383 -28827 -29709 -28816 -29110 -29463 -28090 -28291 -27766 -28850 -28050 -28386 -27693 -27409 -27916
1503 -27916 -26698 -26154 -25819 -25185 -24565 -25536 -25966 -26220 -26701 -27644 -26627 -24922 -26940 -26586 -25198 -25460 -26837
1486 -26837 -25863 -26007 -26084 -25466 -26320 -27202 -27604 -28075 -26812 -26232 -26625 -26375 -25907 -25492 -25332 -24844 -23988 -25907 -25135
1467 -25135 -24909 -25143 -25689 -25328 -25265 -25856 -26431 -25732 -26416 -26897 -27782 -27364 -27848 -26156 -26741 -26631 -26122 -26453 -26424 -26472
1447 -26472 -27086 -26919 -27204 -28098 -26891 -27242 -26984 -26782 -25678 -26956 -25456 -26913 -26327 -27380 -27095 -26939 -26259
1430 -26259 -27374 -27238 -26857 -26978 -26748 -27870 -27467 -26842 -27673 -27068 -27453 -28321 -28333 -28695 -27587 -28389 -28369 -28065 -28689
1411 -28689 -27211 -27898 -27151 -27228 -27584 -27573 -27789 -28019 -29067 -28621 -28533 -27808 -27203 -27051 -27929 -29122 -29343 -28310 -27856
1392 -27856 -28688 -28809 -27692 -28625 -27575 -28064 -28354 -28685 -29071 -28473 -28721 -28768 -28904 -28464 -28391 -28006 -28355 -28556 -28422
1373 -28422 -28904 -29300 -29440 -29105 -29292 -29232 -30238 -28579 -29361 -28779 -29513 -29787 -30306 -30030 -30111 -28703 -28958 -28793 -29404
1354 -29404 -28440 -28989 -29635 -28526 -28890 -29395 -29270 -29379 -29701 -29223 -30195 -29583 -30065 -29150 -29365 -30336 -29402 -29798 -29408
1335 -29408 -29543 -30026 -29910 -29623 -30028 -30031 -30283 -29978 -30029 -30216 -30533 -29847 -29756 -29957 -30506 -30154 -30360 -30076 -30778 -30090 -29227
1314 -29227 -29253 -29246 -30398 -30422 -31140 -30266 -30707 -30822 -29590 -30422 -29173 -29488 -30734 -30533 -29693 -29932 -30868 -30655 -31003
1295 -31003 -30228 -31018 -29183 -30187 -30477 -31416 -30824 -31169 -30766 -30667 -30660 -31102 -30822 -30238 -30820 -30471 -30826 -30900 -31581 -29870
1275 -29870 -31293 -30440 -31326 -30607 -31063 -31996 -31003 -30468 -30845 -31237 -32166 -31008 -30584 -31315 -31603 -32227 -31549 -30403
1257 -30403 -32068 -31526 -30995 -31699 -31858 -31864 -31063 -31656 -31042 -30698 -31731 -31997 -31833 -32505 -31497 -31508 -30691 -31873 -32159
1238 -32159 -33141 -32657 -32615 -32252 -31127 -32469 -31792 -30504 -31428 -32187 -32432 -32031 -32107 -31854 -31363 -31778 -31741 -31419 -30807
1219 -30807 -32586 -31046 -30981 -31565 -31644 -31873 -31109 -31961 -32191 -32676 -31618 -32259 -33409 -33063 -31936 -31312 -32119 -32196 -32990
1200 -32990 -32499 -32229 -31330 -32627 -32164 -32565 -32203 -31749 -31314 -31970 -32331 -32519 -32690 -32805 -31369 -32203 -31775 -32699 -32204
1181 -32204 -32370 -32182 -32793 -33973 -32971 -32281 -32918 -32232 -33304 -32323 -34015 -32278 -32450 -32923 -32059 -32534 -33359 -31841
1163 -31841 -31874 -32296 -32870 -33019 -31905 -32727 -32149 -33257 -32795 -32702 -32926 -33954 -33140 -33380 -31902 -33084 -32827 -32938
1145 -32938 -32720 -32105 -32597 -32303 -32495 -33539 -33708 -33895 -33075 -33133 -33730 -33042 -34035 -32478 -34038 -33805 -33563 -33733 -33468
1126 -33468 -34367 -34275 -34044 -33694 -33754 -33244 -32866 -34410 -33491 -34290 -33871 -33449 -32928 -33404 -34006 -33725 -33143 -33412 -33731 -34105
1106 -34105 -33013 -33150 -33929 -34113 -33608 -33595 -33395 -33550 -34372 -33339 -33805 -34096 -34349 -34755 -35057 -34733 -34033 -34065 -34334
1087 -34334 -34343 -33403 -34723 -34091 -33395 -34185 -34732 -35238 -34158 -34050 -33962 -34844 -34896 -33792 -33395 -34137 -34422 -33813 -34920
1068 -34920 -34029 -33716 -34078 -33524 -34020 -35213 -33388 -34257 -33286 -33762 -33573 -34079 -35031 -34779 -34448 -33751 -34721 -34814 -34870
1049 -34870 -35609 -34359 -34694 -34779 -33639 -34385 -34772 -34856 -34872 -34208 -33921 -34724 -34628 -34589 -34658 -34090 -33405 -34930 -34995 -35620 -35104
1028 -35104 -34601 -34468 -35287 -35001 -34722 -34418 -35031 -35899 -34789 -35198 -34583 -35555 -34831 -35224 -35703 -35096 -35275 -34560 -35482
1009 -35482 -35372 -35510 -35279 -35953 -35236 -36150 -35030 -34922 -35261 -36120 -35197 -36089 -36344 -35938 -36752 -35903 -35698 -35783 -34789
990 -34789 -35077 -35385 -35204 -34443 -35100 -36224 -35415 -34631 -35441 -35628 -34281 -36989 -34987 -35404 -35194 -35583 -34286 -36106
972 -36106 -35830 -35121 -36596 -35351 -35857 -34486 -36089 -36226 -36274 -36266 -35597 -35567 -34842 -35570 -35273 -34790 -36122 -35302 -35516
953 -35516 -35406 -35427 -35670 -36305 -35361 -35942 -36420 -36942 -34643 -33978 -34719 -34957 -33995 -35775 -35878 -35676 -36071 -35878 -34783
934 -34783 -35970 -35767 -35300 -36982 -36219 -37693 -36543 -35432 -35746 -36245 -36808 -36309 -35889 -35673 -36504 -35945 -35741 -35588
916 -35588 -35675 -35402 -36918 -38148 -37038 -35166 -35208 -34948 -36520 -35133 -36671 -36435 -35356 -35801 -35640 -35880 -36095 -36469
898 -36469 -35896 -35757 -36083 -35699 -36704 -35727 -35337 -36141 -34922 -35330 -35996 -35825 -37196 -36033 -34824 -35161 -36690 -35919
880 -35919 -36071 -36101 -36427 -35533 -35267 -36018 -35402 -36558 -37761 -37150 -35916 -36580 -36559 -36444 -36397 -36653 -36639 -35561 -36863
861 -36863 -37408 -37198 -37610 -35151 -35270 -36591 -37741 -37563 -37415 -36866 -35549 -35861 -36198 -37020 -38050 -37841 -36717 -36716
843 -36716 -36232 -36007 -36130 -36425 -37108 -37733 -37901 -36730 -37601 -37852 -36970 -36991 -36623 -36912 -37941 -38377 -37796 -36387 -36539
824 -36539 -36246 -36891 -38226 -37732 -37783 -37086 -35925 -36461 -35923 -36819 -38153 -38900 -38335 -37247 -37612 -38308 -38521 -38107 -39156
805 -39156 -37157 -37104 -37256 -38482 -38821 -37568 -36552 -36098 -36890 -36976 -38251 -37626 -36937 -34769 -34731 -37209 -38488 -39118
787 -39118 -38513 -36961 -38380 -37562 -38046 -37417 -37839 -38468 -38186 -38909 -39077 -38986 -39012 -38086 -38116 -36830 -39108 -39453 -39602
768 -39602 -38800 -37034 -36963 -37802 -37362 -40246 -40387 -39271 -36395 -36648 -37128 -38493 -38545 -38764 -40220 -40858 -40171 -37927
750 -37927 -36756 -38563 -40054 -39869 -39134 -37471 -37145 -38507 -39859 -40883 -38756 -36506 -38558 -40035 -42354 -42886
734 -42886 -39930 -37497 -37161 -39777 -40556 -40829 -39154 -38183 -39942 -40169 -41429 -40152 -37712 -37253 -37887 -40133 -40655
717 -40655 -40728 -39323 -40613 -40172 -37816 -38176 -39982 -41567 -43177 -42053 -38034 -35642 -37593 -45559 -45564 -44753 -42745
700 -42745 -39317 -37631 -35226 -36506 -38875 -41948 -42911 -42115 -40370 -39603 -39443 -40287 -42792 -42471 -39179 -36467
684 -36467 -38259 -39817 -40544 -41530 -37491 -33003 -33765 -43665 -52262 -48741 -43700 -43468 -44765 -39178 -29329 -27383
668 -27383 -31292 -39719 -47475 -48852 -46315 -41332 -36718 -38287 -40330 -39768 -38294 -34624 -36403 -39741 -41195
653 -41195 -40406 -36634 -31447 -32864 -43291 -50398 -46878 -43310 -43547 -43721 -37350 -27410 -26653 -31297 -38699 -45862
637 -45862 -46530 -43972 -38642 -35440 -37152 -37502 -39248 -36374 -34045 -33365 -35975 -39043 -40742 -40267 -37758 -34755
621 -34755 -36262 -40928 -43644 -43132 -40035 -38041 -35180 -31364 -34133 -37645 -38598 -39217 -37312 -36455 -35279 -37361
605 -37361 -37982 -37715 -37875 -37846 -37812 -36158 -34517 -34981 -37419 -39317 -39974 -39261 -35654 -34951 -35536 -37506 -37700 -36621
587 -36621 -35740 -37053 -37006 -38642 -37395 -34230 -33708 -35143 -36967 -38586 -38377 -36563 -35040 -37412 -39083 -39886
571 -39886 -37714 -36321 -35675 -36446 -38220 -38595 -38535 -35765 -34341 -35542 -37665 -37971 -37649 -37699 -36672 -36314 -36231 -36320
553 -36320 -36248 -36516 -37344 -38318 -37156 -35976 -35484 -35660 -37446 -38313 -38949 -36814 -37114 -35822 -35830 -37222 -38684 -38018
535 -38018 -37743 -37396 -35787 -36212 -37049 -35159 -37494 -36376 -37396 -38294 -38550 -37972 -36362 -36181 -37871 -38857 -37664
518 -37664 -36208 -36318 -35034 -36587 -36466 -38322 -38586 -36436 -36377 -37158 -38433 -37870 -38453 -38151 -37837 -37862 -37768 -37874 -37593
499 -37593 -37105 -38660 -37529 -37075 -37682 -37208 -38272 -38641 -38057 -38205 -38436 -38743 -38038 -37465 -38182 -36658 -37826 -37860
481 -37860 -36793 -38362 -37202 -37350 -37807 -38835 -38938 -38758 -37615 -37866 -37333 -37590 -36959 -38879 -39441 -38758 -39014 -37198
463 -37198 -37243 -38277 -39304 -40153 -39452 -38958 -37167 -36468 -38270 -38263 -37992 -38974 -37852 -37918 -38265 -37537 -37796 -37122 -38430
444 -38430 -38164 -39101 -38329 -37973 -37549 -37436 -38867 -38845 -38265 -40016 -38993 -38591 -38868 -37950 -38847 -38669 -38885 -38452 -37871
425 -37871 -36914 -38506 -38529 -38172 -38494 -38856 -37802 -37164 -38404 -38266 -38502 -38457 -39220 -38561 -38031 -38750 -37991 -40122 -39486
406 -39486 -38867 -39211 -38673 -39049 -39211 -38804 -38920 -39365 -37959 -37570 -37730 -38393 -38373 -38950 -39023 -38775 -38560 -39182 -37561 -38088
386 -38088 -38497 -39116 -39340 -39114 -38113 -37584 -37231 -39025 -38426 -38844 -39559 -38418 -38865 -38319 -38342 -38258 -37541 -38702 -38973
367 -38973 -38999 -39744 -38283 -37966 -37925 -38742 -40179 -38992 -38897 -38726 -38375 -39391 -39625 -38663 -38817 -39371 -38210 -38126 -38846
348 -38846 -39486 -38923 -40309 -39167 -39210 -39001 -38751 -37954 -38446 -39709 -39343 -39042 -39361 -39979 -38103 -39948 -38653 -39999
330 -39999 -39533 -38683 -38650 -39303 -39377 -39181 -38515 -38809 -39696 -39599 -39282 -38907 -39351 -39362 -39058 -39804 -38327 -40063 -39193 -39297
310 -39297 -39270 -39196 -39678 -38917 -39552 -39972 -40077 -38937 -39526 -39435 -39564 -39630 -40007 -39581 -39104 -39349 -38952 -39520 -38920 -39528 -39069
289 -39069 -39839 -40167 -40183 -39416 -39999 -39413 -40463 -39663 -40374 -39295 -39173 -39591 -39949 -40352 -40421 -40872 -40194 -40436 -40236 -40540
269 -40540 -40184 -40630 -40722 -40937 -41279 -41606 -40858 -41470 -41924 -39967 -40368 -40279 -41194 -40752 -41507 -41829 -40519 -41849 -41340
250 -41340 -41629 -41891 -40661 -40543 -41260 -41752 -42033 -41855 -42191 -40831 -41868 -42752 -41264 -40777 -41952 -41704 -41977 -42164
232 -42164 -41305 -42835 -41987 -42817 -41593 -42286 -42771 -42042 -41879 -42595 -42280 -42776 -42857 -43524 -43014 -43169 -43617 -43212 -43464
213 -43464 -44749 -42799 -43794 -44295 -43577 -44355 -44422 -44146 -44318 -43884 -44058 -44763 -44366 -45259 -43840 -45419 -45615 -45439 -45788
194 -45788 -45813 -44873 -45560 -46230 -45857 -45939 -46164 -45725 -46666 -46416 -46766 -46490 -47077 -46721 -47109 -47466 -47349 -46638 -47050 -47492
174 -47492 -47844 -46812 -48130 -49147 -48646 -48893 -48027 -48747 -49142 -50321 -48820 -48110 -48962 -50354 -49905 -49382 -49979 -49541
156 -49541 -50296 -50341 -50585 -51288 -50468 -51899 -50944 -51181 -51640 -52167 -52522 -51410 -53305 -52567 -52354 -53194 -52938 -52867 -53208
137 -53208 -54133 -54038 -55691 -54228 -54125 -54315 -54690 -55039 -55055 -55054 -55681 -56405 -55561 -56258 -56870 -56795 -56750 -56675 -57228 -57616 -57815
116 -57815 -57565 -57950 -58515 -57788 -59433 -59402 -59233 -59325 -59910 -59589 -60196 -60588 -60166 -61395 -60890 -61780 -62466 -62421 -62178 -62035
96 -62035 -63227 -63157 -63031 -63956 -64162 -63557 -63998 -63875 -64554 -64527 -65752 -64642 -65959 -65916 -66963 -66507 -66773 -67494 -67266
77 -67266 -67500 -67863 -68122 -68869 -68526 -68613 -69411 -70256 -70162 -69832 -70848 -71251 -71144 -71285 -71239 -71432 -71281 -72662 -72464 -73044
57 -73044 -73291 -73368 -73672 -74754 -75127 -74931 -74795 -75661 -75552 -75751 -76340 -75826 -76787 -77870 -77102 -77151 -77986 -78739 -78719 -78709 -79341
36 -79341 -78610 -79354 -79948 -81093 -81085 -81208 -82766 -81984 -81476 -82015 -82728 -83103 -83445 -84360 -84269 -84327 -85043 -84111 -84633 -86386
16 -86386 -86232 -85969 -85754 -86703 -86421 -86394 -87565 -86944 -87653 -88301 -88673 -89227 -89267 -90345 -89572 -90361
0 -90361
$$ Imaginary data points
##PAGE= N=2
##DATA TABLE= (X++(I..I)), XYDATA
16383 -349046 -343777 -339553 -335492 -330654 -326406 -321685 -316381 -311982 -306897 -303201 -298399 -294470 -289336 -285735
16369 -285735 -280819 -275747 -271704 -266610 -261546 -257017 -252908 -248623 -244383 -240377 -235034 -231279 -225667 -221224
16355 -221224 -217718 -212252 -208705 -203676 -199416 -195875 -190112 -186319 -182863 -177996 -173617 -169230 -165145 -160984
16341 -160984 -156138 -152074 -148218 -144032 -139441 -134594 -130611 -126364 -121720 -117259 -114230 -109969 -105760 -101640
16327 -101640 -97088 -93335 -89119 -85029 -80893 -76030 -72235 -68863 -65305 -60524 -56775 -53091 -49453 -45004
16313 -45004 -40579 -37178 -34386 -29231 -25013 -21946 -18013 -14346 -10222 -6457 -3235 -285 3335 8161
$$ [...]
##END NTUPLES=NMR SPECTRUM
##END=
