##TITLE=abcd
##JCAMPDX= 6.0         $$ Bruker NMR JCAMP-DX V2.0
##DATA TYPE= NMR SPECTRUM
##DATA CLASS= NTUPLES
##ORIGIN= UXNMR, Bruker Analytische Messtechnik GmbH
##OWNER= root
$$ XWIN-NMR		Version 3.5
$$ Fri Apr 10 17:38:40 2026 Russian Standard Time (UT+4h)  servis@DPX200
##.OBSERVE FREQUENCY= 200.131235884673
##.OBSERVE NUCLEUS= ^1H
##.ACQUISITION MODE= SIMULTANEOUS
##.ACQUISITION SCHEME= undefined
##.AVERAGES= 32
##.DIGITISER RES= 18
##SPECTROMETER/DATA SYSTEM= spect
##.PULSE SEQUENCE= zg
##.SOLVENT NAME= CDCl3
##.SHIFT REFERENCE= (INTERNAL, CDCl3, 0, 16.4885)
##AUDIT TRAIL= $$ (NUMBER, WHEN, WHO, WHERE, WHAT)
$$ ##TITLE= Audit trail, XWIN-NMR		Version 3.5
$$ ##JCAMPDX= 5.01
$$ ##ORIGIN= Bruker BioSpin GmbH
$$ ##OWNER= servis
$$ F:\spectra/data/av/nmr/H1/1/pdata/1/auditp.txt
$$ ##AUDIT TRAIL=  $$ (NUMBER, WHEN, WHO, WHERE, WHAT)
(   1,<2026-04-10 17:37:36.67 +0400>,<servis>,<DPX200>,
      <created by zg, POWCHK disabled, PULCHK disabled
       configuration hash MD5:
       00 E9 B6 7A A2 85 ED C7 34 08 36 98 17 FE 4E 26
       data hash MD5: 32K
       3D 4E 2F B9 78 9A F7 11 8C AB 02 47 BE 15 43 1E>)
(   2,<2026-04-10 17:38:09.03 +0400>,<servis>,<DPX200>,
      <Start of raw data processing
       efp BC_mod = 2 LB = 0.05 FT_mod = 6 PKNL = 1 PHC0 = -177.3018 PHC1 = -0.898437 SI = 16K 
       data hash MD5: 16K
       B1 DC 22 39 50 2E EB F1 6A 3B C2 22 A4 D6 F3 74>)
(   3,<2026-04-10 17:38:18.20 +0400>,<servis>,<DPX200>,
      <pk PHC0 = -2.4 PHC1 = 0 
       data hash MD5: 16K
       97 E2 F6 7D 6C AC 11 09 66 1C E9 A4 81 46 87 88>)
$$ ##END=
$$ 
$$ hash MD5
$$ 06 A2 44 1F A5 BA 89 DD 45 08 91 A7 E7 79 13 1A
##$RELAX= 
##$RELAX= 
##$RELAX= 
##$RELAX= 
##$RELAX= 
##$RELAX= 
##$RELAX= 
##$RELAX= 
$$ Bruker specific parameters
$$ --------------------------
##$DU= <F:\spectra>
##$EXPNO= 1
##$NAME= <H1>
##$PROCNO= 1
##$TYPE= <nmr>
##$USER= <av>
##$AMP= (0..31)
100 100 100 100 100 100 100 100 100 100 100 100 100 100 100 100 100 100 
100 100 100 100 100 100 100 100 100 100 100 100 100 100 
##$AQSEQ= 0
##$AQ_mod= 1
##$AUNM= <au_zg>
##$AUTOPOS= <>
##$BF1= 200.13
##$BF2= 200.13
##$BF3= 200.13
##$BF4= 200.13
##$BF5= 500.13
##$BF6= 500.13
##$BF7= 500.13
##$BF8= 500.13
##$BYTORDA= 1
##$CFDGTYP= 0
##$CFRGTYP= 5
##$CHEMSTR= <none>
##$CNST= (0..31)
1 1 145 1 1 1 1 1 1 1 1 1 1 1 1 1 1 1 1 1 1 1 1 1 1 1 1 1 1 1 1 1 
##$CPDPRG= <>
##$CPDPRG1= <>
##$CPDPRG2= <>
##$CPDPRG3= <>
##$CPDPRG4= <mlev>
##$CPDPRG5= <mlev>
##$CPDPRG6= <mlev>
##$CPDPRG7= <mlev>
##$CPDPRG8= <mlev>
##$CPDPRGB= <>
##$CPDPRGT= <>
##$D= (0..31)
0 2 0 0 0 0 0 0 0 0.06 0 0 0 0 0 0 0.0002 0 0 0 0 0 0 0 0 0 0 0 0 0 0 
0 
##$DATE= 1775828256
##$DBL= (0..7)
120 120 120 120 120 120 120 120 
##$DBP= (0..7)
150 150 150 150 150 150 150 150 
##$DBP07= 0
##$DBPNAM0= <>
##$DBPNAM1= <>
##$DBPNAM2= <>
##$DBPNAM3= <>
##$DBPNAM4= <>
##$DBPNAM5= <>
##$DBPNAM6= <>
##$DBPNAM7= <>
##$DBPOAL= (0..7)
0.5 0.5 0.5 0.5 0.5 0.5 0.5 0.5 
##$DBPOFFS= (0..7)
0 0 0 0 0 0 0 0 
##$DE= 6
##$DECBNUC= <off>
##$DECIM= 32
$$ [...]
##$SUBNAM4= <"">
##$SUBNAM5= <"">
##$SUBNAM6= <"">
##$SUBNAM7= <"">
##$SUBNAM8= <"">
##$SUBNAM9= <"">
##$SW= 20.6817932712277
##$SWIBOX= (0..15)
0 0 3 0 0 0 0 0 0 0 0 0 0 0 0 0 
##$SW_h= 4139.07284768212
##$TD= 32768
##$TD0= 1
##$TE= 0
##$TE2= 300
##$TE3= 300
##$TEG= 300
##$TL= (0..7)
0 120 120 120 120 120 120 120 
##$TP= (0..7)
150 150 150 150 150 150 150 150 
##$TP07= 0
##$TPNAME0= <>
##$TPNAME1= <>
##$TPNAME2= <>
##$TPNAME3= <>
##$TPNAME4= <>
##$TPNAME5= <>
##$TPNAME6= <>
##$TPNAME7= <>
##$TPOAL= (0..7)
0.5 0.5 0.5 0.5 0.5 0.5 0.5 0.5 
##$TPOFFS= (0..7)
0 0 0 0 0 0 0 0 
##$TUNHIN= 0
##$TUNHOUT= 0
##$TUNXOUT= 0
##$USERA1= <user>
##$USERA2= <user>
##$USERA3= <user>
##$USERA4= <user>
##$USERA5= <user>
##$V9= 5
##$VALIST= <valist>
##$VCLIST= <CCCCCCCCCCCCCCC>
##$VD= 0
##$VDLIST= <DDDDDDDDDDDDDDD>
##$VPLIST= <PPPPPPPPPPPPPPP>
##$VTLIST= <TTTTTTTTTTTTTTT>
##$WBST= 1024
##$WBSW= 30
##$XGAIN= (0..3)
0 0 0 0 
##$XL= 0
##$YL= 0
##$YMAX_a= 63552
##$YMIN_a= -54517
##$ZGOPTNS= <>
##$ZL1= 120
##$ZL2= 120
##$ZL3= 120
##$ZL4= 120
##$ABSF1= 0
##$ABSF2= 0
##$ABSG= 0
##$ABSL= 0
##$ALPHA= 0
##$AQORDER= 0
##$ASSFAC= 0
##$ASSFACI= 0
##$ASSFACX= 0
##$ASSWID= 0
##$AUNMP= <proc_1d>
##$AZFE= 0.1
##$AZFW= 0.1
##$BCFW= 0
##$BC_mod= 2
##$BYTORDP= 0
##$COROFFS= 0
##$CY= 18.4799938201904
##$DATMOD= 1
##$DC= 0
##$DFILT= <>
##$DTYPP= 0
##$F1P= 9.9274215381318
##$F2P= -0.165520771350173
##$FCOR= 1
##$FTSIZE= 16384
##$FT_mod= 6
##$GAMMA= 0
##$GB= 0
##$INTBC= 1
##$INTSCL= 4.127829e-11
##$ISEN= 128
##$LB= 0.05
##$LEV0= 0
##$LPBIN= 0
##$MAXI= 10000
##$MC2= 0
##$MEAN= 0
##$ME_mod= 0
##$MI= 50
##$NCOEF= 0
##$NC_proc= -9
##$NLEV= 6
##$NOISF1= 3.799351
##$NOISF2= 2.8
##$NSP= 0
##$NTH_PI= 0
##$NZP= 0
##$OFFSET= 16.48848
##$PC= 4
##$PHC0= -179.7018
##$PHC1= -0.898437
##$PH_mod= 1
##$PKNL= yes
##$PPARMOD= 0
##$PSCAL= 4
##$PSIGN= 0
##$REVERSE= no
##$SF= 200.130005582386
##$SI= 16384
##$SIGF1= 3
##$SIGF2= 2
##$SINO= 400
##$SIOLD= 16384
##$SREGLST= <1H.CDCl3>
##$SSB= 0
##$STSI= 16384
##$STSR= 0
##$SW_p= 4139.07284768211
##$SYMM= 0
##$S_DEV= 0
##$TDeff= 32768
##$TDoff= 0
##$TI= <>
##$TILT= no
##$TM1= 0
##$TM2= 0
##$TOPLEV= 0
##$USERP1= <user>
##$USERP2= <user>
##$USERP3= <user>
##$USERP4= <user>
##$USERP5= <user>
##$WDW= 1
##$XDIM= 16384
##$YMAX_p= 432567618
##$YMIN_p= -7906471
$$ End of Bruker specific parameters
$$ ---------------------------------
##NTUPLES= NMR SPECTRUM
##VAR_NAME=  FREQUENCY,     SPECTRUM/REAL,   SPECTRUM/IMAG
##SYMBOL=    X,             R,               I
##VAR_TYPE=  INDEPENDENT,   DEPENDENT,       DEPENDENT
##VAR_FORM=  AFFN,          ASDF,            ASDF
##VAR_DIM=   16384,         16384,           16384
##UNITS=     HZ,            ARBITRARY UNITS, ARBITRARY UNITS
##FACTOR=    0.252644378177508, 1,           1
##FIRST=     3299.83951724647, 0,            0
##LAST=      -839.233330435636, 0,           0
##MIN=       -839.233330435636, -7906471,    0
##MAX=       3299.83951724647, 432567618,    0
$$ Real data points
##PAGE= N=1
##DATA TABLE= (X++(R..R)), XYDATA
$$ [...]
9848 -239542 -731444 -850426 444137 -164053 -614999 78399 -186184 -416924 13822 -403045
9838 -403045 -468675 401746 -658348 -1543690 -844972 -472048 -908521 768092 237635 -512878
9828 -512878 -457670 -233469 -416445 -1048337 -625410 -1068524 -160481 -220159 188424 -455510
9818 -455510 17934 64949 -415222 -150663 -90506 117788 -774414 -1088541 116997 -125191
9808 -125191 79859 -27762 -321437 65093 -97797 -241923 77086 456994 -550873 -523841
9798 -523841 -335287 465489 138123 223653 216844 -65276 -500406 -332732 -402419 -85012
9788 -85012 -218550 351006 124687 11522 20246 184309 -986571 -123691 -84214 -171101
9778 -171101 -801178 -805195 -1601277 832574 -101777 -1081851 -1303450 -330875 67221 703426
9768 703426 -332828 -518063 66737 342619 -434580 19982 -434886 -741850 89532 -704011
9758 -704011 -195506 604804 -652452 -471725 300607 247652 -288704 -181861 88934 -473836
9748 -473836 855555 -1413351 -182348 -71864 -560311 -154007 96680 -177680 115527
9739 115527 430181 -1769 465533 -151603 -1255323 -494801 -150351 -526918 -56779 649359
9729 649359 -259881 -350621 -465600 -301808 -313656 -243365 -870745 451197 135018 -1007396
9719 -1007396 -186123 -893564 51890 72491 -586271 -459037 -332173 405315 -441951 12118
9709 12118 -611088 -958121 433210 -132744 -633678 -612427 -1238511 564762 -28247 356821
9699 356821 -480155 -613503 -53896 -110065 -700375 -1239005 172737 304705 -45761 -17277
9689 -17277 -489118 -817066 44774 -486503 -645293 676871 -199576 261257 -250012 134614
9679 134614 -355137 200830 -1056548 -152058 -242023 -422825 -103994 -283341 -511136 367703
9669 367703 278332 -235329 632892 226190 -946964 188470 -947151 -890345 570703
9660 570703 57115 -121704 -310940 -343992 46337 -200808 -515090 139950 -42192 -805037
9650 -805037 -470674 -587833 -583798 -1043201 -31479 -240646 1027639 122436 133408 -1088721
9640 -1088721 -624793 -360237 424080 -478932 -46892 -549514 -34280 149149 368309 -869530
9630 -869530 123537 406445 -330777 72307 121072 -397518 267182 -408452 -812230 111111
9620 111111 236459 -637252 -481968 -54681 -54920 -263432 -7805 330251 -15097 -691774
9610 -691774 -946229 -590035 -18013 -189955 -660568 -377656 -240714 69483 -295114 -136906
9600 -136906 -119267 -356314 -1560955 -365169 762086 -615891 -488671 -674885 -594586
9591 -594586 532580 229226 -1544291 -672571 521123 -251520 -207380 -612322 -219767
9582 -219767 78141 -969808 -376351 196141 472122 -1019404 285274 -1282021 -492703
9573 -492703 -339020 -720282 338077 78095 -799875 -556438 302476 215385 -47303 -681633
9563 -681633 -742722 -577603 -199121 -1133601 -89974 -517212 -521940 848324 -274736 -405226
9553 -405226 -509499 -397524 -162522 -296687 -101024 -166306 97633 -710490 -1092746 -304062
9543 -304062 -922210 38566 -860370 -247415 263612 -100459 333100 -397694 43005 -178422
9533 -178422 -399344 -617932 -101793 -663506 -456747 98369 -34429 -997939 56237 207523
9523 207523 872926 710540 -145993 -326189 -505801 39987 -793925 -725667 293780 106725
9513 106725 414697 -191326 323452 -476060 -853183 610907 88621 -564777 -417792 -879570
9503 -879570 56449 -5654 -1166 173314 349213 594091 30156 2110 -770956 -461630
9493 -461630 968812 -47106 -265823 -871252 -979548 303885 -524698 551646 -64527
9484 -64527 -641404 752216 370125 345163 -1289022 -343776 -189959 -582429 313980 -486719
9474 -486719 -238976 238398 -249227 -526996 46958 208028 -428318 -23378 -56369 -334208
9464 -334208 -548354 -536001 -249071 317915 196535 -219729 -246021 -265319 -243433 -224156 -1543340
9453 -1543340 -345582 -146884 128015 -530251 -748564 -750656 -322633 -222008 -123956 -8835
9443 -8835 -259841 -699908 -407488 -899506 -503410 -63033 -535356 -334139 74111 306485
9433 306485 -938317 -431611 -291527 -402082 202069 -541348 -654717 -210290 -906781 215238
9423 215238 211881 139193 -335830 -142370 463192 15008 -458681 -452434 -930303 -379942 -1286029
9412 -1286029 175327 -571842 699469 -244889 -673079 -349119 379928 -1304796 -89572
9403 -89572 -790325 51863 -768659 175762 -128366 -490586 31050 -801529 -101498 -81235
9393 -81235 -195811 113151 -817062 -547066 -396664 -423737 517125 276130 -134918 -579658
9383 -579658 282279 -98190 -442740 1046585 472868 -278610 -227839 -347317 308304 -192573
9373 -192573 194923 -640131 -39376 348023 -400077 460655 -43914 -425078 -267342 -826218
9363 -826218 27848 54314 556203 -1293416 -314680 463668 -182959 -24954 300221 -706927
9353 -706927 -482906 -4720 -1033235 -524641 -837157 -923982 354932 189812 80912 -496273
9343 -496273 -379232 -161681 -501003 -1133407 -401192 281434 -97725 -91319 524969 -211072
9333 -211072 117966 -382615 28861 -350274 19533 -1140152 176929 -563719 218302
9324 218302 489837 254340 977038 386270 -740342 -148879 -396375 -280323 -364153 -250155
9314 -250155 -834023 -237410 732670 -773640 -209668 470717 -835082 -278714 -101984
9305 -101984 -102330 220155 -194074 -10820 172508 109062 -309553 -409659 -278856 -415765
9295 -415765 633608 -225111 -214975 -7429 -101547 -262742 905843 248869 -212533 -9323
9285 -9323 -9173 -230783 -289527 149815 46432 411081 -521687 -31761 -767076 132280 -28370
9274 -28370 -307681 -552461 -78753 250315 -66552 502159 -285777 -556558 -565197 110132
9264 110132 -745744 104277 -445218 -176709 -307050 664214 121638 -70014 -952902 -553646
9254 -553646 -768079 148547 -475376 -246161 225465 -366126 -345800 -255776 846145 -695802
9244 -695802 -806405 -587644 -1139030 -258101 -169542 -472148 11478 300107 320532 716718
9234 716718 -93993 397239 -359391 -118668 -730183 -124260 22919 -716184 -429402 -118887
9224 -118887 632057 1256996 -264843 -186322 92662 -9259 88645 -503741 70400 486439
9214 486439 -309381 -460797 -1074322 689036 1770 375986 -291845 -270156 512825 263753
9204 263753 -254277 -34802 -385439 510208 -148579 -185691 -203208 -232489 -387822 -204810
9194 -204810 -113751 539399 598010 -140797 -747215 239923 -209508 71923 245035 226399
9184 226399 395970 276886 -969904 944618 -121389 183713 401909 787003 709847
9175 709847 241157 320942 97109 813402 175662 431046 269653 -334278 20294 152179
9165 152179 140232 -441160 315907 -406988 762317 624806 340673 647755 316292 118051
9155 118051 -226525 104389 412508 397643 109164 973672 1004773 1078166 703218 1111710
9145 1111710 -161819 1248816 1023883 -100523 613802 1481470 174779 1300944 682018
9136 682018 1273748 873522 590152 816615 1555414 1096654 -19743 254232 504195 1188915
9126 1188915 1671001 103537 600088 1510330 398846 -102618 1016054 425496 1364733
9117 1364733 1392767 1548774 1154657 1312233 1609860 1948527 1874583 1467259 1467478 1528435 2103644
9106 2103644 3109047 2320577 2241847 3521618 3167293 3872024 4694506 4379013 4616982
9097 4616982 5830899 6506236 5810999 7729410 9014271 11148252 14839390 23397298 44343023
9088 44343023 73444262 95375038 86483856 68510506 51375647 38457983 29130601
9081 29130601 20724490 15325265 12092477 9860277 8697573 7361065 5002635 5112579
9073 5112579 3967689 3781945 3986861 3842669 3327319 3146169 1886917 2112415 2661140
9064 2661140 2751492 1336748 2376886 2001910 2293078 2372103 1441813 1755962 904354 2576446
9054 2576446 1717073 804318 1069171 935628 2060531 2391856 2088184 1699295 -24584
9045 -24584 2707445 808128 1750874 772955 -157242 1514121 1209969 1156209 1439419 251659
9035 251659 1136003 331341 1020674 478831 789379 873203 165732 1885959 808774 589891
9025 589891 1290732 -44324 512153 1471170 648331 119713 -70795 501546 319668 531123
9015 531123 433532 224360 860256 227416 1133007 421801 519416 250745 505634 -94901
9005 -94901 -763089 380334 593589 751618 136726 235484 896920 225742 46793 90256
8995 90256 -19129 99933 -342142 111745 425083 269842 399063 722957 -151021 -294630
8985 -294630 187699 222359 -176097 -229109 -501303 -41631 747907 -101389 504481 705520
8975 705520 699768 -202518 518918 341743 -361753 431910 117400 -300570 612302 -40533
8965 -40533 -275029 -1292814 -239070 61737 408017 -157789 -262275 -117046 403906 219036
8955 219036 450714 -591581 115996 -742014 -434833 -421562 222661 -184165 548732 351674
8945 351674 -86353 -325007 520162 392133 -373874 -175585 26746 -55622 880985 -509302
8935 -509302 104213 -172400 747225 -28723 -316394 -500838 44115 -362279 232189 -50587
8925 -50587 646623 -283218 -237956 -205808 -31675 -515809 -820725 -1205489 -137251 -414312
8915 -414312 -644200 -215821 629333 157548 230589 -930141 -413547 3607 -277971 -671704
8905 -671704 -618837 107384 -234729 -214428 -413929 333671 385511 72901 -224630 -573073
8895 -573073 -270152 264785 357747 418451 -26256 -137129 -154503 -740855 66415 -73187
8885 -73187 -525013 405457 -353492 155595 -626044 953903 393681 732693 -710887 -55269
8875 -55269 410300 -101728 159218 -1023610 -488561 628612 301933 -798273 -850162 -537872
8865 -537872 -154829 -902501 -116399 -162694 -151129 -402938 -587919 176214 -128872 -424667
8855 -424667 -1427957 -26447 498437 -338210 -993466 -480902 -923069 195431 -194763
8846 -194763 584759 -674417 -441556 -521566 109195 186646 150811 91949 -25337 99313
8836 99313 540035 82137 -941953 -1033588 -886319 234222 322826 -35922 162640 -153908
8826 -153908 128800 36730 -210861 -172593 207736 -249164 -1081731 -155757 -463694 -136478
8816 -136478 152403 -700351 -871343 -133851 -841486 61013 -667695 -415148 -211293 258498
8806 258498 -95773 313363 -437690 -296049 -662056 -354833 -1120387 560347 40992 -931249
8796 -931249 920664 -503005 347165 308686 -987048 -777217 -210073 -122099 -233352 258
8786 258 4840587 -1103804 65219 -1204795 -150246 -716999 -473574 -482098 -743018 -295228
8776 -295228 -242929 -588288 33753 159050 -549928 -1474435 498469 -912108 -378043 -312204
8766 -312204 -299305 -103306 89593 -144284 -293682 -727694 -55880 155283 765054 -283642
8756 -283642 -667041 -216019 -119555 -136601 -597932 279549 381553 -110715 -508771 -73480
8746 -73480 -456912 -202837 -324231 33388 510790 438394 -441398 -822443 -866779 -396550
8736 -396550 -461298 -319968 -174130 123371 -433442 -877288 607379 76410 -468067 355034
8726 355034 -372561 -400294 -530506 -1092110 86475 30330 -77504 -693271 425683 -55409
8716 -55409 -601744 336281 -772602 386159 251797 556501 -656952 -489033 -177645
8707 -177645 408349 -183846 -291093 -453686 556974 -469147 346815 208297 -995454
8698 -995454 -395688 -216138 46771 -90825 41292 -78382 -68361 -490686 726602 -409919
8688 -409919 -139670 -797795 333061 266975 -554373 286378 374531 -356390 -727048 -354855
8678 -354855 62936 395275 -271593 -202277 -268330 135918 759470 355828 1001071 431966
8668 431966 543085 -318189 -256607 396006 -530327 -3649 -374115 -110601 -469186 414605
8658 414605 393629 -384966 -85814 -102817 -266437 135150 -214326 -954260 -789936 -338923
8648 -338923 124777 -185226 119010 -258130 -866522 -388186 472779 54077 -1107776 -226136
8638 -226136 -320184 -1134745 -30924 -131282 628978 -23583 -607536 -262694 -233646 1011542
8628 1011542 -252977 -1094163 -507940 224777 890909 -284180 -348954 -154332 -564635
8619 -564635 474648 338445 -172134 -199512 -554290 -589352 -446244 408521 -122227 428498
8609 428498 152425 -740917 -422965 -296544 55150 64107 -903674 -832795 -243884 -32883
8599 -32883 637960 -1412626 -43835 -229383 420588 -459994 348192 -620355 -1010358 -120024
8589 -120024 491778 -172669 181691 -476354 707343 -1103535 -451802 -1001878 125393
8580 125393 -336665 142597 -525417 -318240 -413293 157775 -296787 526041 -329909 -847554
8570 -847554 -139986 439595 -225136 -82690 37161 80782 43323 -155425 -414680 -496377
8560 -496377 252741 -647637 -200240 -141365 -611044 -219390 -221904 758097 -44245 -40553 -609846
8549 -609846 -730768 -716422 -486426 -1144247 142529 -831856 754570 -318637 -550422
8540 -550422 -518365 -356933 373031 -531100 -641575 -2027703 -607926 -2988724 -2457232
8531 -2457232 1156326 861269 184379 504607 -70936 560040 -14127 419417 -336273
8522 -336273 147769 -84290 835778 623751 889282 -846546 198107 -71794 -312221
8513 -312221 931216 -513792 273485 205667 12525 57465 141961 -87535 -664997 -475422
8503 -475422 530296 -1007070 -1042972 -783697 -708105 314178 -316288 291789 -203035 -798381
8493 -798381 -57183 -578109 15511 -1046952 -1010971 -638317 -617947 -1078413 -131101 -675398
8483 -675398 -434031 -677890 563547 -511203 -504764 -132531 -530574 -321573 -233818 -695395
8473 -695395 101964 -535447 -136182 96084 765654 320226 -339275 -682387 -400758 76375
8463 76375 501016 -566233 -1171 -1100507 599761 307720 66800 -419874 987662
8454 987662 -367839 -346800 -520726 548664 -465818 376972 -219391 -314762 -35793 452445
8444 452445 -62903 148337 -473826 133194 -801254 28091 -48597 -742214 -680715 -403855
8434 -403855 -485059 200108 242168 -636120 -316070 -33676 507052 -503310 -602193 -1294884
8424 -1294884 -112 867492 -118385 -151111 7437 218547 446272 140006 47282 -194857
8414 -194857 583921 -92953 -877920 223940 695367 423654 -555437 181058 454200 377675
8404 377675 -290323 -435608 -307555 160674 -878349 -365174 42479 84003 324165 267873
8394 267873 -429315 550109 -257043 -783556 654151 -454865 -1280515 -896380 -643387
8385 -643387 -364037 550735 -110374 -299422 -158274 -716581 343719 628792 -170286 -1387212
8375 -1387212 -509671 -203130 -17866 100167 -507942 -335754 759499 -683508 -306599
8366 -306599 266200 -77664 853122 -336741 -250690 249130 45689 -57166 122456 -117211
8356 -117211 -598304 -68235 -676461 -898944 -581571 -514984 -794333 -289301 -162207 -228364
8346 -228364 -628772 -457254 -388486 -329781 -1486751 -71670 -699441 -812173 16317 294723
8336 294723 -158121 -167678 -207237 102096 117686 -601064 9485 -614330 -435751 -455847 441498
8325 441498 -548372 134954 -753979 -263904 -201916 501420 -369358 -107706 -684278 -922134
8315 -922134 -73388 -39764 291267 -426737 -132763 89393 -119798 183446 256772 -263446
8305 -263446 -12123 -845472 -204357 -112219 -636385 65707 -822656 309180 -48909 -405177
8295 -405177 -336629 -324402 169389 310836 -1753970 -121201 -696450 -387662 -1051676 -809266
8285 -809266 -207145 5762 -709543 -434338 -278128 116328 -1121822 291464 -628669
8276 -628669 -986560 -548126 44692 -559531 -507744 104671 -547271 -48379 -506680 -811080
8266 -811080 -303897 154186 100296 420883 -102114 354360 432094 -981950 -1007305 -298581
8256 -298581 -163656 -276955 -590023 -1425252 -341509 773307 -578765 -347828 -583427
8247 -583427 -614911 651296 -1025430 -394123 -875591 -924209 -291970 -778472 595216 -1172199
8237 -1172199 -1289386 -1134540 -762479 -596593 -403522 -1793575 575475 -565748 50060
8228 50060 -309089 -415102 -1213128 179131 -127371 498580 130684 -1189186 -577647 -183822
8218 -183822 339425 168227 -175373 -234480 -237776 -446251 -604489 -767078 -227135 -54059
8208 -54059 -523219 -565363 -390195 103286 -643174 570686 -434293 -1226982 1002667 -320329
8198 -320329 974950 105765 -695994 145289 -1685827 867650 -7906471 -3349058 663396
8189 663396 -1548838 614734 -1984656 -657016 -158676 -35381 -850720 -307124 97635
8180 97635 -88012 -265015 -1134274 -241043 241858 -583458 -168926 -893600 53233 436598
8170 436598 257431 -70093 -438923 -180241 34714 558423 -754338 12160 -109237 562288
8160 562288 147180 -61402 -339502 414282 180340 -1172525 -447239 156905 211175 -829060
8150 -829060 -181867 -1056980 739910 -312832 865358 -1183508 -599815 465289 697318
8141 697318 -681434 -249395 -490210 -847772 -260842 -477984 -1284262 -202715 55611
8132 55611 -640415 182770 16292 -130190 550668 -751072 -510566 -302599 -420351 -54304
8122 -54304 585852 364572 518049 111089 -998383 -180724 -380058 367029 -151534 -177309
8112 -177309 -1062331 587226 1247567 -74001 345082 45391 -511489 39481 -300479
8103 -300479 -577750 -282781 -23618 -23034 -198488 -297975 -348437 -27373 342882 42802 -443107
8092 -443107 -734360 -263942 -323849 -793213 -80586 643161 110879 -230904 -381661 146522
8082 146522 -598643 -413365 -349710 -590623 -116726 500029 -470314 -420745 131008 924896
8072 924896 -755707 -415031 -373356 -208077 405366 -241476 -362146 -943757 83154 442276
8062 442276 -52560 -246406 -225288 -778794 -475759 314909 -111886 -383877 360589 552338
8052 552338 -699005 -56369 -19185 200843 -413028 -18395 21940 -564850 228237 -68330
8042 -68330 -79792 215360 -41655 -368254 -438417 301483 -452246 168476 -396506 -456196
8032 -456196 -506865 823107 -140058 62873 226433 -419510 -650344 -142870 -472412 908625
8022 908625 -1278107 -205937 200642 113718 -25588 -1262178 -446249 -276565 323357
8013 323357 -373260 -187997 334095 -716945 -140174 343080 -324550 -279569 -603837 -400175
8003 -400175 -250131 -325875 15037 -662516 -310002 886854 58880 -226787 -377990 -2502165
7993 -2502165 358005 -677282 358566 -1236870 59372 -40424 13054 -308267 -815875
7984 -815875 -382227 856197 -214459 851294 -569792 48016 -193298 496912 -511992
7975 -511992 -41395 -24307 -1007374 167808 880966 -492657 187705 17447 627622 141541
7965 141541 409730 295359 208122 -151623 -278043 116428 447337 10280 -250977 -5189
7955 -5189 -289969 179962 -947983 -63368 853187 424933 -171749 81475 404745 223268
7945 223268 444891 57850 415101 770096 -571462 -507037 -698132 -162003 -774333 802995
7935 802995 864856 376734 -29651 24400 846304 -148292 -206726 -908539 -109450 -404040
7925 -404040 310410 102260 -144496 -66231 -105424 925095 76254 -243665 -449901 78454
7915 78454 -213704 615008 -704710 -482375 574229 1395295 -643894 775483 -338200
7906 -338200 180454 -198770 437684 676695 472860 -228516 -294285 196444 1212366 937859
7896 937859 451991 -419073 900869 1900413 111544 681379 340255 573414 986220
7887 986220 1532580 197034 673913 1048985 1026273 500737 918279 1552979 1105997 1086420
7877 1086420 1123478 1523969 1825441 3069534 1673302 1298779 2128558 2723777 3066677
7868 3066677 3538936 3891577 4156039 3937314 4541165 4041843 5368793 5410221 6236667 5309000
7858 5309000 5445397 5214632 4651302 4340790 4933448 4100122 -2720352 -919967 1851030
7849 1851030 1025726 2849777 1306313 1664160 1820521 1773650 1252083 1210014 1167669 1220028
7839 1220028 721009 1351941 1332638 1170739 646440 197679 153457 340575 524404 527338
7829 527338 254323 1590649 1045988 268701 370918 798322 1006273 -112085 1501511
7820 1501511 665909 119108 390674 -419650 841898 3637 207342 137443 603215 541097
7810 541097 -109106 513821 -493543 -278419 453624 187354 747005 -137933 -651334 -107429
7800 -107429 171920 -671703 -156485 526359 239644 527056 -57787 -15444 665331 -273100
7790 -273100 109093 590727 734478 -419946 -415540 -383176 -605652 426585 -128307 -148633
7780 -148633 703275 58039 323105 -232915 -814626 -386164 -270036 7666 156712 23376
7770 23376 272692 -753505 -624776 -1013884 191628 116654 -632153 86536 -216184 -640257
7760 -640257 73126 366427 -114286 612706 248823 -543087 -1000663 -765079 -576266 476606
7750 476606 6886 651450 732432 164928 -315068 -362541 -186994 11191 -484589 -168465
7740 -168465 -80930 684459 -681243 -326085 -223203 -320434 117520 -258815 -967150 -428808
7730 -428808 -743916 -706657 -481023 132229 -520249 138491 331089 -184169 297046 -640713
7720 -640713 134459 32741 -461761 140535 677033 371883 134744 184262 -650604 -341757
7710 -341757 274986 130127 -637393 575823 -1017598 -479240 385116 110220 -977996
7701 -977996 -9353 -439340 213083 -268504 -390654 -1272328 -770114 -590702 79168 -5266
7691 -5266 -392413 207042 -487058 -292601 -329020 -123971 107858 -171155 -155533 309118
7681 309118 125533 325942 -867545 -199790 -130365 -228600 188170 -532928 403694 7420
7671 7420 132931 -878844 234620 166638 -223119 -377814 447739 -1037607 219408 -742518
7661 -742518 -45187 -686657 -523058 246415 -486915 159917 -458834 -421979 121380 -503651
7651 -503651 27591 772141 -370864 -635458 -591398 46261 751235 337469 120415 6817
7641 6817 -25040 -377211 -999606 -99242 -434525 453295 23900 -900962 168674 386719
7631 386719 93102 624461 -147522 338596 -385085 -17219 -715980 -377856 590058 -294352
7621 -294352 198177 -175960 -622693 -152141 -90618 -364266 -673033 -494354 321040 -475813
7611 -475813 108877 8909 847251 266194 -517474 -836249 -316016 68588 101851 -50563
7601 -50563 256421 -175219 316710 -1839000 316928 169432 -237866 45197 -536387 444047
7591 444047 -1066981 -272011 132487 59245 396001 -2954 -643853 -170428 -249654 574074
7581 574074 -111219 -44248 -665976 497124 790338 622573 -910141 -164465 168735 392019
7571 392019 -599264 -849586 11994 -428887 793239 -343286 63706 99775 -429318 -535942
7561 -535942 -94947 512371 -32875 -840347 -495850 -814485 -100846 -349869 699765 479567
7551 479567 -649123 -208202 -294496 747100 634277 374957 -424318 -360641 -492764 -726535
7541 -726535 1228758 338110 -173606 -305298 -236018 178617 -541587 -462158 455511 -59708
7531 -59708 452724 80216 175944 320482 1904 6682 -403630 89256 231063 -52407
7521 -52407 532809 -778753 427977 108034 -315182 598573 589763 553205 -264096 -189072
7511 -189072 -421319 312668 281738 -294380 -479720 -166395 -344203 151820 2503 318054
7501 318054 471519 -564678 -208243 34074 -47977 -491662 -843518 -251762 203383 278660
7491 278660 -840609 192662 27979 92663 -195876 288685 -512384 551903 150976
7482 150976 -58897 32320 213071 -318127 -246846 -889796 -57991 178566 273962 295373
7472 295373 536808 -3486 -224861 92508 109328 86187 194181 -585704 252874 24891
7462 24891 -73756 970222 -780205 382224 -132439 -654581 -905543 92330 -29853 362340
7452 362340 259014 -1201300 120345 588880 -217736 176922 -529902 -354615 119249
7443 119249 336517 -383690 -517711 437588 -185790 553339 222424 581351 431668 -551053
7433 -551053 -435662 543550 57643 25927 -626298 -699265 719650 265123 766972 -393651
7423 -393651 -34096 -572909 -114017 -843778 -1129220 942694 -85622 174068 484194
7414 484194 -487066 -110753 409620 -45370 258553 -36757 -594498 -269180 216788 -313545
7404 -313545 66476 377907 -578567 628636 6162 -359003 329424 -64586 -193358 598068
7394 598068 332889 -124296 -247412 33437 -149031 593177 -282967 -388429 695239 -173637
7384 -173637 488373 169987 -57414 1051220 657456 170698 118159 -61538 142926 -461117
7374 -461117 -96319 -465561 699773 764996 868625 833989 -752549 -53284 -385157 -470084
7364 -470084 443067 659760 -690373 -45668 503659 -15459 -475234 -65536 -270014 42445
7354 42445 -386851 -259211 118508 9341 -318747 424778 150763 273502 -226878 -335536
7344 -335536 73239 617249 -332465 -519141 190412 492413 192604 469834 -561988 -130704
7334 -130704 -230212 309207 295741 108206 217908 26731 -42179 85192 666443 915544
7324 915544 62544 -364876 191677 646363 661427 -190121 -103821 193894 328905 962574
7314 962574 35681 481331 -785583 -117202 -281560 11039 161758 -300770 187205 395832
7304 395832 -396473 -80170 -449234 379377 107033 497330 -597990 765167 931371
7295 931371 279533 73563 271192 -775987 43822 345130 124375 631709 -27281 184087
7285 184087 576252 428522 250155 264664 651584 -444951 73316 -272534 79374 666318
7275 666318 747521 29486 194829 -733571 590720 764453 242583 -446216 316212 365423
7265 365423 714368 45133 455944 -881656 298334 -292049 331132 389043 329104 -297594
7255 -297594 117876 139893 597486 -983353 987424 -226714 455363 300349 -668253
7246 -668253 -133780 352435 -456730 -197681 -251828 658068 -475845 406023 -698189 -631742
7236 -631742 431850 171014 136229 -443926 -849425 880596 -223015 -178334 -417518 77474
7226 77474 80419 -818148 234558 -617145 594645 146058 -1008321 616491 -462443
7217 -462443 246259 -128794 -227375 -377510 -709040 699956 -136267 -129155 488073 -130636
7207 -130636 357214 -573279 -390824 162063 -509167 890060 -691258 -384480 -430529 -394924
7197 -394924 -108363 -446540 1253599 62393 -482831 -393404 372720 -630103 -714628 -492226
7187 -492226 132445 773029 608273 82953 -146033 -92613 744523 -11630 272672 -514521
7177 -514521 198066 -587773 -859865 266026 417036 226222 -104541 -14605 141638 -647145
7167 -647145 -113240 -776124 -756976 84578 -170967 470598 -321617 211 -691471 -312944
7157 -312944 249528 -179355 212946 -611989 401344 100494 -737111 -261957 -728227 56708
7147 56708 270342 984000 99487 -391464 -212128 310001 240689 -875716 -1277501 -225668
7137 -225668 449105 960327 171346 -521302 368602 415120 -499843 14420 99221 440887
7127 440887 126510 -134736 -424600 192602 82189 -280209 -266609 442969 -181502 170703
7117 170703 -256736 -872003 107192 -264604 -9307 -386541 543703 -1013699 -802103 257567
7107 257567 480873 156845 915319 -331056 -381059 -658107 -71944 -95086 199783 82252
7097 82252 129362 427531 -187356 291654 -320270 -214405 360982 236968 411724 -427786
7087 -427786 -253896 162447 15930 423000 -17812 53474 701234 119404 34315 -288567
7077 -288567 -406380 -278239 286397 31813 -165466 178659 272901 119971 520850 -614310
7067 -614310 -851115 -596651 -684498 280142 251661 -504508 -148005 -703915 237785 132411
7057 132411 452598 -509393 -208059 -410266 -109799 396183 -159586 326262 -103603 123236
7047 123236 -470168 128330 -249807 294608 984645 -375592 373936 190531 -74597 1384361
7037 1384361 -373386 -603640 -117658 628823 130304 -322430 -426059 -410187 -168533 582443
7027 582443 -160375 -411884 26548 155115 896277 -272763 208925 -540184 -753282 1186570
7017 1186570 -699744 227975 -378789 -679459 227296 315574 254254 -70703 -1165906 301951
7007 301951 -18537 291766 -468460 543793 178354 -311950 637661 -671508 -697012 -55600
6997 -55600 312378 12471 354415 -629181 -293193 1087359 117995 -764988 -48123 -95666
6987 -95666 70869 526028 -216876 434387 19696 133502 452954 -466875 -303227 -10792
6977 -10792 467489 646068 -90224 119868 -688048 981089 -9414 -136437 -340967 -358630
6967 -358630 421321 183625 -93058 -26393 -1356973 1343487 -456514 413095 112116
6958 112116 142093 -117831 -889112 376033 447313 -567692 -466784 -172524 730993 505555
6948 505555 247031 -742836 -95442 807507 355814 294595 -57555 -37664 -577161 650060
6938 650060 335001 48810 -223354 807252 132269 221845 -735188 417919 -219040 1104653
6928 1104653 -226480 -384684 -84950 701547 -382840 74703 597214 832012 -534315
6919 -534315 400117 -455336 -57063 448821 -427993 393315 -259278 570684 -85253 419153
6909 419153 1220773 908460 828980 274282 671056 -90688 444106 246648 26844 489655
6899 489655 306693 -410429 851872 257387 1466714 -15053 -270170 -470975 1137177
6890 1137177 105259 68702 -151370 771315 175699 923813 -1068708 472772 326605
6881 326605 -341597 502468 -120196 -237489 990600 116528 441242 423918 527221 383516
6871 383516 550077 -366151 156475 536884 -128170 232355 415761 378252 331644 723542
6861 723542 330462 874508 362253 -66347 133702 272411 210533 575471 275747 203291
6851 203291 775399 -50106 278670 122053 795841 476693 56667 88141 402860 1661943
6841 1661943 924509 1057381 -299204 -103382 901907 -452060 -237542 770045 147282
6832 147282 -480164 294708 269595 794950 757248 94917 -66318 191231 393628 48275
6822 48275 -690874 716352 225794 7771 316766 341469 138667 15133 286738 245543
6812 245543 108594 652883 617343 137737 -21156 389924 325136 -212082 743391 -282359
6802 -282359 -347212 657656 769325 -359850 1028097 -10101 -897800 853254 951612
6793 951612 496686 -298185 322153 -252940 733014 -117995 104779 -98175 621713 -91391
6783 -91391 -200504 -777611 -70158 1124301 208154 1168565 246795 -45225 963418 -150923
6773 -150923 -337142 -263906 562635 583776 -27141 -262178 -143496 831613 367043 749406
6763 749406 648401 218941 71308 443852 -6419 501619 703461 -259587 332267 316445
6753 316445 351496 1413328 1344446 -275070 -415160 677752 382962 1063347 244080 898557
6743 898557 421846 406228 427492 -203029 161143 402282 468832 135464 49512 223337
6733 223337 -175957 317085 841643 395663 1217080 439701 -255393 438985 1360344 798745
6723 798745 570794 607875 519887 -182655 -103295 448691 418745 246211 176209 560146 251019
6712 251019 1261512 780266 599512 183316 611135 634099 1015661 456220 386580 569523
6702 569523 1613313 673832 1047651 1381121 991593 405064 1023907 1659760 1436788 927845
6692 927845 223400 459233 1646261 402295 442061 630297 1373501 327813 161982
6683 161982 80261 713705 403740 831941 157448 602722 881260 715106 265946 632758
6673 632758 665080 585360 772264 546773 322891 455862 892242 793165 1299631 237720
6663 237720 710771 272728 1244694 86331 383806 765838 523489 613719 503358 108055
6653 108055 98658 602842 647761 859918 1153606 207690 -134536 798845 905890 404608
6643 404608 -268446 332978 684326 1026299 791476 1308692 693808 490918 824544 632094
6633 632094 626321 462420 18012 223703 1001610 830455 590883 835746 308800 -408365
6623 -408365 -58369 1074419 961315 315802 -223015 -408198 719897 560923 -114455
6614 -114455 865115 423156 1093944 40779 534471 351931 750242 1233485 1349633 -402364
6604 -402364 322172 242506 1048252 135165 412995 -856716 83277 522150 264703 599564
6594 599564 717111 -38969 58182 -305039 877997 1117621 83720 -542791 666548
6585 666548 160407 630984 69809 824933 324702 16874 391307 -84386 915534 300192
6575 300192 227793 757669 214429 511310 492733 -695798 -83954 257135 201183 -154368
6565 -154368 -172568 11312 698335 80058 378501 -339075 771538 239736 963945 94360
6555 94360 547490 1012640 323803 169560 -403541 -474797 438979 861788 -192306 -188102
6545 -188102 250580 879060 769120 645454 190621 600676 -779002 -163429 833807 1043403
6535 1043403 -194024 219306 -491938 -677086 466442 403358 -313931 903926 813239
6526 813239 480850 732427 881793 411850 -69459 -57611 748616 297990 16777 214110
6516 214110 467969 134460 578703 127832 -168583 1898559 538942 670308 -42111
6507 -42111 -168540 1363280 777437 573603 871814 621046 114210 701746 708494 -132059
6497 -132059 478236 -943847 -235202 1405309 911616 561892 988191 -251135 1158649
6488 1158649 1018848 363961 318902 521610 207925 -556566 387326 907436 629604 1385868
6478 1385868 -462326 1009402 -565928 -54005 358109 287918 118991 4594 -385609
6469 -385609 105697 141866 402146 -55064 740796 134441 492644 522697 -462516 645836
6459 645836 -95760 953733 1346068 743541 790084 638435 660668 1204696 482857 329455
6449 329455 -283880 970529 -146349 152006 593041 -59348 1612516 145638 12712
6440 12712 697435 416051 705333 -330382 166827 112449 984981 886313 392141 650365
6430 650365 529816 869948 740460 232760 1136488 133300 203160 -347204 769403 1095597
6420 1095597 413252 634632 334917 251925 974545 -314323 229254 -180722 878768
6411 878768 -440553 -951758 817576 -67155 699749 561798 -101572 807416 414927
6402 414927 1480933 411213 27730 147540 719951 1587860 595725 453890 1113033
6393 1113033 310175 815753 -291276 360932 681836 -85954 681758 639782 306376 -377210
6383 -377210 -1122481 -165144 194538 786402 -84746 -532806 224754 333354 498566 -6020
6373 -6020 -284404 298377 -634007 885960 79863 1331978 216989 787274 756484 961957
6363 961957 484748 200579 91898 158507 330609 1400929 227399 997838 -146207
6354 -146207 150754 835829 625981 287418 -110511 169184 1164283 535265 986090 -155698
6344 -155698 825387 524469 719986 875657 519253 1359686 757249 -324487 1023477
6335 1023477 747579 972456 1312278 1478371 1191357 336651 714185 739652 1149021 708043
6325 708043 250845 880706 756004 697280 934874 237502 1705151 1040462 1350701 568681
6315 568681 678231 441539 1112879 1126802 585460 663869 1095204 427620 1406251 287252
6305 287252 505016 888736 1388662 1522890 814142 1203961 1066568 578649 747879 924536
6295 924536 1501666 -371603 1253108 1281201 1766534 1247485 320442 -17841 576046 513247
6285 513247 998901 730998 1206074 1519164 428724 629180 1250821 86422 284490
6276 284490 182564 964864 266085 543751 396000 867343 1182634 1261372 1201567 1744720
6266 1744720 830550 446776 196256 914212 1450812 1061026 666353 634074 138805 636358
6256 636358 1378879 1429547 756910 548017 1067786 398685 1342653 416438 310613 335097
6246 335097 1123802 808816 885447 111852 943105 -81521 -33065 1009753 567582 1214773
6236 1214773 547545 -72437 697687 550424 767367 405092 650382 1302456 613274 1395016
6226 1395016 1031495 919804 395917 -101433 660154 636770 758007 127569 203828 992137
6216 992137 638638 1171539 876690 208644 2205744 -386173 253517 977524 1192976
6207 1192976 1209630 606144 1004006 478125 1301966 1274080 410758 966102 868814 782885
6197 782885 1455885 1325340 1794092 1533365 1176870 740962 1474806 1121467 838684 1106385
6187 1106385 748748 886432 595619 611841 1064345 1017892 536860 1094195 1710904 2200784
6177 2200784 1810157 418817 914922 645892 1342113 1493300 982407 1720202 1162050
6168 1162050 1820617 1172788 1106372 1596907 1981452 979595 887990 656119 1435345 1436240
6158 1436240 2022242 1614307 1562550 2498754 1321963 798277 904115 687639 1380199 2059102
6148 2059102 1808828 1522952 1355264 1032517 1101938 1376411 856995 1378957 1585275 289878
6138 289878 1093260 722806 1006626 1978721 1199060 1075339 2339381 1116129 1805777
6129 1805777 698479 1147211 614785 460489 1409748 1865448 1708615 1372303 1115802
6120 1115802 1890044 1322701 1949471 581251 1373982 1516492 1887855 1237705 1309874 1577092
6110 1577092 1913452 1160610 1820927 1055166 2055390 916107 1325548 848966 1253447
6101 1253447 2256031 2048689 1425711 1780177 854092 1425686 2042899 1225663 1637061
6092 1637061 1979007 1252023 612521 1248236 865399 2319431 2096452 1056385 1288228
6083 1288228 1087917 1987764 1686111 813916 1570748 1542295 2345873 1782491 1555210 911499
6073 911499 1054296 1851868 1768291 2254495 1685469 1014225 1530310 2069644 3065891 1577464
6063 1577464 1247055 1141780 1394749 2206195 2592603 1891657 1069542 2038333 2041188 1890249
6053 1890249 1749586 1375891 2001894 2001902 2241164 2277462 2831699 1908929 2294937 2285358 2559907
6042 2559907 2858510 2843412 2165208 2778108 2673229 2734998 3055635 2748293 3053700 3803562
6032 3803562 2530709 3254225 2267420 2409470 2818774 2965624 2711090 2208557 3060212
6023 3060212 2993788 3288005 3057103 2753743 3322431 3201904 3699655 3372766 2942244 2156900
6013 2156900 4235335 3322765 3069087 5549918 3633525 5251502 4060049 3497173 3574403
6004 3574403 4338198 3726632 4073460 3812626 3923933 3838300 4282396 3977305 3950299 3266626
5994 3266626 3725741 4739427 3673230 2979258 3837283 4441240 3866043 3719640 4699847
5985 4699847 4894999 5142330 4401387 3128092 4424920 5358971 4864033 4640682 5162114
5976 5162114 4659508 5313012 4362745 5199873 5322700 5149551 5225294 5259206 4498510 4554926
5966 4554926 3672974 4144277 4673588 4247178 4062744 4741352 4870754 4825842 4152147 4580212
5956 4580212 4514350 6171232 5997889 5581772 5157904 5102591 4892534 5635908 5278925 5350240
5946 5350240 5337658 6319981 5076540 5690265 5298994 5404664 6190042 6002062 5963348 6373027
5936 6373027 6902208 6855230 6563825 6659155 6048972 7758496 6233246 6851493 7444850 7381466
5926 7381466 6541199 6422884 6855618 7742105 7220256 6659271 6129852 6807040 7385003 7017319
5916 7017319 7092122 7815648 8183415 8072346 6882383 7894946 7911942 8827853 8497430 9656761
5906 9656761 10574651 10836631 10795718 10040642 11412619 11288723 11407112 10827445 10093692 9230169
5896 9230169 9062539 8381081 9175043 8785371 8567140 8917402 7988525 7797319 8409703 7968877
5886 7968877 8029476 8376742 8565123 8710031 9165689 9265728 9717375 8619124 8685397 9732507
5876 9732507 10007138 9522611 10583004 10581307 9899275 10916322 9730319 10576371 11058961
5867 11058961 9854791 9563860 9666970 10117378 8812128 8919314 9086735 9582231 10158338
5858 10158338 9225180 9660018 9699110 9634907 9054247 10320748 9696922 10076160 9934420 10290620
5848 10290620 10029122 10213830 10360382 10580661 10116481 9948218 9982927 10612125 10672479 10653404
5838 10653404 11062021 10937008 11886272 11732090 12259014 11299419 12260082 11915050 12232004
5829 12232004 12505851 13129618 12098214 12416034 13553416 13037423 13844748 12772145 13463498
5820 13463498 14036028 14428297 14324689 14175115 14003157 15650711 14959796 15497004 15008743
5811 15008743 16187062 16314310 16810678 16417786 18042360 18894041 18561177 19225525 20630199
5802 20630199 21666200 22736928 22906849 22616591 25471812 26724673 27304967 29529066 30693957
5793 30693957 32106070 35286802 38367103 42227456 48412329 54688843 64126864 74813843
5785 74813843 86916183 98498964 110984284 122256333 131983820 139075068 141286572 139700881
5777 139700881 134825404 126435598 117831655 108429002 98382940 90840828 81306548 75688178
5769 75688178 71505059 68459827 66573692 65638554 65847708 65808895 68049027 69614474 74235086
5760 74235086 80595939 87982232 100746951 115944419 135467469 156872858 179495149
5753 179495149 205197100 228611839 247203071 260581064 268859994 268652233 261212412 247860118
5745 247860118 229862636 209028322 186812645 165152298 145633830 128453960 114191338
5738 114191338 104201226 95998085 90659552 87548752 86734249 88691281 91054221 96381222
5730 96381222 104042222 113166737 126407145 142500774 161630004 185103456 208385302
5723 208385302 231978346 253711616 272367298 284883715 290066662 286478697 275389839
5716 275389839 259002618 240247018 216615182 193959962 171020990 152969036 137060547
5709 137060547 123809596 115017629 109094201 104570409 102590570 102524436 105492115 111095737
5701 111095737 119980326 129894282 145029990 161329539 180151657 201744941 222749181
5694 222749181 242801134 260201894 273378420 281699278 283175753 278384911 268568236 255600663
5686 255600663 238555479 218739481 200862646 182985934 170517685 160980625 153069199
5679 153069199 150370448 148176073 149584412 153579194 158550559 163277084 169074183 175669614
5671 175669614 182790993 193044697 202788873 214304030 229553376 244187313 259563054
5664 259563054 275258054 289552391 301850683 310014948 312784141 310909733 305685426 297993137
5656 297993137 288043870 279269552 268450391 260410660 254010673 246304585 240699503 232707295
5648 232707295 225529743 218232225 210275037 202079817 191558543 182300724 172806389 164987784
5640 164987784 158048718 148093130 142967360 136735928 132852865 129753493 127236579 124742660
5632 124742660 123510135 123063378 122641914 121783397 120809445 119755169 116848852 113574821 109289311
5623 109289311 105122103 100186489 93732761 86963802 81508522 75142607 69431462 63496640
5615 63496640 58149472 54436084 51002083 46667640 43666156 41514338 39369893 36122218
5607 36122218 35611899 33666208 32241610 30924936 29292368 28432187 27669030 26792978 25713022
5598 25713022 25170312 24650122 23889290 23423856 23383895 23991023 22863456 22375037 22399544 21677751
5588 21677751 21278751 20354224 20506017 20120182 19797329 19520764 18828035 18690703 19290588
5579 19290588 18882796 18477770 18061841 18670001 18559972 18413298 19220702 18322301 18360035 18544784
5569 18544784 18213266 18591616 19359019 17984963 18375331 18569158 18365713 18346707 16972979
5560 16972979 18353806 17205723 17983899 17209797 17972907 18469639 18182750 18290174 18220580
5551 18220580 18774093 19324428 18756369 19590563 20006106 19286500 21038505 21065548 22465130
5542 22465130 22870164 23331974 24905300 25625500 27283881 28473012 28346742 29061159 30511048
5533 30511048 31668584 33173242 34879437 37189416 38080344 41034978 44286915 48048725
5525 48048725 52280675 56844327 62680741 68244836 72625132 78738525 85298909 89934201
5517 89934201 94023735 95653253 99325098 101379347 103509510 102714953 104380747 105999604
5509 105999604 106560610 107599567 110050343 113985252 117405129 119351296 124933409 130362892
5501 130362892 137541496 144029025 152299509 161029482 170435181 179829417 186357505 193635129
5493 193635129 200124834 203210290 205423639 204669515 202948770 198757275 192506947 185178281
5485 185178281 177753414 169911398 163339686 157092870 151055980 146534033 143499296 140327728
5477 140327728 137584949 135097913 133190431 131493570 129568082 126615933 123890628 119911509
5469 119911509 115906458 109609999 104903070 98955093 94030707 86491800 80455843 74090404
5461 74090404 68679798 62740014 58603311 53983307 50050805 45279697 41749390 39289605
5453 39289605 37754657 34231439 31782478 30465738 28789327 27474042 26506531 25224963
5445 25224963 24187890 24150023 22898490 21667905 21288003 19509972 18815383 18038468 17718170
5436 17718170 17452340 17003970 16791686 16585472 15508037 15387408 15102917 15346216 14060092
5427 14060092 12562875 13806429 12788935 12989743 12992114 12271987 11774687 11252194 10780974
5418 10780974 10278955 9767929 8965724 9221501 8878873 9212578 9096233 8612200 7914169
5409 7914169 8503877 8435644 7394094 7982630 8376854 7113574 7581949 7656618 7338944 7831082
5399 7831082 7944185 7629504 6732289 7633242 7492948 7278386 6535499 6746268 6259912 6435557
5389 6435557 6138506 5801529 5850609 4909919 5314157 4746015 6066246 5546461 4654200 4280233
5379 4280233 5196258 4344274 4621262 4932377 4524383 4234318 3918439 3975869 4195746 4377443
5369 4377443 4524915 3732972 4526751 4434796 4787133 2994512 3433953 2972386 3970585 3527150
5359 3527150 3875517 3017685 4179760 3996832 3610977 3549006 3255993 3452397 3433095 2845094
5349 2845094 3496379 2621126 3045780 3214827 2857763 2937651 2753309 2779388 2699356 2803007
5339 2803007 3036801 2398998 2625344 2835109 2819271 2720735 2486777 2872888 2613055 2489923
5329 2489923 3317837 3071685 2346559 3166461 3370290 2619435 3139659 3680512 2810692 3401605
5319 3401605 3661789 3506082 2574269 3194989 2811245 2209902 3837435 3257362 3004895
5310 3004895 3174448 3405940 2584956 2231503 3187945 2940629 2657541 3803587 2320136
5301 2320136 2819391 3194712 3279994 3210802 3354434 3643394 3602484 3576396 4394065 4444399
5291 4444399 4556755 5358449 5866822 5216830 5090786 4131216 4287608 5366368 5047492
5282 5047492 4923834 4336898 5360691 4985546 4522140 5162187 5453067 5697541 4589872
5273 4589872 4532987 5147899 4882010 5691750 5274340 5325903 6368659 6390080 6383355 6045999
5263 6045999 6910434 7270211 7448901 7150044 6522289 6242327 6058710 5563381 6536455 5693784
5253 5693784 5665011 5352198 4527687 5200234 4782715 4864731 4524842 5281276 4780919 4719585
5243 4719585 6191671 6374158 5327771 5804893 4946127 5670505 5172536 5158671 4777514
5234 4777514 4601800 5263354 3760919 5137475 4831725 4035681 3498074 3671516 5409910
5225 5409910 3913914 3001843 3407328 3463071 3892431 3586424 3010301 2613136 3072288 3389667
5215 3389667 3250812 3760715 3153981 3233926 3792845 3716581 3153917 3025605 3440107 3532909
5205 3532909 3351314 3330418 2703667 2991509 2901848 3212409 3292797 2937017 3173218 3432354
5195 3432354 3466070 4001847 2467818 3236912 3046550 3299975 2741408 2843126 3806872 3429578
5185 3429578 3420339 2788645 3183398 3734663 3733884 3882774 3653237 3438148 3499641 3424015 3418963
5174 3418963 4351275 4165619 4534817 3897880 4418295 4070874 4227162 4393672 3278502
5165 3278502 3942646 4602704 4425135 3579950 4267046 4929046 4890717 4912733 4375727 5274963
5155 5274963 5080858 4472428 4720596 5243125 4474793 5357306 5634108 5455135 5846836 5726752
5145 5726752 5842626 5510763 5668879 5114463 6175832 6203595 5879127 6027868 6846092 6920172
5135 6920172 7287118 6574022 7019538 7459937 7617258 7149946 7115584 7341257 7890832 7311962
5125 7311962 8057285 7675532 8133833 8762489 8442592 8773854 8597043 9485435 8154971
5116 8154971 9165287 9903066 10039982 10344609 11253085 10898350 10690646 11991826 12713706
5107 12713706 13360521 13613429 14051772 15095680 16470267 17153159 19226021 20038800 22606795
5098 22606795 24663954 27360031 31986622 38526285 46246782 53966971 60780194 63495957
5090 63495957 60852153 55418667 48416149 43401473 38987285 35501208 33535688 32423718
5082 32423718 32832190 32963589 33032278 32868927 31659691 32035835 32673986 32965932 35644239
5073 35644239 37133593 40533971 43331643 48844520 55767506 66829131 80781775 95756544
5065 95756544 110732360 126558698 144701316 164660433 177044000 177111532 162577114 141619084
5057 141619084 120368081 102515774 89526753 78180762 72442150 67453193 64250006
5050 64250006 60551691 56361087 54646876 53688487 54191220 54045526 54793378 56969468 60032697
5041 60032697 63781360 69413329 80628225 95006192 109773417 127445030 146314344
5034 146314344 172246657 198677469 220135063 230286091 225008387 208553421 181790010
5027 181790010 153755297 130113407 109585157 93561663 81587124 72953972 67658632
5020 67658632 61845143 58931806 55598957 53875295 53374081 53040692 52963079 52296826 51640657
5011 51640657 52333666 53561329 56586354 61370373 68830887 82019117 101711165 122798333
5003 122798333 141972353 152964924 154171857 144990551 128867407 110421525 93591067
4996 93591067 79803252 67077185 57141142 50743679 43997717 40236256 36286867 33332001
4988 33332001 31527421 30959576 30374289 29186223 28189780 26913070 25817258 25407530 24925116
4979 24925116 24586115 25628414 26685841 29370869 33860924 38295699 43974090 46026513
4971 46026513 45710374 43339380 39549548 35524997 30846652 26620742 23784065 20930451
4963 20930451 20036236 17015581 15103691 14047056 13784516 12971211 12845625 11547850 11361022
4954 11361022 10791103 11461523 11228142 10204679 9800135 9795069 9414999 9212399 9146916 8623743
4944 8623743 8865316 9643921 8547657 8039629 8538160 8786586 8946948 8540326 8095401
4935 8095401 8540682 7592801 8108496 7904818 8753305 7894565 8589161 8295455 8929324 7935387
4925 7935387 7683057 8003282 8075714 7927051 7623153 7550120 8165819 8186696 8727869 7955825
4915 7955825 8572109 7688267 8230375 7839470 8247795 7490167 7210091 8097735 7882837 7955202
4905 7955202 7314529 7650840 7590143 7635089 8228152 8552864 8837573 7847468 8223537 8148087
4895 8148087 8466562 8617356 8844226 8682308 9075583 8396310 7719619 8457221 9651497
4886 9651497 9155611 8535296 8974133 9556697 9356259 9626186 10100531 10164852 10429963 9535741
4876 9535741 9431212 9945353 10686592 10229702 9839102 10030454 10757818 11232601 11122321 10823439
4866 10823439 11119779 11586781 11501296 12107096 11976729 12796574 12583116 12598965 13040850 13689719
4856 13689719 13908742 14368752 14929539 14904895 14540468 15968965 15519385 16224018 17028582
4847 17028582 17720934 18150542 19724871 20372497 20443337 22412122 22863116 23836178 25845964
4838 25845964 26149168 26801386 26531277 27309176 29735271 31304504 34087382 35862671 38435001
4829 38435001 40710754 40909167 41817365 42112451 43549027 45089187 46747447 48808950 50390142
4820 50390142 51046791 51747427 52160729 52227316 53457666 54648438 55979796 57973188 60720796
4811 60720796 63818988 68369322 73031069 78602457 85218063 92537824 99983656 109494450
4803 109494450 120551204 132267669 145094557 157728352 170426702 179913722 186920152
4796 186920152 191725021 192510739 192919339 194597899 198256080 204122039 213789062 232273042
4788 232273042 258184913 289023593 313925039 320858689 312874857 299455853 287367280
4781 287367280 282472507 283503269 291170498 303712000 323502419 349727928 377726473
4774 377726473 404732235 424291320 432567618 428286976 412209461 390411591 362953130
4767 362953130 338192629 317045403 298881783 285259222 279475702 282134634 296168160
4760 296168160 309770480 312392578 296301697 272543315 249443878 229278082 214298919
4753 214298919 201045854 191351366 184509722 180307630 179864331 178769322 177817388 173350719
4745 173350719 164986609 154340307 142108738 131672514 121157247 111513399 102341989
4738 102341989 93004032 85485017 77908927 72060467 65687964 61288564 58311521 55121767
4730 55121767 52123742 49514173 48489008 48385045 48236991 47379450 48332237 47467305 46081383
4721 46081383 43856425 42135955 39891329 39136875 38370681 38198577 37332088 35387489 32420898
4712 32420898 31038193 28362359 27571851 26076552 25283453 24721937 24204511 22687395 22049825
4703 22049825 20648194 19918333 18588984 17313705 16672476 15752474 15577515 14613428 14958149
4694 14958149 13535855 12886793 13033184 11659684 11859441 10475338 10875875 11547067 10209789
4685 10209789 10395156 9319918 11012578 9930205 9731114 9410427 9370584 9551424 8311696
4676 8311696 7879513 8505516 8173820 8556114 7621765 6804410 6763456 7254489 8056485 6886164
4666 6886164 6694950 6322237 6127770 6271993 6230488 6412117 6230930 6060071 5952250 4573569
4656 4573569 5303245 5512355 5067978 5366086 5171871 5027648 4513663 3968166 4971974
4647 4971974 3562688 4240118 3835423 4331557 4056757 3537831 4368526 3506015 3428078 4499759
4637 4499759 2608576 3792659 3009455 3087196 2449483 2360970 3028171 2138465 3073524 2681919
4627 2681919 2454808 3064343 2073130 2479222 1908754 2102431 2221799 1864607 2094761 1660964
4617 1660964 1666838 1904795 1924170 1955452 793101 1519564 1969711 1857957 1607775 1626825
4607 1626825 1245136 2079582 2249013 1533941 685998 1115614 131522 863747 768250 360161
4597 360161 1385314 1675429 1227816 847678 1410678 1620496 1049185 2103495 1104176
4588 1104176 1713566 419168 549512 1192201 1928526 1515528 1418424 1314357 1894511 1673186
4578 1673186 1845278 1194627 1588403 992144 1585362 1326840 2000412 1495900 1282126 567628
4568 567628 660166 956468 1314072 942823 551720 1056858 1593917 1426697 1914526 1304813
4558 1304813 1036135 1283027 782414 686783 1338758 1435391 1413145 1580076 1230913 1124492
4548 1124492 1953152 2329123 1333298 889553 1513213 1880233 1427097 1080391 2065183 1628061
4538 1628061 997763 1841616 1537336 1194920 1096595 1153136 1087077 1726194 1579254 1553087
4528 1553087 2026110 2466353 1662827 1880047 1779684 2837725 2147078 1172825 1837845
4519 1837845 1108147 1360244 1145880 2392584 1455410 1744523 1845058 673419 1326645
4510 1326645 2177041 1064105 1892131 1557170 1734549 1409810 2037952 1902456 1366406
4501 1366406 2033127 1573324 1279188 1384872 942938 1417134 997861 2264758 1235342
4492 1235342 1079982 663751 1529556 982839 467937 27465 770213 724005 1170733 1075088
4482 1075088 1176782 654119 1184322 408427 1455476 1731133 110620 485622 1441451
4473 1441451 1008992 471753 1294964 674400 144388 231006 978494 1266126 1289006 521538
4463 521538 449403 1207225 883932 799925 154624 194521 1157724 659357 246367 1503610
4453 1503610 700426 655086 45512 393025 738612 942649 1112821 77373 949287 409530
4443 409530 868167 415623 -539724 788925 716974 -3953 722719 1401070 885835 94080
4433 94080 -153380 650236 1055145 1434361 159231 464441 121626 950015 722364 1007492
4423 1007492 460234 522283 446325 543587 923382 995316 884379 252344 591647 600423 1045403
4412 1045403 680126 -15958 451084 1107971 1096912 1107951 290940 890646 1439243 565064
4402 565064 825159 1318832 1931015 1746971 2459465 1995953 867104 2454647 1603860
4393 1603860 1491067 1533070 555989 898040 1347856 1998295 520889 1151603 1120614 1014474
4383 1014474 1354136 695368 1500048 1401857 760549 1615996 1110355 1782169 1061168 1874433
4373 1874433 1167978 1913676 2435423 2619160 3146615 2931939 2667003 3011992 1909347
4364 1909347 2950220 1861384 2497243 1592934 1753485 1892422 1933644 2609367 2162692
4355 2162692 1922219 1646433 2324892 2977465 2284889 2274731 2083315 1339177 2448403 2831716
4345 2831716 2380327 2981687 2927210 3180927 2516867 3424523 3270051 3266833 2637121 2278645
4335 2278645 2282661 2793351 2798071 3480782 2938633 3935500 3864557 3387014 3534683 3375791
4325 3375791 3284394 3499866 3713828 3878170 3923517 4921815 4915052 4280208 5192728 5864333
4315 5864333 6364131 5737729 6630465 7339808 7955632 8282138 10032407 11150072 13484604
4306 13484604 13994617 16512236 17949404 20874244 22577160 21894977 21163827 18973191 16910667
4297 16910667 14323184 12312867 9544921 8561395 8265339 7488480 7550520 6067577 5559006
4288 5559006 4181519 3953623 4428846 3492275 3754680 3369655 3821307 3161817 2281848
4279 2281848 3399175 3079674 3226188 3158402 2622803 2751411 2696952 2177468 1986207 2319761
4269 2319761 3037794 1757940 2127218 2038353 2279771 1830920 2121234 1521469 2328033 2398767
4259 2398767 1875551 1293650 1453850 1088954 1591946 1370241 2124387 1921309 1512660 951899
4249 951899 1568928 1170096 156806 1248436 2039514 689743 2062846 -38253 1128761
4240 1128761 882543 911498 428345 164784 928517 579445 324667 236606 -460030 788315
4230 788315 913859 911872 1002575 153505 384298 833684 -1305 999355 -175258 517682
4220 517682 -171761 1078039 529477 -214139 19240 854178 543582 815917 187309 570338
4210 570338 -551044 199939 730507 -60167 540874 78215 221783 255216 205260 361864
4200 361864 -399127 -497956 -482251 -368071 553497 -161566 549085 326774 -242288 -387351
4190 -387351 439199 590226 28328 -331571 -451759 172878 -130807 -390256 -397482 278565
4180 278565 -538498 -598329 22228 971425 -25192 -851796 -671759 -598097 302335 -652453
4170 -652453 -950027 -424672 -66501 42373 -4098 -201432 74107 411330 73671 391709
4160 391709 668255 379101 -1003590 -51021 -157572 377280 775969 734363 197494 242547
4150 242547 919190 -884268 -385920 763925 483076 -39352 -691380 -532600 419401
4141 419401 254575 477213 84183 338795 2488 259228 -451290 -794015 -978982 -1074217
4131 -1074217 486986 1036102 477346 -191015 -85826 -193608 -306238 -359182 266429 285992
4121 285992 397493 -509047 829205 357114 336330 417191 -419690 543845 259545 285038
4111 285038 -646584 -480756 -802807 1493037 938866 11909 21672 362080 141001 -125176
4101 -125176 -494784 -245177 648155 104928 -744376 -57703 493771 -474139 54195 -130628
4091 -130628 103363 -1827 -490444 209380 72334 -129317 61071 212940 -135823 -464417
4081 -464417 28757 -635623 -148340 162228 -858133 382868 24536 -140405 171308
4072 171308 614724 -307797 98937 -162818 -763307 -196220 425734 538262 -294294 -339522
4062 -339522 -155411 -224024 107979 -388821 -191770 -656355 -114890 445365 114940 431006
4052 431006 -537145 74376 329981 588582 10312 -392884 507617 445073 -287872 878933
4042 878933 -75923 691504 204567 616342 -70636 319752 561740 1671070 74497
4033 74497 797106 827352 820819 971603 108718 783009 92683 1163192 1234968 398111
4023 398111 1128578 831424 1121214 1744814 1388102 1799970 616940 1678309 1275948
4014 1275948 1728504 1717289 1260997 1351122 2231621 2379710 3357733 2508536 3534903 2516846
4004 2516846 2045022 2594671 2673154 2271321 1857259 1152944 2022991 2033528 2076206 1640120
3994 1640120 1152390 1911765 1526308 2534745 2193821 2003534 1436022 1637209 2841695
3985 2841695 2451071 2187244 2344369 2500635 2611407 2239366 1671078 2280238 2306214 2429995
3975 2429995 1209138 2474646 1197829 1646124 1625696 2420323 1273501 1706744 1289553
3966 1289553 1784237 1246080 2339425 755164 1306186 1586172 2136418 1368301 770113
3957 770113 702867 1048826 1189598 862285 788365 957325 315498 803914 210014 507626
3947 507626 1631410 993351 -18775 -137955 1359611 966619 427658 -91901 10164
3938 10164 1181805 894203 77491 737421 1592299 516092 -605405 -529398 133826 881299
3928 881299 304485 -149473 -43188 310130 -58446 -764005 -117980 -189905 -157701 41148
3918 41148 -497992 -502670 -648348 -443182 46435 -92607 83732 -668175 -370620 -1014277
3908 -1014277 -1022244 -325465 -237579 -55964 -731925 -275124 -902412 235675 -414510 -696638
3898 -696638 -520285 -118133 -884911 -897724 -1085060 -465503 -508040 -1094767 -857675 -655462
3888 -655462 -717277 -1256298 -832397 -787456 -438352 -257884 -1250653 -732921 321750 -1116168
3878 -1116168 -554725 -1070304 2904 -438701 -1099340 -174685 -535248 -4793 -806085
3869 -806085 -974671 -455932 -711798 -278958 -406082 -1132142 -9988 -1386334 -601668
3860 -601668 -1069130 -239864 -545299 -304821 209609 -689590 -1199415 -696464 12155 -56875
3850 -56875 -595494 -833132 -625167 -805792 -526706 -917459 -178505 -145009 -624339 -682533
3840 -682533 -697044 -1054575 14944 -152535 -344917 -411389 -703973 -487817 -685774 -409872
3830 -409872 -705155 75163 -102647 -1087220 -258004 -1277352 -585818 -1079235 -1167898 -1061482
3820 -1061482 23641 -403735 -209453 -362132 -595064 -916907 -331056 -1375009 -977786
3811 -977786 -504906 -850292 -1097812 -1108294 -50949 -67553 -581024 -297268 -324956 -802350
3801 -802350 -1004625 -875124 -1157276 -421360 -740971 -712419 -1102587 -1289482 -795840 -976701
3791 -976701 -300204 -325126 -779933 -630155 -734923 -263591 -1426631 -742082 39453 -283395
3781 -283395 -881082 -511518 -1120555 -669529 -562466 -681586 -397090 -860927 -562612 -729502
3771 -729502 -854385 -1298511 -1302482 -938523 -385186 -109891 -988212 -1773767 -284536 -342029
3761 -342029 -634950 -384929 -1015604 -710373 -708368 -721175 -1569886 -1471907 -953547 -241252
3751 -241252 -368452 -1460207 -746547 -751743 -1153368 -916643 -541749 203585 -315467 -527970
3741 -527970 -718349 -1155509 -930753 -543055 -703878 -518173 -234330 -321607 -1647641 -826797
3731 -826797 -533742 -1064678 -69691 -1665612 -881626 -933456 -1024621 -294124 -916642 -554776
3721 -554776 353852 -1260390 -826598 -1109594 -435490 -1689466 -851487 468752 -481356
3712 -481356 -678144 -1080273 -597846 72188 -417791 -614181 -1108985 -1191166 -492561 -1459639
3702 -1459639 -1139351 -996308 -241425 -514513 -440497 -1178797 -1070187 -636399 -747135 -268080
3692 -268080 -330859 -819138 -667737 159864 -751491 46216 -782063 -328739 -1095298 -383095
3682 -383095 -672779 -785759 -772284 -39665 -664555 -110486 -50362 321571 -1250926 -272919
3672 -272919 -604300 -1033265 -382235 -1108341 -911479 -809846 -553264 -800162 -172916 -377522
3662 -377522 -866005 -493270 -338437 -390748 149461 -1298485 -360492 27834 -1039232 -1223451
3652 -1223451 -659029 -816347 -215271 -767139 -1236455 -687152 92106 -659063 -164659 -936584
3642 -936584 -500991 -221524 -759486 -400374 -984674 -292456 -945976 -1239540 -791715 -636516
3632 -636516 -759245 -456483 -702685 -299635 -357833 752400 -1000518 -1761514 -191686
3623 -191686 -45088 -91774 -700357 -1225714 -1221785 -356206 -788877 -1018098 -1196707 -1026404
3613 -1026404 -627791 -388145 -388021 294823 -300486 -1565056 -1441789 -441865 -566021 -20904
3603 -20904 -664170 -1027390 -270177 -574031 -69144 -1236984 -533568 -748753 -412185 -736584
3593 -736584 -117137 -422691 -498052 -905463 42581 -1081110 -765979 -592493 -1363424 -1218396
3583 -1218396 -529512 -715193 -312174 -622244 -713017 -987221 -1033274 -1191392 -448159 421386
3573 421386 -405130 -765391 -1332843 -1244772 -213358 -615463 -646956 -107308 326070 -211567
3563 -211567 -665964 -888628 -424387 -322831 -53300 -811139 -821126 -925651 -463178 -700309
3553 -700309 -758373 -741649 -203410 -706792 -837693 -904856 -1036236 -95822 -642728 -372669
3543 -372669 -371891 -759862 -142374 -284277 -1120214 -1053169 -557001 -100364 -763663 -958872
3533 -958872 -714117 -902521 -436692 -683381 -137818 -821337 -83578 -1250989 -413633 -126225
3523 -126225 -68403 -727338 -1022926 -992225 -158859 -1353525 -481468 -199117 -845200 -814792
3513 -814792 -821885 -894221 -958583 -462885 -267781 -795687 -677922 -916955 -1683548 -878980
3503 -878980 -731182 -293487 -1162549 -83114 -288698 -1418584 -577618 -699477 -631525 -1072390
3493 -1072390 -710916 -787930 -661030 -29777 -802276 -588529 -565646 -1264682 -773178 -669483
3483 -669483 -1095234 -1025881 -841902 -806456 -151333 -1104370 -797222 -371953 -619271 -812480
3473 -812480 -75633 -855819 -971090 -513163 -896309 -69322 -543723 -1359238 -793255 -789890
3463 -789890 -149290 -357032 -724587 -1143620 -1177880 -498020 -823054 -858433 -683210 120229
3453 120229 -387087 -1675964 -689922 -104163 -1321928 -997239 -1218172 -894923 -364878
3444 -364878 -1208619 -970596 -334241 289191 -759278 -230609 -1192781 -723173 -560046 -1029507
3434 -1029507 -530943 165047 -1104981 -293364 -833267 -832222 146306 260719 -203045 -735463
3424 -735463 -471347 -592111 -1240 -508965 -275670 -387527 -639177 -136256 -338817 -737700
3414 -737700 271893 -1362350 -574806 -633919 100347 -547402 -43500 -632375 -623470 387930
3404 387930 -778912 -527235 -312201 -482600 -561105 -118074 -617440 176820 -20017 -39347
3394 -39347 -410767 -696827 -1325918 283552 136436 -280251 -581604 -928765 -376194 1181988
3384 1181988 -101595 -827458 -369408 541562 1049626 784776 556204 850534 1175991
3375 1175991 1379274 2650091 3480767 3497226 7031199 9715658 12791623 12098085 9622396
3366 9622396 7764267 5915219 4068332 3380560 1287671 1757917 876916 1321089 305548
3357 305548 824595 245903 -135784 -122889 467074 278782 487361 -9552 -303472 -1198271
3347 -1198271 -1212299 -157303 -507355 -631988 -151102 -672748 -154387 -200029 -514683 -948711
3337 -948711 543150 -530530 -1404717 -589039 -507487 -512267 -754284 -969287 -215616 -490714
3327 -490714 346209 -1236914 316770 -1098772 -34616 -615173 -1242899 -1123134 -487997
3318 -487997 -86636 -636305 -1263238 -101233 -1507911 -161996 -816585 -784022 -1016673
3309 -1016673 -888917 -830381 -998461 -154461 -733921 -1019631 -372491 -649865 -673847 -542746
3299 -542746 -800209 -1325398 -1388438 -870814 -1127943 -543182 -242673 -603281 -583570 -1034612
3289 -1034612 -946164 -756510 -268175 -342556 -1539436 -864834 -1211701 -699632 -363736 -332013
3279 -332013 -473617 -1734629 -167119 150083 -1013080 -1256070 -1082308 -614937 -515656
3270 -515656 -313923 -859425 -1150878 17248 -157339 -514805 52008 -1121660 -641812
3261 -641812 -427336 -240345 -578292 -791153 -421645 -339173 -413860 -250820 -57682 -583612
3251 -583612 -1228880 -550518 -241613 -1001140 -126078 -359136 -633548 -634755 -1281092 -1092227
3241 -1092227 -265531 -574647 -922868 -115620 -395419 -833506 -507711 -560424 -794951 -428139
3231 -428139 -960731 -289832 -80065 -263435 -1061489 -258506 -16999 -71317 -568588 -905391
3221 -905391 -453311 -459020 -850334 25483 -588947 -194643 -809197 -961162 -240805 183749
3211 183749 -383203 -561008 -708280 -47656 225538 -405802 -452834 -845622 -330591 -1415710
3201 -1415710 -144095 -41423 -121663 -421820 -745825 -15452 681825 -941106 -355219
3192 -355219 -813625 -193463 -50774 -82412 -419624 -627715 -196664 -398738 -266152 -231231
3182 -231231 -20006 -13518 625639 -1437318 -113858 -608731 125656 -779788 -699158 -732825
3172 -732825 101622 -180771 -1070012 -785081 -1110972 274347 25684 -186923 -445128 -328198
3162 -328198 -833459 -682903 -363244 348649 -823937 -73566 -1326803 -545013 -241982
3153 -241982 91047 -447928 -333317 104757 4139 -556944 -1145689 -1228104 -398248 35625
3143 35625 -553582 -858144 -158909 -611046 -213168 -20152 -229107 -501544 -970610 -469269
3133 -469269 -583443 -327824 -8521 -329352 -330881 -1136846 456005 -237590 -1269362 -905547
3123 -905547 -61957 -803202 -678330 -1102337 -355598 123804 184049 -745844 -1087289 -448208
3113 -448208 -558378 -646219 -1102145 -964587 -526813 -674331 -249939 -707001 -225958 -934478
3103 -934478 -404630 -780174 201296 -1246314 -971836 -870153 -711032 -1085567 -150455 -734924
3093 -734924 -743237 13546 -1105877 -925050 -367546 -585820 206621 -912158 -113207 -219330
3083 -219330 -469661 66045 -1308721 -660056 -1060029 -41946 -651542 -1266274 -516246
3074 -516246 -965124 -787178 264998 -274891 -133858 -883754 -578577 -522896 -779783 -618119
3064 -618119 -1504716 -813668 -538831 -623811 -311573 -870381 -418481 -884968 -553697 42376
3054 42376 -1162685 -922579 -1209225 -393887 -359078 -328767 -37531 -1719435 -454085 -1045815
3044 -1045815 -727858 -1118959 -1230426 -90267 -588290 227314 -462404 -957608 -658545
3035 -658545 -1495207 -1139946 -1085658 -428209 -140918 -1361439 -457877 -372569 -1229597 -130113
3025 -130113 -860380 -918771 -1059072 -452951 228333 -1073045 -223016 -1359396 -174316
3016 -174316 38550 -1137166 -603183 -900420 -587516 -1000558 -274083 -715898 191195 -797701
3006 -797701 -618677 -279724 -560763 -1073801 -153744 -1361720 -553896 -528753 -1342873 -908054
2996 -908054 248242 -770201 -1165070 203627 -1219764 -55743 -472652 -1281000 -511840
2987 -511840 -170836 -124617 -505068 -154977 288413 313055 -1144579 -821092 -1228196 447364
2977 447364 -381737 -656099 -899835 -551728 -342326 -718235 -843893 -1589 -387039 -753720
2967 -753720 -868065 -288556 -218861 -941249 -796894 -836865 -519097 -1087850 -489127 -1200697
2957 -1200697 -701934 -193149 -966063 -666068 -308068 -279403 -600646 -513225 -975735 201327
2947 201327 -1007467 -1050805 -381911 -219955 -862726 -200463 -1714803 -1219130 -574793 -12826
2937 -12826 -592346 -1091609 -776368 163452 212471 -646008 -1374950 -656775 -754904 -491351
2927 -491351 -1320856 -947652 -79207 -390287 -619902 -578306 -351827 -31540 -248234 -901837
2917 -901837 -1052710 -159017 -585079 -566351 -55426 386190 -149832 -619873 -920620 303890
2907 303890 139740 -897026 -277021 -505996 -385064 -681853 -143642 -64904 145146 -480690
2897 -480690 -583304 306737 -583673 -89119 -762318 -1496165 -670113 158036 -660995 -816399
2887 -816399 -743866 -1047325 553295 -243287 -809371 -1292431 -385162 -552187 -136384 -1295829
2877 -1295829 -1182868 78110 -369531 -880473 -338744 -441710 -450099 -601732 -631655 -479133
2867 -479133 -82824 -670045 -768438 -858935 -872586 -205176 -240154 -486263 -1117955 -748575
2857 -748575 -869079 719402 -294201 155883 -278757 -104375 -596262 169028 -130286
2848 -130286 -1003199 -358617 -251912 -595301 -383267 467041 -1007226 -639311 -947940 -167723
2838 -167723 -630711 394030 -67480 -1329475 -90594 -725144 -1256657 -276675 -585270
2829 -585270 -1108459 -599639 -1307500 -309141 -1134867 -243739 -1046130 95901 -452375 245567
2819 245567 -1202667 -231584 40065 -834975 -1716264 -310691 -873123 -402913 -678664
2810 -678664 -660297 -73194 174303 121463 -889066 -287958 -398343 -187381 -897234 -862203
2800 -862203 -158152 -356262 -1160736 328876 -368518 -386319 -1547587 -456326 -326384
2791 -326384 264202 -788691 -1176615 -114411 -462267 -100662 -641198 -1064427 82433
2782 82433 -318102 -175430 -777944 -784004 -1338093 -72162 -160375 -951128 -538600 -764320
2772 -764320 -169863 -465293 -825078 5281 -973877 -932285 -941385 -550436 -23191 -467047
2762 -467047 -621794 -888556 -348734 -334559 -642601 -435756 -801362 -340986 -660607 -1110609
2752 -1110609 -370420 174758 -343949 -728998 -1336519 38272 -325722 -948654 -1114437
2743 -1114437 -588906 -49930 -341659 -668114 -1039588 -359505 151583 -962043 -899555 -497298
2733 -497298 -431526 -569188 -954220 15520 -1508770 -937312 -1227711 -303081 84446 -572106
2723 -572106 -250220 -440242 -576581 -111692 -1417545 -357697 22100 438576 -498626
2714 -498626 -1425485 -537366 -365787 -213180 -800587 -1330047 -953112 -385806 -284906 -678460
2704 -678460 -1166405 -346914 -774886 -350092 245658 -1859827 -149484 -1649905 -57223
2695 -57223 -1126240 -1037771 -906762 -854595 -599116 -422005 -1119736 -163510 -895301 423927
2685 423927 -540304 -430943 -730434 -1019622 -104369 -732880 -917619 -1113170 -329527 160970
2675 160970 -743125 -693297 -436484 -1229834 265814 -629196 -803552 68404 -239835 -116579
2665 -116579 -1021748 -70331 -1032606 -1027262 -513048 -1229662 -572408 3377 -788483 -484993
2655 -484993 -912702 78841 8840 -160520 -1152763 -152432 -284568 -1030987 -302378 -584726
2645 -584726 -671084 4675 -599977 -925847 -294032 -1159988 -784634 -107890 1171 -796038
2635 -796038 -35867 -544778 -43630 -89345 -890529 -732326 -701681 -745385 -613886 -39920
2625 -39920 -333707 146046 -630733 -485396 56256 -330467 -691874 -556089 561561 -922399
2615 -922399 -644702 -1260038 -1085433 -314263 -430339 -643053 -189872 -633037 -313494 -651233
2605 -651233 -1367404 -606337 -423509 -159333 -52851 392301 -1648601 -1312363 -543283 -590823
2595 -590823 26011 -310527 -809046 -564112 -489745 -469464 -787180 -287413 -1011928 -108689
2585 -108689 -859793 -340409 -99717 -2068533 -251059 -678595 241391 -743533 -715029 -1286261
2575 -1286261 -646608 385811 -426573 -771295 296638 -610969 461645 -689987 -963091
2566 -963091 -374791 -1842127 -753430 -304961 100537 -339645 -452867 -208646 -992850
2557 -992850 -174319 -1485184 -766500 -93309 -387246 -1090367 -1077653 -915383 -41421 -206006
2547 -206006 -393829 -1336792 37954 313682 -87153 -1088637 -853418 -461013 -57036
2538 -57036 -41669 -483587 -791925 -445992 -1453304 -730275 -1003422 -146219 -788937 -694263
2528 -694263 51321 -600739 -1298411 -100678 -297635 -23838 -831406 -591461 -1124628 -335561
2518 -335561 -794078 -696115 -675212 -521269 -995915 -1008096 -1079538 301494 -1176012 361979
2508 361979 -611401 -203717 -800843 -535798 263456 159515 -949058 244613 -710825
2499 -710825 170399 -1586760 -1006761 -1367424 929270 149600 -220235 -1076469 -342595
2490 -342595 -291018 302622 -1383111 -994342 -403545 65819 -561950 -580114 -708590 -46927
2480 -46927 -557657 -166541 -1037035 -178764 -851092 -1037089 -704807 106382 -289249 -20875
2470 -20875 -840556 14599 -667311 -690420 -1035485 -888451 -1266729 -612888 -1046500 -137232
2460 -137232 -267632 -262730 -1091837 -191085 -1035639 -756585 -467168 -602595 -347209 -958780
2450 -958780 -242806 -50359 -34516 -96982 -625659 431672 -624704 -1017787 -993652 -823612
2440 -823612 -342642 -937289 -580292 44358 -328183 -134558 -400289 360881 -214430 -1019098
2430 -1019098 -540293 -721019 -344477 -630521 -616884 -40533 690629 -131812 -979920 -192077
2420 -192077 -404838 -306804 -222636 -998902 -740862 -792381 -630781 -171941 -622004 407345
2410 407345 -669180 -224460 -831709 -471528 -499574 -1611289 -355549 -583542 -571837 -513902
2400 -513902 -232814 -293721 -420813 -322174 -1087621 -1535069 242168 -1335970 -510139 -959665
2390 -959665 -703239 -341842 277866 -456766 -202343 -1164631 24040 -897090 -529334 -356628
2380 -356628 -281424 -627294 -852953 -503719 -637875 -251902 -569098 -529782 51955 -229028
2370 -229028 -143832 -290386 6619 -358460 -930605 -820869 -1230653 -831483 -213021 -100034
2360 -100034 -430622 -56054 -911378 -1358234 -1009246 -126323 236679 -507374 -551893 -815782
2350 -815782 -317682 -766228 -156011 -1916532 -256062 -169224 -138259 -1144820 -1038016 -927349
2340 -927349 156265 -117577 -88256 -903884 -281005 -1066497 -603136 -649760 -375140 -194545
2330 -194545 -1091680 -259911 -688356 -617333 -511011 -804113 -908 -1077137 -779726 -356623
2320 -356623 -208033 -346106 -107642 -1521888 518538 -647939 218964 -780755 -744379
2311 -744379 -1236370 -759488 -142449 -201423 -885112 -425508 -1301650 -440271 -1170784 377853
2301 377853 -1804352 -724825 -1782905 -1019796 -326048 -397772 -896970 -1031030 -1058472 -945269
2291 -945269 -1163861 -897492 -1093462 -1285105 -1011694 -471896 263621 -1014714 -262274 146727
2281 146727 -310480 -255778 -866320 -1044690 -1298586 -563776 -1343447 -814630 249603 26651
2271 26651 -248976 8282 -784207 -414857 -198325 -578866 -598393 -405874 -782962 -726603
2261 -726603 -179685 -543095 -531000 -68047 -1430171 -473370 -1202571 -875292 -685304 -1038167
2251 -1038167 -30516 -940991 -115577 -398104 -710609 -226567 -1600896 -937950 -1383633
2242 -1383633 -1284810 -958054 -1180825 485807 -284894 183688 217741 -1750584 -529500
2233 -529500 -1200176 -906655 -655949 -794464 -728723 -977433 -500435 -576123 8271 -684709
2223 -684709 -933812 -1067920 -925494 -87776 -673063 -850412 -316985 -962419 -330101 -515290
2213 -515290 -577957 -891963 -1112761 -58308 -944139 -361767 -506831 -411299 523225 -422540
2203 -422540 -511868 -1550611 -394466 -278434 -593669 -689803 -799213 -813773 -689007 -708938
2193 -708938 -215809 -566038 -438646 202240 -993307 -1278091 -1420733 -1090759 -758066 -499846
2183 -499846 -1007526 -864977 -271156 34749 -1336680 -1215321 -958110 -615680 -276194 25301
2173 25301 -996345 -571699 -473699 -227173 -321033 -692043 -465549 -708159 -985962 -1208666
2163 -1208666 -581478 -753434 288632 -267499 118509 -1054078 -400207 -873856 -1550460
2154 -1550460 -810178 -163446 -284721 439253 -394364 -714684 -856779 -22027 -1077770
2145 -1077770 -1259898 -510626 -704048 -303200 -154943 -700074 -164150 -496711 114136 -1271951
2135 -1271951 -652868 -970400 -115385 -518394 -1140670 -619302 -449004 345105 -379300 -181526
2125 -181526 37617 117765 -936391 -977916 -1116560 -1144612 -704837 -334853 331061 473350
2115 473350 -963879 -1227341 -129447 -1345091 -546836 -326259 -965363 -1152879 -415846
2106 -415846 -972403 51274 267245 -168480 -777807 460233 -973366 -1005208 -1132672
2097 -1132672 -482060 -74521 -861446 -783552 421677 -19134 -374647 -106194 -1087120 -706487
2087 -706487 489180 -411417 -1196543 185560 -1112311 -144423 -406618 -633886 -522605
2078 -522605 126790 -274674 -211924 -580814 -869366 -231772 -436717 -923845 238380 -387263
2068 -387263 -1378933 65914 -591171 -395977 -416350 -345911 -916473 -110552 -214141 -724858
2058 -724858 -501793 -498645 -772909 33620 -668541 1266 -821895 -1094361 -372440 -886939
2048 -886939 -336 -245832 -709138 119670 -411640 -1267600 -670504 -752438 -303763 -668242
2038 -668242 475987 -967022 -834706 -753095 -492951 -433657 -450416 -873055 182658 -764755
2028 -764755 -233415 -942363 -1707122 -408497 46775 -239673 -1220148 -63494 -510523
2019 -510523 -853998 -83807 -661116 -441658 -427306 -632345 -1761 -487579 -222322 -1066330
2009 -1066330 -1131131 -81185 6302 -592735 -127230 -312062 -807108 -232084 -696119 -700840
1999 -700840 -537138 -1039321 -1040390 -229023 -761699 -1464452 -1030377 -201707 -73871 -232398
1989 -232398 -684864 -857036 -940575 -596854 85208 -336235 149327 -660988 -86245 -986438
1979 -986438 -537521 -1069063 -526551 -314200 104043 -644811 -360290 -951821 121622 -33544
1969 -33544 325661 -583683 -1002511 -1431761 -187488 -643520 -1061360 -1092815 216322 -801572
1959 -801572 -5038 -878578 -657079 -759514 240695 -812522 -333930 -381495 -725540 -1169320
1949 -1169320 -313573 -708316 -1103284 -635894 -458520 -1123446 -832854 -505680 -47815 -506886
1939 -506886 -728656 -953842 -144666 -819467 -460572 -1091724 -1237255 -806928 -1081062 -795844
1929 -795844 -668594 -601336 -677477 -567144 406557 -1049874 -304321 -176039 -930829 -18572
1919 -18572 -815678 125304 155034 -766470 -547665 -578058 -289818 -222702 -693545 -272096
1909 -272096 -853817 -585141 -723982 -341140 -97829 -267016 -169264 -494408 -1144907 451072
1899 451072 -1340132 -856900 -701777 -260968 -271717 -376974 -1034254 -663600 -456861 -175166
1889 -175166 -1233933 626925 -823543 -1034862 -377933 -893782 -570488 -497691 -95943
1880 -95943 -140712 -393639 -1061690 -773820 -278978 413415 -1558663 -972041 -1031304 41123
1870 41123 119635 -497581 -612543 -527998 -736726 -773426 -21629 -803306 -1264971 -533642
1860 -533642 -249799 -216980 157909 -1225530 -483790 -886937 -633579 -206693 -216470 -790543
1850 -790543 -736402 277171 -115405 -474951 -396727 -517220 -396734 -501620 -1167581 -581331
1840 -581331 -759517 -1031292 -540026 -1241322 123825 -572152 -645101 -409733 -731495 -35062
1830 -35062 -447394 -201109 -1052508 -65172 -621367 -928626 178842 -305530 42526 -265231
1820 -265231 -1348013 7370 -80150 -132904 -838922 -402638 -350795 -284957 -617670 -826306
1810 -826306 -1221183 -383616 -318044 -30006 -1219908 -279640 -94228 -1178048 -742070 -710015
1800 -710015 -759731 -579401 24191 -547691 -445164 -769142 -1387318 -1075701 -319649 -869747
1790 -869747 -400323 -1892087 -554979 -173545 -802112 -869678 -623387 -1177008 305654
1781 305654 -222908 -1119443 -936416 -414030 -429637 -548589 -100622 -516546 -213886 -1026441
1771 -1026441 -507593 -704287 -670230 -630474 -514751 -361095 374181 239652 -773604 -233123
1761 -233123 -704298 459311 -294362 -501011 -1282709 280885 -607922 -846226 -803266 -479779
1751 -479779 -297428 800051 -573426 -319950 -1158403 -732128 -1420898 -436990 -986021
1742 -986021 102162 -413434 -254291 -698936 -110038 -613702 -495554 -24787 -1373043
1733 -1373043 -810418 -912711 -464521 -462214 -287210 -463848 -898519 -753190 -756084 -1747347
1723 -1747347 -122754 -716736 -953877 -364494 -719597 16317 126803 -466825 -269014
1714 -269014 -521149 -998112 -343553 -592476 -403232 -667098 -212183 -1686091 -249695
1705 -249695 -704826 -965105 -381134 -413283 -722874 228375 -662685 -530934 -1080860 -357867
1695 -357867 -734234 -231577 -1091078 -764276 68660 -770675 -1001052 -402844 -658431 266085
1685 266085 -573841 -539501 -853036 -672366 -733021 -1094905 -285854 -814263 -520521 -920012
1675 -920012 -882677 -87895 -139495 -540890 -193709 -663798 -1166432 -1378074 -468648 -550279
1665 -550279 -818928 -840239 -34695 -508437 -383676 -887861 -849740 -141482 -1182979 -200468
1655 -200468 259592 -251665 -990212 -1087876 -1123945 -294825 -522310 -119325 -956490 -401424
1645 -401424 -544551 -42559 -517788 -244191 -744982 -579291 -1810221 201905 -314838
1636 -314838 108675 -682252 -1124463 -886783 -528358 -894018 -736412 -1308261 316423 -588555
1626 -588555 111549 -639438 -748662 -384223 -832917 -244408 -530388 -1278242 244418 -1069914
1616 -1069914 -100458 -333209 -366363 -858950 -143707 227774 -650386 -556707 -121110 -399681
1606 -399681 37981 -1050276 -555259 -273771 -298417 -1088 -983930 -1071764 -237267 -512951
1596 -512951 -806730 -423356 -855348 -690401 -398688 -66204 -746766 -562225 -669338 -529443
1586 -529443 -917995 -965483 -554315 -78609 -162372 -556076 -998304 414358 -139083 -507645
1576 -507645 -814090 -1173363 -704791 162448 -302749 -561129 -76448 23664 349460 93225
1566 93225 -675063 -1220139 -1298813 -769504 -545635 -613466 -429217 -836310 -469270 290678
1556 290678 174923 -804655 -675297 -752485 -734988 -1256994 -448271 -517805 -356523 -315562
1546 -315562 -768615 216707 -661337 621053 35560 -952936 -417529 -644525 -265262 -580431
1536 -580431 -448684 373968 -170572 146141 -1506516 -459871 66024 -1040411 -257617
1527 -257617 -330641 428001 -488156 -656187 -1162372 -104505 -1182992 -925028 -590360 -251913
1517 -251913 -511852 -37183 -1289728 -353178 -107842 326257 -94518 287559 -979239
1508 -979239 -1025726 -299150 -730335 -413353 16828 -316843 -171584 -164298 -514412 -259828
1498 -259828 -473317 335568 -167301 -508420 -214325 -434314 -1098991 -730633 -138480 -668577
1488 -668577 -686910 5937 -1446935 -1219417 -1057529 -282837 -455334 688607 -259675 -411154
1478 -411154 -487957 -444426 -6007 -819010 -1023640 -1002119 -582913 -681826 -577621 -689079
1468 -689079 -695414 599173 -93982 -819617 805237 -621081 -977086 -1282723 -799399 -118946
1458 -118946 382317 -786939 -1455102 -71529 -591119 -157411 -84027 -458673 -359063 -242502
1448 -242502 37533 -263145 -618696 -227047 -1199256 82009 -874807 -892499 -495776 -816983
1438 -816983 36526 -66851 -775719 -1159716 -749503 -58659 -372618 -170121 250723 -854955
1428 -854955 825308 -977439 -470867 -915278 -1082834 -183932 74283 -265898 -1157808
1419 -1157808 -642335 -473311 -168046 174916 352860 -571209 -354056 -1165518 -515825 -344690
1409 -344690 -849775 -576015 112410 -874190 -221960 -598463 41706 73175 -112747 -943113
1399 -943113 -901883 -585526 -135234 -161208 -486420 98441 -498245 -331474 -218419 328741
1389 328741 -765747 -773143 -876412 -823737 22109 -371951 -809173 115456 5542 -117596
1379 -117596 -601435 -677725 -1007136 -545409 -905664 -484974 482302 -872565 -364745 -772435
1369 -772435 -843859 356489 -249559 -561873 -1164941 -1109255 -805090 -800775 299218 -699130
1359 -699130 259864 7928 -58893 -62117 12798 -350089 -845819 -1283769 -705717 -564113
1349 -564113 -608699 -102383 -147611 212702 -50631 72434 -607563 -438603 -626405 -372683
1339 -372683 -1531657 -404613 -943554 -43561 -261767 24881 -208287 -251935 -46661 -1156019
1329 -1156019 -1651473 -521200 -368230 -130300 46183 112857 388784 -202244 -911501 -365847
1319 -365847 -276381 -570756 -262925 -1035054 -919253 -579567 -577598 324961 -189417 -15469
1309 -15469 -645007 -135651 -510020 -656661 -1265493 -1357318 -1001277 -427399 -431047 -885333
1299 -885333 27230 -656244 -775948 -1627191 -667279 254325 968606 -571389 -902621 -64528
1289 -64528 -602691 -314490 -481721 -370380 -806607 -452250 -515669 -160825 -441651 -976389
1279 -976389 -612187 -38665 182795 -394794 -867855 -1165646 -979117 -928757 -143478 -762724
1269 -762724 478760 -1000457 -373648 -461562 -750224 -1039004 -792226 -795218 110374 -664269
1259 -664269 -388688 -3026 -226070 -693744 -911146 -515811 -876863 -469316 -1235778 -676741
1249 -676741 -757813 -955689 -485575 -194026 -870863 -144102 -685789 -592658 -864786 36904
1239 36904 -1104245 -863083 -722252 -657215 -243422 -740947 -839331 316017 -272150 -550170
1229 -550170 -971342 -416073 20345 -359509 -283585 -284553 -388240 148363 -869789 513276
1219 513276 -1087500 -505844 -337029 -785557 -441596 -646629 -374321 -495081 19618 -262004
1209 -262004 -834432 -426025 -1113317 -1584547 125539 -737578 187837 -1129515 -632141
1200 -632141 -205113 -1134005 -582346 -817056 14703 -82919 -676450 -772499 -728667 -47164
1190 -47164 -619172 -860647 18584 -1250799 12623 -485371 -384752 -971244 -676659 331257
1180 331257 -1312091 -153721 -19048 -413532 -271904 -1216383 -644650 -425544 -766498
1171 -766498 498763 -1084036 634065 -1233270 -973053 -710889 -957547 -401507 -1053706
1162 -1053706 152507 -327436 -759646 -775855 -805027 -55589 70636 -659477 -136758 -1192354
1152 -1192354 -627336 -1349574 -1256675 171763 -403815 421239 28133 -506516 -970830 -465037
1142 -465037 -498052 -519082 -121179 -300137 -1277970 -763038 -1091304 34540 -114727 -409575
1132 -409575 -423819 -318068 -1310173 -1037431 -966872 -579571 -198381 285586 -175020 -771620
1122 -771620 -503146 -311579 -92824 -232862 -773625 -557075 -60368 -382030 -154481 -286739
1112 -286739 -405309 -65995 -588752 -717172 -73869 -845920 -142337 -351828 22317 -110925
1102 -110925 -373525 -133292 -304747 -145769 -22514 -1116158 -558928 -1181513 275980
1093 275980 -898076 -3017 201188 -762040 -925498 -775925 -755870 68137 -257025 -716043
1083 -716043 -1240856 175648 188760 293064 -258684 -1147087 -136092 -233882 -851682 40125
1073 40125 -768986 -575527 -114022 175777 324613 -577401 -424004 -1219248 -577280 -1153194
1063 -1153194 -846549 -570768 -1476530 -440237 11095 -109559 139147 -97594 -809757
1054 -809757 -1213275 -1139660 -695737 -605252 -814654 -579750 -376416 275856 -347030 -439035
1044 -439035 -384055 187213 -765282 -667896 -577826 -508020 -888930 -344534 66980 666502
1034 666502 204498 -423043 -709061 -10819 -903185 -626814 -440246 49412 98106 -176353
1024 -176353 -648149 -648122 207370 -291549 -205242 -518715 -849367 -1040429 -122114 -169917 -433608
1013 -433608 -275817 -275001 -346077 -346083 -249510 -716130 -1127487 -452387 -1275204 -322221 -728560
1002 -728560 -364200 -667394 -356406 -586107 -425481 -621291 -1209333 -1041289 199520 -755695
992 -755695 -907886 -800145 -680985 231923 -468754 -785779 557345 -562466 -504317 -867823
982 -867823 -874966 -834228 -542613 -615046 -853610 -16121 -295703 -439114 -544162 -26360 -394806
971 -394806 -1064814 62085 -59202 -615798 -1277073 -561667 -442208 -198300 268256 -812954
961 -812954 -984291 -659469 -984560 132437 -315116 -963763 -775894 239286 -117054 -215836
951 -215836 -309312 -1083547 -637515 -391756 -1273451 -17301 -143765 -582263 -417139 -764860
941 -764860 -188834 -297893 -448009 -894997 161167 -190711 -542156 -134146 -444278 -1131750
931 -1131750 -455976 -1003073 585325 -148711 -378574 -1155075 -494502 -759082 -499726 -155585
921 -155585 -772323 -577265 -985154 -232670 -479685 -458793 -869238 220498 -428295 -664509
911 -664509 -1096439 -400421 -746649 -221445 -547168 -349810 -151303 -527052 -161095 -960014
901 -960014 -1021245 -630315 336590 37270 321509 -1152563 -33345 -195087 -112032 -500601
891 -500601 321332 -822019 -235434 -443581 -527485 -230970 150803 -1078731 -418925 -696056
881 -696056 -1043528 -312016 -870714 -900214 -697846 141703 -659487 -595189 -467705 -297209
871 -297209 -286814 -100304 -466660 -922209 -1333305 -346612 -182711 -1028950 -626743 428499
861 428499 -511012 -1094822 -870849 -614108 375109 -37402 -447034 -1316095 -730475 -720643
851 -720643 -745785 -795951 -632246 -82685 -529217 -822454 74983 -884579 -636043 -624009
841 -624009 355339 -167341 -1256226 -1511605 -185576 -405948 385924 -1219399 -267795
832 -267795 40824 -241630 -1127185 -1436914 -552616 -297027 -365851 -989878 -806658 -635066
822 -635066 -407666 -63127 -485072 -1206667 -419967 -877291 -1211621 -536828 34049 -67513
812 -67513 -676774 -495213 -1001886 -276350 169774 -1088957 -850795 106086 -300383 -300515
802 -300515 -716215 -647162 -17070 -557003 -122292 -496846 -770033 -1305793 -670303 -349224
792 -349224 -294850 -610077 -418352 -538082 180323 -1212652 -445297 -539025 -364779 65600
782 65600 -701230 -868818 -861283 -544723 -4488 -612452 236670 -747620 -773948 -471825 -641279
771 -641279 331629 -405672 -537904 67191 -702828 -92902 -523099 -520890 -597360 -377980
761 -377980 -473290 -1058098 -385859 -257935 958973 -727565 -351930 -435206 -291251 -622278
751 -622278 -1375293 -800438 -508776 41884 391837 -1032262 -291460 -1059681 -306785 -31530
741 -31530 -93443 -631459 -1290581 22521 251876 -13785 139419 167474 -118974 -671545
731 -671545 -828013 -348616 -343638 119569 -1206688 -601051 205907 -773894 -721798 -612006
721 -612006 -115796 -687297 -917313 -698745 -757081 73413 -422444 -692507 -221419 -511384
711 -511384 190448 -1310230 153501 -957719 -809413 -518407 -191958 419281 -100511
702 -100511 13366 -550221 102372 609023 -727515 139836 -865968 -515715 -704602 -744104
692 -744104 124597 -876084 -45855 189131 -660682 -239391 -790014 -268734 -1605104 -716977
682 -716977 -18205 5451 -137689 -539114 -1128871 -96977 -1459208 -39266 -864602 -825759
672 -825759 -921496 -953691 -866379 -493081 474418 -1413763 -352920 879703 -1353068 -596494
662 -596494 -1170598 -704928 -426560 -507068 -536874 -744929 -246495 -153759 -1155148 264724
652 264724 -1208955 350555 -876116 -482041 -649543 -886959 -265888 -201591 -365775 17514
642 17514 -1146890 263569 -551618 -82057 -846836 -1541421 -105542 -662021 -420447 -833069
632 -833069 -758358 346753 -1131819 -150789 -480454 -328270 -473190 -988010 -1174724 -554373
622 -554373 -1104118 209299 -430257 -50103 -1154541 -86078 -161143 -655148 -63863 -838813
612 -838813 -1019554 -377875 -583296 50758 -1018607 -821308 -906120 -660886 256303 -9269
602 -9269 -363431 -761229 -932281 -654192 -518463 -282047 -369841 -390332 -54128 -464262 64064
591 64064 -245131 -1148837 -404727 59428 -270893 -641019 -1512665 -1084797 55487 177340
581 177340 -1070536 -1093483 -386554 -259144 -727821 -551449 -1074844 -548320 -921022 -461549
571 -461549 -276476 -1141535 -469890 -199208 -604775 -293958 -753734 -242232 -1310361 241779
561 241779 -1039923 -22676 -741379 -369192 -547875 179292 -1184386 -601926 -588624 -451729
551 -451729 -374775 -153344 -773248 -836749 -414818 -236538 -561955 -825179 -603822 -396239
541 -396239 -540353 -218132 -953692 -737490 -526182 -634552 -1127806 -29638 -537244 -564822
531 -564822 -508918 -328317 -375726 -133941 -693258 -293369 -283583 -35399 -526698 -646535 -1332176
520 -1332176 -893066 203699 -687421 224606 -889913 -1217670 -505911 5122 -923750
511 -923750 -1123800 -380549 -1079588 -310080 -955878 -867630 -235529 55970 -122535 138407
501 138407 -879843 -560872 -62710 -702969 -1066347 -555532 -725228 213722 -358781 -702028
491 -702028 -1004941 -60807 260914 -1079691 -1103893 -1168594 375620 -488034 -1400842 -759653
481 -759653 -444772 -147510 -51499 -787606 -511256 -935981 -1348902 -947661 -969060 -352742
471 -352742 -749853 -527099 -908063 -495585 -295252 -662373 -473868 -94127 -609909 -1264984
461 -1264984 -738722 -400534 -467958 -337769 -234353 -681270 -48603 373163 -824068 -562745
451 -562745 -623064 -833557 -611358 -40726 -1136830 -390483 -244920 -912064 -538677 206350
441 206350 -1002479 -377358 -1116312 -1268419 -358834 -607878 -552852 -131156 -725563 -975683
431 -975683 -37445 -480715 -328475 145089 -938820 -692657 279835 -938944 -172643 -690550
421 -690550 -380985 -917875 -461697 -373664 -1003700 140836 -455264 -1410357 16871 -1065960
411 -1065960 377713 -939030 -513187 -1383936 -588875 36333 -262699 -843399 -809995 -677700
401 -677700 494673 -1067192 -459152 -1223981 -545661 -622450 -901169 -659119 135957 -78917
391 -78917 682316 -1163243 157359 -204674 -30274 -683297 -1104997 -428785 -1248769 -618166
381 -618166 -157237 -339629 -613893 -1083377 -646527 -381543 -400094 -682405 -1347783 -349013
371 -349013 -902995 -739539 -799933 -652346 -154946 -816751 -711442 -345119 -256743 -764125
361 -764125 -506406 -1620563 -456280 -770974 433766 -1219361 184600 -1032671 353060
352 353060 -514424 -897233 -887625 161895 -1019923 -607023 -801703 -475136 2281 199303
342 199303 -651122 -823037 224694 -1176721 -205319 -1534420 -357007 -586282 -249989
333 -249989 -925946 -966248 -443886 -772786 130588 -668772 -644997 -239446 -343542 -544510
323 -544510 -216763 -919441 -879327 -978176 -442329 -497941 -663342 -89707 -461679 101056
313 101056 -877943 -380302 -656276 -901382 -89453 173563 -287941 -473905 -411056 -321766
303 -321766 -396735 -819618 -845521 -732513 -447071 -629541 -681188 -124815 141527 -991966
293 -991966 -1286047 -1092376 -74548 -429217 -395829 -531059 -60419 -623731 615564 -658013
283 -658013 47890 -782004 -435470 -840296 -823597 -376163 -204859 -841492 64859 -96192
273 -96192 -471557 -598538 -442378 -409668 -205649 101139 -1394744 -859688 -1232392 -1097945
263 -1097945 -667827 -634385 -680593 435745 -483336 -203458 -1029480 28935 -1370624 -41061
253 -41061 -796438 -450757 -356035 -401530 -370245 -49000 -731577 -132201 -501560 -63555 -1299751
242 -1299751 -590788 -53879 -441991 -741122 -942315 -121369 -680363 -779179 -275340 -715859
232 -715859 -156607 -665184 -632511 -691634 -898497 -921844 -252899 -1371779 -447012 -777705
222 -777705 -165867 -153267 -105407 -767281 -629786 -107967 -1228498 330946 -10147 -932588
212 -932588 62744 -498236 -101566 -315793 -519903 -985548 -1028957 -312320 -889652 94383
202 94383 84250 -155887 -458257 -1075707 62542 -612995 -1562486 -413798 -948455 -78243
192 -78243 -381547 -538614 -681374 -494666 -601449 -19674 -701428 -292540 -723461 118681
182 118681 -573988 -277173 -291631 -315670 -650305 -459308 -336240 -123511 -743039 -191646
172 -191646 -323564 -543621 -206793 -537395 -1187931 461491 -451087 -823043 -466672 -685915
162 -685915 -582531 -158113 -148945 -483359 -1271944 -267050 -1294449 -148322 -631373 -783941
152 -783941 -238173 -1354688 -1119396 373202 -66550 120286 -388537 -622494 -377755 -719542
142 -719542 -365694 -928586 -425874 -635735 -569191 273249 -122768 -263246 -837492 -672774
132 -672774 -583896 -551736 -1208243 -911090 -776263 -881462 -315224 75830 -874937 -339177
122 -339177 -664450 -593975 -354038 -704512 -137527 -764291 -864169 -698770 -110095 168408
112 168408 -881453 -152039 -680390 -290520 -769092 -974233 -417587 -886599 -428810 -387259
102 -387259 -531087 118431 44532 -583599 -404729 -529763 -1139165 -1079493 -87115 -842591
92 -842591 -337610 -478158 -262054 -50763 -428009 -467860 -354173 -735039 168889 -1026853
82 -1026853 -188722 -746147 215854 -973209 -840186 737473 -628469 -683234 -888267 -897016
72 -897016 -151723 -1123730 -567808 -632349 100554 -1061487 -970283 -205980 41018 -358277
62 -358277 -856816 -783926 -620954 -770610 -47904 -473618 -532623 -156373 -599221 -411888
52 -411888 -246431 185005 -1098775 -275053 -275000 -589231 -309954 -458496 -384200 -597860 -358564
41 -358564 46631 -580148 -544025 -327853 -950226 -412296 -649884 253174 -733893 -76796
31 -76796 -1194845 -1088060 -576183 -662355 -389825 -537841 -773648 -733168 -783098 -508953 -337668
20 -337668 -176679 -358635 -605880 -545907 -776741 -453807 -343378 -660569 -229460 -525836
10 -525836 -190080 -316516 -1116532 -458242 -619261 -93690 -520699 -456082 -446955 -1031657
0 -1031657
$$ Imaginary data points
##PAGE= N=2
##DATA TABLE= (X++(I..I)), XYDATA
16383 -1609180 -1318328 -1580956 -1204466 -1077586 -1640493 -805172 -1002035 -1110124 -840537
16374 -840537 -390621 -708835 -662564 -1403658 -1467905 -810902 -609786 -1060703 -1027683 -884631
16364 -884631 -638095 -563184 -1432982 -235337 -564176 -173348 -1053525 -312289 -878143 -191096
16354 -191096 -746482 -822861 -242373 -596337 -194820 -287312 -477394 -520536 -1073282 -208463
16344 -208463 -535106 498982 -589786 -173073 -68170 -352417 444307 17304 34188
16335 34188 131105 -832300 -310226 -296699 -28913 -271848 42236 234026 33307 492020
16325 492020 347238 431708 -69612 -511703 215528 -128002 183715 183766 -483770 42050
16315 42050 122810 227271 237600 -115042 270993 197914 708104 90068 376950 769945
16305 769945 378557 677362 -88025 739932 675392 586554 763590 499299 740711 831461
16295 831461 655201 722339 859111 1340728 671223 1248463 614339 993012 399885 835662
16285 835662 612808 883004 439485 445526 527380 626464 353972 142528 839967 1294119
16275 1294119 266619 338298 1606184 1326143 1330642 752634 970336 1291315 961884 1655737
16265 1655737 836445 1857220 1168988 1904710 1331111 1638212 1628809 1085318 1270838 1524022
16255 1524022 1073751 1680594 1580095 1561485 1195878 578364 933581 1167777 1055355 743076
16245 743076 1322109 1601153 1538258 1432855 609252 523562 1810793 1603411 957842 1330583
16235 1330583 1682024 2209558 1534157 1069394 2025542 1620639 1933111 1529521 1297204
16226 1297204 1533991 1955992 1780511 1326893 2122318 2074784 1650493 2218903 1893816 1523943
16216 1523943 2423457 2255863 2219103 1592023 1589781 2130785 1571310 1812404 1865158 1542473
16206 1542473 1892894 1665413 2505892 1578484 2377386 1315301 1569838 2498384 2758397
16197 2758397 1876428 1823509 1242835 2146514 1701759 2190681 1445085 1952890 1273779 2542183
16187 2542183 2188596 2124002 2270761 2635210 1219867 2172113 1637995 2397418 1521764
16178 1521764 2530770 1486665 2223727 2583028 2090582 2052019 2272067 1729166 2236969
16169 2236969 2992609 2843351 2547387 1757980 2481217 2048206 2726392 2508481 2648680
16160 2648680 2730553 1674431 2284220 2089571 2367549 3379551 1575331 2709893 2350858
16151 2350858 2010966 2316506 2293121 2328713 1626167 2724036 2795197 1371188 2103789 1473185
16141 1473185 2649590 2473162 1957835 3362344 2343111 2843144 2387199 1790758 2568516
16132 2568516 2113852 2510796 2284557 1540642 2833520 1528439 2541597 2562577 1665147
16123 1665147 3042310 1856570 2597091 1989600 2507545 2932280 2364300 2156189 2045473
16114 2045473 2018617 2080108 1705579 2417461 2200479 2661642 2736787 1771183 2125014 2664820
16104 2664820 2592507 2994227 2463740 2746464 1913727 2071944 2499704 2564845 2659068 2050976
16094 2050976 2212125 2978758 2127543 2923551 2503512 2338174 2453166 2056547 2654657
16085 2654657 1989671 3087600 1846575 2587988 2449492 3075591 2644065 2005154 1813529
16076 1813529 2775093 1639931 3088281 2579628 3203516 2549181 3227654 2936937 2304470
16067 2304470 1788009 1199767 1811213 3180651 2971361 2416877 2476763 2724727 2577139
16058 2577139 2276883 3195717 2758422 1917501 1903058 1929584 2524866 2592138 2653172 1857656
16048 1857656 3140382 1738397 1920159 2270942 2277804 3146210 2287812 2385911 3110687 3408072
16038 3408072 2867902 2208123 1762072 2041067 2522474 2919826 2323852 2494053 2723625
16029 2723625 1742702 2701820 2590701 3568238 3061119 2529323 1347917 2514575 3120823
16020 3120823 3121057 1749175 1948863 2120787 3511366 2797973 2284745 2156216 1633611 3077397
16010 3077397 2565248 2484193 2332370 2821504 2264055 2692439 2727249 3338932 2597970 2189263
16000 2189263 2325447 1689355 2605585 2427723 3245869 2209768 3137510 2180317 2418300
$$ [...]
##END NTUPLES=NMR SPECTRUM
##END=
