##TITLE=abcd
##JCAMPDX= 6.0         $$ Bruker NMR JCAMP-DX V2.0
##DATA TYPE= NMR SPECTRUM
##DATA CLASS= NTUPLES
##ORIGIN= UXNMR, Bruker Analytische Messtechnik GmbH
##OWNER= root
$$ XWIN-NMR		Version 3.5
$$ Wed Mar  4 16:48:56 2026 Russian Standard Time (UT+4h)  servis@DPX200
##.OBSERVE FREQUENCY= 200.131235884673
##.OBSERVE NUCLEUS= ^1H
##.ACQUISITION MODE= SIMULTANEOUS
##.ACQUISITION SCHEME= undefined
##.AVERAGES= 32
##.DIGITISER RES= 18
##SPECTROMETER/DATA SYSTEM= spect
##.PULSE SEQUENCE= zg
##.SOLVENT NAME= DMSO
##.SHIFT REFERENCE= (INTERNAL, DMSO, 0, 16.4885)
##AUDIT TRAIL= $$ (NUMBER, WHEN, WHO, WHERE, WHAT)
$$ ##TITLE= Audit trail, XWIN-NMR		Version 3.5
$$ ##JCAMPDX= 5.01
$$ ##ORIGIN= Bruker BioSpin GmbH
$$ ##OWNER= servis
$$ F:\spectra/data/av/nmr/H1/1/pdata/1/auditp.txt
$$ ##AUDIT TRAIL=  $$ (NUMBER, WHEN, WHO, WHERE, WHAT)
(   1,<2026-03-04 16:47:56.65 +0400>,<servis>,<DPX200>,
      <created by zg, POWCHK disabled, PULCHK disabled
       configuration hash MD5:
       00 E9 B6 7A A2 85 ED C7 34 08 36 98 17 FE 4E 26
       data hash MD5: 32K
       A3 85 DE C7 60 D0 C7 14 3E E6 22 27 3E 60 A2 96>)
(   2,<2026-03-04 16:48:10.93 +0400>,<servis>,<DPX200>,
      <Start of raw data processing
       efp BC_mod = 2 LB = 0.05 FT_mod = 6 PKNL = 1 PHC0 = -184.1201 PHC1 = 6.301564 SI = 16K 
       data hash MD5: 16K
       C1 AF 85 2D 8B B4 BB 84 6C A6 11 64 9E 24 EE C9>)
$$ ##END=
$$ 
$$ hash MD5
$$ 9B 25 84 05 A9 6C 80 D0 86 0C CC CB C9 9F CD F7
##$RELAX= 
##$RELAX= 
##$RELAX= 
##$RELAX= 
##$RELAX= 
##$RELAX= 
##$RELAX= 
##$RELAX= 
$$ Bruker specific parameters
$$ --------------------------
##$DU= <F:\spectra>
##$EXPNO= 1
##$NAME= <H1>
##$PROCNO= 1
##$TYPE= <nmr>
##$USER= <av>
##$AMP= (0..31)
100 100 100 100 100 100 100 100 100 100 100 100 100 100 100 100 100 100 
100 100 100 100 100 100 100 100 100 100 100 100 100 100 
##$AQSEQ= 0
##$AQ_mod= 1
##$AUNM= <au_zg>
##$AUTOPOS= <>
##$BF1= 200.13
##$BF2= 200.13
##$BF3= 200.13
##$BF4= 200.13
##$BF5= 500.13
##$BF6= 500.13
##$BF7= 500.13
##$BF8= 500.13
##$BYTORDA= 1
##$CFDGTYP= 0
##$CFRGTYP= 5
##$CHEMSTR= <none>
##$CNST= (0..31)
1 1 145 1 1 1 1 1 1 1 1 1 1 1 1 1 1 1 1 1 1 1 1 1 1 1 1 1 1 1 1 1 
##$CPDPRG= <>
##$CPDPRG1= <>
##$CPDPRG2= <>
##$CPDPRG3= <>
##$CPDPRG4= <mlev>
##$CPDPRG5= <mlev>
##$CPDPRG6= <mlev>
##$CPDPRG7= <mlev>
##$CPDPRG8= <mlev>
##$CPDPRGB= <>
##$CPDPRGT= <>
##$D= (0..31)
0 2 0 0 0 0 0 0 0 0.06 0 0 0 0 0 0 0.0002 0 0 0 0 0 0 0 0 0 0 0 0 0 0 
0 
##$DATE= 1772628476
##$DBL= (0..7)
120 120 120 120 120 120 120 120 
##$DBP= (0..7)
150 150 150 150 150 150 150 150 
##$DBP07= 0
##$DBPNAM0= <>
##$DBPNAM1= <>
##$DBPNAM2= <>
##$DBPNAM3= <>
##$DBPNAM4= <>
##$DBPNAM5= <>
##$DBPNAM6= <>
##$DBPNAM7= <>
##$DBPOAL= (0..7)
0.5 0.5 0.5 0.5 0.5 0.5 0.5 0.5 
##$DBPOFFS= (0..7)
0 0 0 0 0 0 0 0 
##$DE= 6
##$DECBNUC= <off>
##$DECIM= 32
##$DECNUC= <off>
##$DECSTAT= 4
##$DIGMOD= 1
##$DIGTYP= 9
##$DL= (0..7)
0 120 120 120 120 120 120 120 
##$DP= (0..7)
150 150 150 150 150 150 150 150 
##$DP07= 0
##$DPNAME0= <>
$$ [...]
##$SUBNAM4= <"">
##$SUBNAM5= <"">
##$SUBNAM6= <"">
##$SUBNAM7= <"">
##$SUBNAM8= <"">
##$SUBNAM9= <"">
##$SW= 20.6817932712277
##$SWIBOX= (0..15)
0 0 3 0 0 0 0 0 0 0 0 0 0 0 0 0 
##$SW_h= 4139.07284768212
##$TD= 32768
##$TD0= 1
##$TE= 0
##$TE2= 300
##$TE3= 300
##$TEG= 300
##$TL= (0..7)
0 120 120 120 120 120 120 120 
##$TP= (0..7)
150 150 150 150 150 150 150 150 
##$TP07= 0
##$TPNAME0= <>
##$TPNAME1= <>
##$TPNAME2= <>
##$TPNAME3= <>
##$TPNAME4= <>
##$TPNAME5= <>
##$TPNAME6= <>
##$TPNAME7= <>
##$TPOAL= (0..7)
0.5 0.5 0.5 0.5 0.5 0.5 0.5 0.5 
##$TPOFFS= (0..7)
0 0 0 0 0 0 0 0 
##$TUNHIN= 0
##$TUNHOUT= 0
##$TUNXOUT= 0
##$USERA1= <user>
##$USERA2= <user>
##$USERA3= <user>
##$USERA4= <user>
##$USERA5= <user>
##$V9= 5
##$VALIST= <valist>
##$VCLIST= <CCCCCCCCCCCCCCC>
##$VD= 0
##$VDLIST= <DDDDDDDDDDDDDDD>
##$VPLIST= <PPPPPPPPPPPPPPP>
##$VTLIST= <TTTTTTTTTTTTTTT>
##$WBST= 1024
##$WBSW= 30
##$XGAIN= (0..3)
0 0 0 0 
##$XL= 0
##$YL= 0
##$YMAX_a= 2990626
##$YMIN_a= -2930223
##$ZGOPTNS= <>
##$ZL1= 120
##$ZL2= 120
##$ZL3= 120
##$ZL4= 120
##$ABSF1= 0
##$ABSF2= 0
##$ABSG= 0
##$ABSL= 0
##$ALPHA= 0
##$AQORDER= 0
##$ASSFAC= 0
##$ASSFACI= 0
##$ASSFACX= 0
##$ASSWID= 0
##$AUNMP= <proc_1d>
##$AZFE= 0.1
##$AZFW= 0.1
##$BCFW= 0
##$BC_mod= 2
##$BYTORDP= 0
##$COROFFS= 0
##$CY= 18.4799938201904
##$DATMOD= 1
##$DC= 0
##$DFILT= <>
##$DTYPP= 0
##$F1P= 9.9274215381318
##$F2P= -0.165520771350173
##$FCOR= 1
##$FTSIZE= 16384
##$FT_mod= 6
##$GAMMA= 0
##$GB= 0
##$INTBC= 1
##$INTSCL= 4.127829e-11
##$ISEN= 128
##$LB= 0.05
##$LEV0= 0
##$LPBIN= 0
##$MAXI= 10000
##$MC2= 0
##$MEAN= 0
##$ME_mod= 0
##$MI= 50
##$NCOEF= 0
##$NC_proc= -2
##$NLEV= 6
##$NOISF1= 3.799351
##$NOISF2= 2.8
##$NSP= 0
##$NTH_PI= 0
##$NZP= 0
##$OFFSET= 16.48848
##$PC= 4
##$PHC0= -184.1201
##$PHC1= 6.301564
##$PH_mod= 1
##$PKNL= yes
##$PPARMOD= 0
##$PSCAL= 4
##$PSIGN= 0
##$REVERSE= no
##$SF= 200.130005582386
##$SI= 16384
##$SIGF1= 3
##$SIGF2= 2
##$SINO= 400
##$SIOLD= 16384
##$SREGLST= <1H.CDCl3>
##$SSB= 0
##$STSI= 16384
##$STSR= 0
##$SW_p= 4139.07284768211
##$SYMM= 0
##$S_DEV= 0
##$TDeff= 32768
##$TDoff= 0
##$TI= <>
##$TILT= no
##$TM1= 0
##$TM2= 0
##$TOPLEV= 0
##$USERP1= <user>
##$USERP2= <user>
##$USERP3= <user>
##$USERP4= <user>
##$USERP5= <user>
##$WDW= 1
##$XDIM= 16384
##$YMAX_p= 476311656
##$YMIN_p= -330236
$$ End of Bruker specific parameters
$$ ---------------------------------
##NTUPLES= NMR SPECTRUM
##VAR_NAME=  FREQUENCY,     SPECTRUM/REAL,   SPECTRUM/IMAG
##SYMBOL=    X,             R,               I
##VAR_TYPE=  INDEPENDENT,   DEPENDENT,       DEPENDENT
##VAR_FORM=  AFFN,          ASDF,            ASDF
##VAR_DIM=   16384,         16384,           16384
##UNITS=     HZ,            ARBITRARY UNITS, ARBITRARY UNITS
##FACTOR=    0.252644378177508, 1,           1
##FIRST=     3299.83951724647, 0,            0
##LAST=      -839.233330435636, 0,           0
##MIN=       -839.233330435636, -330236,     0
##MAX=       3299.83951724647, 476311656,    0
$$ Real data points
##PAGE= N=1
##DATA TABLE= (X++(R..R)), XYDATA
$$ [...]
$$ plain form
9449 -133211 -132529 -132860 -134294 -132923 -129468 -133335 -130870 -131296 -132330 -134117 -135528 -132755 -133296 -133842 -134736 -132979
9433 -132979 -134702 -135849 -133419 -136924 -135659 -133436 -133484 -133549 -133037 -133706 -132989 -133065 -136106 -134482 -135293 -133238 -133794
9416 -133794 -135596 -134686 -132409 -133423 -133395 -132525 -133393 -131548 -133093 -132057 -134184 -133606 -134353 -132823 -132783 -130460 -134033
9399 -134033 -132592 -130513 -131048 -130336 -131455 -131280 -129505 -128032 -128567 -128483 -129616 -130361 -131024 -129972 -130464 -130394 -127319
9382 -127319 -123897 -121921 -124163 -123806 -125664 -127904 -128330 -126830 -127696 -130199 -125385 -123165 -120754 -123571 -124269
9367 -124269 -128512 -127049 -127212 -129227 -130474 -130643 -131550 -131359 -130319 -126607 -129285 -130868 -131165 -131432 -132134 -132949
9351 -132949 -134229 -131250 -132345 -131497 -133373 -134832 -134257 -131646 -134389 -134773 -136945 -136486 -133300 -133381 -136474 -135121
9335 -135121 -134641 -135198 -134869 -132602 -132654 -132471 -132505 -134832 -134406 -133778 -132622 -135598 -134825 -134502 -132287 -133149 -134221 -134806
$$ packed form
9449a33211O82l31j434J371L455l867K465m26j034j787j411K773n41n46q94J757
9433a32979j723j147K430l505J265K223m8o5N12o69P17p6l041J624q11K055n56
9416a33794j802R10K277j014K8Q70q68J845j545J036k127N78p47J530M0K323l573
9399a34033J441K079n35P12j119J75J775J473n35Q4j133p45o63J052m92P0L075
9382a27319L422J976k242L57j858k240m26J500q66k503M814K220K411k817o98
9367a24269m243J463j63k015j247j69r07J91J040L712k678j583k97k67p02q15
9351a32949j280K979j095Q48j876j459N75K611k743l84k172M59L186q1l093J353
9335a35121M80n57L29K267n2J83l4k327M26O28J156k976P73L23K215q62j072n85
$$ plain form
9317 -134806 -134220 -131602 -134632 -132474 -134186 -134064 -134671 -134857 -133769 -133997 -133577 -133527 -134071 -132367 -134571 -133646 -132976
9300 -132976 -135759 -133373 -134549 -134515 -132684 -134302 -134963 -135043 -134418 -135117 -134077 -133749 -132439 -132963 -131529 -133528 -133752
9283 -133752 -136347 -135011 -133618 -133406 -135358 -135701 -134322 -132662 -134152 -136614 -131939 -133632 -133460 -132773 -136160
9268 -136160 -134845 -133816 -133569 -134179 -132917 -133559 -132852 -133370 -134132 -131374 -133218 -135014 -133122 -134086 -134556 -134084 -133009
9251 -133009 -134531 -135458 -134816 -136262 -134598 -133771 -136366 -134736 -135088 -135112 -134521 -132787 -133070 -133807 -132804 -134038 -133597
9234 -133597 -136406 -131625 -134358 -134339 -133542 -136408 -135889 -134735 -135227 -135473 -137564 -134684 -135898 -136929 -135969 -134980
9218 -134980 -134277 -134293 -135264 -134951 -134885 -135298 -131680 -134928 -136069 -134635 -134813 -134588 -133846 -135323 -133910 -133148 -135633
9201 -135633 -133806 -135957 -133917 -135613 -133793 -136039 -134123 -135955 -136193 -135263 -134976 -135307 -135054 -133728 -133230 -134024
$$ packed form
9317a34806N86K618l030K158j712J22o07j86J088k28M20N0n44J704k204R25O70
9300a32976k783K386j176L4J831j618o61q0O25o99J040L28J310n24J434j999k24
9283a33752k595J336J393K12j952l43J379J660j490k462M675j693J72O87l387
9268a36160J315J029K47o10J262o42P07n18p62K758j844j796J892r64m70M72J075
9251a33009j522r27O42j446J664Q27k595J630l52k4N91J734k83p37J003j234M41
9234a33597k809M781k733J9P97k866N19J154m92k46k091K880j214j031R60R89
9218a34980P03j6r71L13O6m13L618l248j141J434j78K25P42j477J413P62k485
9201a35633J827k151K040j696J820k246J916j832k38R30K87l31K53J326M98p94
$$ plain form
9185 -134024 -134230 -136270 -134578 -138734 -135926 -133606 -134589 -135245 -134655 -134502 -135718 -135334 -134134 -135294 -134858 -132290
9169 -132290 -134374 -135518 -134080 -134405 -135681 -134158 -134298 -136250 -136624 -132673 -136820 -134715 -134940 -135077 -136958 -135754
9153 -135754 -132067 -134331 -137301 -137024 -134518 -135440 -135452 -134484 -135393 -135494 -134353 -132786 -134094 -134043 -133280 -134038 -136797
9136 -136797 -132130 -133872 -134517 -134611 -136832 -135544 -133670 -135444 -134611 -132850 -134853 -136381 -135699 -136707 -134963 -135810
9120 -135810 -136145 -134393 -134662 -135712 -133735 -137128 -135829 -134894 -132437 -134605 -133075 -135929 -133750 -134052 -135300
9105 -135300 -136238 -134306 -135096 -134723 -134768 -135282 -135698 -134334 -132321 -134414 -135863 -135183 -134066 -135524 -135705 -135056 -136310
9088 -136310 -134705 -136656 -135115 -135018 -134808 -136563 -135239 -136368 -136563 -135350 -134451 -135349 -133054 -135960 -133953 -134501
9072 -134501 -134467 -132899 -133592 -134614 -133518 -132612 -133942 -134232 -136240 -134735 -134152 -133727 -134605 -133784 -134181 -134306 -134692
$$ packed form
9185a34024k06k040J692m156K808K320r83o56N90J53j216L84J200j160M36K568
9169a32290k084j144J438l25j276J523j40j952l74L951m147K105k25j37j881J204
9153a35754L687k264k970K77K506r22j2R68r09j01J141J567j308N1P63p58k759
9136a36797M667j742o45r4k221J288J874j774Q33J761k003j528O82j008J744q47
9120a35810l35J752k69j050J977l393J299R35K457k168J530k854K179l02j248
9105a35300r38J932p90L73m5n14m16J364K013k093j449O80J117j458j81O49j254
9088a36310J605j951J541R7K10j755J324j129j95J213Q99q98K295k906K007n48
9072a34501L4J568o93j022J096R06j330k90k008J505N83M25q78Q21l97j25l86
$$ plain form
9055 -134692 -135093 -134689 -134886 -135148 -132143 -135332 -133920 -135280 -136816 -134304 -136180 -134383 -136072 -135165 -134725 -136475
9039 -136475 -134766 -134493 -133822 -133712 -136578 -135920 -136695 -133510 -134438 -134370 -135132 -134363 -136655 -135293 -135635 -135840 -135296 -135482
9021 -135482 -135408 -135488 -135555 -135791 -135316 -135204 -135683 -135149 -133632 -135722 -136378 -135433 -133292 -134549 -136747 -134692 -133728 -134684
9003 -134684 -134573 -136953 -135641 -134264 -133010 -136967 -136306 -136872 -134665 -135444 -135723 -136263 -134695 -134597 -136488 -136042 -135264
8986 -135264 -134352 -134897 -135636 -134988 -134934 -136083 -137130 -135276 -135339 -132671 -135561 -133025 -134053 -133381 -135265 -136842 -134190
8969 -134190 -133942 -136064 -132405 -135327 -134458 -136584 -133285 -135349 -132771 -135320 -134430 -134922 -137233 -135033 -132825
8954 -132825 -135996 -136260 -135881 -137808 -138305 -138391 -136274 -135303 -138217 -134481 -137192 -136838 -135802 -135791 -136843 -135396 -137079
8937 -137079 -138306 -136729 -136399 -138102 -137211 -135083 -135843 -135856 -135936 -136341 -137223 -135486 -137440 -136116 -136194 -135796 -137866
$$ packed form
9055a34692m01M04j97k62L005l189J412j360j536K512j876J797j689R07M40j750
9039a36475J709K73O71J10k866O58p75L185r28O8p62P69k292J362l42k05N44j86
9021a35482P4q0o7k36M75J12m79N34J517k090o56R45K141j257k198K055R64r56
9003a34684J11k380J312J377J254l957O61n66K207p79k79n40J568R8j891M46P78
8986a35264R12n45p39O48N4j149j047J854o3K668k890K536j028O72j884j577K652
8969a34190K48k122L659k922Q69k126L299k064K578k549Q90m92k311K200K208
8954a32825l171k64L79j927m97q6K117R71k914L736k711L54J036J1j052J447j683
8937a37079j227J577L30j703Q91K128p60j3q0m05q82J737j954J324p8L98k070
$$ plain form
8920 -137866 -137554 -136964 -135885 -134253 -136754 -137070 -134518 -134482 -136838 -136502 -136457 -137417 -136984 -136685 -137040 -136516 -135763 -136183
8902 -136183 -135820 -140081 -137231 -137639 -137892 -135459 -135035 -135408 -137777 -135492 -136909 -137035 -137141 -136826 -135285 -137074
8886 -137074 -136834 -137504 -136519 -136493 -137627 -135703 -137088 -135020 -138451 -135635 -136886 -135271 -137356 -135269 -135885 -134609
8870 -134609 -135726 -136368 -136736 -137074 -136894 -137256 -136517 -137767 -135169 -138204 -135202 -136092 -136650 -136814 -135161 -135122 -135684
8853 -135684 -135776 -138265 -136549 -138330 -137738 -137250 -135024 -137435 -136971 -138129 -139228 -137127 -137779 -138502 -137749 -139315
8837 -139315 -140722 -137359 -136776 -133852 -139104 -137326 -139866 -137281 -135332 -134671 -137079 -138626 -138095 -137661 -138125 -137024
8821 -137024 -136493 -136066 -137348 -135973 -137965 -136414 -137998 -138071 -138690 -138266 -139342 -137965 -137466 -137220 -137458 -136143 -138526
8804 -138526 -139953 -136902 -137466 -139796 -137019 -138627 -137381 -136766 -138731 -139195 -138071 -140018 -138485 -139599 -136403
$$ packed form
8920a37866L12N90J079J632k501l16K552L6k356L36M5r60M33K99l55N24P53m20
8902a36183L63m261K850m08k53K433M24l73k369K285j417j26j06L15J541j789
8886a37074K40o70R85K6j134J924j385K068l431K816j251J615k085K087o16J276
8870a34609j117o42l68l38J80l62P39j250K598l035L002q90n58j64J653L9n62
8853a35684r2k489J716j781N92M88K226k411M64j158j099K101o52p23P53j566
8837a39315j407L363N83K924n252J778k540K585J949O61k408j547N31M34m64J101
8821a37024N31M27j282J375j992J551j584p3o19M24j076J377M99K46k38J315k383
8804a38526j427L051n64k330K777j608J246O15j965m64J124j947J533j114L196
$$ plain form
8789 -136403 -139427 -139929 -139665 -147665 -134140 -136144 -136513 -136403 -136398 -138260 -139244 -139026 -139200 -137711 -138356 -137199 -137753
8772 -137753 -138728 -137325 -137370 -136964 -139677 -138852 -138100 -139960 -139301 -137815 -136044 -137109 -138595 -137073 -136292 -138850
8756 -138850 -137426 -138041 -139011 -138688 -136993 -138854 -137532 -138932 -138019 -138880 -138458 -138570 -140102 -138363 -140107 -138011
8740 -138011 -141615 -139405 -140107 -139167 -140033 -141747 -137674 -140081 -139026 -140132 -137965 -139349 -138546 -137139 -136347 -136458
8724 -136458 -136526 -137202 -139966 -138426 -138310 -139671 -138049 -140800 -138560 -140070 -140424 -139769 -141454 -139790 -135693 -139707
8708 -139707 -140115 -141359 -140622 -140015 -138153 -140362 -139898 -139122 -142216 -142627 -141886 -140466 -140325 -142344 -143406 -139828
8692 -139828 -141693 -141649 -145685 -145109 -146401 -144616 -143425 -145177 -145969 -144066 -143054 -143232 -141273 -141973 -141758 -142038
8676 -142038 -140891 -142284 -142726 -145701 -144445 -143751 -146887 -145404 -144860 -145146 -145853 -143586 -144402 -144241 -141281 -141557
$$ packed form
8789a36403l024n02K64q000J3525k004l69J10Nj862r84K18j74J489o45J157n54
8772a37753r75J403m5M06k713Q25P52j860O59J486J771j065j486J522P81k558
8756a38850J424o15r70L23J695j861J322j400R13q61M22j12j532J739j744K096
8740a38011l604K210p02R40q66j714M073k407J055j106K167j384Q03J407P92j11
8724a36458o8o76k764J540J16j361J622k751K240j510l54O55j685J664M097m014
8708a39707m08j244P37O07J862k209M64P76l094m11P41J420J41k019j062L578
8692a39828j865M4m036N76j292J785J191j752p92J903J012j78J959p00K15k80
8676a42038J147j393m42k975J256O94l136J483N44k86p07K267q16J61K960k76
$$ plain form
8660 -141557 -141832 -143380 -146031 -147003 -145749 -145782 -149074 -150537 -149921 -151178 -152445 -153046 -150963 -152641 -150264 -151860
8644 -151860 -151893 -151714 -150534 -151472 -152803 -152381 -150650 -153450 -152519 -154065 -150819 -153000 -151594 -154920 -155391 -151466
8628 -151466 -150734 -151021 -150177 -152607 -152246 -152176 -150883 -151658 -151807 -152796 -151250 -150094 -151196 -148759 -149149 -148260 -148900
8611 -148900 -147188 -149425 -151174 -150672 -151659 -152926 -153387 -154591 -152697 -151568 -150308 -149123 -149311 -146485 -143858
8596 -143858 -141055 -138673 -137686 -136055 -138095 -137267 -138694 -140539 -141385 -138827 -140556 -140814 -137844 -138987 -137403
8581 -137403 -138939 -134806 -136595 -137379 -133964 -134424 -132197 -132408 -133011 -134033 -132183 -132027 -129695 -129766 -132003 -131207
8565 -131207 -132136 -130229 -128933 -127619 -128788 -127252 -128132 -127227 -128503 -128350 -129400 -125817 -129122 -127324 -125143
8550 -125143 -125600 -123809 -123561 -124227 -123589 -125271 -127653 -128471 -125681 -125089 -125441 -122900 -125178 -120530 -111114 -122241
$$ packed form
8660a41557k75j548k651r72J254l3l292j463O16j257j267o01K083j678K377j596
8644a51860l3J79J180r38j331M22J731k800R31j546L246k181J406l326m71L925
8628a51466P32k87Q44k430L61P0J293p75j49r89J546J156j102K437l90Q89o40
8611a48900J712k237j749N02r87j267m61j204J894J129J260J185j88K826K627
8596a43858K803K382R87J631k040Q28j427j845q46K558j729k58K970j143J584
8581a37403j536M133j789p84L415m60K227k11o03j022J850J56K332p1k237P96
8565a31207r29J907J296J314j169J536q80R05j276J53j050L583l305J798K181
8550a25143m57J791K48o66O38j682k382q18K790N92l52K541k278M648R416j1127
$$ plain form
8534 -122241 -165754 -139093 -133466 -131183 -129430 -127675 -125214 -126263 -128095 -125580 -127216 -127590 -126376 -126710
8520 -126710 -127681 -128854 -130082 -125844 -124524 -126168 -125113 -128062 -125678 -123588 -122987 -124928 -126168 -128347 -128192
8505 -128192 -130932 -126500 -128129 -127792 -127579 -129032 -128687 -125982 -126273 -126817 -127421 -128275 -124464 -124808 -124714 -129064 -127809
8488 -127809 -123475 -122297 -126984 -130777 -128394 -124330 -124175 -126315 -130921 -124544 -125607 -126814 -127138 -125736 -129792
8473 -129792 -129199 -129381 -128077 -127713 -126185 -128113 -125520 -129260 -128250 -124670 -124261 -128255 -128946 -127331 -122185 -128899
8457 -128899 -130667 -128568 -123199 -126206 -131390 -130405 -126582 -123479 -124172 -125053 -131094 -129583 -127755 -127605 -126290
8442 -126290 -127064 -121542 -123356 -125854 -128034 -128279 -123287 -125857 -128443 -128119 -128857 -129326 -129433 -132339 -126312 -124431
8426 -124431 -124741 -129926 -130017 -127456 -121785 -123377 -127234 -130346 -130326 -129277 -130650 -128974 -128444 -124752 -124393 -126274
$$ packed form
8534a22241m3513K6661N627K283J753J755K461j049j832K515j636l74J214l34
8520a26710r71j173j228M238J320j644J055k949K384K090O01j941j240k179J55
8505a28192k740M432j629L37K13j453L45K705k91n44o04q54L811l44R4m350J255
8488a27809M334J178m687l793K383M064J55k140m606O377j063j207l24J402m056
8473a29792N93j82J304L64J528j928K593l740J010L580M09l994o91J615N146o714
8457a28899j768K099N369l007n184R85L823L103o93q81o041J511J828J50J315
8442a26290p74N522j814k498k180k45M992k570k586L24p38m69j07k906O027J881
8426a24431l10n185r1K561N671j592l857l112K0J049j373J676N30L692L59j881
$$ plain form
8410 -126274 -131785 -130236 -124831 -125731 -129383 -131955 -129772 -124318 -130751 -131453 -126804 -125599 -123593 -131004 -130245
8395 -130245 -128692 -126641 -125442 -127023 -127189 -146471 -133556 -132238 -130231 -126178 -128021 -127858 -129369 -130839
8381 -130839 -131885 -128395 -129536 -130650 -130217 -127707 -127937 -126486 -131636 -132859 -127411 -125579 -130503 -129519 -126124
8366 -126124 -128911 -129086 -127390 -129553 -128766 -130130 -130713 -128611 -126529 -127801 -130372 -132138 -127999 -128518 -125833
8351 -125833 -128998 -130202 -135011 -129971 -125814 -125546 -130245 -130882 -131419 -129483 -127893 -128082 -128437 -130384 -130302 -130772
8335 -130772 -129512 -129456 -133279 -129980 -127918 -128291 -129471 -131517 -130605 -129132 -130288 -130408 -127536 -129639 -129688 -127162
8319 -127162 -130389 -130061 -125958 -130616 -130394 -129187 -130568 -127024 -129812 -129649 -132034 -131257 -129924 -130472 -129593 -127531
8303 -127531 -134317 -129142 -129879 -129972 -128332 -129030 -128396 -132062 -131157 -126816 -127248 -126860 -128860 -131162 -130812 -127586 -129126
$$ packed form
8410a26274n511J549N405r00l652k572K183N454o433p02M649J205K006p411P59
8395a30245J553K051J199j581j66j9282J2915J318K007M053j843J63j511j470
8381a30839j046L490j141j114M33K510k30J451n150j223N448J832m924R84L395
8366a26124k787j75J696k163P87j364n83K102K082j272k571j766M139n19K685
8351a25833l165j204m809N040M157K68m699o37n37J936J590j89l55j947Q2m70
8335a30772J260N6l823L299K062l73j180k046R12J473j156j20K872k103m9K526
8319a27162l227L28M103m658K22J207j381L544k788J63k385P77J333n48Q79K062
8303a27531o786N175p37r3J640o98O34l666R05M341m32L88k000k302L50L226j540
$$ plain form
8286 -129126 -133401 -128740 -129166 -128916 -130375 -130059 -132568 -131668 -128615 -130343 -132924 -129942 -127864 -130923 -128937
8271 -128937 -131101 -128318 -131618 -130837 -129370 -129193 -128157 -129159 -128953 -130499 -128083 -129889 -129609 -126112 -129057
8256 -129057 -125272 -128969 -127984 -128584 -129449 -125851 -131479 -127132 -127866 -131625 -130178 -131427 -133165 -131613 -131944 -129813
8240 -129813 -129412 -133144 -130137 -133293 -130607 -129588 -131340 -128098 -130947 -135919 -130793 -131086 -127243 -129997 -134062
8225 -134062 -129107 -129662 -129540 -131779 -130425 -126548 -135650 -126992 -124809 -125115 -129102 -134747 -125941 -133705 -131792
8210 -131792 -124855 -127143 -125381 -123398 -127629 -124407 -127637 -122860 -130388 -135294 -123838 -138774 -128055 -125105
8196 -125105 -125375 -127004 -116393 -108123 -159543 -120796 -129585 -141838 -140630 -136309 -135602 -135799 -129302 -126035
8182 -126035 -139937 -131238 -132884 -135156 -135730 -131788 -134466 -134140 -132223 -128301 -127489 -132322 -127352 -124500 -131588
$$ packed form
8286a29126m275M661m26K50j459L16k509R00L053j728k581K982K078l059J986
8271a28937k164K783l300P81J467J77J036j002K06j546K416j806K80L497k945
8256a29057L785l697R85o00q65L598n628M347p34l759J447j249j738J552l31K131
8240a29813M01l732L007l156K686J019j752L242k849m972N126k93L843k754m065
8225a34062M955n55J22k239J354L877r102Q658K183l06l987n645Q806p764J913
8210a31792O937k288J762J983m231L222l230M777p528m906J1456j4936J0719K950
8196a25105k70j629J0611Q270n1420L8747q789j2253J208M321P07j97O497L267
8182a26035j3902Q699j646k272n74L942k678L26J917L922Q12m833M970K852p088
$$ plain form
8167 -131588 -131163 -132368 -126941 -130594 -133885 -129959 -130007 -128615 -132664 -127777 -128743 -126490 -134312 -131523 -127929
8152 -127929 -127789 -134530 -130491 -127243 -129064 -126129 -131902 -126375 -130115 -130924 -125751 -128313 -129352 -131140 -133671
8137 -133671 -125595 -135338 -131842 -130127 -128537 -129279 -133453 -131864 -126824 -131630 -129902 -127203 -129032 -129226 -129405
8122 -129405 -126839 -128208 -128423 -126978 -129197 -128461 -126442 -127561 -129311 -131030 -127400 -130589 -131659 -125449 -129614
8107 -129614 -130099 -128352 -130896 -127451 -127734 -127724 -128430 -131260 -131499 -127337 -130203 -127349 -126898 -132453 -131659 -128490
8091 -128490 -129271 -130654 -132660 -131214 -130105 -127365 -130377 -130338 -127993 -130098 -131234 -133295 -126165 -127121 -128647
8076 -128647 -126869 -127538 -126327 -128405 -125936 -127631 -125714 -124712 -127334 -126449 -128442 -129278 -131019 -129022 -127167
8061 -127167 -127765 -130612 -128285 -129310 -126727 -127657 -129266 -128617 -126613 -129378 -130246 -129673 -127624 -127306 -129919 -127504
$$ packed form
8167a31588M25j205N427l653l291L926m8J392m049M887r66K253p822K789L594
8152a27929J40o741M039L248j821K935n773N527l740q09N173k562j039j788k531
8137a33671Q076r743L496J715J590p42m174J589N040m806J728K699j829j94j79
8122a29405K566j369k15J445k219P36K019j119j750j719L630l189j070O210m165
8107a29614m85J747k544L445k83J0p06k830k39M162k866K854M51n555P94L169
8091a28490p81j383k006J446J109K740l012L9K345k105j136k061P130r56j526
8076a28647J778o69J211k078K469j695J917J002k622Q85j993q36j741J997J855
8061a27167n98k847K327j025K583r30j609O49K004k765q68N73K049L18k613K415
$$ plain form
8045 -127504 -126944 -128318 -128120 -129284 -128346 -129776 -127233 -128912 -128177 -127816 -128448 -129788 -127749 -128363 -125430 -124789
8029 -124789 -126366 -129118 -127135 -129741 -131386 -130372 -126819 -132329 -129368 -129555 -128514 -128309 -129703 -130959 -132163
8014 -132163 -128771 -129879 -129248 -126817 -128976 -127469 -128731 -128198 -127099 -129200 -129178 -128504 -128112 -128531 -130755 -126723
7998 -126723 -125909 -126180 -129407 -129799 -135916 -128182 -126825 -127392 -124329 -125469 -125432 -126262 -127067 -127213 -126954 -126884 -128274
7981 -128274 -128854 -126856 -128120 -122513 -126592 -123910 -126930 -126498 -126606 -126871 -122175 -126551 -125756 -123201 -125914 -124260
7965 -124260 -122892 -126751 -126807 -128664 -125444 -125820 -127176 -125989 -126832 -126335 -126072 -125630 -127256 -126045 -127305 -126670
7949 -126670 -125034 -124987 -126492 -125659 -126375 -124302 -125970 -127102 -126838 -126413 -124919 -125137 -124574 -124509 -124135 -124181 -124702 -126689
7931 -126689 -124897 -124469 -125571 -126964 -124747 -125791 -125059 -126554 -125978 -124836 -126114 -126528 -124406 -126393 -127202 -125550
$$ packed form
8045a27504N60j374J98j164R38j430K543j679P35L61o32j340K039o14K933O41
8029a24789j577k752J983k606j645J014L553n510K961j87J041K05j394j256j204
8014a32163L392j108O31K431k159J507j262N33J099k101K2O74L92m19k224M032
7998a26723Q14k71l227l92o117P734J357n67L063j140L7q30q05j46K59P0j390
7981a28274n80J998j264N607m079K682l020M32j08k65M696m376P95K555k713J654
7965a24260J368l859n6j857L220l76j356J187q43M97K63M42j626J211j260O35
7949a26670J636M7j505Q33p16K073j668j132K64M25J494k18N63O5L74m6n21j987
7931a26689J792M28j102j393K217j044P32j495N76J142j278m14K122j987q09J652
$$ plain form
7915 -125550 -124457 -127017 -124602 -126255 -126150 -124079 -124590 -124105 -126375 -125132 -125415 -127121 -124043 -125926 -124116
7900 -124116 -125236 -124677 -127982 -128875 -126777 -125342 -127341 -124657 -124955 -125650 -124797 -125111 -123865 -123580 -125780 -125089
7884 -125089 -125420 -125309 -124583 -125599 -126292 -125383 -123582 -123028 -126030 -126292 -125248 -126865 -125173 -127385 -125681 -126445
7868 -126445 -124805 -127911 -125629 -126816 -129432 -127542 -124635 -126893 -125843 -126613 -127144 -126025 -127700 -126691 -130545
7853 -130545 -129207 -126678 -134767 -124294 -141483 -115101 -119833 -122177 -123523 -122100 -122229 -125042 -123902 -123629
7839 -123629 -123010 -122021 -125301 -124211 -123278 -124880 -123121 -126594 -123903 -127027 -125629 -125162 -124167 -122609 -124787 -126655
7823 -126655 -125446 -124668 -121974 -124004 -122569 -124047 -125214 -123332 -124999 -125002 -124811 -123927 -123124 -124198 -124600 -123138
7807 -123138 -124556 -123852 -123214 -124071 -126049 -124142 -126002 -125182 -124134 -124387 -126012 -126279 -122257 -124099 -124483 -123995
$$ packed form
7915a25550J093k560K415j653J05K071n11M85k270J243k83j706L078j883J810
7900a24116j120N59l305q93K098J435j999K684k98o95Q53l14J246K85k200O91
7884a25089l31J11P26j016o93R09J801N54l002k62J044j617J692k212J704p64
7868a26445J640l106K282j187k616J890K907k258J050p70n31J119j675J009l854
7853a30545J338K529q089J0473j7189K6382m732k344j346J423j29k813J140K73
7839a23629O19R89l280J090R33j602J759l473K691l124J398M67R95J558k178j868
7823a26655J209P78K694k030J435j478j167J882j667lJ91Q84Q03j074m02J462
7807a23138j418P04O38q57j978J907j860Q20J048k53j625k67M022j842l84M88
$$ plain form
7791 -123995 -123503 -125062 -125207 -125699 -126186 -124632 -122722 -123790 -124762 -122032 -124655 -125875 -122297 -121585 -121443 -122032
7775 -122032 -123248 -123659 -123356 -121662 -123751 -122638 -120671 -121896 -122134 -125010 -121717 -122219 -122085 -122340 -122982 -124960
7759 -124960 -121471 -122911 -120557 -120614 -120737 -121885 -121317 -123554 -124725 -121749 -123767 -124314 -119026 -117705 -121697 -118596
7743 -118596 -119605 -120842 -124442 -122188 -121286 -120388 -120168 -121376 -119192 -120264 -121769 -123231 -122240 -122119 -120697 -122110
7727 -122110 -121070 -121173 -120922 -121942 -121853 -120472 -121344 -122680 -121880 -123654 -120734 -120411 -121220 -120766 -120975 -120047 -118174
7710 -118174 -120500 -119336 -120000 -119499 -122394 -122379 -121219 -118822 -120804 -121141 -119085 -122909 -121919 -123644 -122816 -121767
7694 -121767 -120177 -118903 -124052 -123700 -120963 -123679 -122386 -118793 -119452 -121447 -121113 -122983 -122679 -123043 -122210 -121617
7678 -121617 -122811 -123056 -121889 -121644 -121326 -120468 -122087 -118575 -120097 -121841 -119326 -119146 -121545 -120069 -121904 -122102
$$ packed form
7791a23995M92j559j45m92m87J554J910j068r72K730k623j220L578P12J42n89
7775a22032j216m11L03J694k089J113J967j225k38k876L293n02J34k55o42j978
7759a24960L489j440K354n7j23j148N68k237j171K976k018n47N288J321l992L101
7743a18596j009j237l600K254R02Q98K20j208K184j072j505j462R91J21J422j413
7727a22110J040j03K51j020Q9J381q72j336Q00j774K920L23q09M54k09R28J873
7710a18174k326J164o64N01k895J5J160K397j982l37K056l824R90j725Q28J049
7694a21767J590J274n149L52K737k716J293L593o59j995L34j870L04l64Q33N93
7678a21617j194k45J167K45L18Q58j619L512j522j744K515J80k399J476j835j98
$$ plain form
7662 -122102 -124126 -121420 -123985 -120311 -121484 -122750 -121381 -122254 -122915 -122381 -122379 -122439 -120920 -123007 -124179 -123527 -122890
7645 -122890 -123066 -121983 -120534 -120962 -120575 -120446 -121388 -123046 -125127 -123483 -121316 -121107 -122520 -121576 -122653 -122706 -124658
7628 -124658 -122398 -124303 -120991 -122759 -121289 -118500 -121078 -121393 -122114 -122019 -120239 -123153 -122707 -125617 -124070 -125004
7612 -125004 -121660 -123774 -124921 -123606 -120759 -125379 -121420 -123444 -121197 -124725 -122997 -123588 -126071 -131997 -127576
7597 -127576 -123818 -126648 -128471 -124761 -124894 -124877 -124315 -124224 -127857 -127285 -128018 -128233 -129668 -129180 -126866 -126843 -125514
7580 -125514 -126224 -126118 -126298 -127032 -124519 -124530 -126267 -128980 -127718 -127907 -129850 -129183 -133265 -129778 -131269 -131130 -131759
7563 -131759 -133216 -128120 -126492 -123233 -119705 -117949 -118740 -117752 -120395 -122207 -121501 -123856 -122478 -124721 -124901
7548 -124901 -120852 -122308 -120603 -122473 -119845 -120649 -120301 -120641 -120667 -121004 -123018 -125009 -126860 -123967 -121439 -118284
$$ packed form
7662a22102k024K706k565L674j173j266J369q73o61N34Ko0J519k087j172O52O37
7645a22890j76J083J449m28L87J29r42j658k081J644K167K09j413R44j077n3j952
7628a24658K260j905L312j768J470K789k578l15p21R5J780k914M46k910J547r34
7612a25004L344k114j147J315K847m620L959k024K247l528J728n91k483n926M421
7597a27576L758k830j823L710j33J7N62R1l633N72p33k15j435M88K314K3J329
7580a25514p10J06j80p34K513j1j737k713J262j89j943O67m082L487j491J39o29
7563a31759j457N096J628L259L528J756p91R88k643j812P06k355J378k243j80
7548a24901M049j456J705j870K628q04L48l40k6l37k014j991j851K893K528L155
$$ plain form
7532 -118284 -113815 -111410 -109785 -109249 -110937 -111805 -112268 -112700 -112161 -113757 -113143 -115333 -114435 -111566 -112039 -111824 -112025
7515 -112025 -108494 -110213 -110222 -109906 -109793 -107815 -108973 -108725 -108979 -109773 -107798 -106768 -108830 -105973 -106455 -106596 -105149
7498 -105149 -100541 -102321 -102492 -99912 -103806 -104215 -103804 -105005 -104437 -103109 -101376 -101766 -101640 -103004 -102699 -100947
7482 -100947 -102352 -102493 -102899 -100183 -102404 -103488 -104333 -106342 -102823 -104082 -102396 -100234 -100163 -100264 -98896 -100442
7466 -100442 -99385 -97140 -97773 -98102 -98485 -97457 -100167 -99345 -98528 -101207 -100699 -100781 -102721 -103474 -102073 -102370 -102856
7449 -102856 -102908 -101397 -100842 -100669 -99546 -100668 -101398 -102979 -101030 -103056 -103415 -101947 -102293 -101271 -99259 -100792
7433 -100792 -101072 -99454 -98725 -102385 -102140 -101055 -99906 -102537 -101473 -103113 -99762 -102239 -102160 -100498 -101690 -100375
7417 -100375 -102429 -101912 -101594 -101129 -98661 -101888 -98975 -100167 -100224 -102771 -104142 -103190 -103324 -100064 -101188 -100699
$$ packed form
7532a18284M469K405J625N36j688q68m63m32N39j596O14k190Q98K869m73K15k01
7515a12025L531j719rL16J13J978j158K48k54p94J975J030k062K857m82j41J447
7498a05149M608j780j71K580l894m09M11j201N68J328J733l90J26j364L05J752
7482a00947j405j41m06K716k221j084q45k009L519j259J686K162P1j01J368j546
7466a00442J057K245o33l29l83J028k710Q22Q17k679N08q2j940p53J401k97m86
7449a02856n2J511N55J73J123j122p30j581J949k026l59J468l46J022K012j533
7433a00792k80J618P29l660K45J085J149k631J064j640L351k477P9J662j192J315
7417a00375k054N17L18M65K468l227K913j192n7k547j371R52j34L260j124M89
$$ plain form
7401 -100699 -101695 -100541 -99418 -100878 -103887 -101688 -100417 -104640 -100381 -102859 -105915 -101884 -104849 -101474 -101663
7386 -101663 -99977 -100451 -101309 -101167 -103253 -98880 -102087 -101471 -100200 -99713 -99625 -99863 -100818 -101338 -99944 -100942 -102353
7369 -102353 -101384 -102207 -100894 -101799 -100277 -101366 -100960 -100511 -100090 -100372 -99856 -101537 -103173 -98665 -100812 -101031 -101909
7352 -101909 -100506 -98580 -99829 -99931 -100824 -101984 -100985 -101339 -103053 -100750 -101863 -99833 -102198 -102883 -103235 -102151
7336 -102151 -100141 -101628 -100889 -98396 -103813 -101370 -101167 -100514 -101024 -100941 -100291 -100832 -102156 -101311 -100940 -102301 -99436
7319 -99436 -100373 -100209 -101237 -99529 -100508 -101481 -101076 -99116 -100915 -102450 -101211 -101813 -100876 -99527 -101047 -98848
7303 -98848 -99216 -98050 -99460 -99058 -100225 -98885 -100032 -100750 -100909 -98167 -99498 -99385 -98252 -98276 -100086 -98854
7287 -98854 -98562 -99190 -98018 -99053 -97489 -99722 -98438 -97548 -98918 -98312 -96528 -98679 -98273 -99717 -97894 -96062
$$ packed form
7401a00699r96J154J123j460l009K199J271m223M259k478l056M031k965L375j89
7386a01663J686m74q58J42k086M373l207O16J271M87Q8k38r55n20J394r98j411
7369a02353R69q23J313r05J522j089M06M49M21k82N16j681j636M508k147k19q78
7352a01909J403J926j249j02q93j160R99l54j714K303j113K030k365o85l52J084
7336a02151K010j487P39K493n417K443K03O53n10Q3O50n41j324Q45L71j361K865
7319i9436r37J64j028J708r79r73M05J960j799j535J239o02R37J349j520K199
7303i8848l68J166j410M02j167J340j147p18j59K742j331J13J133k4j810J232
7287i8854K92o28J172j035J564k233J284Q90j370O06J784k151M06j444J823J832
$$ plain form
7271 -96062 -97790 -99469 -99663 -96979 -97295 -99427 -98625 -99865 -100443 -98318 -97302 -101068 -99934 -98154 -97921 -100594
7255 -100594 -98955 -99500 -98195 -97793 -98522 -100617 -99768 -98280 -101697 -98828 -98320 -99080 -100495 -97918 -101902 -99387
7239 -99387 -98807 -98680 -98215 -98037 -98200 -99352 -97744 -99689 -99750 -98475 -99661 -97765 -97617 -99121 -98410 -98577 -99212
7222 -99212 -100804 -98442 -100982 -97851 -99730 -96878 -98789 -99216 -99742 -97759 -98512 -97922 -97893 -98729 -98485 -97847 -97589
7205 -97589 -96575 -95372 -97226 -85192 -98535 -97612 -99646 -98432 -99243 -97219 -99878 -99471 -98723 -98899 -99035 -100642
7189 -100642 -96937 -97466 -98859 -94788 -98852 -97377 -98099 -97914 -98944 -98032 -97758 -96432 -97008 -95424 -97167 -99051
7173 -99051 -97088 -97031 -97615 -97569 -97345 -97002 -94865 -96547 -98059 -96601 -98369 -95340 -97233 -95790 -95125 -96792 -97053
7156 -97053 -99096 -96086 -95636 -96749 -98886 -97231 -98826 -96762 -99502 -97226 -97941 -96848 -96876 -95683 -96391 -97789
$$ packed form
7271i6062j728j679j94K684l16k132Q02j240n78K125J016l766J134J780K33k673
7255a00594J639n45J305M02p29k095Q49J488l417K869N08p60j415K577l984K515
7239i9387N80J27M65J78j63j152J608j945o1J275j186J896J48j504P11j67o35
7222i9212j592K362k540L131j879K852j911m27n26J983p53N90K9q36K44O38K58
7205i7589J014J203j854J2034j3343R23k034J214q11K024k659M07P48j76j36j607
7189a00642L705n29j393M071m064J475p22J85j030R12K74J326n76J584j743j884
7173i9051J963N7n84M6K24L43K137j682j512J458j768L029j893J443O65j667k61
7156i7053k043L010M50j113k137J655j595K064k740K276p15J093k8J193p08j398
$$ plain form
7140 -97789 -97002 -98461 -98104 -99356 -97155 -97778 -98152 -98035 -97018 -96210 -95175 -96388 -98606 -97109 -95514 -96601
7124 -96601 -97025 -97993 -96116 -97039 -95506 -95465 -97702 -99252 -96760 -96847 -97039 -95490 -96832 -98133 -96959 -98646 -96258
7107 -96258 -96793 -95328 -97706 -95983 -96472 -95899 -95620 -97681 -97303 -97788 -95803 -96653 -96495 -96803 -95974 -97631 -96668
7090 -96668 -95326 -97840 -95139 -96430 -95397 -94936 -95113 -95953 -96329 -94917 -94881 -94862 -94801 -97083 -94701 -94083 -95134
7073 -95134 -95217 -96485 -96034 -94925 -95617 -95745 -95513 -94168 -94469 -95845 -96416 -97895 -94909 -95119 -95215 -96869 -92173
7056 -92173 -96729 -94518 -96160 -94008 -95276 -95363 -91313 -94105 -95605 -95655 -94681 -94094 -95850 -97625 -93455 -94378
7040 -94378 -94959 -96276 -94624 -93914 -95491 -93385 -95335 -94308 -94732 -95973 -94153 -95106 -94109 -92979 -94196 -94261
7024 -94261 -96083 -94896 -95106 -94228 -96165 -95212 -93296 -95381 -96184 -95545 -93811 -95154 -94567 -95035 -95385 -95988 -95218
$$ packed form
7140i7789P87j459L57j252K201o23l74J17J017Q08J035j213k218J497J595j087
7124i6601m24r68J877r23J533M1k237j550K492q7j92J549j342j301J174j687K388
7107i6258n35J465k378J723m89N73K79k061L78m85J985q50J58l08Q29j657R63
7090i6668J342k514K701j291J033M61j77q40l76J412L6J9O1k282K382O18j051
7073i5134q3j268M51J109o92j28K32J345l01j376n71j479K986k10r6j654M696
7056i2173m556K211j642K152j268q7M050k792j500n0R74N87j756j775M170r23
7040i4378n81j317J652P10j577K106j950J027m24j241J820r53R97J130j217o5
7024i4261j822J187k10Q78j937R53J916k085q03O39J734j343N87m68l50o03P70
$$ plain form
7007 -95218 -97790 -96582 -95721 -95543 -95439 -94404 -96827 -97182 -95373 -95033 -97434 -97466 -97669 -95728 -96726 -95750 -94893
6990 -94893 -95230 -97792 -97412 -97467 -94591 -95104 -93969 -94196 -96546 -96357 -96461 -95243 -98555 -96137 -94069 -94222 -95482
6973 -95482 -98400 -96492 -96463 -96276 -95936 -95082 -95178 -94602 -95944 -96454 -94901 -94303 -94561 -96018 -96666 -95874 -96799 -95561
6955 -95561 -95993 -96858 -95156 -96837 -97245 -97284 -95649 -96798 -95430 -95766 -95483 -98157 -97115 -95239 -95360 -95045 -96689
6938 -96689 -95333 -96304 -94847 -96958 -96826 -97208 -95833 -98354 -95424 -96632 -96380 -96925 -95019 -97527 -96681 -95428
6922 -95428 -96443 -98197 -97174 -98273 -97939 -95683 -96348 -96467 -99297 -94508 -98045 -97395 -96839 -96215 -96352 -95329
6906 -95329 -97299 -96767 -98880 -97861 -97206 -95382 -98048 -96927 -97071 -98005 -95482 -97771 -99225 -97230 -98710 -98203
6890 -98203 -98121 -96946 -100025 -96979 -97830 -98609 -98891 -98336 -97919 -96015 -97391 -96779 -99547 -97059 -98790 -98572 -99122
$$ packed form
7007i5218k572J208Q61J78J04J035k423l55J809L40k401l2k03J941r98R76Q57
6990i4893l37k562L80n5K876n13J135k27k350J89j04J218l312K418K068j53j260
6973i5482k918J908K9J87L40Q54r6N76j342n10J553N98k58j457o48P92r25J238
6955i5561m32q65J702j681m08l9J635j149J368l36K83k674J042J876j21L15j644
6938i6689J356r71J457k111J32l82J375k521K930j208K52n45J906k508Q46J253
6922i5428j015j754J023j099L34K256o65j19k830M789l537O50N56O24j37J023
6906i5329j970N32k113J019O55J824k666J121j44r34K523k289j454J995j480N07
6890i8203Q2J175l079L046q51p79k82N55M17J904j376O12k768K488j731K18n50
$$ plain form
6873 -99122 -99732 -95818 -98604 -99678 -96769 -97206 -99434 -99969 -97952 -96967 -98355 -97335 -97866 -98339 -98643 -96369
6857 -96369 -98385 -97467 -98677 -97966 -98551 -97460 -99182 -99451 -96768 -98166 -98878 -97615 -95820 -97623 -97641 -98462 -97301
6840 -97301 -97708 -97659 -97847 -96006 -97859 -95096 -96407 -95064 -97434 -97738 -98340 -98176 -100343 -98894 -97931 -96485 -96616
6823 -96616 -96729 -97553 -99622 -100726 -97801 -99663 -96880 -99186 -98875 -96686 -98549 -99620 -96938 -97514 -99200 -100147
6807 -100147 -101192 -95326 -96971 -99627 -97172 -95933 -97662 -98196 -98911 -98602 -97059 -98714 -97598 -96925 -97333 -97438
6791 -97438 -96700 -97878 -99887 -100660 -99554 -99810 -98191 -101362 -98925 -98821 -98235 -98239 -100725 -99114 -99341 -98627 -98086
6774 -98086 -97630 -100893 -99214 -102283 -99449 -96589 -99391 -100695 -100391 -100942 -99230 -99692 -98187 -100927 -97756 -99564
6758 -99564 -98515 -99154 -98737 -99003 -100609 -99829 -99166 -98709 -102150 -99575 -102399 -99912 -98172 -101271 -100969 -99368
$$ packed form
6873i9122o10L914k786j074K909m37k228n35K017R85j388J020n31m73l04K274
6857i6369k016R18j210P11n85J091j722k69K683j398p12J263J795j803j8q21J161
6840i7301m07M9j88J841j853K763j311J343k370l04o02J64k167J449R63J446j31
6823i6616j13q24k069j104K925j862K783k306L11K189j863j071K682n76j686r47
6807a00147j045N866j645k656K455J239j729n34p15L09J543j655J116O73m08j05
6791i7438P38j178k009p73J106k56J619l171K437J04N86mk486J611k27P14N41
6774i8086M56l263J679l069K834K860k802j304L04n51J712m62J505k740L171j808
6758i9564J049o39M17k66j606P80O63M57l441K575k824K487J740l099L02J601
$$ plain form
6742 -99368 -99183 -99980 -101615 -97521 -98218 -101963 -101693 -102244 -101401 -99083 -99745 -101120 -101284 -103920 -101513 -100180 -100562
6725 -100562 -100273 -102107 -101398 -104211 -102942 -103844 -101688 -102356 -105332 -103360 -103317 -101769 -103418 -102349 -103419 -101445
6709 -101445 -103421 -106415 -105572 -103912 -102302 -102778 -105693 -106998 -106241 -105454 -104180 -103533 -105641 -104932 -104317 -101892
6693 -101892 -103618 -103346 -106054 -103168 -103011 -103116 -102376 -102559 -103966 -103641 -102830 -103006 -101828 -103066 -102974 -101877 -104156
6676 -104156 -105610 -103903 -103582 -99548 -101972 -106928 -102607 -99232 -99279 -100994 -100051 -99084 -97169 -100753 -99082 -97218
6660 -97218 -97665 -96625 -97418 -94710 -96168 -96895 -98577 -97890 -96034 -94719 -96578 -98074 -96241 -96457 -95720 -96472
6644 -96472 -95130 -96565 -94510 -91173 -93881 -93021 -90832 -89481 -91365 -90305 -90532 -88064 -87750 -90113 -89250 -89799
6628 -89799 -90001 -88582 -89338 -88725 -90459 -91315 -89925 -85606 -85434 -87898 -89926 -89437 -91219 -87711 -87532 -85796
$$ packed form
6742i9368J85p97j635M094o97l745K70n51Q43K318o62j375j64k636K407J333l82
6725a00562K89j834P09k813J269r02K156o68k976J972M3J548j649J069j070J974
6709a01445j976k994Q43J660J610m76k915j305P57P87J274O47k108P09O15K425
6693a01892j726K72k708K886J57j05P40j83j407L25Q11j76J178j238R2J097k279
6676a04156j454J707L21M034k424m956M321L375m7j715R43R67J915l584J671J864
6660i7218m47J040p93K708j458p27j682O87J856J315j859j496J833k16P37p52
6644i6472J342j435K055L337k708Q60K189J351j884J060k27K468L14k363Q63n49
6628h9799k02J419p56O13j734q56J390M319J72k464k028M89j782L508J79J736
$$ plain form
6612 -85796 -89225 -90242 -87692 -84566 -86222 -87986 -85883 -86757 -87085 -86370 -84024 -84227 -83078 -82929 -79926 -80078
6596 -80078 -78177 -81295 -81298 -76540 -75256 -78947 -82014 -78728 -74611 -78172 -78429 -82103 -80493 -80274 -79665 -79954
6580 -79954 -80460 -81793 -83105 -81339 -85479 -82802 -81617 -80712 -82383 -85642 -84027 -80642 -79586 -83534 -84346
6565 -84346 -83402 -82271 -85023 -84450 -80941 -78008 -86629 -85617 -82760 -78771 -76929 -82631 -83917 -83505 -83909 -82918
6549 -82918 -81578 -83915 -85143 -84446 -81389 -80727 -84770 -86790 -83486 -82617 -80240 -83841 -83162 -85488 -83159 -83162
6533 -83162 -80575 -83146 -90237 -88693 -81382 -78647 -83950 -91460 -87830 -81498 -81584 -78440 -73324 -74968 -82960
6518 -82960 -87327 -84239 -78642 -79411 -85407 -86630 -82380 -80091 -81015 -80831 -84144 -82926 -77634 -79439 -84690
6503 -84690 -88642 -83734 -78064 -78822 -86415 -96635 -88585 -77441 -77554 -75455 -67688 -69779 -82213 -88153
$$ packed form
6612h5796l429j017K550L126j656j764K103q74l28P15K346k03J149J49L003j52
6596h0078J901l118lM758J284l691l067L286M117l561k57l674J610K19O09k89
6580g9954n06j333j312J766m140K677J185R05j671l259J615L385J056l948q12
6565h4346R44J131k752N73L509K933q621J012K857L989J842n702j286M12m04R91
6549h2918J340k337j228O97L057O62m043k020L304Q69K377l601O79k326K329l
6533h3162K587k571p091J544P311K735n303p510L630O332q6L144N116j644p992
6518h2960m367L088N597p69n996j223M250K289r24J84l313J218N292j805n251
6503h4690l952M908N670p58p593j0220Q050J1144j13K099P767k091j2434n940
$$ plain form
6489 -88153 -83928 -77409 -75891 -81470 -84246 -82047 -77912 -78444 -77777 -81018 -80619 -76426 -74926 -80702 -85429
6474 -85429 -81683 -75751 -72897 -79880 -85947 -83879 -77239 -75485 -70365 -67009 -70717 -81888 -83401 -77909
6460 -77909 -70306 -72564 -78541 -78774 -77032 -75976 -73787 -76330 -78986 -79730 -74936 -72631 -75651 -80037 -79522
6445 -79522 -77307 -73736 -74231 -77792 -77929 -75057 -75839 -73962 -72885 -75508 -75514 -75829 -70806 -69283 -73109 -76993
6429 -76993 -76294 -72770 -71515 -74780 -71919 -74909 -75586 -78071 -72133 -68407 -73994 -74778 -74854 -74356 -72421 -74889
6413 -74889 -74367 -73969 -73531 -71891 -78287 -76306 -76614 -71457 -72198 -75225 -78984 -77425 -73207 -72148 -74364 -77652
6397 -77652 -76876 -71825 -71513 -76528 -76369 -70153 -71162 -71560 -71825 -73817 -72913 -75443 -72421 -71610 -71997 -74042 -71568
6380 -71568 -71401 -71900 -71687 -74042 -72889 -73371 -71232 -70280 -68038 -74116 -73053 -72648 -68399 -69255 -69991 -73969 -73050
$$ packed form
6489h8153M225O519J518n579k776K199M135n32O67l241L99M193J500n776m727
6474h5429L746N932K854o983o067K068O640J754N120L356l708j1171j513N492
6460g7909P603k258n977k33J742J056K189k543k656p44M794K305l020m386N15
6445g9522K215L571m95l561j37K872p82J877J077k623ol15N023J523l826l884
6429g6993O99L524J255l265K861k990o77k485N938L726n587p84p6M98J935k468
6413g4889N22L98M38J640o396J981l08N157p41l027l759J559M218J059k216l288
6397g7652P76N051L12n015J59O216j009l98k65j992R04k530L022Q11l87k045K474
6380g1568J67m99K13k355J153m82K139R52K242o078J063M05M249q56p36l978R19
$$ plain form
6363 -73050 -74544 -72023 -72248 -71082 -73792 -71733 -71593 -69722 -72440 -72920 -69769 -71078 -70728 -72058 -70515 -70331
6347 -70331 -67306 -68540 -70191 -72178 -69446 -71154 -68725 -69490 -71579 -68668 -66747 -69340 -68326 -69965 -72638
6332 -72638 -69793 -69333 -68567 -67916 -69900 -71434 -73940 -69230 -70145 -70754 -67865 -67758 -66901 -68307 -68240 -69719 -70490
6315 -70490 -68829 -67048 -68800 -70298 -71102 -69257 -67283 -65247 -67380 -69576 -67799 -66891 -69348 -69423 -68262 -65560
6299 -65560 -64678 -68650 -66972 -66216 -65662 -66840 -67907 -66418 -64753 -65435 -62941 -65099 -64830 -64388 -63625 -66248
6283 -66248 -62362 -64616 -65571 -67648 -64937 -63307 -65125 -63619 -62775 -62833 -64135 -62815 -63333 -64867 -62372 -60434
6267 -60434 -62132 -61852 -62672 -64761 -64631 -62284 -58910 -60530 -62484 -62085 -61254 -61105 -60835 -59696 -63108 -62708 -62529
6250 -62529 -63759 -61609 -61708 -60716 -60878 -61390 -61955 -59792 -59814 -61589 -59586 -58816 -58835 -58781 -58626 -58753 -58717 -59987 -59421
$$ packed form
6363g3050j494K521k25J166k710K059J40J871k718m80L151j309L50j330J543J84
6347g0331L025j234j651j987K732j708K429p65k089K911J921k593J014j639k673
6332g2638K845M60P66O51j984j534k506M710r15o09K889J07Q57j406O7j479p71
6315g0490J661J781j752j498q04J845J974K036k133k196J777R08k457p5J161K702
6299f5560Q82l972J678P56N54j178j067J489J665o82K494k158K69M42P63k623
6283f6248L886k254r55k077K711J630j818J506Q44n8j302J320n18j534K495J938
6267f0434j698K80q20k089J30K347L374j620j954L99Q31J49K70J139l412M00J79
6250f2529j230K150r9R92j62n12n65K163k2j775K003P70j9N4J55j27L6j270N66
$$ plain form
6231 -59421 -58093 -58310 -55473 -56465 -56750 -57821 -55836 -54299 -55530 -55041 -56062 -56455 -54101 -54777 -54966 -55086 -52032
6214 -52032 -52176 -52916 -53819 -52358 -52050 -50144 -50936 -49368 -46842 -49473 -48695 -46400 -47678 -44412 -48702 -46380
6198 -46380 -45285 -44320 -47791 -48663 -49116 -48680 -48633 -49912 -48067 -50138 -50593 -50618 -49477 -53517 -52499 -49937 -51479
6181 -51479 -50818 -53532 -50086 -48891 -51951 -49863 -48648 -46172 -48493 -48660 -48464 -47702 -49835 -47924 -50823 -49894
6165 -49894 -47169 -48679 -43811 -47605 -45144 -46872 -46453 -45469 -45496 -46625 -43866 -44491 -45516 -41812 -44000 -42373
6149 -42373 -43192 -42947 -43134 -42256 -42854 -41697 -39490 -42449 -41169 -40592 -40392 -41859 -39008 -38362 -41157 -41108 -40072
6132 -40072 -37765 -38425 -35167 -38252 -35408 -37623 -36473 -37030 -35955 -35680 -34595 -37250 -35272 -32227 -34740
6117 -34740 -33843 -32096 -34070 -33715 -32989 -31018 -30831 -29749 -30299 -30019 -30730 -29400 -29004 -26402 -28267 -27206 -26864
$$ packed form
6231e9421J328k17K837r92k85j071J985J537j231M89j021l93K354o76j89j20L054
6214e2032j44p40r03J461L08J906p92J568K526k631P78K295j278L266m290K322
6198d6380J095R65l471q72m53M36M7j279J845k071m55k5J141m040J018K562j542
6181e1479O61k714L446J195l060K088J215K476k321j67J96P62k133J911k899R29
6165d9894K725j510M868l794K461j728M19R84k7j129K759o25j025L704k188J627
6149d2373q19K45j87Q78n98J157K207k959J280N77K00j467K851O46k795M9J036
6132d0072K307o60L258l085K844k215J150n57J075K75J085k655J978L045k513
6117c4740Q97J747j974L55P26J971J87J082n50K80p11J330L96K602j865J061L42
$$ plain form
6100 -26864 -25956 -25398 -25406 -24800 -24115 -25577 -23577 -23482 -22140 -21423 -20293 -21249 -21483 -20628 -19443 -19448 -21422 -18633 -19276
6081 -19276 -16596 -15592 -17929 -16430 -15049 -14731 -13243 -15781 -13004 -11844 -11298 -12703 -10771 -10749 -9599 -10014
6065 -10014 -9655 -9365 -7243 -7162 -7210 -7536 -5988 -4805 -4919 -3927 -3796 -1927 2211 99 -729 719 799 2019
6047 2019 74 5165 4616 7973 7515 7650 8523 11792 9209 9947 10626 12286 11886 14535 15218 14290 13926
6030 13926 16296 16886 19421 19732 19964 20679 22480 23198 23789 24307 24967 24914 27818 26740 29126 25049 31948
6013 31948 31172 33195 32885 32737 35037 35813 39381 38734 42340 42450 41152 45074 45245 48912 47820 50573
5997 50573 52224 51477 53731 55899 55950 57139 58767 60499 60600 62943 61499 64641 63967 67517 67424 70691
5981 70691 70534 73459 74789 76750 75898 78068 80452 82447 81636 83694 87335 87142 89807 91730 92307 94199
$$ packed form
6100b6864R08N58qO06O85j462K000R5J342P17J130r56k34Q55J185nj974K789o43
6081a9276K680J004k337J499J381L18J488k538K777J160N46j405J932K2J150m15
6065a0014L59K90K122Q1m8l26J548J183j14R92J31J869M138k112q28J448Q0J220
6047B019j945N091n49L357m58J35Q73L269k583P38O79J660m00K649O83r28l64
6030A3926K370N90K535L11K32P15J801P18N91N18O60n3K904j078K386m077O899
6013C1948p76K023l10j48K300P76L568o47L606J10j298L922J71L667j092K753
5997E0573J651p47K254K168N1J189J628J732J01K343j444L142o74L550r3L267
5981G0691j57K925J330J961q52K170K384J995q11K058L641j93K665J923N77J892
$$ plain form
5965 94199 96726 98330 101509 102149 104223 104306 106352 108344 110038 112954 114833 118246 118301 120611 124343 125341
5949 125341 125260 128013 131860 132770 135515 134289 138551 138078 139244 142560 144239 147280 150486 151917 153313
5934 153313 157104 159312 159680 164396 166488 168830 171396 171392 176043 176210 182556 184551 184061 189068 191407 194058
5918 194058 197888 200648 203038 206510 209198 212308 216562 220861 220551 222327 226958 229230 232834 237059 240702
5903 240702 242304 246886 247432 249298 250657 254721 256750 259949 261618 263016 269843 271586 277965 283160 290115
5888 290115 293457 301289 304507 307687 311022 315444 318951 322073 324663 330318 335960 339089 342375 348388
5874 348388 353149 359665 363757 369935 374749 379606 382925 387499 391589 398550 402899 409014 415876 421525
5860 421525 426641 432244 439797 445599 455189 459919 466727 474064 477992 483208 490832 495671 500284 507850
$$ packed form
5965I4199K527J604L179O40K074Q3K046J992J694K916J879L413N5K310L732R98
5949A25341q1K753L847R10K745j226M262m73J166L316J679L041L206J431J396
5934A53313L791K208L68M716K092K342K566mM651J67O346J995m90N007K339K651
5918A94058L830K760K390L472K688L110M254M299l10J776M631K272L604M225L643
5903B40702J602M582N46J866J359M064K029L199J669J398O827J743O379N195O955
5888B90115L342P832L218L180L335M422L507L122K590N655N642L129L286O013
5874C48388M761O516M092O178M814M857L319M574M090O961M349O115O862N649
5860D21525N116N603P553N802R590M730O808P337L928N216P624M839M613P566
$$ plain form
5846 507850 513525 517607 524885 528712 537359 545067 555598 560273 568774 580775 586806 595991 603876 614223
5832 614223 624038 634843 643291 653384 663260 668911 679412 688822 700269 708352 718173 729241 737602
5819 737602 748035 756491 765300 776030 788441 797608 810963 820054 832003 843171 855850 869170
5807 869170 880385 893304 904879 918952 929976 943722 955951 968834 979714 991545 1004884 1018886
5795 1018886 1027812 1041443 1056990 1070918 1087009 1103367 1121146 1138878 1150985 1165290 1182051 1195430
5783 1195430 1213557 1228429 1248924 1267092 1285742 1300739 1319049 1337725 1354494 1372179 1385101
5772 1385101 1396167 1408088 1418089 1426420 1438101 1452628 1471729 1493930 1517880 1541689 1569062 1597946
5760 1597946 1625752 1654149 1684828 1713302 1741067 1765706 1787520 1812200 1840050 1871311 1909013
$$ packed form
5846E07850N675M082P278L827Q647P708J0531M675Q501J2001O031R185P885J0347
5832F14223R815J0805Q448J0093R876N651J0501R410J1447Q083R821J1068Q361
5819G37602J0433Q456Q809J0730J2411R167J3355R091J1949J1168J2679J3320
5807H69170J1215J2919J1575J4073J1024J3746J2229J2883J0880J1831J3339J4002
5795A018886Q926J3631J5547J3928J6091J6358J7779J7732J2107J4305J6761J3379
5783A195430J8127J4872K0495J8168J8650J4997J8310J8676J6769J7685J2922
5772A385101J1066J1921J0001Q331J1681J4527J9101K2201K3950K3809K7373K8884
5760A597946K7806K8397L0679K8474K7765K4639K1814K4680K7850L1261L7702
$$ plain form
5749 1909013 1948011 1987271 2028408 2068163 2108702 2146736 2187786 2224257 2267783 2304909 2351045
5738 2351045 2389394 2432639 2473217 2517009 2558397 2603409 2646730 2693573 2737547 2779659 2820859
5727 2820859 2857794 2898343 2939877 2980348 3026206 3073458 3125519 3185311 3246039 3309391 3373896
5716 3373896 3438427 3497039 3563003 3622773 3681314 3742607 3798523 3860076 3924453 3992744 4062631
5705 4062631 4137351 4218747 4299793 4384259 4470969 4558524 4649430 4738947 4824559 4913121 5002814
5694 5002814 5090019 5181177 5274765 5375036 5484736 5597702 5718733 5845979 5972283 6102074
5684 6102074 6239351 6375626 6521764 6668664 6821442 6978970 7142910 7308994 7484499 7669436
5674 7669436 7859129 8060230 8267392 8478661 8693556 8915324 9145391 9387680 9638439 9905636
$$ packed form
5749A909013L8998L9260M1137L9755M0539L8034M1050L6471M3526L7126M6136
5738B351045L8349M3245M0578M3792M1388M5012M3321M6843M3974M2112M1200
5727B820859L6935M0549M1534M0471M5858M7252N2061N9792O0728O3352O4505
5716C373896O4531N8612O5964N9770N8541O1293N5916O1553O4377O8291O9887
5705D062631P4720Q1396Q1046Q4466Q6710Q7555R0906Q9517Q5612Q8562Q9693
5694E002814Q7205R1158R3588J00271J09700J12966J21031J27246J26304J29791
5684F102074J37277J36275J46138J46900J52778J57528J63940J66084J75505J84937
5674G669436J89693K01101K07162K11269K14895K21768K30067K42289K50759K67197
$$ plain form
5664 9905636 10181484 10471061 10774606 11091724 11429069 11778300 12143160 12520352 12910239 13313495
5654 13313495 13732765 14171085 14637359 15127347 15647320 16194346 16773938 17384863 18028113
5645 18028113 18708487 19429009 20195446 21017863 21898817 22845251 23860508 24952276 26131681
5636 26131681 27412305 28802164 30315215 31965380 33780921 35787667 38026124 40541538
5628 40541538 43379549 46613295 50313218 54570403 59489763 65201728 71861979 79667003
5620 79667003 88864735 99774173 112817678 128559774 147775934 171454708 200746867
5613 200746867 236673381 279421852 327348249 376381362 420723756 454576359 473705663
5606 473705663 476311656 463146567 436981807 401657387 361204560 319218500 278514931
$$ packed form
5664I905636K75848K89577L03545L17118L37345L49231L64860L77192L89887M03256
5654A3313495M19270M38320M66274M89988N19973N47026N79592O10925O43250
5645A8028113O80374P20522P66437Q22417Q80954R46434J015257J091768J179405
5636B6131681J280624J389859J513051J650165J815541K006746K238457K515414
5628D0541538K838011L233746L699923M257185M919360N711965O660251P805024
5620G9667003R197732J0909438J3043505J5742096J9216160K3678774K9292159
5613B00746867L5926514M2748471M7926397M9033113M4342394L3852603J9129304
5606D73705663K605993j3165089k6164760l5324420m0452827m1986060m0703569
$$ plain form
5599 278514931 241047289 207913874 179492928 155638409 135888036 119634071 106265259
5592 106265259 95212669 86017593 78293011 71737947 66122830 61269883 57040500 53330946
5584 53330946 50047664 47131799 44520836 42177205 40054632 38121298 36341512 34700641
5576 34700641 33177545 31765388 30448371 29217038 28064829 26987234 25973431 25021861
5568 25021861 24121989 23263611 22447607 21666762 20928109 20224294 19558125 18923138 18318037
5559 18318037 17737525 17179623 16646036 16136913 15647571 15182819 14737153 14308775 13899229
5550 13899229 13504169 13126984 12764755 12417520 12080971 11757857 11436045 11125096 10818219
5541 10818219 10525199 10243420 9976873 9726431 9493954 9277294 9059430 8841997 8622830
$$ packed form
5599B78514931l7467642l3133415k8420946k3854519j9750373j6253965j3368812
5592A06265259j1052590r195076p724582o555064n615117m852947m229383l709554
5584E3330946l283282k915865k610963k343631k122573j933334j779786j640871
5576C4700641j523096j412157j317017j231333j152209j077595j013803r51570
5568B5021861q99872q58378q16004p80845p38653p03815o66169o34987o05101
5559A8318037n80512n57902n33587n09123m89342m64752m45666m28378m09546
5550A3899229l95060l77185l62229l47235l36549l23114l21812l10949l06877
5541A0818219k93020k81779k66547k50442k32477k16660k17864k17433k19167
$$ plain form
5532 8622830 8407010 8197559 7990667 7786615 7587974 7391604 7206357 7030463 6858142 6699711
5522 6699711 6552781 6413075 6280199 6149790 6021901 5901300 5791262 5678838 5565419 5440982
5512 5440982 5314883 5187836 5067642 4951677 4838262 4730964 4628487 4524079 4425295 4327165
5502 4327165 4232925 4140787 4051691 3966087 3883624 3805509 3737372 3671880 3607606 3544053 3477645
5491 3477645 3405114 3332905 3259003 3182576 3109773 3038560 2964908 2900248 2831205 2770037 2711288
5480 2711288 2655528 2605127 2554118 2510917 2461826 2418612 2372376 2326733 2278419 2236970 2198391
5469 2198391 2157600 2120391 2084878 2050093 2017111 1984553 1959426 1933351 1910383 1885416 1856487
5458 1856487 1821303 1784012 1742412 1700558 1662233 1624226 1587817 1555577 1524500 1495387 1466266
$$ packed form
5532H622830k15820k09451k06892k04052j98641j96370j85247j75894j72321j58431
5522F699711j46930j39706j32876j30409j27889j20601j10038j12424j13419j24437
5512E440982j26099j27047j20194j15965j13415j07298j02477j04408r8784r8130
5502D327165r4240r2138q9096q5604q2463p8115o8137o5492o4274o3553o6408
5491C477645p2531p2209p3902p6427p2803p1213p3652o4660o9043o1168n8749
5480B711288n5760n0401n1009m3201m9091m3214m6236m5643m8314m1449l8579
5469B198391m0791l7209l5513l4785l2982l2558k5127k6075k2968k4967k8929
5458A856487l5184l7291m1600m1854l8325l8007l6409l2240l1077k9113k9121
$$ plain form
5447 1466266 1439568 1410861 1380971 1345351 1311520 1275856 1241756 1209333 1183666 1163999 1148278
5436 1148278 1127532 1104955 1078185 1048840 1021841 997443 975952 956001 935054 913210 894709
5425 894709 873774 855302 839418 820769 805317 791039 776247 762456 754975 748546 738788 727210
5413 727210 707273 685434 665855 647989 629192 610804 598076 581403 568713 554004 542270 529476
5401 529476 515890 505889 494330 481733 472105 462591 454450 448344 436704 425243 412185 401834
5389 401834 392417 381575 373334 365528 359211 352061 342314 333651 323734 318932 312123 308238 300179 292903
5375 292903 285407 279643 271639 265941 258241 253704 246805 240885 233426 227194 218424 213143 209596 202659
5361 202659 196089 191285 183648 180136 174733 169343 164092 163754 158466 154375 150878 146653 140280 137129 133442
$$ packed form
5447A466266k6698k8707k9890l5620l3831l5664l4100l2423k5667j9667j5721
5436A148278k0746k2577k6770k9345k6999k4398k1491j9951k0947k1844j8501
5425H94709k0935j8472j5884j8649j5452j4278j4792j3791p481o429r758j1578
5413G27210j9937k1839j9579j7866j8797j8388j2728j6673j2690j4709j1734j2794
5401E29476j3586j0001j1559j2597r628r514q141o106j1640j1461j3058j0351
5389D01834r417j0842q241p806o317p150r747q663r917m802o809l885q059p276
5375B92903p496n764q004n698p700m537o899n920p459o232q770n281l547o937
5361B02659o570m804p637l512n403n390n251l38n288m091l497m225o373l151l687
$$ plain form
5346 133442 131648 124282 119079 118512 110774 105193 105358 101349 98644 93716 90503 87223 83734 80780 78347
5331 78347 77160 75711 71127 70080 65431 62795 61082 59487 57207 56967 57770 56609 52978 48473 46196
5316 46196 43523 37364 36123 31073 28490 27696 23379 23115 18649 18775 15343 14584 12848 10564 8806 6694
5300 6694 4864 6488 2708 -232 -2046 -4940 -3125 -3704 -7226 -8435 -8505 -9749 -9409 -9855 -11457 -12782
5284 -12782 -14935 -16100 -16925 -18936 -19214 -18648 -18679 -21859 -21831 -22843 -26106 -24566 -26000 -27343 -28194 -28096 -29342
5267 -29342 -31615 -32184 -32677 -33960 -36337 -37387 -36221 -35635 -36841 -38534 -37235 -37835 -38733 -38107 -39947 -39367
5251 -39367 -41466 -41022 -41830 -42332 -41568 -42866 -44559 -44579 -44407 -42731 -43491 -46084 -47309 -46472 -45560 -47409 -50004
5234 -50004 -48768 -50904 -50983 -51759 -50919 -50902 -53092 -51804 -53126 -51578 -53635 -54797 -53172 -53526 -57262 -55637
$$ packed form
5346A33442j794p366n203n67p738n581J65m009k705m928l213l280l489k954k433
5331G8347j187j449m584j047m649k636j713j595k280k40Q03j161l631m505k277
5316D6196k673o159j241n050k583p94m317k64m466J26l432p59j736k284j758k112
5300F694j830J624l780k940j814k894J815n79l522j209p0j244L40m46j602j325
5284a2782k153j165q25k011k78N66l1l180K8j012l263J540j434j343q51R8j246
5267b9342k273n69m93j283k377j050J166N86j206j693J299o00q98O26j840N80
5251c9367k099M44q08n02P64j298j693k0J72J676p60k593j225Q37R12j849k595
5234e0004J236k136p9p76Q40J7k190J288j322J548k057j162J625l54l736J625
$$ plain form
5218 -55637 -57233 -57781 -57823 -56030 -56345 -57642 -58036 -58822 -58664 -60033 -61577 -60048 -59004 -57706 -60298 -60133 -60335
5201 -60335 -61589 -62543 -63329 -62459 -63347 -62857 -65043 -62539 -63065 -61226 -63215 -63058 -65322 -64256 -65256 -66023 -66759
5184 -66759 -64674 -66050 -69105 -65492 -68916 -69472 -67939 -69349 -69022 -70233 -70349 -69218 -70358 -71051 -68903 -71170
5168 -71170 -68424 -66869 -67390 -69242 -68724 -70698 -70983 -71262 -70994 -72874 -74570 -73314 -75655 -75333 -73733 -73949
5152 -73949 -76013 -73403 -76345 -76196 -75832 -76416 -77532 -77542 -76080 -76775 -76316 -76386 -76811 -77133 -74482 -75071 -74449 -77916
5134 -77916 -77441 -77883 -79089 -78156 -79758 -82003 -83348 -82017 -81846 -81646 -83066 -82448 -82729 -84341 -81791 -83148
5118 -83148 -83669 -82324 -82841 -82528 -81851 -81232 -83675 -81710 -81338 -82896 -81686 -81335 -80422 -81820 -83333 -84575 -82417
5101 -82417 -83343 -81619 -83711 -82491 -81850 -82435 -80182 -78154 -81017 -81699 -80675 -80150 -83023 -83031 -81720 -82257 -82557
$$ packed form
5218e5637j596n48m2J793l15j297l94p86J58j369j544J529J044J298k592J65k02
5201f0335j254r54p86Q70q88M90k186K504n26J839j989J57k264J066j000p67p36
5184f6759K085j376l055L613l424n56J533j410L27j211j16J131j140o93K148k267
5168g1170K746J555n21j852N18j974k85k79K68j880j696J256k341L22J600k16
5152g3949k064K610k942J49L64n84j116j0J462o95M59p0m25l22K651n89O22l467
5134g7916M75m42j206R33j602k245j345J331J71K00j420O18k81j612K550j357
5118h3148n21J345n17L13O77O19k443J965L72j558J210L51R13j398j513j242K158
5101h2417r26J724k092J220O41n85K253K028k863o82J024N25k873qJ311n37l00
$$ plain form
5084 -82557 -82326 -82919 -85158 -82773 -85939 -85119 -84895 -84891 -85172 -86188 -85245 -84238 -86975 -87382 -85855 -87981 -83520
5067 -83520 -84213 -85808 -84491 -86011 -84647 -85503 -87720 -84414 -87145 -86756 -88106 -85597 -85439 -86269 -86645 -86672 -85893
5050 -85893 -87503 -87161 -87386 -85611 -86980 -86447 -86024 -85021 -84910 -85796 -86914 -86372 -83618 -83116 -82122 -84187 -85119
5033 -85119 -83976 -85903 -84011 -82560 -84140 -82394 -82201 -83078 -83826 -83553 -82490 -83764 -82940 -86995 -83963 -83236
5017 -83236 -85478 -84163 -87599 -90172 -90237 -90456 -91629 -91170 -91369 -91505 -89820 -88945 -85731 -85064 -85140 -84259 -81962
5000 -81962 -83396 -82466 -83151 -79973 -79895 -78730 -78768 -77701 -76824 -75574 -73240 -73002 -71304 -70856 -67878 -65893 -62840
4983 -62840 -52828 -42152 -30591 -28990 -29598 -32592 -42458 -47215 -52448 -54255 -57376 -59006 -60524 -61466
4969 -61466 -63419 -62485 -61870 -60327 -57962 -56562 -53927 -51842 -51930 -49028 -44378 -39139 -34298 -26202 -7127
$$ packed form
5084h2557K31n93k239K385l166Q20K24Mk81j016R43J007k737m07J527k126M461
5067h3520o93j595J317j520J364q56k217L306k731L89j350K509J58q30l76k7P79
5050h5893j610L42k25J775j369N33M23J003J11q86j118N42K754N02R94k065r32
5033h5119J143j927J892J451j580J746J93q77p48K73J063j274Q24m055L032P27
5017h3236k242J315l436k573o5k19j173M59j99j36J685Q75L214O67p6Q81K297
5000h1962j434R30o85L178P8J165l8J067Q77J250K334K38J698M48K978J985L053
4983f2840J0012J0676J1561J601o08k994r866m757n233j807l121j630j518r42
4969f1466j953R34O15J543K365J400K635K085q8K902M650N239M841Q096J9075
$$ plain form
4954 -7127 25592 60173 82085 81039 61386 38720 18938 4637 -8338 -17402 -28462 -32334 -32689
4941 -32689 -35638 -37553 -36960 -38085 -37532 -36233 -34921 -34313 -31420 -29970 -24154 -19348 -14248 -8061 7687
4926 7687 36976 74216 101801 107819 92180 70627 50035 32004 16101 7050 -1265 -5721 -9671
4913 -9671 -12888 -14243 -12633 -15005 -15258 -13905 -12782 -12478 -11041 -8038 -10050 -4517 -4471 326 7534 17262
4897 17262 26619 40805 45684 45118 40306 33956 30245 26906 27807 25797 28634 31347 35122 42206 53035
4882 53035 61569 84460 119243 179863 266547 331070 337934 301575 256908 214303 176712 144645
4870 144645 122395 108006 97685 90796 86067 87915 89844 93330 96688 101607 106788 113634 125930
4857 125930 137579 158794 183566 219840 277973 381759 572471 843347 1041282 1054334 937783
$$ packed form
4954g127L2719L4581K1912j046j9653k2666j9782j4301j2975r064j1060l872l55
4941c2689k949j915N93j125N53J299J312O08K893J450N816M806N100O187J5748
4926G687K9289L7240K7585O018j5639k1553k0592j8031j5903r051q315m456l950
4913i671l217j355J610k372k53J353J123L04J437L003k012N533M6M797P208R728
4897A7262R357J4186M879n66m812o350l711l339R01k010K837K713L775P084J0829
4882E3035Q534K2891L4783O0620Q6684O4523O864l6359m4667m2605l7591l2067
4870A44645k2250j4389j0321o889m729J848J929L486L358M919N181O846J2296
4857A25930J1649K1215K4772L6274N8133J03786J90712K70876J97935J3052j16551
$$ plain form
4846 937783 784153 633403 508873 413874 343299 292829 252521 220184 202686 191639 189499
4835 189499 188003 188283 189177 190556 196139 204310 218098 234989 258862 296204 358434 466807 666086
4822 666086 939037 1131976 1134677 1007557 847331 693508 565222 470427 395233 340283 297130
4811 297130 266229 248231 235416 227603 221533 218252 219187 221607 219989 221026 222913 229368 235763 250077
4797 250077 274077 312471 385278 479166 534318 532401 488297 436476 386693 346860 316405 292525
4785 292525 275101 261046 253152 250829 246884 244661 244713 244463 249793 251617 250435 251616 256743 258419 262704
4770 262704 264735 269768 270755 276553 282424 286469 288705 292416 295270 298734 303439 305534 312481 315649 321095
4755 321095 325602 329387 334665 345943 358625 362720 363768 368993 373394 382484 389590 397238 402418 407544
$$ packed form
4846I37783j53630j50750j24530r4999p0575n0470m0308l2337j7498j1047k140
4835A89499j496K80Q94J379N583Q171J3788J6891K3873L7342O2230J08373J99279
4822F66086K72951J92939K701j27120j60226j53823j28286r4795p5194n4950m3153
4811B97130l0901j7998j2815p813o070l281R35K420j618J037J887O455O395J4314
4797B50077K4000L8394P2807R3888N5152j917m4104n1821m9783l9833l0455k3880
4785B92525j7424j4055p894k323l945k223N2k50N330J824j182J181N127J676M285
4770B62704K031N033R87N798N871M045K236L711K854L464M705K095O947L168N446
4755C21095M507L785N278J1278J2682M095J048N225M401R090P106P648N180N126
$$ plain form
4741 407544 413487 421886 433757 446388 452185 453943 457265 462797 465754 470702 476739 478290 485313 497031
4727 497031 509999 523535 542954 559984 570069 575231 580838 591835 609178 624374 632152 635397
4715 635397 639449 643770 658450 682380 707177 729627 743088 748925 755702 761552 770722 777443 789494
4702 789494 799756 806040 815861 837301 862532 887427 908561 923320 944439 964859 982224 999192
4690 999192 1015432 1023703 1029502 1039226 1058612 1080780 1114127 1149477 1191161 1228630 1256378 1273247
4678 1273247 1283706 1294876 1306371 1326769 1345699 1365575 1381973 1409258 1439430 1470744 1499508
4667 1499508 1539574 1581088 1616572 1643623 1667907 1695446 1725566 1750965 1778671 1805618 1852234
4656 1852234 1907019 1966708 2026385 2085276 2140650 2189722 2230763 2264171 2298503 2334697 2384784
$$ packed form
4741D07544N943Q399J1871J2631N797J758L322N532K957M948O037J551P023J1718
4727D97031J2968J3536J9419J7030J0085N162N607J0997J7343J5196P778L245
4715F35397M052M321J4680K3930K4797K2450J3461N837O777N850R170O721J2051
4702G89494J0262O284R821K1440K5231K4895K1134J4759K1119K0420J7365J6968
4690I99192J6240Q271N799R724J9386K2168L3347L5350M1684L7469K7748J6869
4678A273247J0459J1170J1495K0398J8930J9876J6398K7285L0172L1314K8764
4667A499508M0066M1514L5484K7051K4284K7539L0120K5399K7706K6947M6616
4656A852234N4785N9689N9677N8891N5374M9072M1041L3408L4332L6194N0087
$$ plain form
4645 2384784 2434718 2489427 2546709 2608009 2671172 2739826 2819115 2894837 2967331 3040616 3121808
4634 3121808 3207611 3289675 3366413 3446758 3546883 3656476 3774167 3896248 4027557 4157433
4624 4157433 4281781 4414456 4561969 4718034 4875797 5042286 5225835 5439519 5685024 5963301
4614 5963301 6276837 6623587 7029345 7502341 8043699 8665506 9400004 10275367 11371517
4605 11371517 12825259 14871563 18066696 23899187 35096840 51430577 64310857 66471977
4597 66471977 60322412 51442127 42597355 35021427 29190502 24883849 21787738 19521135
4589 19521135 18037470 17225079 16883067 16890154 17196915 17783428 18655908 19815759 21281538
4580 21281538 23125019 25448320 28538588 32865918 39263313 49458167 67775984 101508893
$$ packed form
4645B384784M9934N4709N7282O1300O3163O8654P9289P5722P2494P3285Q1192
4634C121808Q5803Q2064P6738Q0345J00125J09593J17691J22081J31309J29876
4624D157433J24348J32675J47513J56065J57763J66489J83549K13684K45505K78277
4614E963301L13536L46750M05758M72996N41358O21807P34498Q75363J096150
4605A1371517J453742K046304L195133N832491J1197653J6333737J2880280K161120
4597F6471977o149565q880285q844772p575928n830925m306653l096111k266603
4589A9521135j483665q12391l42012P087L06761N86513Q72480J159851J465779
4580B1281538J843481K323301L090268M327330O397395J0194854J8317817L3732909
$$ plain form
4572 101508893 148974578 184842641 189641201 170653655 143850656 116709626 92772468
4565 92772468 73946166 59709288 49261764 41303734 35642723 31984974 29565025 28019007
4557 28019007 27132586 26801012 26943991 27483503 28422139 29809486 31757059 34572944 38725377
4548 38725377 45077234 55454593 74366891 109199064 157424766 192632341 195814099
4541 195814099 175200275 147029652 118722781 93843292 74243652 59364666 48340148
4534 48340148 39847198 33691484 29535413 26570257 24426065 22879304 21805329 21068486
4526 21068486 20565961 20262395 20163509 20313036 20822929 21807200 23565460 26780773 33195990
4517 33195990 45641098 62695089 74328867 73961338 65452264 54760060 44536472 35916075
$$ packed form
4572A01508893M7465685L5868063M798560j8987546k6802999k7141030k3937158
4565I2772468j8826302j4236878j0447524p958030n661011l657749k419949j546018
4557B8019007q86421l31574J42979N39512R38636J387347J947573K815885M152433
4548C8725377O351857J0377359J8912298L4832173M8225702L5207575L181758
4541A95814099k0613824k8170623k8306871k4879489j9599640j4878986j1024518
4534D8340148q492950o155714m156071k965156k144192j546761j073975p36843
4526B1068486n02525l03566r8886J49527N09893R84271J758260L215313O415217
4517C3195990J2445108J7053991J1633778l67529q509074j0692204j0223588q620397
$$ plain form
4509 35916075 29233590 24176375 20364425 17388038 15201427 13638966 12460390 11545510
4501 11545510 10827434 10258345 9777314 9328692 8901828 8496249 8130534 7799500 7487674
4492 7487674 7187358 6915124 6675467 6459926 6263545 6086004 5920197 5746832 5573622 5408138
4482 5408138 5254422 5105409 4950816 4799652 4656880 4524827 4401630 4284673 4171964 4070299
4472 4070299 3977425 3893189 3814577 3727039 3627081 3524386 3424748 3334392 3240987 3148736 3062488
4461 3062488 2989392 2923053 2861543 2799620 2740267 2685747 2634513 2577161 2507888 2437248 2378362
4450 2378362 2324520 2273306 2215295 2156514 2110192 2068007 2025203 1985534 1957013 1926835 1887211
4439 1887211 1838887 1792106 1744867 1699765 1655257 1616945 1578574 1543728 1510202 1488586 1468610
$$ packed form
4509C5916075o682485n057215l811950k976387k186611j562461j178576r14880
4501A1545510p18076n69089m81031m48622m26864m05579l65715l31034l11826
4492G487674l00316k72234k39657k15541j96381j77541j65807j73365j73210j65484
4482E408138j53716j49013j54593j51164j42772j32053j23197j16957j12709j01665
4472D070299r2874q4236p8612q7538r9958j02695r9638r0356r3405r2251q6248
4461C062488p3096o6339o1510o1923n9353n4520n1234n7352o9273p0640n8886
4450B378362n3842n1214n8011n8781m6322m2185m2804l9669k8521l0178l9624
4439A887211m8324m6781m7239m5102m4508l8312l8371l4846l3526k1616j9976
$$ plain form
4428 1468610 1450976 1430491 1401998 1369818 1343322 1321760 1295164 1263943 1224172 1186546 1160392
4417 1160392 1137610 1117054 1097344 1081457 1064983 1049382 1031431 1010519 983805 953268 917712
4406 917712 889493 863578 844518 824200 812287 802395 796760 789773 782281 778501 768868 756592 735205
4393 735205 709829 684552 656944 637407 619734 609052 602834 599198 594452 585382 578950 570409 553933
4380 553933 534905 511637 490451 471625 458319 449482 448267 445444 440094 428454 417143 404158
4368 404158 391044 374756 364497 355547 346623 338751 329122 318001 310339 307247 303998 303422 297436 294711
4354 294711 287033 284420 278821 274886 275372 269086 263188 251891 243409 239135 231540 226829 221525 216427
4340 216427 213964 217915 227831 243672 251013 244871 235601 225943 222165 219258 222059 238153 277319 325797
$$ packed form
4428A468610j7634k0485k8493l2180k6496k1562k6596l1221l9771l7626k6154
4417A160392k2782k0556j9710j5887j6474j5601j7951k0912k6714l0537l5556
4406I17712k8219k5915j9060k0318j1913r892n635o987p492l780r633j2276k1387
4393G35205k5376k5277k7608j9537j7673j0682o218l636m746r070o432q541j6476
4380E53933j9028k3268k1186j8826j3306q837j215k823n350j1640j1311j2985
4368D04158j3114j6288j0259q950q924p872r629j1121p662l092l249n76n986k725
4354B94711p678k613n599l935M86o286n898j1297q482m274p595m711n304n098
4340B16427k463L951R916J5841P341o142r270r658l778k907K801J6094L9166M8478
$$ plain form
4326 325797 354415 355150 339373 318156 296366 281390 290499 329894 399678 451856 458023 419710
4314 419710 369090 316868 276018 243779 219633 202096 188576 181627 181254 183211 189561 204026 240042
4301 240042 289066 322009 327297 308902 289419 277866 272397 285601 319789 399271 563545 812745
4289 812745 1020984 1055269 947211 795894 646155 513928 413456 339254 281965 237685
4279 237685 205240 179377 159208 146399 138832 135773 133632 133986 134650 141101 149466 164834 184385
4266 184385 217955 268098 362801 539567 801633 1011509 1037530 922470 761169 604951
4256 604951 469294 364540 283378 221796 176050 144349 118231 100139 89233 79878 75261 66591
4244 66591 62763 59437 59203 59411 62138 66860 75800 91744 126963 189057 276792 340191 340507 297285
$$ packed form
4326C25797K8618P35j5777k1217k1790j4976R109L9395O9784N2178O167l8313
4314D19710n0620n2222m0850l2239k4146j7537j3520o949l73J957O350J4465L6016
4301B40042M9024L2943N288j8395j9483j1553n469J3204L4188P9482J64274K49200
4289H12745K08239L4285j08058j51317j49739j32227j00472p4202n7289m4280
4279B37685l2445k5863k0169j2809p567l059k141L54O64O451Q365J5368J9551
4266A84385L3570N0143R4703J76766K62066K09876K6021j15060j61301j56218
4256F04951j35657j04754q1162o1582m5746l1701k6118j8092j0906r355m617q670
4244F6591l828l326k34K08K727M722Q940J5944L5219O2094Q7735O3399L16m3222
$$ plain form
4230 297285 239762 186681 139266 104724 74405 53794 35100 24422 16430 7847 2221 -2940
4218 -2940 -4346 -10464 -13122 -14315 -15134 -20732 -24059 -24446 -28436 -27840 -30589 -31487 -34592 -35932 -35125 -35020
4202 -35020 -36454 -37034 -40207 -40194 -41106 -43811 -44364 -46676 -44961 -49456 -46886 -48365 -52595 -50088 -50406 -52926
4186 -52926 -54977 -54923 -55031 -57824 -55324 -57299 -58752 -58166 -58926 -62515 -62106 -61309 -60094 -62116 -60780 -60884 -61830
4169 -61830 -63305 -64873 -64745 -63923 -64642 -65218 -63478 -65148 -68152 -68545 -68719 -68135 -68929 -69099 -69784 -70259 -72329
4152 -72329 -71133 -71007 -69896 -72487 -73704 -71520 -72487 -73796 -71391 -73448 -74466 -72001 -73062 -74574 -74635 -74173
4136 -74173 -71902 -73705 -76386 -76919 -74495 -76581 -73965 -74361 -76771 -77120 -78370 -76443 -77003 -78834 -78641 -78018
4120 -78018 -76694 -77321 -77370 -78168 -78575 -79682 -79904 -79593 -79066 -78899 -79593 -81094 -81799 -80827 -80025 -80185 -80328 -79271
$$ packed form
4230B97285n7523n3081m7415l4542l0319k0611j8694j0678p992q583n626n161
4218b940j406o118k658j193q19n598l327l87l990N96k749q98l105j340Q07J05
4202c5020j434n80l173J3r12k705n53k312J715m495K570j479m230K507l18k520
4186e2926k051N4j08k793K500j975j453N86p60l589M09P97J215k022J336j04r46
4169f1830j475j568J28Q22p19n76J740j670l004l93j74N84p94j70o85m75k070
4152g2329J196J26J111k591j217K184r67j309K405k057j018K465j061j512o1M62
4136g4173K271j803k681n33K424k086K616l96k410l49j250J927n60j831J93O23
4120g8018J324o27m9p98m07j107k22L11N27J67o94j501p05R72Q02j60j43J057
$$ plain form
4102 -79271 -82743 -78902 -79813 -81863 -80818 -78065 -79829 -80381 -81254 -81193 -81516 -81563 -80625 -82263 -82042 -81647 -82286 -83640
4084 -83640 -83820 -85216 -84283 -84129 -84870 -86466 -82621 -85851 -85279 -84495 -86582 -85536 -85222 -81252 -84793 -85922
4068 -85922 -85330 -87084 -86356 -86390 -84994 -86126 -88083 -86671 -86182 -90188 -87869 -87488 -85718 -89307 -88130 -88100 -88412
4051 -88412 -88652 -88320 -87757 -88556 -89134 -89036 -91255 -88905 -91644 -90570 -89414 -90889 -90287 -89964 -90282 -93286 -90724
4034 -90724 -93182 -90421 -90385 -89830 -90461 -92556 -91324 -92638 -91190 -92520 -90439 -91334 -91808 -90029 -90502 -91152 -90524
4017 -90524 -90251 -90871 -94270 -94447 -93569 -93554 -94599 -93449 -95319 -93927 -96403 -93790 -94141 -95820 -97104 -95737
4001 -95737 -94554 -95908 -95731 -97209 -95005 -96565 -92954 -94678 -94891 -97600 -97498 -97633 -97355 -94136 -94969 -95385
3985 -95385 -98443 -97958 -98465 -97010 -98218 -100157 -99902 -101479 -101340 -102118 -102014 -102072 -102830 -102006 -99193 -100189 -98622
$$ packed form
4102g9271l472L841r11k050J045K753j764n52q73O1l23m7R38j638K21L95o39j354
4084h3640j80j396R33J54p41j596L845l230N72P84k087J046L14L970l541j129
4068h5922N92j754P28l4J396j132j957J412M89m006K319L81J770l589J177L0l12
4051h8412k40L32N63p99n78R8k219K350k739J074J156j475O02L23l18l004K562
4034i0724k458K761L6N55o31k095J232j314J448j330K081q95m74J779m73o50O28
4017i0524K73o20l399j77Q78J5j045J150j870J392k476K613l51j679j284J367
4001i5737J183j354J77j478K204j560L611j724k13k709J02j35K78L219q33m16
3985i5385l058M85n07J455j208j939K55j577J39p78J04n8p58Q24K813r96J567
$$ plain form
3968 -98622 -100877 -100844 -99780 -97905 -99537 -98739 -99226 -99415 -100574 -100681 -100997 -101761 -100560 -98373 -98440 -100138 -97442
3951 -97442 -103395 -102049 -100052 -102988 -102040 -103044 -102813 -102319 -103101 -102267 -102185 -102479 -101160 -102758 -102264 -102019 -101117
3934 -101117 -98930 -101649 -102011 -103414 -99373 -101375 -101796 -98494 -99560 -101776 -100466 -101024 -103209 -98375 -101951
3919 -101951 -103953 -103762 -103105 -101655 -102866 -103839 -102228 -103564 -102761 -101214 -102611 -101640 -101596 -103350 -102815 -102249 -101261
3902 -101261 -105665 -102931 -103276 -104584 -101888 -103091 -103968 -102700 -103702 -105773 -107515 -108330 -105247 -105270 -104267 -106061
3886 -106061 -105314 -106351 -105008 -106811 -105515 -104725 -106906 -106395 -108348 -107242 -108804 -108078 -107200 -106276 -106546 -107601
3870 -107601 -108495 -109480 -109443 -109848 -109572 -107487 -107033 -108169 -108763 -109460 -111474 -108131 -108817 -107366 -109643 -109732 -111315
3853 -111315 -108012 -107316 -107878 -108434 -109297 -107741 -110233 -111349 -109865 -110439 -109825 -110971 -112007 -111995 -107843 -109138
$$ packed form
3968i8622k255L3J064J875j632P98m87j89j159j07l16p64J201K187o7j698K696
3951i7442n953J346J997k936R48j004K31M94p82Q34Q2k94J319j598M94K45R02
3934a01117K187k719l62j403M041k002m21L302j066k216J310n58k185M834l576
3919a01951k002J91O57J450j211r73J611j336Q03J547j397R71M4j754N35N66R88
3902a01261m404K734l45j308K696j203q77J268j002k071j742q15L083k3J003j794
3886a06061P47j037J343j803J296P90k181N11j953J106j562P26Q78R24k70j055
3870a07601q94r85L7m05K76K085M54j136n94o97k014L343o86J451k277q9j583
3853a11315L303O96n62n56q63J556k492j116J484n74O14j146j036J2M152j295
$$ plain form
3837 -109138 -109516 -110431 -109730 -108991 -112811 -110695 -111478 -109035 -109565 -111791 -109934 -110712 -111446 -109821 -111540 -110164
3821 -110164 -112210 -111280 -107710 -110739 -110725 -111767 -110579 -110972 -111157 -114612 -111950 -114560 -116722 -116779 -114824 -115966
3805 -115966 -112800 -112937 -112868 -114591 -116608 -115113 -116901 -116132 -114719 -113915 -116290 -115588 -115912 -115916 -116725 -116384 -118026
3788 -118026 -117265 -115361 -115236 -116935 -118004 -119653 -117411 -118032 -118659 -115857 -118155 -116144 -120138 -118500 -118092 -118954
3772 -118954 -119089 -120230 -118338 -117868 -120023 -115826 -119766 -119862 -120010 -123613 -123497 -122789 -122388 -121495 -122068 -121589 -120302
3755 -120302 -119626 -120807 -123022 -120418 -120264 -120476 -119623 -121222 -122078 -122996 -122507 -122480 -124479 -125704 -125690 -129041 -125857
3738 -125857 -126127 -127376 -127133 -124710 -124897 -125775 -126938 -126017 -124174 -126238 -127217 -128110 -129796 -126755 -128861 -130740
3722 -130740 -129574 -130685 -128073 -129413 -128495 -129181 -129684 -130582 -129446 -130281 -130580 -131434 -130018 -129154 -127901 -129087
$$ packed form
3837a09138l78r15P01P39l820K116p83K443n30k226J857p78p34J625j719J376
3821a10164k046R30L570l029J4j042J188l93j85l455K662k610k162n7J955j142
3805a15966L166j37O9j723k017J495j788P69J413Q04k375P02l24mq09L41j642
3788a18026P61J904J25j699j069j649K242o21o27K802k298K011l994J638M08q62
3772a18954j35j141J892M70k155M197l940r6j48l603J16P08M01Q93n73M79J287
3755a20302O76j181k215K604J54k12Q53j599q56r18M89K7j999j225J4l351L184
3738a25857k70j249K43K423j87q78j163R21J843k064r79q93j686L041k106j879
3722a30740J166j111K612j340R18o86n03q98J136q35k99q54J416Q64J253j186
$$ plain form
3706 -129087 -127546 -128186 -127277 -128310 -128787 -129001 -129463 -128602 -129721 -129015 -131458 -130951 -132035 -134132 -134937 -136369 -137574
3689 -137574 -135613 -135068 -130328 -127737 -124552 -122769 -120400 -122503 -122676 -121952 -125726 -126757 -126473 -127759 -128637 -127041
3673 -127041 -126842 -124778 -126587 -123814 -123423 -124783 -123618 -126720 -128470 -126351 -127535 -127318 -127388 -127037 -122554 -119780
3657 -119780 -116247 -114901 -112252 -113950 -114146 -115476 -116961 -116824 -117766 -118147 -118141 -118705 -117081 -114975 -115158 -115212 -115186 -114907
3639 -114907 -115814 -115501 -113056 -111501 -111738 -112106 -112853 -111752 -112387 -112141 -112876 -113086 -114135 -113227 -111811 -111021 -112649
3622 -112649 -109811 -109411 -109447 -110983 -109775 -112186 -110745 -113369 -110561 -111435 -111819 -113032 -109575 -108485 -109404 -106434
3606 -106434 -104276 -106428 -105939 -109905 -108976 -112527 -112948 -110607 -112622 -111586 -109692 -110393 -111366 -111016 -111028 -109631
3590 -109631 -109428 -109322 -109725 -110825 -112487 -113614 -114269 -114312 -113298 -114567 -110000 -114824 -111388 -110996 -112043 -110577
$$ packed form
3706a29087J541o40R09j033m77k14m62Q61j119P06k443N07j084k097q05j432j205
3689a37574J961N45M740K591L185J783K369k103j73P24l774j031K84j286q78J596
3673a27041J99K064j809K773L91j360J165l102j750K119j184K17p0L51M483K774
3657a19780L533J346K649j698j96j330j485J37r42l81On64J624K106j83n4K6K79
3639a14907r07L13K445J555k37l68p47J101o35K46p35k10j049R08J416P90j628
3622a12649K838M00l6j536J208k411J441k624K808q74l84j213L457J090r19K970
3606a06434K158k152M89l966R29l551m21K341k015J036J894p01r73L50j2J397
3590a09631K03J06m03j100j662j127o55m3J014j269M567m824L436L92j047J466
$$ plain form
3574 -110577 -108580 -110084 -109524 -109440 -111835 -113465 -112238 -112984 -111309 -112394 -113652 -113784 -112780 -113880 -111058 -113572
3558 -113572 -111292 -114019 -112592 -116641 -114791 -114867 -113229 -112674 -113540 -114215 -112896 -112211 -114112 -113064 -113603 -113879
3542 -113879 -113213 -111317 -114323 -111586 -114032 -115274 -114219 -116144 -117193 -114518 -115767 -114425 -113383 -113408 -113134
3527 -113134 -114999 -116100 -116157 -114908 -113506 -111471 -112875 -112183 -112383 -116130 -115284 -113279 -112151 -114539 -114232 -112114
3511 -112114 -112612 -114077 -114862 -115720 -114300 -111470 -112331 -113154 -113708 -112284 -110166 -108892 -109124 -108958 -107867 -110674
3495 -110674 -108536 -111713 -112695 -110283 -108575 -110875 -112874 -111510 -110928 -108866 -109613 -109498 -110652 -110743 -112468 -108982
3479 -108982 -111190 -111528 -109029 -110855 -108802 -109042 -108525 -107306 -108087 -107019 -106853 -108090 -107840 -108436 -107911 -107213 -109065
3462 -109065 -107120 -108055 -106263 -109448 -106685 -106719 -107132 -106018 -103949 -103174 -102447 -94149 -82010 -66804 -60646
$$ packed form
3574a10577J997j504N60Q4k395j630J227p46J675j085j258j32J004j100K822k514
3558a13572K280k727J427m049J850p6J638N55q66o75J319O85j901J048n39k76
3542a13879O66J896l006K737k446j242J055j925j049K675j249J342J042k5K74
3527a13134j865j101n7J249J402K035j404O92k00l747Q46K005J128k388L07K118
3511a12114m98j465p85q58J420K830q61q23n54J424K118J274k32J66J091k807
3495a10674K138l177r82K412J708k300j999J364N82K062p47J15j154r1j725L486
3479a08982k208l38K499j826K053k40N17J219p81J068J66j237K50n96N25O98j852
3462a09065J945r35J792l185K763l4m13J114K069P75P27Q298J2139J5206O158
$$ plain form
3447 -60646 -62295 -69495 -77164 -84416 -88110 -90464 -92783 -91293 -84715 -69246 -54336 -53191 -62182 -70681
3433 -70681 -76307 -78235 -71841 -69145 -73208 -77371 -84732 -90817 -95010 -99671 -99531 -101784 -103527 -102239 -105261
3418 -105261 -106882 -108014 -106238 -106363 -109338 -110726 -111192 -109853 -110621 -111221 -110616 -110346 -110135 -111897 -109871 -111487
3402 -111487 -113151 -110371 -110802 -111521 -111901 -111938 -113301 -113082 -113073 -110507 -113073 -113006 -112105 -113811 -112155 -111691 -112934 -115056
3384 -115056 -113158 -115617 -113974 -114562 -115027 -115813 -113214 -114730 -115359 -112926 -114600 -114853 -114611 -114690 -114415 -113104 -113956
3367 -113956 -114313 -112756 -113033 -112356 -112574 -115896 -114830 -112477 -111675 -114042 -114085 -112222 -113494 -112412 -113565 -114516
3351 -114516 -113569 -115035 -112410 -113614 -113859 -112445 -111323 -112370 -112648 -114965 -112635 -110398 -110361 -112540 -109461 -115557
3335 -115557 -112182 -109134 -108917 -108162 -108032 -106112 -107795 -105312 -105148 -103850 -102612 -101839 -100933 -101929 -101077 -97427
$$ packed form
3447f0646j649p200p669p252l694k354k319J490O578J5469J4910J145q991q499
3433g0681n626j928O394K696m063m163p361o085m193m661J40k253j743J288l022
3418a05261j621j132J776j25k975j388m66J339p68o00O05K70K11j762K026j616
3402a11487j664K780m31p19l80l7j363K19RK566k566O7R01j706J656M64j243k122
3384a15056J898k459J643n88m65p86K599j516o29K433j674k53K42p9K75J311q52
3367a13956l57J557k77O77k18l322J066K353Q02k367m3J863j272J082j153r51
3351a14516R47j466K625j204k45J414J122j047k78k317K330K237L7k179L079o096
3335a15557L375L048K17P55J30J920j683K483J64J298J238P73R06r96Q52L650
$$ plain form
3319 -97427 -98210 -94328 -90586 -86626 -83616 -81377 -77648 -72056 -64361 -56624 -44191 -26679 7363 86236
3305 86236 235769 423167 523448 493999 398230 291289 196551 121791 65278 27245 370
3294 370 -19379 -28660 -27995 -19941 9352 34509 39665 29336 6870 -16591 -33138 -47842 -62451
3281 -62451 -71589 -75401 -84756 -87003 -92013 -93141 -95850 -95805 -97435 -99387 -103790 -100999 -102817 -103830 -103393
3266 -103393 -106866 -107498 -107192 -105866 -107725 -108545 -107975 -112215 -109760 -112315 -112596 -112399 -112936 -113614 -113396 -115510 -114885
3249 -114885 -116588 -116297 -115244 -113266 -115227 -113267 -114126 -114214 -114527 -115755 -116941 -117209 -117169 -119467 -120862 -121272 -120101
3232 -120101 -120017 -120992 -121134 -122343 -123026 -120469 -123034 -123387 -123504 -121712 -120076 -121061 -121065 -121810 -120348 -117789 -116341
3215 -116341 -114262 -113974 -117204 -119581 -119793 -122150 -122144 -124667 -124566 -126155 -126310 -124271 -125894 -124796 -125022 -124407 -125661
$$ packed form
3319i7427p83L882L742L960L010K239L729N592P695P737J2433J7512L4042P8873
3305H6236J49533J87398J00281k9449r5769j06941r4738p4760n6513l8033k6875
3294C70j9749r281O65Q054K9293K5157N156j0329k2466k3461j6547j4704j4609
3281f2451r138l812r355k247n010j128k709M5j630j952m403K791j818j013M37
3266a03393l473o32L06J326j859q20N70m240K455k555k81J97n37o78K18k114O25
3249a14885j703K91J053J978j961J960q59q8l13j228j186k68M0k298j395m10J171
3232a20101Q4r75j42j209o83K557k565l53j17J792J636r85mp45J462K559J448
3215a16341K079K88l230k377k12k357Ok523J01j589j55K039j623J098k26O15j254
$$ plain form
3198 -125661 -125642 -124349 -125312 -125887 -124065 -123414 -122676 -122292 -125282 -123529 -121772 -120202 -120892 -120929 -121188 -124126 -124397
3181 -124397 -125645 -122769 -124243 -123123 -124683 -122349 -124840 -123373 -124304 -125810 -123782 -122948 -123952 -121956 -123542
3166 -123542 -124493 -124281 -123794 -123672 -125883 -124330 -125900 -124165 -123415 -123204 -120868 -123463 -126456 -125304 -125994 -125656
3150 -125656 -124355 -123958 -124685 -125582 -126665 -126072 -126640 -121728 -124253 -124668 -123629 -124132 -124096 -126088 -126404 -126325 -123779
3133 -123779 -124154 -121102 -121299 -120300 -121711 -123269 -122109 -121769 -120510 -124597 -121862 -124151 -122031 -122837 -120298 -121956
3117 -121956 -120436 -121494 -123025 -122148 -118795 -119827 -118251 -118830 -116488 -115628 -112226 -111997 -107629 -104907 -104811 -104548
3101 -104548 -106953 -105424 -109660 -108770 -110585 -110891 -113151 -114180 -112999 -112702 -113556 -114332 -113487 -112382 -111526 -109213
3085 -109213 -110257 -108806 -104445 -101645 -96576 -94206 -85079 -80417 -75924 -75570 -75659 -74875 -76269 -81602 -84456
$$ packed form
3198a25661J9J293r63n75J822O51P38L84k990J753J757J570o90l7k59k938k71
3181a24397j248K876j474J120j560K334k491J467r31j506K028Q34j004J996j586
3166a23542r51K12M87J22k211J553j570J735P50K11K336k595k993J152o90L38
3150a25656J301L97p27q97j083N93n68M912k525m15J039n03L6j992l16P9K546
3133a23779l75L052j97R99j411j558J160L40J259m087K735k289K120q06K539j658
3117a21956J520j058j531Q77L353j032J576n79K342Q60L402K29M368K722R6K63
3101a04548k405J529m236Q90j815l06k260j029J181K97q54p76Q45J105Q56K313
3085a09213j044J451M361K800N069K370R127M662M493L54q9P84j394n333k854
$$ plain form
3070 -84456 -85385 -89197 -92036 -95771 -96961 -99627 -100722 -99101 -97046 -96471 -96334 -93433 -93207 -89578 -83710 -82849
3054 -82849 -74797 -66540 -55570 -48296 -41437 -36183 -36494 -36495 -40060 -42063 -47277 -54942 -63125 -66748 -72240
3039 -72240 -76830 -80421 -80944 -81597 -82714 -80084 -80123 -77516 -74114 -72222 -67563 -62615 -53129 -44102 -33992
3024 -33992 -27145 -20140 -16390 -11784 -12855 -13354 -20714 -27702 -34087 -46562 -52884 -55005 -60817 -63244 -65267
3009 -65267 -66577 -64273 -63257 -66117 -64872 -61157 -56476 -52787 -47050 -40221 -35545 -25535 -20516 -13424
2995 -13424 -10369 -8926 -7310 -8378 -12996 -20157 -26535 -33939 -39765 -43883 -45906 -47206 -50534 -49204 -46685
2980 -46685 -46804 -43064 -42146 -40405 -41555 -37823 -34579 -31289 -26405 -19489 -16803 -15675 -10557 -8980 -8848
2965 -8848 -10250 -11172 -13250 -16459 -21118 -20638 -21587 -22065 -23205 -21513 -21328 -21474 -18991 -15540 -12689 -11048
$$ packed form
3070h4456r29l812k839l735j190k666j095J621K055N75J37K901K26L629N868Q61
3054h2849Q052Q257J0970P274O859N254l11jl565k003n214p665q183l623n492
3039g2240m590l591n23o53j117K630l9K607L402J892M659M948R486R027J0110
3024c3992O847P005L750M606j071m99p360o988o385j2475o322k121n812k427k023
3009f5267j310K304J016k860J245L715M681L689N737O829M676J0010N019P092
2995a3424L055J443J616j068m618p161o378p404n826m118k023j300l328J330K519
2980d6685j19L740R18J741j150L732L244L290M884O916K686J128N118J577J32
2965h848j402r22k078l209m659M80r49m78j140J692J85j46K483L451K851J641
$$ plain form
2949 -11048 -6648 -3810 -2357 1647 1561 7311 6887 11487 13567 13141 10934 12917 11861 12565 9776 10940
2933 10940 10540 16111 19468 22243 28947 30029 34938 39889 42445 46954 54675 62879 69346 74367 78102
2918 78102 82811 84102 81302 83057 86818 93937 98618 102773 103023 105517 106732 113377 124242 139252
2904 139252 153876 175117 194565 221550 255790 298371 375965 524293 783404 1063857 1195504
2893 1195504 1137166 998349 842292 696041 576147 485683 422853 379761 348943 331381 318375
2882 318375 312752 310295 308335 316774 325945 344890 369880 395293 430743 471729 530653 608183 750798
2869 750798 1042220 1566259 2114776 2323313 2168196 1870499 1551127 1266430 1040817 882718
2859 882718 777775 707000 656090 622941 593072 566612 542697 521056 504511 494210 492926 494076
$$ packed form
2949a1048M400K838J453M004q6N750m24M600K080m26k207J983j056P04k789J164
2933A0940m00N571L357K775O704J082M909M951K556M509P721Q204O467N021L735
2918G8102M709J291k800J755L761P119M681M155K50K494J215O645J0865J5010
2904A39252J4624K1241J9448K6985L4240M2581P7594J48328K59111K80453J31647
2893A195504n8338j38817j56057j46251j19894r0464o2830m3092l0818j7562j3006
2882C18375n623k457j960Q439R171J8945K4990K5413L5450M0986N8924P7530J42615
2869G50798K91422N24039N48517K08537j55117k97697l19372k84697k25613j58099
2859H82718j04943p0775n0910l3149k9869k6460k3915k1641j6545j0301j284J150
$$ plain form
2847 494076 499959 512738 533230 560230 599409 672961 815702 1061351 1313644 1415346 1348764
2836 1348764 1208633 1063716 938417 846851 794611 782935 798909 813415 806991 771905 729163
2825 729163 679783 645250 613692 595856 585868 580206 573947 571749 572671 576906 582654 590108 592636 595530
2811 595530 599213 604786 608750 618463 629597 649864 677959 719677 768073 822841 863890 874132
2799 874132 854232 813527 785148 762728 756090 756665 755916 751107 751656 762614 784211 810908 832002
2786 832002 842917 844136 846115 853071 859126 865136 874580 881062 891994 912405 947243 992283 1033410
2773 1033410 1060249 1072379 1071631 1071040 1067791 1066933 1073134 1082697 1085460 1095237 1115677 1148329 1188475 1225166
2759 1225166 1264455 1293239 1323117 1340337 1357135 1376589 1397794 1424617 1451692 1469150 1482100
$$ packed form
2847D94076N883J2779K0492K7000L9179P3552J42741K45649K52293J01702o6582
2836A348764j40131j44917j25299r1566n2240j1676J5974J4506o424l5086m2742
2825G29163m9380l4533l1558j7836r988n662o259k198R22M235N748P454K528K894
2811E95530L683N573L964R713J1134K0267K8095M1718M8396N4768M1049J0242
2799H74132j9900m0705k8379k2420o638N75p49m809N49J0958K1597K6697K1094
2786H32002J0915J219J979O956O055O010R444O482J0932K0411L4838M5040M1127
2773A033410K6839J2130p48n91l249q58O201R563K763R777K0440L2652M0146L6691
2759A225166L9289K8784K9878J7220J6798J9454K1205K6823K7075J7458J2950
$$ plain form
2748 1482100 1507172 1542457 1579490 1618067 1660862 1708009 1740634 1759718 1777975 1798623 1823559
2737 1823559 1856029 1895652 1937185 1996105 2073354 2178366 2314933 2438199 2512161 2544964 2545677
2726 2545677 2534789 2530546 2537949 2555556 2583412 2613466 2661670 2719147 2791420 2888215 2997782 3095417
2714 3095417 3164260 3226211 3294099 3391226 3507170 3595058 3625733 3636932 3671847 3732807 3799986
2703 3799986 3863694 3930939 4018168 4139461 4284813 4412181 4514206 4612613 4719047 4814526
2693 4814526 4902106 4986198 5077004 5178488 5297215 5434656 5575797 5725678 5883892 6054240
2683 6054240 6230543 6396435 6555230 6749947 7008043 7267293 7501026 7765904 8079026 8405079
2673 8405079 8713645 9051005 9450130 9872964 10257103 10621641 11004909 11451429 11975118 12612231
$$ packed form
2748A482100K5072L5285L7033L8577M2795M7147L2625J9084J8257K0648K4936
2737A823559L2470L9623M1533N8920P7249J05012J36567J23266P3962L2803P13
2726B545677j0888m243P403J7607K7856L0054M8204N7477P2273R6795J09567R7635
2714C095417O8843O1951O7888R7127J15944Q7888L0675J1199L4915O0960O7179
2703C799986O3708O7245Q7229J21293J45352J27368J02025R8407J06434R5479
2693D814526Q7580Q4092R0806J01484J18727J37441J41141J49881J58214J70348
2683F054240J76303J65892J58795J94717K58096K59250K33733K64878L13122L26053
2673H405079L08566L37360L99125M22834L84139L64538L83268M46520N23689O37113
$$ plain form
2663 12612231 13371057 14266021 15328314 16621037 18195243 20116374 22388497 24890834
2655 24890834 27792000 31566832 37022286 45716032 61643363 93384319 144380364 190558895
2647 190558895 204634021 188671698 160632641 131026348 104461680 83607970 68165148
2640 68165148 57188501 49194210 43560573 40029567 37818000 36601140 36197683 36534034
2632 36534034 37615460 39472884 42195757 45706552 49751794 54782587 61834104 72566571
2624 72566571 90184605 123330159 188205985 282034917 353297759 369309265 341645529
2617 341645529 295552514 243897564 194415837 153490471 121728997 98434606 80763928
2610 80763928 67853952 59010258 52559115 47840968 44410748 42022376 40472343 39620937
$$ packed form
2663A2612231P58826Q94964J062293J292723J574206J921131K272123K502337
2655B4890834K901166L774832N455454Q693746J5927331L1740956N0996045M6178531
2647A90558895J4075126j5962323k8039057k9606293k6564668k0853710j5442822
2640F8165148j0976647p994291n633637l531006k211567j216860m03457L36351
2632C6534034J081426J857424K722873L510795M045242N030793P051517J0732467
2624G2566571J7618034L3145554O4875826R3828932P1262842J6011506k7663736
2617C41645529m6093015n1654950m9481727m0925366l1761474k3294391j7670678
2610H0763928j2909976q843694o451143m718147l430220k388372j550033q51406
$$ plain form
2602 39620937 39439814 39815160 40611605 41975292 44253438 48195362 55280735 69368333
2594 69368333 98761040 146359822 188561377 199884110 183043720 155165933 125965087
2587 125965087 99775887 79049471 63471365 52114314 43538452 37157457 32639036
2580 32639036 29191514 26491186 24329016 22589718 21154612 19927364 18878908 17956205
2572 17956205 17132125 16405253 15727136 15078407 14512952 14046706 13597129 13152498 12743125
2563 12743125 12375800 12000556 11610430 11222412 10857199 10519870 10198037 9883852 9581389
2554 9581389 9299628 9038353 8787902 8545221 8317269 8094739 7884757 7674130 7467319 7262584
2544 7262584 7072503 6898244 6734786 6551740 6358380 6181316 6031258 5910801 5792564 5667247
$$ packed form
2602C9620937j81123L75346P96445J363687K278146L941924P085373J4087598
2594F9368333K9392707M7598782M2201555J1322733j6840390k7877787k9200846
2587A25965087k6189200k0726416j5578106j1357051q575862o380995m518421
2580C2639036l447522k700328k162170j739298j435106j227248j048456r22703
2572A7956205q24080p26872o78117o48729n65455m66246m49577m44631m09373
2563A2743125l67325l75244l90126l88018l65213l37329l21833l14185l02463
2554I581389k81761k61275k50451k42681k27952k22530k09982k10627k06811k04735
2544G262584j90081j74259j63458j83046j93360j77064j50058j20457j18237j25317
$$ plain form
2534 5667247 5536450 5413646 5298944 5184345 5061409 4923718 4785599 4661272 4543961 4429985
2524 4429985 4331097 4243014 4162778 4079390 4006170 3934012 3848424 3753521 3658549 3569942 3492621
2513 3492621 3424630 3350869 3270194 3184891 3112365 3062148 3021419 2985957 2949255 2909834 2856968
2502 2856968 2790435 2715341 2644049 2583441 2523169 2461859 2406763 2363381 2321599 2277343 2234858
2491 2234858 2203115 2169891 2131577 2090527 2048136 2007916 1959889 1912428 1872541 1827620 1782223
2480 1782223 1747258 1726320 1712492 1705726 1686344 1663645 1635646 1604841 1574083 1538076 1498652 1455244
2468 1455244 1416589 1387659 1366664 1348202 1331354 1314091 1295685 1276178 1257701 1247194 1228849
2457 1228849 1199997 1160649 1121548 1090184 1060226 1038352 1021698 1010686 1001751 991419 980495 968939
$$ packed form
2534E667247j30797j22804j14702j14599j22936j37691j38119j24327j17311j13976
2524D429985r8888q8083q0236q3388p3220p2158q5588r4903r4972q8607p7321
2513C492621o7991p3761q0675q5303p2526n0217m0729l5462l6702l9421n2866
2502B856968o6533p5094p1292o0608o0272o1310n5096m3382m1782m4256m2485
2491B234858l1743l3224l8314m1050m2391m0220m8027m7461l9887m4921m5397
2480A782223l4965k0938j3828o766j9382k2699k7999l0805l0758l6007l9424m3408
2468A455244l8655k8930k0995j8462j6848j7263j8406j9507j8477j0507j8345
2457A228849k8852l9348l9101l1364k9958k1874j6654j1012q935j0332j0924j1556
$$ plain form
2445 968939 958150 942147 926928 907866 889710 870122 851981 834730 824180 820564 816200 807427
2433 807427 796356 786676 778812 774133 764775 751617 738998 726277 718554 712040 707952 705251 706182 705068
2419 705068 703323 707256 720360 735165 750403 769969 789020 800907 808757 827510 854121 909897
2407 909897 1022928 1237732 1548968 1815156 1896810 1841384 1782249 1841222 2046036 2270118
2397 2270118 2365139 2296785 2118674 1892127 1667880 1470399 1300477 1166574 1074332 1014162
2387 1014162 982602 970624 961076 952321 957444 984852 1064857 1239953 1506510 1737507 1806778
2376 1806778 1743459 1646456 1602388 1699584 2079937 2713033 3172086 3164075 2849852 2448378 2041130
2365 2041130 1684114 1394857 1174036 1006362 878765 787397 717495 663866 620858 585279
$$ packed form
2445I68939j0789j6003j5219j9062j8156j9588j8141j7251j0550l616m364q773
2433H07427j1071r680p864m679r358j3158j2619j2721p723o514m088k701R31j114
2419G05068j745L933J3104J4805J5238J9566J9051J1887P850J8753K6611N5776
2407I09897J13031K14804L11236K66188Q1654n5426n9135N8973K04814K24082
2397B270118R5021o8354j78111k26547k24247j97481j69922j33903r2242o0170
2387A014162l1560j1978r548q755N123K7408Q0005J75096K66557K30997O9271
2376A806778o3319r7003m4068R7196L80353O33096M59053q011l14223m01474m07248
2365B041130l57016k89257k20821j67674j27597r1368o9902n3629m3008l5579
$$ [...]
##END NTUPLES=NMR SPECTRUM
##END=
