##TITLE=abcd
##JCAMPDX= 6.0         $$ Bruker NMR JCAMP-DX V2.0
##DATA TYPE= NMR SPECTRUM
##DATA CLASS= NTUPLES
##ORIGIN= UXNMR, Bruker Analytische Messtechnik GmbH
##OWNER= root
$$ XWIN-NMR		Version 3.5
$$ Thu Jul  9 15:41:16 2026 Russian Standard Time (UT+4h)  servis@DPX200
##.OBSERVE FREQUENCY= 200.131235884673
##.OBSERVE NUCLEUS= ^1H
##.ACQUISITION MODE= SIMULTANEOUS
##.ACQUISITION SCHEME= undefined
##.AVERAGES= 32
##.DIGITISER RES= 18
##SPECTROMETER/DATA SYSTEM= spect
##.PULSE SEQUENCE= zg
##.SOLVENT NAME= CDCl3
##.SHIFT REFERENCE= (INTERNAL, CDCl3, 0, 16.4885)
##AUDIT TRAIL= $$ (NUMBER, WHEN, WHO, WHERE, WHAT)
$$ ##TITLE= Audit trail, XWIN-NMR		Version 3.5
$$ ##JCAMPDX= 5.01
$$ ##ORIGIN= Bruker BioSpin GmbH
$$ ##OWNER= servis
$$ F:\spectra/data/av/nmr/H1/1/pdata/1/auditp.txt
$$ ##AUDIT TRAIL=  $$ (NUMBER, WHEN, WHO, WHERE, WHAT)
(   1,<2026-07-09 15:33:52.31 +0400>,<servis>,<DPX200>,
      <created by zg, POWCHK disabled, PULCHK disabled
       configuration hash MD5:
       00 E9 B6 7A A2 85 ED C7 34 08 36 98 17 FE 4E 26
       data hash MD5: 32K
       BB 5C B4 41 F1 33 CD 65 FD 6C FB BD 24 84 23 91>)
(   2,<2026-07-09 15:40:24.62 +0400>,<servis>,<DPX200>,
      <Start of raw data processing
       efp BC_mod = 2 LB = 0.05 FT_mod = 6 PKNL = 1 PHC0 = -415.99 PHC1 = 3.101563 SI = 16K 
       data hash MD5: 16K
       6B CA 97 B6 1E 38 56 CD 0F 86 48 C3 08 6F D0 45>)
(   3,<2026-07-09 15:40:40.85 +0400>,<servis>,<DPX200>,
      <pk PHC0 = 0.6 PHC1 = 0 
       data hash MD5: 16K
       DD 54 A4 CC 5C D2 8F 86 E1 3F 82 2F 70 5A DC 26>)
$$ ##END=
$$ 
$$ hash MD5
$$ 5D B6 B1 BE 0E 9B 51 7E 84 EE 45 AA 37 AD B1 F4
##$RELAX= 
##$RELAX= 
##$RELAX= 
##$RELAX= 
##$RELAX= 
##$RELAX= 
##$RELAX= 
##$RELAX= 
$$ Bruker specific parameters
$$ --------------------------
##$DU= <F:\spectra>
##$EXPNO= 1
##$NAME= <H1>
##$PROCNO= 1
##$TYPE= <nmr>
##$USER= <av>
##$AMP= (0..31)
100 100 100 100 100 100 100 100 100 100 100 100 100 100 100 100 100 100 
100 100 100 100 100 100 100 100 100 100 100 100 100 100 
##$AQSEQ= 0
##$AQ_mod= 1
##$AUNM= <au_zg>
##$AUTOPOS= <>
##$BF1= 200.13
##$BF2= 200.13
##$BF3= 200.13
##$BF4= 200.13
##$BF5= 500.13
##$BF6= 500.13
##$BF7= 500.13
##$BF8= 500.13
##$BYTORDA= 1
##$CFDGTYP= 0
##$CFRGTYP= 5
##$CHEMSTR= <none>
##$CNST= (0..31)
1 1 145 1 1 1 1 1 1 1 1 1 1 1 1 1 1 1 1 1 1 1 1 1 1 1 1 1 1 1 1 1 
##$CPDPRG= <>
##$CPDPRG1= <>
##$CPDPRG2= <>
##$CPDPRG3= <>
##$CPDPRG4= <mlev>
##$CPDPRG5= <mlev>
##$CPDPRG6= <mlev>
##$CPDPRG7= <mlev>
##$CPDPRG8= <mlev>
##$CPDPRGB= <>
##$CPDPRGT= <>
##$D= (0..31)
0 2 0 0 0 0 0 0 0 0.06 0 0 0 0 0 0 0.0002 0 0 0 0 0 0 0 0 0 0 0 0 0 0 
0 
##$DATE= 1783596831
##$DBL= (0..7)
120 120 120 120 120 120 120 120 
##$DBP= (0..7)
150 150 150 150 150 150 150 150 
##$DBP07= 0
##$DBPNAM0= <>
##$DBPNAM1= <>
##$DBPNAM2= <>
##$DBPNAM3= <>
##$DBPNAM4= <>
##$DBPNAM5= <>
##$DBPNAM6= <>
##$DBPNAM7= <>
##$DBPOAL= (0..7)
0.5 0.5 0.5 0.5 0.5 0.5 0.5 0.5 
##$DBPOFFS= (0..7)
0 0 0 0 0 0 0 0 
##$DE= 6
##$DECBNUC= <off>
##$DECIM= 32
$$ [...]
##$SUBNAM4= <"">
##$SUBNAM5= <"">
##$SUBNAM6= <"">
##$SUBNAM7= <"">
##$SUBNAM8= <"">
##$SUBNAM9= <"">
##$SW= 20.6817932712277
##$SWIBOX= (0..15)
0 0 3 0 0 0 0 0 0 0 0 0 0 0 0 0 
##$SW_h= 4139.07284768212
##$TD= 32768
##$TD0= 1
##$TE= 0
##$TE2= 300
##$TE3= 300
##$TEG= 300
##$TL= (0..7)
0 120 120 120 120 120 120 120 
##$TP= (0..7)
150 150 150 150 150 150 150 150 
##$TP07= 0
##$TPNAME0= <>
##$TPNAME1= <>
##$TPNAME2= <>
##$TPNAME3= <>
##$TPNAME4= <>
##$TPNAME5= <>
##$TPNAME6= <>
##$TPNAME7= <>
##$TPOAL= (0..7)
0.5 0.5 0.5 0.5 0.5 0.5 0.5 0.5 
##$TPOFFS= (0..7)
0 0 0 0 0 0 0 0 
##$TUNHIN= 0
##$TUNHOUT= 0
##$TUNXOUT= 0
##$USERA1= <user>
##$USERA2= <user>
##$USERA3= <user>
##$USERA4= <user>
##$USERA5= <user>
##$V9= 5
##$VALIST= <valist>
##$VCLIST= <CCCCCCCCCCCCCCC>
##$VD= 0
##$VDLIST= <DDDDDDDDDDDDDDD>
##$VPLIST= <PPPPPPPPPPPPPPP>
##$VTLIST= <TTTTTTTTTTTTTTT>
##$WBST= 1024
##$WBSW= 30
##$XGAIN= (0..3)
0 0 0 0 
##$XL= 0
##$YL= 0
##$YMAX_a= 304082
##$YMIN_a= -670782
##$ZGOPTNS= <>
##$ZL1= 120
##$ZL2= 120
##$ZL3= 120
##$ZL4= 120
##$ABSF1= 0
##$ABSF2= 0
##$ABSG= 0
##$ABSL= 0
##$ALPHA= 0
##$AQORDER= 0
##$ASSFAC= 0
##$ASSFACI= 0
##$ASSFACX= 0
##$ASSWID= 0
##$AUNMP= <proc_1d>
##$AZFE= 0.1
##$AZFW= 0.1
##$BCFW= 0
##$BC_mod= 2
##$BYTORDP= 0
##$COROFFS= 0
##$CY= 18.4799938201904
##$DATMOD= 1
##$DC= 0
##$DFILT= <>
##$DTYPP= 0
##$F1P= 9.9274215381318
##$F2P= -0.165520771350173
##$FCOR= 1
##$FTSIZE= 16384
##$FT_mod= 6
##$GAMMA= 0
##$GB= 0
##$INTBC= 1
##$INTSCL= 4.127829e-11
##$ISEN= 128
##$LB= 0.05
##$LEV0= 0
##$LPBIN= 0
##$MAXI= 10000
##$MC2= 0
##$MEAN= 0
##$ME_mod= 0
##$MI= 50
##$NCOEF= 0
##$NC_proc= -6
##$NLEV= 6
##$NOISF1= 3.799351
##$NOISF2= 2.8
##$NSP= 0
##$NTH_PI= 0
##$NZP= 0
##$OFFSET= 16.48848
##$PC= 4
##$PHC0= -415.39
##$PHC1= 3.101563
##$PH_mod= 1
##$PKNL= yes
##$PPARMOD= 0
##$PSCAL= 4
##$PSIGN= 0
##$REVERSE= no
##$SF= 200.130005582386
##$SI= 16384
##$SIGF1= 3
##$SIGF2= 2
##$SINO= 400
##$SIOLD= 16384
##$SREGLST= <1H.CDCl3>
##$SSB= 0
##$STSI= 16384
##$STSR= 0
##$SW_p= 4139.07284768211
##$SYMM= 0
##$S_DEV= 0
##$TDeff= 32768
##$TDoff= 0
##$TI= <>
##$TILT= no
##$TM1= 0
##$TM2= 0
##$TOPLEV= 0
##$USERP1= <user>
##$USERP2= <user>
##$USERP3= <user>
##$USERP4= <user>
##$USERP5= <user>
##$WDW= 1
##$XDIM= 16384
##$YMAX_p= 342740877
##$YMIN_p= -1040221
$$ End of Bruker specific parameters
$$ ---------------------------------
##NTUPLES= NMR SPECTRUM
##VAR_NAME=  FREQUENCY,     SPECTRUM/REAL,   SPECTRUM/IMAG
##SYMBOL=    X,             R,               I
##VAR_TYPE=  INDEPENDENT,   DEPENDENT,       DEPENDENT
##VAR_FORM=  AFFN,          ASDF,            ASDF
##VAR_DIM=   16384,         16384,           16384
##UNITS=     HZ,            ARBITRARY UNITS, ARBITRARY UNITS
##FACTOR=    0.252644378177508, 1,           1
##FIRST=     3299.83951724647, 0,            0
##LAST=      -839.233330435636, 0,           0
##MIN=       -839.233330435636, -1040221,    0
##MAX=       3299.83951724647, 342740877,    0
$$ Real data points
##PAGE= N=1
##DATA TABLE= (X++(R..R)), XYDATA
$$ [...]
12131d57266K19733k33421J30347o9418J40687m5061r3959K72694l05462P7675
12121c63451O482N70L20399n67760L20750m4855K0175q3462j21114K29075j7949
12110c01140j44701K67733j44362J66176o21887L98584K91227j82750O2223O8282
12100a40615j12997j09599j00262N67145k91079N5475l11130J81444j83746K21166
12090b24198l4371Q9266k02338J80666j83745p6491J00467M00891l35125K15844
12080f9134m70548K74523L90296m31788J80950j95524n3165P1397J08084k25226
12070d20135o1452K98655N7883n24134O54771m58088L79752j92044j04112J10423
12060b58481k25476K98126r2171J43900j47383m7903O7196j08127Q7423R8137
$$ y = [-457266, -237533, -470954, -340607, -410025, -269338, -314399, -408358, -135664, -441126, -363451, -356969, -356399, -36000, -603760, -283010, -327865, -307690, -391152, -512266, -283191, -301140, -445841, -178108, -322470, -156294, -778181, -379597, -88370, -271120, -208897, -140615, -253612, -363211, -463473, 103672, -187407, -131932, -443062, -261618, -445364, -224198, -258569, -169303, -371641, -190975, -374720, -451211, -350744, 50147, -284978, -69134, -539682, -265159, 125137, -306651, -125701, -321225, -374390, -302993, -194909, -420135, -481587, -182932, -125049, -649183, 5588, -452500, -72748, -264792, -368904, -258481, -483957, -185831, -278002, -134102, -281485, -329388, -262192, -370319, -282896, -184759]
12050a84759J57519l49733j2496J52339L7716k75553K93699K5973J1116j02997
12040b47176R6734l5263n9681k03791K28682J26485j7939j78289J08481J19147
12030f2610n82827K96126j28152L71526j78597r0823o13J39130j98039Q3892J93861
12019a57126k9365k43740R7368j52350K36472k33206K16736q2660K8925L6973
12009b81973k02890J72343L15354m70390m6931K86134q8334M3403J17004p5304
11999b31584q0743K24648l20333L00186l81380M75747m57582K97032j50274J33359
11989a90924Q520n8329k73771O29539j39294k88416p7031J59268J2829M6313N5668
11978a15628P857j17488j81664J40118J60120k20440M9194k22461O53125j85547
$$ y = [-184759, -27240, -376973, -389469, -237130, -199414, -474967, -181268, -155295, -144179, -247176, -150442, -185705, -245386, -449177, -220495, -94010, -111949, -290238, -181757, -62610, -645437, -349311, -477463, -105937, -284534, -375357, -375970, -236840, -434879, -350987, -157126, -186491, -430231, -332863, -485213, -248741, -481947, -265211, -347871, -318946, -281973, -484863, -312520, 2834, -467556, -514487, -228353, -316687, -273284, -156280, -231584, -312327, -87679, -408012, -107826, -489206, -13459, -471041, -174009, -324283, -190924, -182404, -240733, -514504, 115035, -24259, -312675, -389706, -230438, -217609, -171296, -115628, -107771, -225259, -406923, -266805, -106685, -327125, -277931, -500392, 152733, -32814]
11968c2814l79688K11691m9003M5608j55712J45869J34515j58901r4084J84658
11958a47861K30365k63315j54204K10138j26014o9160J94002K3368l98390N6296
11948d44775J38624J87479j93228P776J42074p7078R3794k05999R7522L1054K00310
11937b2447r1883j87568K33945l16662K76466N9738l2546J20190k29235N58J09400
11926h0044P6078j44055l8761K61350l91921L22832j56886j51740L25818m1018
11916a8347k07390k76242L44073k6728R2843j91741j7346r4083J25691j04531
11906c73801J49519O2471J19203k05219K15437j87328J11803j86681k52552L43307
11896b03841L83300n58320J24698L05105l51477J0536M04586k06203k56785K02706
$$ y = [-32814, -412502, -200811, -249814, -204206, -359918, -214049, -79534, -238435, -332519, -147861, 82504, -180811, -335015, -124877, -250891, -320051, -126049, -102681, -501071, -444775, -306151, -118672, -311900, -304124, -162050, -239128, -145334, -351333, -253811, -222757, -22447, -114330, -301898, -67953, -384615, -108149, -48411, -80957, 39233, -190002, -189444, -80044, -3966, -148021, -186782, 74568, -317353, 5479, -151407, -303147, 22671, -18347, -225737, -501979, -157906, -184634, -91791, -283532, -300878, -394961, -269270, -373801, -224282, -161811, -42608, -247827, -32390, -219718, -107915, -294596, -547148, -203841, 179459, -378861, -254163, 50942, -300535, -289999, 114587, -91616, -348401, -145695]
11886a45695L80037m65094l1748J69207O642K7869k39972p217p1048K42104J26182
11875h733j7071k86602l0382O8494L2998J08425Q4624P1844j92245k36109K99624
11864a05133o5542N3105J86727k90852r3599K69726l20649K32727O6358k4494
11854i1626p9570l03548L09025K77874m31147J67812L24642l05338N3124m9486
11844a28238P9666k75856J80313m5670J43412l28512J94414k16069M03920j2528
11834e148J8122k69837N41j4203J07359q850O4905J7868k69547J26245J68330
11823f4215n8461J17373J56850k81206j31275J01037l05453L05307J6481J43578
11813A6l9010l7281P208k79385M34062j43822J29802j24198j2216l44377O72924
$$ y = [-145695, 234342, -230752, -262500, -93293, -86651, -58782, -298754, -305971, -377019, -134915, -8733, -25804, -312406, -342788, -274294, -241296, -132871, -48247, 23597, -168648, -404757, -105133, -170675, -117570, 69157, -221695, -315294, -45568, -366217, -133490, -67132, -91626, -171196, -474744, -165719, 112155, -318992, -151180, 173462, -131876, -78752, -128238, -48572, -324428, -144115, -189785, -46373, -374885, -180471, -396540, 7380, -5148, 12974, -256863, -256322, -270525, -163166, -172016, -107111, -89243, -358790, -232545, -64215, -122676, -5303, 151547, -129659, -260934, -159897, -465350, -160043, -143562, 16, -38994, -76275, -69067, -348452, 85610, -58212, 71590, -52608, -64824, -409201, 263723]
11802B63723l05469j74679L93853l5160k40688Q8310k94265L38059o6309k43244
11792b75869K8683K81847k82153N4969J47545j80464J49663M8258J02642k64746
11782a89625m6193K97880k17784K80160q9846k25684J11794n6919M3901r3370
11772a85686L84616j71928o6585l06241L45352O1806m3391j33391J88271j49454
11762g6631j57694N3487L33170j69230j35046J14743p9917J36086L3397j69315
11752a16950L63607j97798j72876k0133K04818j37172K13110j95601J03759M8775
11742I3539l48630L11189J02193k22796j02690L95689J83719o75786K9567L80497
11732A46491l53859K93563P5654j6245N365q0502j47428p8287K86980q9744j63508
$$ y = [263723, -41746, -216425, 177428, 142268, -98420, -10110, -304375, 33684, -32625, -275869, -247186, 34661, -247492, -192523, -44978, -225442, -75779, -27521, 75121, -189625, -235818, 62062, -155722, 124438, 34592, -191092, -79298, -136217, -92316, -185686, 198930, 27002, -39583, -345824, -472, 61334, 17943, -115448, 72823, -76631, -234325, -180838, 152332, -16898, -151944, -37201, -117118, 18968, 52365, -116950, 246657, 48859, -124017, -144150, 60668, -76504, 136606, -58995, 44764, 93539, -255091, 56098, 158291, -64505, -167195, 228494, 412213, -263573, -234006, 146491, -207368, 86195, 161849, 145604, 150969, 70467, -76961, -155248, 131732, 41988, -121520]
11721a21520K49732l06120M02790j22381k42499K68260L4672R7973l53601j484
11711i4178J32403j20111L20770l13035J20157p0974o8117J50906Q4614R9407
11701B41842k29146q956o903R178j72472L54809j80374K76382m69202Q2835k350
11690a04357K15798k72108J20547K12509j92996q8784R0906K40818j48155J68185
11680B42363k22087J68572L2046j49726j84262L27922p0411M8674j15139L0708
11670A08660j78433J66977M3803P9335j03918J63429j69831P3867m62911O56908
11660C77886j64536J51472k96722j80960K06741J07508l5912O6852k9272R0690
11650B93747k88683K12434l21052K85458Q8341k89248r919L48951o2999q0733
$$ y = [-121520, 128212, -177908, 224882, 102501, -139998, 128262, 162934, 260907, -92694, -94178, 38225, -81886, 238884, -74151, 46006, -24968, -93085, 57821, 142435, 241842, 12696, 3740, -3163, 6015, -166457, 188352, 7978, 284360, -184842, -102007, -104357, 111441, -160667, -40120, 172389, -20607, -109391, -18485, 222333, 74178, 242363, 20276, 188848, 220894, 71168, -113094, 214828, 144417, 193091, 77952, 108660, -69773, 97204, 141007, 220342, 116424, 279853, 110022, 183889, -279022, 377886, 213350, 364822, 68100, -112860, 93881, 201389, 165477, 232329, 203057, 293747, 5064, 217498, -103554, 181904, 270245, -19003, -28922, 320029, 257030, 176297]
11640A76297l0352J8286j51654K23402j13089k9397J29181J29644j89125K1702
11630A84895p273L5450O4770q0827l0542L90552l63855o1757M7915j26377J36998
11619A89949o428Q0371r7665j11387L81145k38995M6341K48313l30883J47165
11609C07926J19462K6351j60327J05803j75375K60335o1884p7550k71950K96215
11599C69006k11075K00788k08727J96291j66719Q5078q2287j3472J75655J58015
11589E02553l29458J86214j05371k07229K38128K6328N253P332J14792k50968
11579A87574M5804K03526k53610K06121J79984k26841M36131o09899K28617n5662
11569C41745j0825J4002J48419k7990L2214m3069M6496m15294K64518m9896J86131
$$ y = [176297, 145945, 164231, 12577, 235979, 122890, 93493, 222674, 352318, 163193, 184895, 177622, 213072, 277842, 197015, 166473, 557025, 193170, 131413, 179328, 52951, 189949, 183521, 263892, 166227, 54840, 435985, 196990, 243331, 491644, 160761, 307926, 427388, 453739, 293412, 399215, 223840, 484175, 422291, 344741, 72791, 369006, 157931, 358719, 149992, 346283, 179564, 264642, 182355, 168883, 344538, 502553, 173095, 359309, 253938, 46709, 284837, 311165, 316418, 323750, 438542, 187574, 233378, 436904, 183294, 389415, 569399, 342558, 778689, 168790, 397407, 341745, 330920, 344922, 493341, 465351, 497565, 454496, 500992, 85698, 350216, 300320, 486451]
11558D86451r5072J6860J60574l856k41583L65067k05502n8243j03889J78095
11548D98902j01845k2676M8169k03886K61472J72971j1578l69574l7465J80316
11538D14806L8298J15734J9819j57075K6341L1323J7929J16718J46554l69061
11528D01386J36225j3775K3560R4891n0080J80038q1671o6911M8974k15927J77281
11517F33991j04657J96221l07132j14175L19959o0685O3257K00366j22689l50496
11507C53960K42614j11442L4375J13768K01597j8082k87941P8707M684R2600K48485
11496I53325m24485K85845k79419J85240K1365j19560R2737j12949K04825p7482
11486G29442j03533K92383m5889k02229K31491k04834L22145l13874k57032L15686
$$ y = [486451, 391379, 408239, 568813, 564957, 323374, 688441, 482939, 424696, 320807, 498902, 397057, 374381, 422550, 218664, 480136, 653107, 641529, 271955, 234490, 414806, 453104, 568838, 588657, 431582, 457923, 489246, 507175, 623893, 770447, 401386, 537611, 523836, 547396, 642287, 592207, 772245, 690574, 623663, 672637, 456710, 633991, 529334, 725555, 418423, 304248, 624207, 563522, 626779, 827145, 704456, 353960, 596574, 485132, 519507, 633275, 834872, 816790, 528849, 607556, 612240, 704840, 953325, 528840, 814685, 535266, 720506, 741871, 622311, 715048, 602099, 806924, 729442, 625909, 918292, 872403, 670174, 901665, 696831, 1018976, 705102, 448070, 763756]
11476G63756K44019j49924O105n6608r7198O2593R9200l61373K77487q353L6667
11465H16371o867L80371m32679J38575R7166m5266j20175K3023k80670M22729
11455I92578r647j63900L09616k17889j80252L20259J4595l58618M25297N2536
11445A184575k22098l06360K61114J34710j08066K00046j09822j48013K65759
11436A151845l96321K31587J28627o4987j41722J23403l5347K32144m50839M75485
11426A253875j71744L31948l32549p2310J02969j92985O8773L41681j6150q0853
11416A232655q3033K1227k0057m2783J68516m881o8654n523k23453J09798K87953
11405A371765K7535j49521j52876K09583k55727K97044P2792k04400J11479K42497
$$ y = [763756, 1007775, 857851, 863956, 807348, 710150, 772743, 871943, 510570, 788057, 779704, 816371, 809504, 1189875, 757196, 895771, 992937, 947671, 827496, 850519, 569849, 992578, 982931, 819031, 1128647, 910758, 730506, 1050765, 1065360, 706742, 1132039, 1184575, 962477, 656117, 917231, 1051941, 943875, 1143921, 1034099, 886086, 1151845, 755524, 987111, 1115738, 1050751, 909029, 1032432, 997085, 1229229, 778390, 1253875, 1082131, 1414079, 1081530, 1009220, 1112189, 919204, 987977, 1329658, 1313508, 1232655, 1149622, 1170849, 1150792, 1108009, 1276525, 1271644, 1202990, 1197467, 974014, 1083812, 1371765, 1399300, 1249779, 1096903, 1306486, 1050759, 1347803, 1420595, 1216195, 1327674, 1570171]
11395A570171l56535m0689P5750L36963j56376J18404j84505J39878j8692n3337
11385A431032K1840P773j66804N2365J13422J32094q3448J22475n1277o8312O4686
11374A575846k41978J57302r4518Q9772O9586K45923m03786M195K17549j55692
11364A464199Q3703J4887K72477p1867j02435J47093l35749L10636J522j43469
11354A640997R941N3265o8231K3224K90429q4324q6764M0477j64797J06476N2338
11343A813031j69789M22115k13043P1788j42564J43414K2118n5929n5712R9164
11333A934593o0877Q6R2997L11596m56181J49865P1797R5694k34673j020J57865
11322B061742R7910J11111k61799O3319J06823l94095J16185J46034J52477n397
$$ y = [1570171, 1213636, 1172947, 1248697, 1585660, 1429284, 1547688, 1363183, 1503061, 1484369, 1431032, 1452872, 1460645, 1293841, 1346206, 1459628, 1591722, 1508274, 1630749, 1579472, 1511160, 1575846, 1333868, 1491170, 1396652, 1486424, 1556010, 1801933, 1398147, 1402342, 1619891, 1464199, 1547902, 1562789, 1835266, 1763399, 1660964, 1808057, 1472308, 1782944, 1784466, 1640997, 1650938, 1704203, 1635972, 1659196, 1949625, 1865301, 1778537, 1819014, 1654217, 1760693, 1813031, 1643242, 2065357, 1852314, 1924102, 1781538, 1924952, 1947070, 1891141, 1835429, 1934593, 1873716, 1873802, 1966799, 2278395, 1822214, 1972079, 2043876, 2139570, 1904897, 1903877, 2061742, 2159652, 2270763, 2008964, 2072283, 2179106, 1785011, 1901196, 2047230, 2199707, 2194310]
11312B194310J04469k75139O0786n490K13024O234q2738j59765R2937J10738p055
11301B252311K41520j13547q9716J68361j33518j29001L23670K9001N0538m46224
11291B153395J96421n804J07484J89901j81997J92387j94842K07226l3531j08959
11281B521681J59499n6812J4844J06561K5789J63699J1852r98M94005J11577L57984
11270C909681O91898M82143N56357j10880J13520l91181o51439l14437l08434
11261C977228j68643n40166N0983j69750j9601j86999K96399m03343L28535l31641
11251B833002L51433j11962Q0549j86260p6564j7291J23472Q4183j15597k0217
11241B944748Q7585k92208M46905J196p0396l14388K42054k18644J44405N0120
$$ y = [2194310, 2298779, 2023640, 2084426, 2078936, 2291960, 2298194, 2215456, 2055691, 2148628, 2259366, 2252311, 2493831, 2380284, 2290568, 2458929, 2325411, 2196410, 2520080, 2549081, 2599619, 2153395, 2349816, 2344012, 2451496, 2641397, 2459400, 2651787, 2456945, 2664171, 2630640, 2521681, 2681180, 2624368, 2639212, 2745773, 2771562, 2935261, 2947113, 2946115, 3440120, 3551697, 3909681, 4601579, 5083722, 5640079, 5529199, 5642719, 5251538, 4600099, 4285662, 3977228, 3808585, 3268419, 3319402, 3149652, 3130051, 2943052, 3239451, 2836108, 3164643, 2833002, 3184435, 3072473, 3153022, 2966762, 2890198, 2872907, 2996379, 3080562, 2964965, 2944748, 3032333, 2740125, 3187030, 3188226, 3117830, 2803442, 3045496, 2826852, 2971257, 3021377]
11231C021377N9685k711j59292m3741n1284M24545o6898q7633k20888n940K12684
11220C079904P5800m7608j40058K5717k5456Q5689M995k3131j02964J71388L7793
11209C142069j12198J99921j98806O1767P160o237O5683l705j06719k7048J18543
11198C140430j65019J46153j70836J13348q3180K29756K9229J3867j56480J78627
11188C275895l03058J55219K2110k71038K27304M714l1753K96173j88335J2437
11178C199668L9675k995O0157j38198l37387M45426K3159j27726k81321J76358
11168C056816J69281m57183L13057J02603j69539K47661j13094j07784N3663m5152
11158C050329K88242l65576J42770j12579J32827q1774J21756J73525m21790J06809
$$ y = [3021377, 3081062, 3078351, 2919059, 2875318, 2824034, 3248579, 3181681, 3094048, 2873160, 2867220, 3079904, 3155704, 3108096, 2968038, 2993755, 2968299, 3053988, 3058983, 3035852, 2932888, 3104276, 3142069, 3029871, 3229792, 3030986, 3092753, 3099913, 3093676, 3159359, 3155654, 3048935, 3021887, 3140430, 2975411, 3121564, 2950728, 3064076, 2980896, 3210652, 3239881, 3253748, 3097268, 3275895, 2972837, 3128056, 3150166, 2879128, 3106432, 3111146, 3079393, 3375566, 3187231, 3199668, 3239343, 3236348, 3296505, 3158307, 2820920, 3266346, 3289505, 3161779, 2880458, 3056816, 3226097, 2768914, 3081971, 3184574, 3015035, 3262696, 3149602, 3041818, 3095481, 3050329, 3338571, 2972995, 3115765, 3003186, 3136013, 3054239, 3175995, 3349520, 2927730, 3034539]
11148C034539n5940K19781j3165k99451L54014k60580O8882j43865M22958l17167
11138C010006k51904K02002m6286m4036R3072r3022K04840k23035L43994j37888
11128C057743q1833J45246j43508J10751j42450j67958J37255O5567L6305k7861
11118B989257j99457K02492k79022K30133Q3000k07013K382j01848l794o0185
11108B655945L07466k4364j23408M0048l9617R0056j78647j57928K41699j3900
11098B797350p3191j753j46820o289l9563J87997J83581n33436M14025j03600
11088B678301j14796L7347M1914j96141K02256k76187K71258j24708p4069L36924
11078B782099l90733j4665p8586M06819N9925l61961j41821L90034l53695J27137
$$ y = [3034539, 2978599, 3198380, 3185215, 2885764, 3239778, 2979198, 3048080, 2904215, 3327173, 3010006, 2758102, 2960104, 2913818, 2869782, 2962854, 2869832, 3074672, 2851637, 3195631, 3057743, 2975910, 3121156, 2977648, 3088399, 2945949, 2777991, 2915246, 2980813, 3017118, 2989257, 2789800, 2992292, 2713270, 2943403, 3026403, 2819390, 2821772, 2719924, 2716130, 2655945, 2963411, 2939047, 2815639, 2855687, 2816070, 2906126, 2727479, 2569551, 2811250, 2797350, 2724159, 2722406, 2575586, 2569297, 2529734, 2717731, 2901312, 2367876, 2781901, 2678301, 2563505, 2600852, 2642766, 2446625, 2648881, 2372694, 2643952, 2519244, 2445175, 2782099, 2391366, 2376701, 2298115, 2704934, 2764859, 2402898, 2261077, 2651111, 2297416, 2424553]
11068B424553k03157K70607k34803J92258j22559L69230l55700J14676K0181o6298
11058B408988r7287J80509l79580K58112m4403O6573Q23j34267k69167N02415
11048B492716m28247K23849l8116l8453r0400J06818j73880K12173j24946K36802
11038B378316k75541L23877k02497k02172P6976p8234J76704j355j61005j8727
11028B016342J15721o6337j9769l1093J30506j05481j28052J71731l53827K84773
11018B014514J25308j5961j06852l89811K22760J37489K11496l83897q610K62208
11008B068644k12779k22663J95259J0763K72664k55860o4869J48936k25084K19897
10998A934908j14522Q6620k1779j09181K9215j70664R4942J55042k55001O8322
$$ y = [2424553, 2221396, 2492003, 2257200, 2449458, 2326899, 2696129, 2340429, 2455105, 2475286, 2408988, 2311701, 2492210, 2112630, 2370742, 2326339, 2392912, 2393735, 2259468, 1990301, 2492716, 2064469, 2288318, 2250202, 2211749, 2121349, 2228167, 2054287, 2266460, 2141514, 2378316, 2102775, 2426652, 2224155, 2021983, 2098959, 2020725, 2197429, 2196074, 2035069, 2016342, 2132063, 2065726, 2045957, 2014864, 2145370, 2039889, 1911837, 2083568, 1729741, 2014514, 2139822, 2123861, 2017009, 1627198, 1849958, 1987447, 2198943, 1815046, 1806436, 2068644, 1855865, 1633202, 1828461, 1839224, 2111888, 1856028, 1791159, 1940095, 1715011, 1934908, 1820386, 1907006, 1885227, 1776046, 1805261, 1634597, 1729539, 1884581, 1629580, 1697902]
10988A697902l012j28218J42912k4614J52248j09885j91710J08742m8252j51204
10978A444909J30738q4740K30171l95903K08836J6703j05283J01031m5313J61935
10968A663084K40811n75061K36443J06126r2065k10209J07595J14258q4565j68960
10958A337457K07680k27469L59502n00197J91876K4792J34356o5569j38991J9282
10948A342719K0966J78446Q4790n44876O52399n93958K99270j59204J42187k52664
10938A170075J13317K02793m1656r2318J30614n01281M78823m84575K74223J5078
10928A265093N7340j2708p1485J426r6119J49649j4353k00338K77821j22172n1308
10917A182846p0003j41840R3892l85P2460j05078L14768r6204l00743L57467l2706
$$ y = [1697902, 1694890, 1566672, 1709584, 1684970, 1837218, 1727333, 1535623, 1644365, 1596113, 1444909, 1575647, 1490907, 1721078, 1325175, 1534011, 1550714, 1445431, 1546462, 1501149, 1663084, 1903895, 1328834, 1565277, 1671403, 1579338, 1369129, 1476724, 1590982, 1506417, 1337457, 1545137, 1317668, 1677170, 1176973, 1368849, 1393641, 1527997, 1462428, 1323437, 1342719, 1363685, 1542131, 1626921, 1082045, 1734444, 1140486, 1439756, 1280552, 1422739, 1170075, 1283392, 1486185, 1444529, 1352211, 1482825, 981544, 1460367, 975792, 1250015, 1265093, 1322433, 1309725, 1238240, 1239666, 1143547, 1293196, 1278843, 1078505, 1356326, 1234154, 1182846, 1112843, 971003, 1064895, 1064510, 1136970, 1031892, 1346660, 1250456, 949713, 1307180, 1274474]
10906A274474m12319K69300J23929K6025k34110n8699K43535j50758Q0636j99872
10896I62141J41954K46424m54820K53343j88506J36509m6290K0016q361o1110
10886A001300M91N6191j45542Q3985k3830j95097K67266o631m4677j73296J42804
10875I62964o1341N0454J07214j78581J47509r8660k35439M4286K19368Q5108
10865A042882o8126l5764k2531j6327O9208Q2971q9476o2167j49379j0014L24524
10854A065801k60895K15968q5900j34511K52298j50322o5516N7458k9675M9049
10844I13755m40429N94750k59233R4374k44954J31159J43250J09411m79674N75075
10834A137484n06630K82941k79816N51333m30313j34831k78154N12227L2464j17426
$$ y = [1274474, 862155, 1131455, 1255384, 1281409, 1047299, 988600, 1232135, 1081377, 1162013, 962141, 1104095, 1350519, 895699, 1149042, 960536, 1097045, 1050755, 1070771, 1062410, 1001300, 1001791, 1057982, 912440, 996425, 972595, 777498, 1044764, 1038133, 993456, 820160, 962964, 901623, 952077, 1059291, 880710, 1028219, 929559, 694120, 738406, 957774, 1042882, 974756, 938992, 916461, 900134, 969342, 1052313, 962837, 900670, 751291, 741277, 1065801, 804906, 1020874, 934974, 800463, 1052761, 902439, 836923, 894381, 864706, 913755, 473326, 1068076, 808843, 903217, 658263, 789422, 932672, 1042083, 562409, 1137484, 630854, 913795, 633979, 1185312, 754999, 620168, 342014, 854241, 886705, 769279]
10824G69279j40010M30494l18629O3093k53324J41754k0164k6334j07178J62679
10814G01660J7102R1249k80866J62474o8678M4126n0042l933K05930k05682o1207
10803E52133n6681J30012L78868m88627K60190m2433j42134Q1667R4986k38502
10793E29479O1822J65023L5635o4155J8535l1599o0211M8766k51757K24731J8135
10782F94404j49191J30714j26271j20744K20725k9726R7360k09991J89368j50947
10772E45701n648j27457P0017M57227m54668n1982J56835R6994j87831j27441
10762C71747K29084K8840k17464J12741M0188j26786K23333l86523J85621j46079
10752C14702L28466l52789K49214K889K1323j35184J87175k41251J046j28312
$$ y = [769279, 629269, 1059763, 741134, 804227, 550903, 692657, 672493, 646159, 538981, 701660, 718762, 810011, 529145, 691619, 622941, 667067, 617025, 613092, 819022, 613340, 552133, 495452, 625464, 1004332, 515705, 775895, 733462, 591328, 672995, 767981, 529479, 591301, 756324, 791959, 727804, 746339, 714740, 654529, 703295, 451538, 676269, 694404, 545213, 675927, 549656, 428912, 649637, 619911, 717271, 507280, 696648, 545701, 540053, 412596, 482613, 939840, 485172, 433190, 590025, 687019, 499188, 371747, 600831, 629671, 412207, 524948, 565136, 438350, 661683, 275160, 460781, 314702, 643168, 290379, 539593, 542482, 563805, 428621, 615796, 374545, 375591, 247279]
10742B47279K67790L1648j39226l4168J32382K1869Q6005n93527Q47860n28872
10732C39040P7809R4179o7790p0626M9876P4754j30807J37018l9066n5166L16019
10721G25240m27792K45690j18947J110p5998N2102o4144J48513k834j39758j25395
10710B17787L33003j24694J04096m4028n0733j02424J71858k19188n5474M49524
10700F79727k77900O0978m9035j24214J84037k15214N8882K0666Q4506m3660j57132
10689B21641K13102j96166K9652Q4983l96913O72669o1625m76221M0312L27521
10679D58955L9092k16931K8957j9799L5580j82466J09583J18210o2897j35342
10669A72942J40706N4042j59159r7994K44114J4521j64141K7795J93228k42483
$$ y = [247279, 515069, 546717, 407491, 373323, 505705, 527574, 613579, 20052, 867912, 339040, 416849, 511028, 443238, 372612, 422488, 497242, 366435, 503453, 464387, 409221, 725240, 297448, 543138, 424191, 425301, 349303, 401405, 337261, 485774, 482940, 343182, 217787, 550790, 426096, 530192, 486164, 435431, 333007, 504865, 285677, 230203, 679727, 401827, 462805, 413770, 289556, 473593, 258379, 317261, 337927, 422433, 378773, 221641, 434743, 238577, 268229, 353212, -43701, 628968, 567343, 91122, 131434, 458955, 498047, 281116, 310073, 290274, 325854, 143388, 252971, 371181, 308284, 172942, 313648, 367690, 208531, 110537, 354651, 369172, 205031, 232826, 426054, 183571]
10659A83571N6934O7025j3911j29829L3706R3351K42012k88356K49648k45158
10649B48993J73954l76411J49388J41365n8425j30901J23876L02115l93596j06125
10639G4233K77314m0599K2083m3039p2477N7536k20643J45990J67707j90391J35398
10628C13112k31533L10418K27743l72891r7751K30334r9583J0231l13545J74285
10618A50820Q8800K26368m10569L69654P4098k20199k14253K93847k14692J32223
10608B76097j13237J99714j26126K03186k96369M43347P3667o63848K54303J06289
10598C57023l65490L69337L9307J0521k66602m9822L57528l1145n33142M49228
10588C36743j75720M3401j69076K45316p2471p7022P0934O1030l5579n5511O9792
$$ y = [183571, 240505, 307530, 293619, 163790, 197496, 290847, 532859, 244503, 494151, 248993, 422947, 46536, 195924, 337289, 278864, 147963, 271839, 573954, 180358, 74233, 351547, 310948, 333031, 289992, 217515, 275051, 54408, 200398, 368105, 177714, 313112, 81579, 391997, 619740, 246849, 149098, 379432, 279849, 290080, -23465, 150820, 239620, 465988, 55419, 425073, 499171, 278972, 64719, 358566, 143874, 276097, 162860, 362574, 236448, 439634, 143265, 586612, 660279, -3569, 250734, 357023, -8467, 360870, 400177, 410698, 144096, 94274, 451802, 420657, -112485, 336743, 161023, 204424, 35348, 280664, 208193, 131171, 202105, 263135, 227556, 172045, 241837]
10577B41837m0057j86895J80464M8591j50704K45771n23415N15931l06327P7971
10567A03167J48663k12743L69211k66274k04758L44227l1415o7796O2725j15782
10557A29225o7024J49317k50226J93529k4848J01460l22699L21911O6604m5196
10547B52053j17561J33877j3054j28285j7944K78686k58664j53348J62711K21445
10537C59916j16050n57699O42539L73352o89928n1948K29084K35196j10567k89011
10527B4884J92557K26401n57167J55575L8699J15213N0503l7306O8428k89970
10517a2183N1453K40173l21343O4470O4335K2067p9662M2449J2469M6484q1610
10506D9102O3353O249K06207l9002k33877J04622J89585m78252L24457K7300k93907
$$ y = [241837, 201780, 14885, 195349, 243940, 93236, 339007, -184408, 331523, 25196, 103167, 251830, 39087, 408298, 142024, -62734, 281493, 250078, 182282, 245007, 129225, 62201, 211518, -38708, 154821, 129973, 231433, -91266, 230645, 297249, 252053, 134492, 268369, 255315, 127030, 109086, 387772, 129108, -24240, 138471, 359916, 243866, -313833, 328706, 702058, 12130, -39818, 189266, 424462, 313895, 24884, 217441, 443842, -113325, 42250, 80949, 196162, 246665, 209359, 277787, -12183, 39270, 279443, -41900, 22570, 86905, 108972, 29310, 71759, 84228, 130712, 49102, 112455, 118704, 324911, 285909, 52032, 156654, 346239, -132013, 192444, 219744, -74163]
10495g4163J83168M5627l2706R9440l0303j06089R8430J6980k43740K80342j17564
10484A19422K075l23361M01817n1186J04922l42924K34679K6557R6849k46292
10474B2558J49172K5930N107l24364L18466J3237k4630R497o9041k5787k9759
10463G0386l75152M26297K4233J83737n16727N11944k35334r1763m1292J83414
10453A39743q1184q7848J42372j12156P8339j97087L47160J73072k25249l73300
10443a96138J99417J91763N0681m36118K30471q5563K13724k22085Q6691K0871
10433E3714K74548l95549J16734K2291L27075l95320J52399j70914K33161m08329
10423a90190L93317k14452K8443j70718K28337k62834K66975J70668l17127k39172
$$ y = [-74163, 109005, 154632, 121926, 221366, 191063, 84974, 183404, 200384, -43356, 236986, 119422, 121497, -201864, 199953, 148767, 253689, -89235, 145444, 172001, 268850, 22558, 171730, 197660, 202767, -121597, 196869, 210106, 185476, 194973, 125932, 100145, 70386, -304766, 121531, 145764, 329501, -187226, 324718, 89384, -2379, -43671, 139743, 58559, -29289, 113083, 927, 79266, -117821, 229339, 402411, 177162, -196138, 3279, 195042, 245723, -190395, 40076, -45487, 168237, -53848, 32843, 53714, 328262, -67287, 49447, 71738, 398813, 3493, 155892, -15022, 218139, -190190, 203127, -11325, 17118, -153600, 74737, -188097, 78878, 249546, -67581, -306753]
10413c06753L51526L54232l31515j1837K78587l57036k5778Q97J71008p2951P4784
10402A25164k42293K92665l1003j30712K70561k00921N4905J36181l16081q6632
10392a28166Q8614J35302j36775K84317j01466k35333P4270K38949p3580j12802
10382C3330j26828M3357J35019N1379j78727j22524L79241j31967M0747j30390
10372g363o3670J35767o912q2903j62801L49194l51929K86865k17653K36397k33080
10361a18088J43738o6210K06084j56427o1790L7921n3156J22889K47953l1350
10351B71564m07959M6736J15424L05744m17018K3413Q9757n055L7289l05316L67788
10340A22367L7165m6689j7400k72335K92914k83357R1610J14957l0569p1371k7198
$$ y = [-306753, 44773, 399005, 67490, 55653, 334240, -22796, -48574, -47677, 123331, 50380, 125164, -117129, 175536, 144533, 13821, 284382, 83461, 138366, 274547, -41534, -128166, -39552, 95750, -41025, 243292, 141826, -93507, -19237, 219712, 146132, 33330, -93498, -50141, 84878, 136257, -42470, -164994, 214247, 82280, 123027, -7363, -71033, 64734, 57822, -25081, -187882, 161312, -190617, 96248, -121405, 114992, -118088, 25650, -40560, 165524, 9097, -52693, -14772, -67928, 54961, 302914, 271564, -136395, -89659, 25765, 331509, -85509, -62096, 27661, 22606, 59895, -245421, 122367, 159532, 112843, 95443, -176892, 116022, -167335, -75725, 39232, 8663, -62708, -89906]
10329h9906j07075L15817l46370L63047k20432K403J03763Q4462k30804m8346
10319a73441L36441J46394p91720L45294J10730K42919q0094n2796R9495l9061
10309A44161m40996M00474l2706j31194M266J88468J35391k87152l3170P1044
10299A8586j25234L23333o3073k28216K84406L4617l98233L70574M4427l35066
10289g3879n7465J78057J59775p7340k52582K67846j52221J80691l72286j1651
10279b11055J22354K55296m5364j79610l6627n6307K4044P7493n7341L51538k68036
10268b3615l1848P0711j72818Q1785j79002J04940K28698P3791n5141l47324K3818
10257b26005L02647l6204J4556k48536Q8530n4503n3736J33066R0249j81498J8139
$$ y = [-89906, -196981, 118836, -227534, 135513, -84919, -82516, 21247, 105709, -125095, -173441, 163000, 309394, -482326, -137032, -26302, 216617, 136523, 83727, 183222, 144161, -296835, 103639, 70933, -60261, -55995, 132473, 267864, -19288, -52458, 18586, -106648, 216685, 153612, -74604, 209802, 244419, -153814, 216760, 261187, -73879, -131344, 46713, 206488, 129148, -123434, 144412, -7809, 172882, -199404, -211055, -88701, 166595, 121231, -58379, -95006, -151313, -127269, -49776, -107117, 244421, -23615, -55463, 15248, -157570, -75785, -254787, -149847, 78851, 152642, 97501, -249823, -226005, 76642, 40438, 54994, -193542, -105012, -159515, -213251, -80185, 10064, -171434, -153295]
10246a53295P3472p8532J18681K8084J74161j92194j66325J07911J27193K31950
10236B71106j39869L0105P7601n59783J50000M44186P6525l40197k20237L01708
10226I1145m2934j78204j51615J22948N60583n25536P9565P4790r6531j21935
10216a87724L88050l59438L07263r0537j91074K22545J77465l56756K73118j68539
10206A4373k32740J72436M5808p2722J40354j05360n6924p5240K70993q5830j85687
10195a70539J78364j29987K20957k56980J54933k40510N53115m57080M3113R8175
10185f439K22064o03674M21989l1344J38759m20451L18440k75395M41170l52845
10175a47726l7974K58627R6864j58471j24753P7449J543k28296M19142m54180
$$ y = [-153295, -79823, -158355, -39674, -11590, 162571, -29623, -195948, -88037, 39156, 271106, 131237, 161342, 238943, -320840, -170840, 273346, 349871, 9674, -210563, 91145, 48211, -129993, -281608, -158660, 401923, -123613, -44048, 30742, -65789, -187724, 200326, -159112, 148151, 57614, -133460, 89085, 266550, -90206, 182912, 14373, -218367, -45931, -123, -72845, 67509, -37851, -94775, -170015, 100978, 15148, -170539, 7825, -122162, 98795, -158185, -3252, -243762, 309353, -147727, -104614, -6439, 215625, -388049, 33940, 2596, 141355, -279096, 39344, -236051, 205119, -147726, -185700, 72927, 169791, 11320, -113433, -35984, -34441, -262737, 156405, -297775]
10165b97775N98979l69936J78136Q9566l00841k98346L15895O1803l2239o9189
10155a23947K0181J11562J36748l34037j3838L34817k63210r2500J0763K57024
10145D3563k47358K00209K8397J23201m64625K99771j65082L25351l68072L15834
10135I1189p6885k0655J59495Q2327m27120M1694K13180L28263l89976j5057N4196
10124D0651m1692q7924M6244J40551l55061J15561J42807L54905k48012k77263
10114a69233K57775r9161J17006j98643j40032M14178j82091j38216J99190j52464
10104i1691L22578l48836K39854J34389k43934q4600k7990K58979l12529r0580
10094b44360M2459J73737P8317J21386p1998p9174j35270L5022o2137Q6105K3612
$$ y = [-297775, 301204, -68732, 109404, 198970, -101871, -400217, -84322, -22519, -54758, -123947, -103766, 7796, 144544, -189493, -203331, 131486, -131724, -224224, -213461, 43563, -203795, -3586, 24811, 148012, -316613, -16842, -181924, 143427, -224645, 91189, 14304, -6351, 153144, 235471, -191649, -149955, 63225, 391488, 1512, -13545, 40651, -1041, -88965, -42721, 97830, -257231, -141670, 1137, 356042, 108030, -169233, 88542, -10619, 106387, -92256, -232288, 181890, -201, -138417, 60773, -91691, 230887, -117949, 121905, 256294, 12360, -72240, -100230, 158749, -153780, -244360, -201901, -28164, 50153, 171539, 99541, 20367, -114903, -79881, -142018, -55913, -32301]
10083c2301j3753K89053n76282M69194l56478N0814R3047j51427J66815N2462
10073h856k1585r484j58643J10120j15459l88K77463O6432k49847q4336K08234
10062A3651L09626l45080M9870N8158J13385l40065K34694J46300k87258r8254
10052a44973L89363k33038k13787K64118o3100j18336J06943J76768n9386m90279
10042c85707L19344K47753j59319k78815K10715J38122m4571q7668J30865j25222
10032c4503j9807M1307K08014m65595K28548P6251J5677j36222K88483m6562k23080
10021f7489R1569O6394k15372K75110o7498J1665J89628n00127K73831r6887l7119
10010g6295J08130J21427p8781r0368l6537J93282j24547J53835n08486M40626
$$ y = [-32301, -46054, 242999, -333283, 135911, -220567, -169753, -76706, -228133, -61318, -8856, -30441, -39925, -198568, -88448, -203907, -204295, 73168, 139600, -110247, -194583, 13651, 323277, -21803, 28067, 86225, 199610, -140455, 94239, 240539, -46719, -144973, 244390, 11352, -202435, 61683, -1417, -119753, -12810, 163958, 104572, -385707, -66363, 181390, 22071, -256744, -46029, 92093, 47522, -40146, 90719, -34503, -54310, -13003, 195011, -270584, -42036, 34215, 49892, -86330, 202153, 155591, -67489, 24080, 90474, -124898, 150212, 82714, 94379, 284007, -216120, 57711, -39176, -76295, 31835, 153262, 74481, -15887, -52424, 140858, 16311, 170146, -338340, 102286]
10000A02286n1457j14816P8418k2914J37895o7660r2704J05425k70771L33083
9990A36785j74935J34041J23977j67511M66384k97866k45727K25673j58536M3261
9980H5546o2631K19018j35900j63281J68273k48829K80969K7192m0913r1956k3917
9969A3571J34052k06760J03622J26843P195M17466o72201K13797j2295J21783
9959B47073l34225K73494j06316l1320N58M6146J44183k01873K07156J11035k16153
9948A39758J64865p9426M7084J95742l53926K30491j69080K15011o0223K63113
9938E93409j83848K69184J4078J04184Q8360Q03834L23247L92276o3694J57146
9928B498176j37167k65060m10260j06378l85116j84966l37086R2328j81113J86960
$$ y = [102286, 50829, -63987, 14431, -8483, 129412, 61752, -30952, 74473, -196298, 136785, -38150, 95891, 219868, 52357, 518741, 220875, -24852, 200821, 42285, 85546, 22915, 241933, 106033, -57248, 111025, -137804, 143165, 170357, 129444, 37488, 13571, 147623, -59137, 44485, 171328, 178523, 595989, -76212, 137585, 125290, 247073, -87152, 186342, 80026, 48706, 49264, 95410, 239593, 37720, 244876, 355911, 139758, 304623, 225197, 272281, 468023, 114097, 344588, 175508, 390519, 330296, 593409, 409561, 678745, 692823, 797007, 885367, 1689201, 2012448, 2404724, 2341030, 2498176, 2361009, 2095949, 1685689, 1579311, 1194195, 1009229, 672143, 764471, 583358, 770318]
9918G70318m26135J04659J12408l44442p8975j06727K25193j47186m625L40609
9908D45097m84684J29195J91292j43214K70212k80832J86718k45269K6943q631
9898H6827k2101K10577m0270j25245J25289j76682M55523m64064M7347K93938
9888C91139j85998j72795K97452j80429N89576o03206M28565l25483K29014j14490
9878C53345j20213K18889j89785K16176q2210K69789m9561k57468J04895J20416
9868E84273R303R146j00739p4726J51528K43871m53322J63546j37808L78232k67508
9857E05796J9883p2529J06342J99522n51985L43376J84149l22084K67354N9647
9847G39471J33754Q0474k50266L53331j1127K30146k93828M10755N32628J23439
$$ y = [770318, 344183, 448842, 561250, 216808, 137833, 31106, 256299, 109113, 104488, 445097, -39587, 89608, 280900, 137686, 407898, 127066, 313784, 68515, 95458, 86827, 64726, 275303, 235033, 109788, 235077, 58395, 513918, 49854, 97201, 391139, 205141, 32346, 329798, 149369, 738945, 135739, 564304, 238821, 467835, 353345, 233132, 452021, 262236, 478412, 396202, 665991, 616430, 358962, 463857, 584273, 593576, 602722, 501983, 427257, 578785, 822656, 369334, 532880, 395072, 773304, 505796, 525679, 453150, 559492, 759014, 207029, 550405, 734554, 412470, 679824, 739471, 873225, 953699, 703433, 1056764, 1045637, 1275783, 981955, 1392710, 1925338, 2048777]
9837B048777L23948L46040l73180N607n01370L31823m98766l08512j60891J64411
9827A377887j10160j1586m33088M67567m00886L68618p25920K55124J62626m53851
9817D96331J17821K11956j23784J62178m86788L23548J5161K00822k77640m7161
9807E92444J65040n37344M13975l619j42596R9473J25978l01788L05531k12691
9797E04403m7104m4930k8206r1941J57856O9287j53661j9968L05229n51143L41009
9786D40831N6340j9702k84688L71676l97861R7088J2774L33048l21079J38465
9776D26892k20255M89932j12663l29790r9796M20643l36359L00383j75756P1123
9766D34354j61259k68562K09662R5953N8257j58096j0809L41802m57578L01872
$$ y = [2048777, 2372725, 2718765, 2345585, 2351192, 1849822, 2181645, 1682879, 1374367, 1213476, 1377887, 1267727, 1256141, 823053, 1290620, 889734, 1258352, 532432, 787556, 950182, 496331, 614152, 826108, 702324, 864502, 377714, 701262, 716423, 917245, 639605, 592444, 757484, 220140, 634115, 630496, 487900, 587373, 713351, 411563, 717094, 504403, 457299, 412369, 384163, 292222, 450078, 519365, 365704, 345736, 650965, 99822, 440831, 497171, 477469, 192781, 564457, 166596, 263684, 276458, 609506, 288427, 426892, 206637, 696569, 583906, 254116, 154320, 574963, 238604, 538987, 363231, 434354, 273095, 4533, 214195, 310148, 368405, 210309, 199500, 541302, 83724, 385596]
9756C85596p0937l9196K61710k94982K01530j04598K64009m5073j21426N6459
9746D93092P8617k62697R4501L5517L14890j70785j04931Q0743j22808k9847k34320
9735A71972R9277J92790j83920Q941j63492K34838L9391l69877n669J67139J44195
9724C35585r3035j97846K86299q6616N2988q4319j78617J49184J34880l68568
9714e0065L34733K3328j82908J26431l8098K20014l57025K52947j33947J16251
9704C11661K7624l8470K03419j97068k27412K33435k32974O5692q7158J66284
9694B25033m4488N3868M1259j01916j56328M70184k83616K27217l54232J18846
9684A95827L9034m2290M3604j85481J52822k2812j58735K83104o0490M5881P3636
$$ y = [385596, 314659, 275463, 537173, 242191, 443721, 339123, 603132, 558059, 436633, 493092, 571709, 309012, 403513, 439030, 753920, 583135, 478204, 558947, 436139, 406292, 171972, 271249, 464039, 280119, 289060, 125568, 360406, 399797, 29920, 24251, 191390, 335585, 242550, 44704, 331003, 244387, 297375, 213056, 34439, 183623, 318503, -50065, 284668, 307996, 125088, 251519, 213421, 433435, 76410, 329357, 195410, 311661, 339285, 300815, 504234, 307166, 79754, 313189, 80215, 145907, 58749, 225033, 180545, 234413, 275672, 173756, 17428, 487612, 203996, 431213, 76981, 195827, 234861, 192571, 236175, 50694, 203516, 180704, 21969, 305073, 244583, 290464, 364100]
9673C64100k11613K18645l35933K89536m9324r4914j95724M61059m95725N60629
9663E10736l34040J84537j34806k1708k61384K12569J60489k6013m96249M89379
9653B83510j80996L41688l71154R0775o8421K86386p1446q7106L6951K83403k96768
9642B46822N3194N6457k14613K19672J88925m20683K33171j47947o7076J01311
9632B49233j85181J38028J28033Q2260l6551J2826J39750k85377l9974J12473
9622C15520j66538P3285J39290J27773j95693J80400j57898p9763P9305J10283
9612D25964J7247j40484k90030L91188J01333R9269l063P3526j41745l4823J32221
9601F30603M32957j24836K71603J82523j6590K12449J58833K65525k555k5060
$$ y = [364100, 152487, 371132, 35199, 324735, 275411, 180497, -15227, 445832, -49893, 510736, 176696, 361233, 226427, 204719, -56665, 155904, 316393, 290380, -205869, 283510, 102514, 444202, 73048, 163823, 95402, 381788, 310342, 223236, 260187, 543590, 246822, 300016, 356473, 141860, 361532, 550457, 129774, 362945, 214998, 147922, 249233, 64052, 202080, 330113, 412373, 375822, 388648, 528398, 243021, 203047, 315520, 148982, 222267, 361557, 489330, 293637, 474037, 316139, 236376, 315681, 425964, 443211, 302727, 12697, 403885, 505218, 604487, 601424, 674950, 533205, 498382, 630603, 1063560, 938724, 1210327, 1392850, 1376260, 1588709, 1747542, 2013067, 2010512, 1985452]
9591A985452L5837k56893k10307L14879m60703J8418l678l51138l8918n4143j29586
9580H49220J8154j36499K06866j03254L41144k64805J91916q1496O5383K63071
9570A349700n9005L49711K67085K34224L90817m18635J59201L4003j52157K18172
9560B373116j16510J83299n19887j77361k43127j04606l83884q3870O2078o8137
9550I21111n22750J31143l1352K45545k29506K91863j26356k95225K55538o7860
9540E72151p6539J65735k94848K15955p0734j3889j0761J01301j68651K04034
9530F23754k6297j55862j22921P866K61651J05838l63211J4119K16075K90376
9520H51388m37453K2649J87320k2237l0361o662L38685j93201j8246J45128p9276
$$ y = [1985452, 2021289, 1764396, 1554089, 1868968, 1408265, 1426683, 1423005, 1071867, 1032949, 978806, 849220, 867374, 730875, 937741, 834487, 1175631, 910826, 1102742, 1021246, 1086629, 1349700, 1290695, 1640406, 1907491, 2141715, 2532532, 2113897, 2273098, 2307101, 2154944, 2373116, 2256606, 2439905, 1920018, 1742657, 1499530, 1394924, 1011040, 927170, 989248, 921111, 398361, 529504, 498152, 743697, 514191, 806054, 679698, 384473, 640011, 572151, 495612, 661347, 366499, 582454, 511720, 497831, 487070, 588371, 419720, 623754, 597457, 441595, 318674, 326540, 588191, 694029, 330818, 344937, 561012, 851388, 413935, 436584, 623904, 601667, 571306, 564644, 903329, 710128, 691882, 837010, 757734]
9509G57734J18428l45760M39521o6987M6269J18969J33425j93233J16222K03345
9499A327933L69285l28979J23029j82339J81855j11603j94625N0419K25949k19403
9489A241521j7279J01521J10062j82192J46962j0415P6673l05679K40090J94729
9479A595993m004l5249m8267L02779j43201n9882m091J75880k10205k16949J38278
9468A491082K43496k84733J09084J1735J50520k54176M702J19923k21192j52742
9458A217699K67583m5700m8279k98515K54433Q3767l55082K88569J42523j82716
9448A324282k249j99624K92911K5903J67204j77061J94614r6230j05535L59083
9438A783298k15133l78600J35436J39796K7645O7886j46576J51647r7407j45664
$$ y = [757734, 876162, 530402, 969923, 902936, 949205, 1068174, 1201599, 1008366, 1124588, 1327933, 1697218, 1368239, 1491268, 1308929, 1490784, 1379181, 1184556, 1234975, 1460924, 1241521, 1224242, 1325763, 1435825, 1253633, 1400595, 1390180, 1466853, 1161174, 1401264, 1595993, 1591989, 1556740, 1508473, 1811252, 1668051, 1608169, 1604078, 1779958, 1569753, 1352804, 1491082, 1734578, 1449845, 1558929, 1570664, 1721184, 1467008, 1471710, 1591633, 1370441, 1217699, 1485282, 1439582, 1391303, 1092788, 1347221, 1430988, 1075906, 1364475, 1506998, 1324282, 1322033, 1122409, 1415320, 1441223, 1608427, 1431366, 1625980, 1529750, 1424215, 1783298, 1568165, 1189565, 1325001, 1464797, 1492442, 1560328, 1413752, 1565399, 1467992, 1322328]
9428A322328J64206J69301m2561k4520j01400J3973l0388l5560K02816M8090J19006
9417A805291j38791j08448r7508J62068J66283k59075o7376J69050q1281J66839
9407A717052J98063r9419m01058L85804J77332k77133L943O788O9221M7140q0759
9396A746974J76280j78304P2956L99803p4604J72390M4921K53517j27219j41622
9386B345092o931k9748q7570p9203O6498L8865l27990j93830K32103J27602j29294
9375A955594n8681J43730p8182j08244L00180K32764R8295l03j15908N4586j57485
9364B266346L01781n4737K60651J5150k30379J37416J30731j82677J60283M6562
9354B851127k95478r2699P9555m666o5625J8217j19174J61432N4500j05949J01311
$$ y = [1322328, 1486534, 1655835, 1613274, 1588754, 1487354, 1501327, 1470939, 1435379, 1638195, 1686285, 1805291, 1666500, 1558052, 1460544, 1622612, 1788895, 1529820, 1462444, 1631494, 1550213, 1717052, 1915115, 1815696, 1414638, 1800442, 1977774, 1700641, 1704584, 1711372, 1780593, 1827733, 1746974, 1923254, 1744950, 1817906, 2217709, 2143105, 2315495, 2360416, 2613933, 2486714, 2345092, 2338161, 2308413, 2220843, 2141640, 2208138, 2247003, 1919013, 1725183, 1957286, 2084888, 1955594, 1896913, 2040643, 1962461, 1854217, 2154397, 2387161, 2485456, 2485153, 2369245, 2423831, 2266346, 2568127, 2513390, 2774041, 2789191, 2558812, 2696228, 2826959, 2644282, 2804565, 2851127, 2555649, 2462950, 2542505, 2537839, 2472214, 2490431, 2371257, 2532689, 2587189, 2481240, 2582551]
9343B582551m1912K35276P1762K69973j37141L45429M04852p2213N17674K68482
9333D444733L50162M69860N39470l7519j70376P3388k83833l65603J50449K36569
9323E407300l50393l33992N94380l79155P5369k03082R6188m4663k299J8986K95510
9312E174149m5581J66402q0242N02216Q9127K72139o0610L39771Q8952N45127
9302F991450M74752M66915j77879K76510m85573Q3652j62936l63265M4655j55660
9292F992621j60803k34306j62145m27434l72143k4828j85959k67584K71857p3759
9282E355517K02562o2400j445J95547j03842J41230K95098j18003J69895l43835
9272E730324M84918j41310K05953K07913j59139L33168r7863j52011M01406m59333
$$ y = [2582551, 2540639, 2775915, 2847677, 3117650, 2980509, 3325938, 3730790, 3658577, 4176251, 4444733, 4794895, 5264755, 5804225, 5766706, 5596330, 5669718, 5385885, 5020282, 5170731, 5407300, 5056907, 4722915, 5317295, 4938140, 5013509, 4810427, 4906615, 4861952, 4859653, 4878639, 5174149, 5128568, 5294970, 5214728, 5716944, 5806071, 6078210, 6017600, 6357371, 6446323, 6991450, 7466202, 7933117, 7755238, 8031748, 7546175, 7629827, 7466891, 7103626, 7148281, 6992621, 6831818, 6597512, 6435367, 6007933, 5635790, 5610962, 5425003, 5157419, 5429276, 5355517, 5558079, 5495679, 5494234, 5689781, 5585939, 5727169, 6022267, 5904264, 6074159, 5730324, 6215242, 6073932, 6279885, 6487798, 6328659, 6661827, 6563964, 6411953, 6813359, 6354026]
9262F354026L55459j64133l9345K46176r1697L12795j5797J09029o778J05775
9252G165510L07268m3096K62120O1031J25477J80347K73224o9540K78005Q3927
9242H624273J63032K46651N43983q2008j55026M30174M3606N60695N83922m04045
9232A0555257L65092L57941L72386K18493J26259N80035L6771L78104L74847J33568
9222A3498753N52327K34081N52809M81708L61931J98762O03776O03350N23811
9213A7611308O81727J150659J71851N44032J227594O39912O99988O22336Q29204
9204B4178611R11627J039937J173244R08187J515808J327532J830673J896793
9196C4782412J909305K273192K080843K125617K644563K938922L603931L523719
$$ y = [6354026, 6709485, 6545352, 6506007, 6752183, 6660486, 6973281, 6957484, 7066513, 7059735, 7165510, 7472778, 7429682, 7691802, 7752833, 7878310, 8058657, 8331881, 8262341, 8540346, 8624273, 8787305, 9033956, 9577939, 9495931, 9340905, 9771079, 9814685, 10375380, 10959302, 10555257, 10920349, 11278290, 11650676, 11869169, 11995428, 12575463, 12612234, 12990338, 13365185, 13498753, 14051080, 14285161, 14837970, 15319678, 15681609, 15880371, 16484147, 17087497, 17611308, 18293035, 19443694, 19615545, 20159577, 21387171, 22027083, 22727071, 23349407, 24178611, 25090238, 26130175, 27303419, 28211606, 29727414, 31054946, 32885619, 34782412, 36691717, 38964909, 41045752, 43171369, 45815932, 48754854, 52358785, 55882504]
9188E5882504N170737O469470Q389023J0375334J1768748J3035754J2515115J1793367
9180A35400052R755165Q161917O143150M518520L550666L633910L279913K284442
9172A76727735M72782l72013J4411K335685O719446J2117121J8396409K4085828
9164B40497404K8506747K8633953K4466581J6000026M636166o400679j6231596
9157C20108602k2425970k5450126k5451182k3282713j9981157j5997112j3465197
9150A74055145j1261688j0025315q177300p500787n469183m116990k746144j198992
9142A23558746o8793O72667J358083O30236k35157n78123q26037n89926k11120
9133A23710576K72009M02825J028239J922121K138351J927845J622148J330610
$$ y = [55882504, 61053241, 67522711, 75911734, 86287068, 98055816, 111091570, 123606685, 135400052, 145155217, 153317134, 159460284, 163978804, 167529470, 171163380, 174443293, 176727735, 177200517, 176828504, 176842915, 179178600, 185898046, 198015167, 216411576, 240497404, 269004151, 297638104, 322104685, 338104711, 342740877, 336340198, 320108602, 297682632, 272232506, 246781324, 223498611, 203517454, 187520342, 174055145, 162793457, 152768142, 144590842, 137090055, 131620872, 127503882, 124757738, 123558746, 123489953, 124162620, 125520703, 126150939, 125915782, 125337659, 124511622, 123921696, 123710576, 123982585, 124385410, 125413649, 127335770, 129474121, 131401966, 133024114, 134354724]
9125A34354724K58869p34267j169499j950129k322680k904012l024256l053252
9117A19455498l405089l519539l524698m302942m179823m107105l940843l210536
9109H9264923l029071k326143k276901k101319j943283k137018k563847k329662
9101G0557679j972225j420825j341507n09552l45956n86437l00356j40657o05313
9092F3334851O4956j78733J211414M602076Q028246J1316173P285240Q54242l818647
9083I2699818p549096p180911q298880p353421o449742n864768l867389k289933
9075D3845678j613932j203230j275103o55869j440660j089900n05393k89246k41280
9066C5531065j96958k1475P6636Q4642j91796q81059o97800r84743j384273r95564
$$ y = [134354724, 134613593, 133879326, 132709827, 130759698, 128437018, 125533006, 122508750, 119455498, 116050409, 112530870, 109006172, 104703230, 100523407, 96416302, 92475459, 89264923, 86235852, 83909709, 81632808, 79531489, 77588206, 75451188, 72887341, 70557679, 68585454, 67164629, 65823122, 65313570, 64967614, 64381177, 64080821, 63940164, 63334851, 63399807, 63221074, 64432488, 69034564, 77062810, 88378983, 95664223, 96518465, 92699818, 85150722, 77969811, 69670931, 62317510, 55867768, 50003000, 46135611, 43845678, 42231746, 41028516, 39753413, 39097544, 37656884, 36566984, 36061591, 35772345, 35531065, 35334107, 35312632, 35389268, 35473910, 35282114, 34401055, 33703255, 32718512, 31334239, 30338675]
9056C0338675j205170n22413k85143k49032J98860N1252J38120K46884l03978
9047B8408055K11405l13955j21807j292274n98630j207230n98821q37123o04469
9038B3045151r41990m29602p39047j61723n92827n03463l09231m17266n06980
9029A8443022l93920m14363J98060r16101J24512l9004J58077j03343j44706j66763
9019A6745471J09980j62586m79255L6379k53119m71411o10979q444l73660p09647
9009A3822729n2242n70427l16183n22647l32942m92713n8702n30052m42907K14995
8999A0718909j46459k75891J86548m58628k16031j08814p88327K25632k25973
8990H910966l62365l48152j73347k24986k56915k26405J24299n18391R118j52204
$$ y = [30338675, 29133505, 28611092, 28325949, 28076917, 28275777, 28327029, 28465149, 28712033, 28408055, 28619460, 28305505, 28183698, 26891424, 26292794, 25085564, 24486743, 23649620, 23045151, 22103161, 21673559, 20934512, 20772789, 20179962, 19676499, 19367268, 18950002, 18443022, 18049102, 17634739, 17832799, 16916698, 17041210, 17002206, 17160283, 17056940, 16912234, 16745471, 16855451, 16692865, 16213610, 16249989, 15996870, 15525459, 14914480, 14906036, 14532376, 13822729, 13770487, 13200060, 12883877, 12361230, 12028288, 11535575, 11476873, 10946821, 10503914, 10718909, 10572450, 10296559, 10483107, 10024479, 9808448, 9699634, 8911307, 9136939, 8910966, 8548601, 8200449, 8027102, 7802116, 7545201, 7318796, 7443095, 6924704, 6933822, 6781618]
8980F781618j19547k39713m3039m80798j02640l27757l35795o6804J3033l05348
8970D773210j29035j17161j45044k51789J13295j70016M1782p4777J19191n25562
8960C634094J08686P1015n20N6573m32593Q0621L5664k43739L459P4904l95566
8949B992598K37729l21273N2151j9915j40466j26620q3798j55194K23040l76792
8939B281460L28789l11206l8763J49628j44304J11935l58898J62156q6912k28595
8929A865290K89020N2429j28029K6812R3837k44682J24696M9433k22381j31641
8919A774784P4922m9900M4225k75625R6674j8389k22559j9268r4687N38718n62244
8908A286651l3280J55140J47390j21987l3036L5433K9645l57020L59580l57712
$$ y = [6781618, 6662071, 6422358, 6379319, 5898521, 5795881, 5468124, 5132329, 5065525, 5078558, 4773210, 4644175, 4527014, 4381970, 4130181, 4243476, 4073460, 4115242, 4040465, 4159656, 3634094, 3742780, 3813795, 3813275, 3869848, 3437255, 3517876, 3553540, 3309801, 3313260, 3388164, 2992598, 3230327, 2909054, 2961205, 2941290, 2800824, 2674204, 2590406, 2435212, 2658252, 2281460, 2610249, 2299043, 2260280, 2409908, 2265604, 2377539, 2018641, 2180797, 2093885, 1865290, 2154310, 2206739, 2078710, 2105522, 2199359, 1954677, 2079373, 2128806, 1906425, 1774784, 1849706, 1799806, 1844031, 1568406, 1665080, 1646691, 1424132, 1404864, 1310177, 1848895, 1286651, 1253371, 1408511, 1555901, 1433914, 1400878, 1436311, 1465956, 1108936, 1468516, 1110804]
8898A110804j59756L55941N7106n2057J01067n59568M72934m64425M55311k31833
8888A085524M4094J58948q6940K384J5249j23125K80803j97386L37593j2590n3865
8877A450689J75965q1022l9428K9858K32308j37717j32972J19911l7254j69301
8867A411037L53405k13540Q1326k05212r7500L18999j89332J82107q6683j11936
8857A442671J16649j11402J90584j5q8031J89954j24022r8553M47196k27088J72334
8846A910277J7114J23794l30516n9659K05668m5318K37732m06422J41784k0824
8836A773630l63903L41403l9557l21470N9595j22614L60208o16063L70982M9386
8826A491597k66335J40825k10499L44951j6164k21423K82319j43365J8451j52538
$$ y = [1110804, 951048, 1306989, 1364095, 1312038, 1413105, 853537, 1326471, 862046, 1317357, 1085524, 1129618, 1288566, 1201626, 1204010, 1219259, 1096134, 1376937, 1179551, 1517144, 1504554, 1450689, 1626654, 1545632, 1506204, 1536062, 1768370, 1630653, 1497681, 1617592, 1580338, 1411037, 1764442, 1550902, 1632228, 1427016, 1329516, 1648515, 1459183, 1641290, 1554607, 1442671, 1559320, 1447918, 1638502, 1638487, 1550456, 1740410, 1616388, 1517835, 1965031, 1737943, 1910277, 1927391, 2051185, 1720669, 1661010, 1866678, 1821360, 2059092, 1652670, 1794454, 1773630, 1409727, 1751130, 1711573, 1390103, 1449698, 1327084, 1687292, 1071229, 1442211, 1491597, 1225262, 1366087, 1155588, 1500539, 1484375, 1262952, 1545271, 1401906, 1420357, 1267819]
8816A267819n8767R9095j35290Q4842J18946r9154J93163k68268k07343J54192
8806A149235j0689P957k29248O0076n0720K63295k17909R3113o2324j3730L8278
8795A027334j4021l14131O3621J38502R0441l26528K29997j46111l30359J62049
8785E80794L27510j09699N5864N397Q2556j1265J15516l71004J53167O8042m23067
8774D73811L75545p9423j20478j9878J37494j09384q4954q1146K23855p580k80595
8763D27267K37844j2291p0731J72531j16230R7322o52391M89575j51688K88818
8753G10026l02457N1583J52164K3513k17378L1915R018R6936O145J07106l27627
8742C40944K05891M4456j83490P3441m1077k7261l7001J4139L5943j7994N2549
$$ y = [1267819, 1209052, 1308147, 1172857, 1257699, 1376645, 1277491, 1470654, 1202386, 995043, 1149235, 1138546, 1146503, 917255, 977331, 926611, 1189906, 971997, 1065110, 1002786, 989056, 1027334, 1013313, 699182, 762803, 901305, 991746, 665218, 895215, 749104, 418745, 580794, 908304, 798605, 854469, 859866, 942422, 931157, 1046673, 675669, 828836, 896878, 473811, 849356, 769933, 649455, 629577, 767071, 657687, 572733, 491587, 715442, 707862, 427267, 665111, 652820, 582089, 754620, 638390, 735712, 83321, 572896, 421208, 710026, 407569, 459152, 611316, 634829, 417451, 449366, 458384, 555320, 561465, 668571, 340944, 546835, 591291, 407801, 481242, 440165, 412904, 375903, 390042, 425985, 407991, 460540]
8731D60540j19746Q0191R4965Q3078k55186j50743L90020n224O725l79738K1536
8720B26418K31115J66953l17065k5329J870N345K99590l57132K29961j86337j3363
8709B62026L4232K42318j42824Q1458j3010q9778p8117J65236l3995j44836K02604
8698D85314M4771k49362n3345M1573J51258J0127j55665K48335j80724K18829
8688E61111k42409O1378R2290l02369L68734o7883j65407J5801j8820N09504m34763
8677C77167p4632k23221J30764K92561k07820K40829N7457l04417L05716J1531
8667F05935j755m7363q5547R2087j22643J72573m21464J46942j09337Q8606K8994
8656C47028l21666q3165J27952J67394P9687j34383J51090j64736R7404q3038
$$ y = [460540, 340794, 420985, 515950, 599028, 343842, 193099, 583119, 577895, 584620, 204882, 226418, 457533, 624486, 307421, 282092, 283962, 289307, 588897, 231765, 461726, 275389, 262026, 296258, 538576, 395752, 477210, 464200, 374422, 296305, 461541, 427546, 282710, 485314, 530085, 280723, 227378, 268951, 420209, 430336, 274671, 523006, 342282, 561111, 318702, 380080, 472370, 170001, 538735, 470852, 305445, 321246, 302426, 811930, 377167, 302535, 79314, 210078, 502639, 294819, 535648, 593105, 288688, 594404, 605935, 604180, 556817, 471270, 563357, 440714, 613287, 191823, 338765, 229428, 318034, 347028, 25362, -57803, 70149, 237543, 317230, 182847, 333937, 169201, 266605, 183567]
8646A83567P1514P1941r1248n7662K97165k0397q7412L4804k87041J37578Q4052
8635C36861k02153j9268K23184M7991K5331Q1915k01418N7612j73763L4271K97128
8624E07691k26430N8420Q934j37652K03039q1115K8403o5880J62638j63568J83408
8613D77888k21046j20101P8018L64697j85111n06732M02626J538m8152j8270N0042
8602B75397J10429r0621r5415K53550k31748m5005K72872k801j18929J70632j94747
8591C03614K73298j11117r6720l82026K82186J8766J55902J39997l95275J66803
8581C55428m1689l2892K19490j57620J00244k25988J58080j51306M0737L27653
8571E92137m28055J18361K03588L6019n66354L12878J54481J02242k13968K4081
$$ y = [183567, 255081, 327022, 235774, 178112, 475277, 454880, 367468, 402272, 115231, 252809, 336861, 134708, 115440, 338624, 386615, 411946, 493861, 292443, 350055, 176292, 210563, 507691, 281261, 339681, 348615, 210963, 414002, 332887, 361290, 295410, 458048, 294480, 477888, 256842, 136741, 214759, 579456, 394345, -112387, 290239, 291777, 243625, 225355, 275397, 385826, 295205, 199790, 453340, 221592, 176587, 449459, 446658, 327729, 498361, 303614, 576912, 465795, 369075, -12951, 269235, 288001, 443903, 583900, 188625, 355428, 313739, 280847, 500337, 342717, 442961, 216973, 375053, 223747, 264484, 592137, 164082, 282443, 486031, 522050, -44304, 268574, 423055, 525297, 311329, 335410]
8561C35410P216J72482j66879J33947j49513K78486m41287K86502j17474j2502
8551C26388J50891l8147k17454K30433l04285J89613O2649J25736l49070K44071
8541D20825M2646j57541J16391k14326J9539j06117j023255J220947K99367k27546
8531C90930K19115m02377L13966J3067q0713P032q8035j25431L02896j13465k76913
8520A60072J07895M05239k61612L6759J46149J6211N6868j5047l09239L9278j01013
8509B81560L57537r4840M3483k11728Q9196J79591j85946j84968L30240j15192
8499D88933J37884l14902J56056Q5659j34510M471N1746j09799L5295J37967n0953
8488D87847O1078j45469j72616K46651J98362l37348j38219K65732J74881o5778
$$ y = [335410, 342626, 515108, 348229, 482176, 332663, 611149, 169862, 456364, 338890, 326388, 477279, 439132, 221678, 452111, 147826, 337439, 400088, 525824, 176754, 420825, 463471, 305930, 422321, 207995, 227534, 121417, -901838, 319109, 618476, 390930, 610045, 207668, 521634, 534701, 453988, 461020, 372985, 247554, 550450, 436985, 160072, 267967, 673206, 411594, 448353, 594502, 610713, 667581, 652534, 343295, 382573, 281560, 639097, 544257, 587740, 376012, 465208, 644799, 458853, 273885, 604125, 488933, 626817, 311915, 467971, 553630, 419120, 423591, 475337, 365538, 400833, 538800, 487847, 548925, 403456, 230840, 477491, 675853, 338505, 200286, 466018, 640899, 575121]
8478E75121j16868j07018m6912j9085K06820l5464O176O1969O6775q5448j71994
8467C34072K90912J39269l15033J7266P5600j09144j8004J44708P0785K90159
8457I20590k44419j09424P1364K7008m3528m368J87407M3044k33202J1074J5983
8446F41529L25684o02614J92260M8244K08077k47834r9232L03101J2263l82317
8436C99161J19322J15944J18912k35100J91640J9170k00211j50114J13878P653
8426E00255K14057k57700J9695L94948k72674n6643J57251j15087L04764j04065
8416G84801j02096r0890n4172K77946p9408J19693m19004M00042M3464m60564
8406D19812P9611M37171j26086j40840K38233l7649l72499K62852r7789L95609
$$ y = [575121, 458253, 351235, 304323, 285238, 492058, 456594, 462770, 524739, 591514, 506066, 334072, 624984, 764253, 449220, 466486, 542086, 432942, 414938, 559646, 630431, 920590, 676171, 566747, 638111, 665119, 621591, 617223, 804630, 847674, 614472, 625546, 641529, 967213, 364599, 556859, 605103, 813180, 565346, 466114, 769215, 781478, 399161, 518483, 634427, 753339, 518239, 709879, 729049, 528838, 378724, 492602, 500255, 714312, 456612, 476307, 871255, 598581, 541938, 699189, 584102, 888866, 784801, 682705, 591815, 537643, 815589, 736181, 855874, 436870, 836912, 880376, 419812, 499423, 936594, 810508, 669668, 907901, 870252, 497753, 760605, 662816, 1058425]
8396A058425j37270k42478j03558L16691k41750K43806J6410J9424l50126K80967
8386H60541l38027M34347l64595L16164k44182M59205k07019j21305J82169j14727
8376H62571k8234J20765n6985J31247m37920O8409K37248l6824K3934N8796p6626
8365H66381j62150K28996j87477J30006J67202j87147J5534j80077K91433j94141
8355G88560J07548Q3329l86068K71950N3897J7584m4849o5303R708K74160j15773
8344I94743M2737l68373M22522r5427J88928j24262o400k87314J23300J04565
8334I95019R5083j32669Q6413k23824R4798L391q8387M006M4102P5425K4359m5001
8322I32715K2265j63826K23121K83325l06121p1255j62255J16284M477q030J9597
$$ y = [1058425, 921155, 678677, 575119, 891810, 650060, 893866, 910276, 929700, 579574, 860541, 522514, 956861, 592266, 908430, 664248, 1123453, 916434, 795129, 977298, 862571, 834337, 955102, 898117, 1029364, 591444, 659853, 897101, 860277, 884211, 943007, 866381, 704231, 933227, 745750, 875756, 1042958, 855811, 871345, 691268, 982701, 788560, 896108, 979437, 593369, 865319, 919216, 936800, 891951, 826648, 836356, 1110516, 994743, 1037480, 669107, 1091629, 996202, 1185130, 1060868, 1054468, 767154, 890454, 995019, 1090102, 957433, 1043846, 820022, 914820, 918211, 829824, 833830, 877932, 953357, 977716, 932715, 954980, 791154, 1014275, 1297600, 991479, 920224, 757969, 874253, 878730, 870700, 890297]
8311H90297J65232j65145n2287J45781N7186l54285J43886J35483l9270m24657
8301E02221L87795r336J9950J6933Q8127Q6500l77396L6630K13283j46986j86239
8290F31482J45257N6884J8227j98335J38100K37649J15170k71398l8843P9743
8280I13936J27903k80090J90582j70229K43966m77900M09247J16011j74489j19378
8270G79559j07287L46572M6353k50691O6678k82190J24660Q8486K4793k0699P8732
8259H94966j73007K7899J05738J02848m29802L24519J72697j31503j43390m3889
8249G07076K53889q9431j00310k18683L61881j07388j7225M496K36362k62769
8239G67898J3736J69665j48495K8678J95138l23498J76435J4676M6783k61657
$$ y = [890297, 1055529, 890384, 838097, 983878, 1041064, 686779, 830665, 966148, 926878, 502221, 890016, 880680, 900630, 917563, 1005690, 1092190, 714794, 751424, 964707, 817721, 631482, 776739, 833623, 851850, 653515, 791615, 1029264, 1144434, 873036, 834193, 913936, 1041839, 761749, 952331, 782102, 1026068, 548168, 957415, 1073426, 898937, 779559, 672272, 1018844, 1065197, 814506, 881184, 598994, 723654, 812140, 836933, 816234, 894966, 721959, 749858, 855596, 958444, 528642, 853161, 1025858, 894355, 750965, 707076, 960965, 871534, 771224, 552541, 914422, 807034, 789809, 794305, 1030667, 767898, 781634, 951299, 802804, 831482, 1026620, 703122, 879557, 894233, 941016, 679359]
8229F79359K59920j67684K53234p7799j32755R1978j2930J34014k01055J79706
8219A005988n6043P2837l2459p6786m8646K86098k38383P0624J14843N7701l2714
8208A123060r6440j91149L25145k08819l31937K12732O9322K09201m00674K07760
8198I18201j44167L9033L2925l7384N7631L86243j709699J578077m83262K5795
8188F63393p8041M53942o9920N6310J92689k60728k30108N6253l2338O67079p95391
8177F23140J60466j33433N11600l12446m40874N73402Q7092n90943J45835J44893
8167G68732L47469k31892k32359K26727K05752j66363K2377L82882m19716k20588
8157F83021K50566J2043J86479k30713K1212M09447m53297m3856M5788J99671
$$ y = [679359, 939279, 771595, 1024829, 947030, 814275, 906253, 893323, 1027337, 826282, 1005988, 949945, 1022782, 990323, 913537, 864891, 1150989, 912606, 983230, 1098073, 1155774, 1123060, 1026620, 835471, 1160616, 951797, 619860, 832592, 901914, 1111115, 710441, 918201, 774034, 813067, 845992, 808608, 866239, 1252482, -457217, 1120860, 637598, 663393, 585352, 1039294, 969374, 1025684, 1218373, 957645, 727537, 783790, 751452, 1418531, 623140, 783606, 650173, 1161773, 849327, 408453, 981855, 1068947, 478004, 623839, 768732, 1116201, 884309, 651950, 878677, 1084429, 918066, 940443, 1323325, 903609, 683021, 933587, 945630, 1132109, 901396, 922608, 1332055, 878758, 834902, 880690, 1080361]
8147A080361j89835r1214K72122l0071l27629J4955L25781J71756l90833J03789
8137I39182L22231k42211j49579o4610M29676m06066K54600J31616q1695m32700
8127G00444J64724K74678m41133J59678L57234K7741k68141l68835K72170M53447
8117A332007j09403l32009j64523P46256m45659p8135L50541j60650k83338Q4225
8107I39312j71897O18524n16966J79209p1948P852J1523j01944L01751q3968j61719
8096I49729K11362l04934K31116k13064K09866L01515m80148r184K8260L24295
8086A248813k63005J35418m3445r905K2763p7868J81939J00497k67238N1040J65850
8075A244859L5816M2570J50516m96406K01964J71489K549m48621J79101r3143
$$ y = [1080361, 890526, 799312, 1071434, 1041363, 713734, 728689, 1054470, 1226226, 835393, 939182, 1261413, 1019202, 869623, 805013, 1234689, 828623, 1083223, 1214839, 1133144, 700444, 865168, 1139846, 698713, 858391, 1215625, 1243366, 975225, 606390, 878560, 1332007, 1222604, 890595, 726072, 1472328, 1026669, 948534, 1299075, 1138425, 855087, 939312, 767415, 1385939, 868973, 1048182, 976234, 984086, 995609, 893665, 1195416, 1111448, 949729, 1161091, 856157, 1087273, 874209, 1084075, 1385590, 905442, 896258, 924518, 1248813, 985808, 1121226, 1077781, 1067876, 1090639, 1012771, 1194710, 1295207, 1027969, 1079009, 1244859, 1280675, 1323245, 1473761, 977355, 1179319, 1350808, 1353357, 904736, 1083837, 990694]
8065I90694K05481k48159J51010J07449J04122r7566l87731J94530Q2137J52358
8055A254325j22103L3814J40421j92721M9329O7238K1173J69403n12606L07524
8045A215797p8057K3092o981J534R201K95652m36986K00367j72895K43314p565
8034A286473J11915p4005p7043J08245J46829j00899J46361n38182M42141J39512
8024A591347l82900M18946j51164p4793j09584J92163n5155Q5376n6387k499m4226
8013A411124M48792p26652M16650k34721J42573k94698M4512J19508M26788j45252
8003A608624j64354l54057M47219l8144O1077k40509J35672M0742R8699j45070
7993A449899J73757k8531j61453J88174j07003J82743j67089L9610K81042k13708
$$ y = [990694, 1196175, 948016, 1099026, 1206475, 1310597, 1213031, 825300, 1019830, 1101967, 1254325, 1132222, 1166036, 1306457, 1113736, 1163065, 1230303, 1251476, 1420879, 908273, 1215797, 1137740, 1160832, 1153851, 1155385, 1164586, 1460238, 1023252, 1223619, 1050724, 1294038, 1286473, 1398388, 1324383, 1247340, 1355585, 1502414, 1401515, 1547876, 1009694, 1451835, 1591347, 1208447, 1627393, 1476229, 1401436, 1291852, 1484015, 1428860, 1514236, 1457849, 1455350, 1411124, 1859916, 1133264, 1549914, 1315193, 1457766, 1163068, 1207580, 1327088, 1753876, 1608624, 1444270, 1090213, 1537432, 1499288, 1560365, 1319856, 1455528, 1496270, 1594969, 1449899, 1623656, 1595125, 1433672, 1621846, 1514843, 1697586, 1530497, 1570107, 1851149, 1637441]
7983A637441J49963n1057k36212N715j33522L75793k10663J07035j74834J95890
7973A665549m3185k59027N9281K31016m5790K59630m72917L83654j24967n0929
7963A602315J78923Q8757k36047K19461j0100j56189J4029J62085j24435o5505
7953A673294M1479J97602j59967k10668K81326R7332j07579k99658K34286J75554
7943A923001m0736r3293q9369K35020J35553m31580K07457k0114J15421k15709
7933A725651P721K50893l30505K35499k7346K294K882k49247J92828n8223L30162
7922B082609l74891J36750K44187j75999J63648j9804l14714L98220j09345R3343
7912B124004j4338N8483L2802M1866K0725o7938k19074K39188k11970K23079l16540
$$ y = [1637441, 1787404, 1736347, 1500135, 1505850, 1372328, 1748121, 1537458, 1644493, 1469659, 1665549, 1622364, 1363337, 1422618, 1653634, 1607844, 1867474, 1394557, 1778211, 1653244, 1602315, 1781238, 1869995, 1633948, 1853409, 1843309, 1687120, 1701149, 1863234, 1738799, 1673294, 1714773, 1912375, 1752408, 1541740, 1823066, 1920398, 1812819, 1513161, 1747447, 1923001, 1882265, 1788972, 1699603, 1934623, 2070176, 1638596, 1846053, 1825939, 1941360, 1725651, 1733372, 1984265, 1653760, 1889259, 1861913, 1864207, 1867089, 1617842, 1810670, 1752447, 2082609, 1707718, 1844468, 2088655, 1912656, 2076304, 2056500, 1741786, 2140006, 2030661, 2124004, 2109666, 2168149, 2200951, 2242817, 2263542, 2195604, 1976530, 2215718, 2003748, 2226827, 1910287]
7901A910287N98518j50814k59861L37533j54179K6673R2578m41058N19160m87700
7891A991137L20455n8249L0496j1266J14713j49533q791q31J01071K9939j97463
7880B161678L93774j96477j28949j3506J20711J1107L10649m92079K76429q0411
7870B362926l801L2749R083J28008k8908J18512p3095k13489L98247l82815K90125
7859B637542j24984J29330j6031j44297J99842J19134O5680m10442K27399M54769
7849C137942l67432l72344K69207l1144j08691J46733k04225K61994L8794L4925
7839B805759J0310O7917k05029L25485k41700J58469m9810k0914J01284K8285
7829B980056j44914J23596q8489L15459l76443j06443M62204L6453P5979k30710
$$ y = [1910287, 2508805, 2357991, 2098130, 2435663, 2281484, 2308157, 2400735, 1959677, 2478837, 1991137, 2311592, 2253343, 2283839, 2272573, 2387286, 2237753, 2228962, 2228131, 2329202, 2359141, 2161678, 2555452, 2358975, 2230026, 2216520, 2337231, 2348338, 2658987, 2166908, 2443337, 2362926, 2359125, 2391874, 2400957, 2528965, 2500057, 2618569, 2545474, 2331985, 2730232, 2347417, 2637542, 2512558, 2641888, 2625857, 2481560, 2681402, 2800536, 2866216, 2455774, 2683173, 3137942, 2770510, 2398166, 2667373, 2636229, 2527538, 2674271, 2470046, 2732040, 2770834, 2805759, 2816069, 2883986, 2678957, 3004442, 2762742, 2921211, 2871401, 2850487, 2951771, 2980056, 2835142, 2958738, 2870249, 3185708, 2809265, 2702822, 3165026, 3201479, 3277458, 3046748]
7819C046748J67200r8504j54660M0672L13389N2561o5457q6708K09001j0223K11983
7808C626002j15572J13871N8309k91592J59670n2841l6206Q0478K81044r5127
7798C728036j96167N8836M4035J6J72995M1300J03332O3097j24806m4499j64461
7787C681714K86918J23180P5490K8307r4389p4825l3452L38466l79490L57492
7777D309411L8703k03341J21801J16766K52725j94451J5373K84930N3147l6415
7767D758649l1891K13315J05671j43201N05704k56544J54724k50881J1022J41098
7757E207666K16921p9191j07701K52255M9693J932K08999K45064j17768l5577
7747E842293L9469J92140n1391J93502K35802j48747k6609K38846L69295L7877
$$ y = [3046748, 3213948, 3115444, 2960784, 3001456, 3314845, 3367406, 3301949, 3215241, 3424242, 3414019, 3626002, 3510430, 3624301, 3682610, 3391018, 3550688, 3497847, 3461641, 3542119, 3823163, 3728036, 3531869, 3590705, 3634740, 3634756, 3807751, 3849051, 3952383, 4015480, 3890674, 3846175, 3681714, 3968632, 4091812, 4167302, 4195609, 4101220, 4026395, 3992943, 4331409, 3951919, 4309411, 4348114, 4144773, 4266574, 4383340, 4636065, 4441614, 4456987, 4741917, 4795064, 4758649, 4726758, 4940073, 5045744, 4902543, 5408247, 5151703, 5306427, 5055546, 5066568, 5207666, 5424587, 5345396, 5237695, 5489950, 5539643, 5541575, 5750574, 5995638, 5877870, 5842293, 5881762, 6073902, 6022511, 6216013, 6451815, 6303068, 6276459, 6515305, 6884600, 6922477]
7737F922477j82580L79548N1600l0387K24329K44011J13787j64372N39119j40521
7727G957011J30166K25662K9P6884M02795j34206O06153k04066K08001N6657K86354
7716I611440l8450K33822J87200J24696j28370L16105J10335N18123k28072M58239
7706A1165068j65350N31866k71146K82874J37393J74760O4813M79033l09005R0331
7696A2180637K35017j59093M29967J52935k47617K14086j39908K71354J55897
7687A3093275K18220j66653L44886j39062O8001o6767K5722J13859J32582J968
7677A3626031k39448L16744K10685O3019k09708Q8446Q4866j62865K26929j43415
7667A3861284L98193k0259j17164M74659j27592r2291J47980L69400J66467L8612
$$ y = [6922477, 6739897, 7119445, 7171045, 7140658, 7364987, 7608998, 7722785, 7558413, 8097532, 7957011, 8087177, 8312839, 8312868, 8389752, 8792547, 8658341, 9264494, 9060428, 9268429, 9325086, 9611440, 9572990, 9806812, 9994012, 10118708, 9990338, 10306443, 10416778, 10934901, 10706829, 11165068, 10999718, 11531584, 11260438, 11543312, 11680705, 11855465, 11920278, 12399311, 12090306, 12180637, 12415654, 12256561, 12686528, 12839463, 12591846, 12805932, 12666024, 12937378, 13093275, 13311495, 13144842, 13489728, 13350666, 13418667, 13351900, 13377622, 13491481, 13624063, 13626031, 13386583, 13703327, 13914012, 13977031, 13767323, 13855769, 13940635, 13777770, 14004699, 13861284, 14259477, 14239218, 14122054, 14596713, 14469121, 14376830, 14524810, 14894210, 15060677, 15099289]
7657A5099289J1911K2581M08411N9196l472L62412K24306l486R5811K59503j8052
7646A6518410M73320R9855l52640K28276J61401K27731K23571J45384m1280L0530
7636A7714558K4882l72713N24672k01903J49640o0876N6557l50444K43474l11838
7626A7416009L41443m12867j5024k77013M55k55550k42205o0382p5247k62102
7616A6157517o6912n81354K41649j96713k20256k21042j11576o05700O6485j25380
7606A4336718o092j15972K58421l75509K28626n9568R2372k00561o2149n91695
7596A3504591j09797k26670n04167p7412n9569k56533l74540k40461j47151j77891
7586A1330400K24124n19309l6749K13434l64962n1367j59018k47267J22658k04179
$$ y = [15099289, 15111200, 15133781, 15542192, 15601388, 15597916, 15960328, 16184634, 16181148, 16276959, 16536462, 16518410, 16991730, 17091585, 16738945, 16967221, 17128622, 17356353, 17579924, 17725308, 17684028, 17714558, 17739440, 17366727, 17891399, 17689496, 17839136, 17778260, 17834817, 17484373, 17727847, 17416009, 17757452, 17344585, 17329561, 17052548, 17053003, 16797453, 16555248, 16494866, 16419619, 16157517, 16090605, 15509251, 15750900, 15554187, 15333931, 15112889, 15001313, 14395613, 14462098, 14336718, 14330626, 14214654, 14473075, 14097566, 14326192, 14266624, 14358996, 14158435, 14096286, 13504591, 13394794, 13168124, 12663957, 12586545, 12526976, 12270443, 11895903, 11655442, 11508291, 11330400, 11554524, 11035215, 10998466, 11211900, 10846938, 10795571, 10636553, 10389286, 10511944, 10307765]
7576A0307765Q689p2565j36026k7446l59252N40228o09985J26614l4542j42532
7566I600948J04024j81303k6396m1667l66262K79945j0598j41563m3025q1811
7556I092292K09188k26746j77103R3590P3781l61487J49675r8182r9784k30321
7546H424903L47894j01265L443j21105J07557k00873L2784k02092L80992j98120
7536H474118p1305J16107r0282j13770Q7305n8363k04679L09052j56670J13354
7526H404867l5102Q8935j61999J87361m42895L14604k26622n9755L606K77784
7516H350784p6987j1765M3896j7305m97786Q18065n98234K39537L4252J9185k05859
7505H097783J30948m49663N70021j46839j29117o7797L14741K9219j90088J05066
$$ y = [10307765, 10316454, 10243889, 10107863, 10080417, 9721165, 10261393, 9651408, 9778022, 9743480, 9600948, 9704972, 9523669, 9497273, 9455606, 9089344, 9369289, 9358691, 9217128, 9174103, 9092292, 9301480, 9074734, 8897631, 8991221, 9065002, 8703515, 8853190, 8755008, 8655224, 8424903, 8772797, 8671532, 8674975, 8553870, 8661427, 8460554, 8493338, 8291246, 8672238, 8474118, 8402813, 8518920, 8428638, 8314868, 8402173, 8343810, 8139131, 8448183, 8291513, 8404867, 8369765, 8458700, 8296701, 8484062, 8041167, 8355771, 8129149, 8069394, 8073000, 8350784, 8273797, 8262032, 8305928, 8288623, 7790837, 8608902, 8010668, 8250205, 8284457, 8303642, 8097783, 8228731, 7779068, 8349089, 8202250, 8073133, 8005336, 8320077, 8349296, 8159208, 8264274]
7495H264274J70056l33874K0055p8519J50819J41189J96090j81020q7392m7230
7485H214448j18135K62447j67920j53917K30460J08774l134K2777k05899N47776
7475H737677l38227j28465J41042n5345j78425j8332K14362J55551j03237J61391
7465H587992m7266K70976l03654K44408N7574l37036J15035m6621K05160j50543
7455H596025J19108j8372J05482j23351K55023l21050j11243M53498j47745J2053
7445H819428K29280k35574k5819J17624J86399l56061J16623J57518n4183m7319
7435H907916r9871L20281J3561K9394j52691K55287j29466N837n8962J51919j35259
7424I107946K51774J24643n4227j59766J12740J23601n2341J87520M4087m554
$$ y = [8264274, 8434330, 8100456, 8120511, 8041992, 8192811, 8334000, 8530090, 8349070, 8261678, 8214448, 8096313, 8358760, 8190840, 8036923, 8267383, 8376157, 8373023, 8395800, 8189901, 8737677, 8399450, 8270985, 8412027, 8356682, 8178257, 8159925, 8374287, 8529838, 8426601, 8587992, 8540726, 8811702, 8508048, 8752456, 8810030, 8472994, 8588029, 8541408, 8746568, 8596025, 8715133, 8696761, 8802243, 8678892, 8933915, 8612865, 8501622, 8955120, 8807375, 8819428, 9048708, 8813134, 8787315, 8904939, 9091338, 8735277, 8851900, 9009418, 8955235, 8907916, 8808045, 9128326, 9141887, 9171281, 9018590, 9273877, 9144411, 9150248, 9091286, 9243205, 9107946, 9359720, 9484363, 9430136, 9270370, 9383110, 9506711, 9454370, 9641890, 9685977, 9681423]
7414I681423J11445j62621J44063K5901K07469k82940J44849P342O2117j46324
7404I792724M17782l07976J42199j7219O9591L6795K9182M7478Q4464J20220Q9189
7393A0504429j37819R0666j05971k12291L23229K13058p9407L35616k02026M64215
7383A1193699m57270P4361O2356K61477J90341j28032R7241L24902k24618J69627
7373A1564084L06739q2323J20186Q3643K26446J9263J89834J01574o6403J47229
7363A2610272L5872K04824J0232N7520l5250o3203K80689M2888J58277J60630
7353A3462751k9852J85347J09134l7402L68530M8507m4918L28028J64075L0571
7343A4584771K42712M67831k10116J69524N48124J49995Q3918M48806K89773N78695
$$ y = [9681423, 9792868, 9630247, 9774310, 9800211, 10007680, 9724740, 9869589, 9876931, 9939048, 9792724, 10210506, 9902530, 10044729, 10027510, 10097101, 10133896, 10163078, 10210556, 10295020, 10415240, 10504429, 10366610, 10457276, 10351305, 10139014, 10462243, 10675301, 10595894, 10931510, 10729484, 11193699, 10736429, 10810790, 10873146, 11134623, 11324964, 11196932, 11294173, 11619075, 11394457, 11564084, 11870823, 11788500, 11908686, 11992329, 12218775, 12238038, 12427872, 12529446, 12463043, 12610272, 12646144, 12850968, 12861200, 12918720, 12883470, 12820267, 13100956, 13143844, 13302121, 13462751, 13432899, 13618246, 13727380, 13689978, 14058508, 14107015, 14062097, 14390125, 14554200, 14584771, 14827483, 15295314, 15085198, 15254722, 15802846, 15952841, 16036759, 16485565, 16775338, 17354033]
7333A7354033K84309k01613N75955N52838K37864P56293Q45068Q82000N16180
7324B1802927O63029L26595M42683P9947m20917k3673J79398k39070j09743j10597
7314B2590579J60741J90080M80683j15958N05127K41052J97498J36942P24046
7305B5110790o5123L65616K36490K72055j67547J87521L08144j19781j68092L21835
7295B6281908k98779M2070o4839N7337l43932k51797l9724j44146m09443l81182
7285B4447473Q544k58561J37586m86204j60302k59653j60150n94242K28594o46047
7275B2257038J7286n1781l75156O3374o9095k89983m5214m0650k73680j14801
7265B1077338J58335n17340j37412J78780M6293q0985R8441j23405Q1779j94960
$$ y = [17354033, 17638342, 17436729, 18012684, 18565522, 18803386, 19559679, 20404747, 21286747, 21802927, 22465956, 22792551, 23235234, 23315181, 22894264, 22870591, 23049989, 22810919, 22701176, 22590579, 22751320, 22941400, 23422083, 23306125, 23811252, 24052304, 24249802, 24386744, 25110790, 25045667, 25411283, 25647773, 25919828, 25752281, 25939802, 26247946, 26128165, 25960073, 26281908, 25983129, 26025199, 25960360, 26017697, 25673765, 25421968, 25382244, 25238098, 24828655, 24447473, 24456017, 24197456, 24335042, 23848838, 23688536, 23428883, 23268733, 22674491, 22903085, 22257038, 22274324, 22222543, 21847387, 21910761, 21841666, 21551683, 21506469, 21465819, 21192139, 21077338, 21235673, 20718333, 20580921, 20759701, 20805994, 20725009, 20823450, 20700045, 20781824, 20586864]
7255B0586864j68144k19806K10393k09197J77406l07837J00127K39546r7394j02967
7245B0208991J35534j8825k11692j74995M46873l59576m17431l2880j57335O3972
7235A9482636j10667l1746q8380l26396J25620n75407J15894l79170l33449P1281
7225A7950216K9349m3959l37326J3639J53883l80541J06192K257l35155j03025
7215A7055530n03173j45802K0644m65529m1437m45657m04821q0427j50816j07272
7205A4731240k56271j22160j40822k82214j44861L03155l95503m0416k11528j29202
7195A3311418n9567P0171m89890J40319J36290j62917k99927L05964k51763o5742
7185A2634356l84021o4867J3827l1734n03916L39557l57625j5708k91608K65645
$$ y = [20586864, 20418720, 20198914, 20409307, 20200110, 20377516, 20069679, 20169806, 20409352, 20311958, 20208991, 20344525, 20325700, 20114008, 19939013, 20385886, 20026310, 19608879, 19575999, 19418664, 19482636, 19371969, 19340223, 19251843, 18925447, 19051067, 18475660, 18591554, 18212384, 17878935, 17950216, 17979565, 17935606, 17598280, 17611919, 17765802, 17385261, 17491453, 17493710, 17158555, 17055530, 16552357, 16406555, 16427199, 15961670, 15920233, 15474576, 15069755, 14989328, 14838512, 14731240, 14474969, 14352809, 14211987, 13929773, 13784912, 14088067, 13692564, 13652148, 13440620, 13311418, 13251851, 13322022, 12832132, 12972451, 13108741, 12945824, 12645897, 12951861, 12700098, 12634356, 12250335, 12185468, 12199295, 12167561, 11663645, 12003202, 11645577, 11629869, 11338261, 11603906]
7175A1603906m30079k13170l2105m34789K34806k22048k07707J44107j72681j31528
7165A0138712J00748m7587L8936n75687K05971l67625j43139K3562N5789K51177
7155I680857l98560l02442K38930j06407J99978m48791J36360k9749p3115j44832
7145H752229k89179L58635j85858k68823q685L51386m05622K13408j35507j00950
7135H281034J37005m32198n8102N3240N0587j58580j02833J87031m29641K11545
7125G739088N8371m76619J41176J77710l84533J40408j88484K40376n32160O2540
7115F977873j1931J97782j7810l31856M65516j51833m78727L70058j23046j42241
7105F753785R957j8492L6813k37524L68906l58564j38172K17441l36929K39733
$$ y = [11603906, 11173827, 10960657, 10928552, 10493763, 10728569, 10506521, 10298814, 10442921, 10270240, 10138712, 10239460, 10191873, 10230809, 9655122, 9861093, 9493468, 9350329, 9373891, 9429680, 9680857, 9282297, 8979855, 9218785, 9112378, 9312356, 8863565, 8999925, 8970176, 8897061, 8752229, 8463050, 8821685, 8635827, 8367004, 8358319, 8709705, 8304083, 8517491, 8381984, 8281034, 8418039, 7985841, 7927739, 7980979, 8031566, 7872986, 7770153, 7957184, 7527543, 7739088, 7797459, 7320840, 7462016, 7639726, 7255193, 7395601, 7207117, 7447493, 6915333, 6977873, 6965942, 7163724, 7145914, 6814058, 7279574, 7127741, 6649014, 7019072, 6896026, 6753785, 6763742, 6745250, 6782063, 6544539, 6913445, 6554881, 6416709, 6634150, 6297221, 6536954]
7095F536954J84566m49417R2943Q6333k23170J48340l25518J92724l0938j50334
7085F062483J85283k31504K51262k69331j41090J92027M0467P4805k94695m9314
7075E820393J64660l25813J37235P1472P0715j36263k9649K0176p7660N5296m5222
7064E725340k0312J74525k08691R0641L39790k81633R7743J29718J88244K71599
7054F506964K19498J35801K22074O9577L70719k06097J89265l32896l1078j87125
7044F956702m51176l02774J6695j43548j12324j38563L54198n23040k2034K10303
7034E844439k75723M3887k93216J27075J21353j55265L0121R6720l7541k43545
7024E258305k7967L15685k80870L7883R7305K6163p1470j23980k97405K42673
$$ y = [6536954, 6721520, 6272103, 6365046, 6451379, 6228209, 6376549, 6051031, 6243755, 6212817, 6062483, 6247766, 6016262, 6267524, 5998193, 5857103, 6049130, 6089597, 6164402, 5869707, 5820393, 5985053, 5659240, 5796475, 5867947, 5938662, 5802399, 5772750, 5792926, 5715266, 5770562, 5725340, 5705028, 5879553, 5670862, 5761503, 6101293, 5819660, 5917403, 6047121, 6235365, 6506964, 6726462, 6862263, 7084337, 7153914, 7524633, 7318536, 7507801, 7174905, 7143827, 6956702, 6505526, 6202752, 6219447, 6075899, 5963575, 5825012, 6179210, 5656170, 5634136, 5844439, 5568716, 5612603, 5319387, 5446462, 5567815, 5412550, 5442671, 5539391, 5501850, 5258305, 5230338, 5546023, 5265153, 5303036, 5400341, 5426504, 5355034, 5231054, 4933649, 5176322]
7014E176322J63599J59754l07755J97805j60147P1461j01928J21727j35940M4053
7004E228951P6469j5060R2747j34851k05701N88079k49092O0512K2606J85328
6994E649988j12506L35152J45919J37028j41499K88380L89367L99406J01785O25085
6984G818105R40597J084256J154673P70650K23155m32735L7251p09655j117400
6975I768897n09919n77935o34291m26140k75278J23950j34767l1724m72728N02268
6965G332333j81261O5862P25131K22524K13679P57349M65077J566414J541608
6956A2708716K928549L790950L932014K926396J285687j000977j886998k409882
6948B2274455k319936k950838k417083j960407j300779j270563n44839m47276
$$ y = [5176322, 5339921, 5499675, 5191920, 5389725, 5229578, 5301039, 5199111, 5320838, 5184898, 5228951, 5305420, 5290360, 5383107, 5248256, 5042555, 5630634, 5381542, 5442054, 5464660, 5649988, 5537482, 5872634, 6018553, 6155581, 6014082, 6302462, 6691829, 7091235, 7193020, 7818105, 8758702, 9842958, 10997631, 11768281, 11991436, 11558701, 11595952, 10886297, 9768897, 9258978, 8681043, 8046752, 7620612, 7345334, 7469284, 7334517, 7302793, 6830065, 7332333, 7151072, 7216934, 7942065, 8164589, 8378268, 9135617, 9600694, 11167108, 12708716, 15637265, 19428215, 23360229, 26286625, 27572312, 26571335, 24684337, 22274455, 19954519, 17003681, 14586598, 12626191, 11325412, 10054849, 9510010, 9062734]
6940I062734n79329k79825O5486j89274L98631k74942r5432M71441N49447K48823
6930I377760P98485J445253K043884L517553L943573K521496J463989n17408j664812
6921B2929773k120538k492775k834180j796540j516577j799516p86262o04143
6913H979242q19818j69598n68447j63536k02988n8438K0252K518J18278m30435
6903F707030L29909O02265L10697R23635P60568J365022J579986O87071M27602
6894A3693785J12953m7489m88074o37520o89695j019094o39847q21792p00263
6885H762964n12382q00435k63764o84466j48849l18073n58336j78521m69183J33377
6875D962332J2756m15602K42249k55050J19056m8950k37522J15794k08818M8096
$$ y = [9062734, 8483405, 8203580, 8269066, 8079792, 8478423, 8203481, 8108049, 8579490, 9128937, 9377760, 10176245, 11621498, 13665382, 17182935, 21126508, 23648004, 25111993, 24594585, 22929773, 20809235, 18316460, 15482280, 13685740, 12169163, 10369647, 9583385, 8979242, 8159424, 7989826, 7421379, 7257843, 7054855, 6996417, 7016669, 7019187, 7137465, 6707030, 7036939, 7639204, 7949901, 8873536, 9634104, 10999126, 12579112, 13266183, 13693785, 13806738, 13759249, 13271175, 12633655, 11943960, 10924866, 10285019, 9463227, 8762964, 8250582, 7450147, 7186383, 6501917, 6353068, 6034995, 5476659, 5298138, 4828955, 4962332, 4975088, 4559486, 4801735, 4546685, 4665741, 4616791, 4379269, 4495063, 4286245, 4334341]
6865D334341J52553k18407k8791l01983L94214k40952R310j31416K70658p0070
6855D169457j93039j2296K15293l04474J96802k46706K83307j15257m89717L28503
6845C831873L54109L5112j92267L06656k07976M52212L27734M53588L94118R86338
6835F741497N91705K06072n3465j00975n65551o0379r69105n07888j31233m52063
6825D698615m82017j08601k7501j28767m01397J03320k80982K75226k22213k06797
6815C218886K09891l32226K10233j80281n2968j33250K92764q5671J22441k71349
6805B998470L64934k90827N2822j91007r1615Q0937L54636l35522j2897J70847
6795C100778O4498l73274L93897m7821J12598m89084L12582L2434K56120n03056
$$ y = [4334341, 4486894, 4268487, 4239696, 3937713, 4331927, 4090975, 4100285, 3968869, 4239527, 4169457, 3976418, 3964122, 4179415, 3874941, 4071743, 3825037, 4108344, 3993087, 3503370, 3831873, 4185982, 4221094, 4028827, 4335483, 4127507, 4579719, 4907453, 5361041, 5755159, 6741497, 7333202, 7539274, 7485809, 7384834, 6819283, 6758904, 5789799, 5281911, 5150678, 4698615, 4216598, 4107997, 4080496, 3951729, 3550332, 3653652, 3372670, 3647896, 3425683, 3218886, 3428777, 3096551, 3306784, 3126503, 3073535, 2940285, 3233049, 3147378, 3269819, 2998470, 3363404, 3072577, 3125399, 2934392, 2842777, 2923714, 3278350, 2942828, 2929931, 3100778, 3165276, 2792002, 3185899, 3138078, 3250676, 2761592, 3074174, 3106608, 3362728, 2859672]
6785B859672O8616j41913L19911j69194K88822p3813K5255K12758K15808j89899
6775C416023J38936L63656N9246j05157k46185Q0114j19764r3244k33246O2163
6765C322542k07782r8006j25358K03080j26966j28895r2851J88298k5533o6736
6755B841793K66549K02087l86265Q194q5644L65442o0143J78101L55003M66385
6745D151502j45742M3504L11220M02230k99118j48071p0925j09478P70p4361k5920
6734D035611r4384k73762J41534l24408l02083P807m7599k5963j95591K15518
6724C136680k42168M00840j08245j56428K51626k1778n5349q1263Q1039K90606
6714C495560J7964L53049P83410M59520J84238K8271L1431n68903j75234l04047
$$ y = [2859672, 2928288, 2786375, 3106286, 2937092, 3225914, 3152101, 3177356, 3390114, 3605922, 3416023, 3554959, 3918615, 3977861, 3872704, 3626519, 3706633, 3586869, 3493625, 3260379, 3322542, 3114760, 3016754, 2891396, 3094476, 2967510, 2838615, 2745764, 2934062, 2908529, 2841793, 3108342, 3310429, 2924164, 2932358, 2846714, 3212156, 3152013, 3330114, 3685117, 4151502, 4005760, 4049264, 4360484, 4762714, 4463596, 4315525, 4244600, 4135122, 4135892, 4061531, 4035611, 3941227, 3667465, 3808999, 3484591, 3182508, 3190315, 3142716, 3116753, 2921162, 3136680, 2894512, 3295352, 3187107, 3030679, 3282305, 3260527, 3205178, 3123915, 3204954, 3495560, 3513524, 3866573, 4649983, 5109503, 5293741, 5322012, 5353443, 4784540, 4609306, 4305259]
6704D305259k76614l57203k38424j11340K10141k34397l3428K18369j19248r9591
6694C263524l1649J22133J18227j63902J49802K52240J33916K66122L60836Q77366
6684E348615N55063P88207N16964j71176o7894n01583l84109o21029n92296k11975
6674D658787l42777l70906r0255J36584r4805o9028j67242n0605j0191Q6471r7804
6663C588229L47852J70605j5362J68751K33694M66636P27486N28980J100931K60416
6653G578218r9080O8004n34220n18191m37365n65844m91172n93539k61683M20304
6643D565432k84581r3492k60406L34357m2279K64733M32565Q2207M17201O3600
6633E479337L19358k15643j88379J59828j26650J40500j6693J90273k44725n5109
$$ y = [4305259, 4028645, 3671442, 3433018, 3321678, 3531819, 3297422, 3263994, 3482363, 3363115, 3263524, 3231875, 3354008, 3472235, 3308333, 3458135, 3710375, 3844291, 4110413, 4471249, 5348615, 5903678, 6691885, 7208849, 7037673, 6969779, 6468196, 6084087, 5463058, 4870762, 4658787, 4316010, 3945104, 3854849, 3991433, 3896628, 3827600, 3660358, 3609753, 3599562, 3686033, 3588229, 3936081, 4106686, 4091324, 4260075, 4493769, 4960405, 5687891, 6216871, 7317802, 7578218, 7479138, 7547142, 7012922, 6494731, 6057366, 5491522, 5000350, 4406811, 4145128, 4565432, 4280851, 4187359, 3926953, 4261310, 4219031, 4483764, 4916329, 4998536, 5415737, 5479337, 5798695, 5583052, 5394673, 5554501, 5427851, 5568351, 5551658, 5741931, 5497206, 5442097]
6623E442097k84854q2304r6509l28271j63161j42723L28190k67052j40001L32129
6613D597541L18782o9529j06569J71812R35791N49182O90023M58074J2018l63210
6603G193915l02803k98193m35584q06066l11724l82933j1954k82850P9951P9298
6593D521057j45949j44725J72857j5626j23894J43879J47916l4887l29504N13935
6583D705059M76936K16195L79808M87033J303299M62694L27330j09547n60903
6574G687904j44589m00476o23089k44056l52555j08016k1258k51962o7814J15948
6564E590037P387K3501L3075K7309N4813L05077M58270m63746M59382k23219P06683
6553F978569P47658Q70164O80831M17236K24181R5967K39530J86173P2316J045632
$$ y = [5442097, 5157243, 5074939, 4978430, 4650159, 4486998, 4344275, 4672465, 4405413, 4265412, 4597541, 4916323, 4846794, 4740225, 4912037, 5847828, 6397010, 7087033, 7545107, 7557125, 7193915, 6891112, 6592919, 6157335, 5351269, 5039545, 4656612, 4644658, 4361808, 4441759, 4521057, 4375108, 4230383, 4403240, 4387614, 4263720, 4407599, 4555515, 4520628, 4191124, 4705059, 5181995, 5398190, 5777998, 6265031, 7568330, 8031024, 8358354, 8248807, 7687904, 7543315, 7142839, 6519750, 6275694, 5923139, 5815123, 5793865, 5541903, 5474089, 5590037, 5597424, 5620925, 5654000, 5681309, 5736122, 6041199, 6499469, 6035723, 6495105, 6271886, 6978569, 7726227, 8596391, 9277222, 9694458, 9918639, 10014606, 10254136, 10440309, 10512625, 11558257]
6543A1558257J161297J821221J570920Q05807R4584n10374r43783j236544j359806
6534A2961579o26121o90636m41964k34308K34700K15837R2245k52099J63605K06914
6524A1629752k07562J65633P16073N20368M75439L69533K26105R4406J90789J10557
6514A4291093P55896K23487O09361J067888P98673J208392J089732J046527J281904
6505B2372953P68020Q01989R37068L49723l01801J60905k72409l20027j196389
6496B3300032q28443j044371j549521r42674j209190n00235r23760j046036n9757
6487A5196045p87090o95847O6745l19525l48141k10503R9080k27852j52067J14221
6477A2735066k94442M79421j42908o32704M64751j14710L27285k68237r6777L19330
$$ y = [11558257, 12719554, 14540775, 16111695, 16917502, 17012086, 16501712, 15557929, 14321385, 12961579, 12335458, 11644822, 11202858, 10968550, 11203250, 11419087, 11511332, 11259233, 11422838, 11629752, 11422190, 11587823, 12303896, 12824264, 13299703, 13669236, 13895341, 13989747, 14180536, 14291093, 15046989, 15270476, 15879837, 16947725, 17746398, 18954790, 20044522, 21091049, 22372953, 23140973, 23942962, 24880030, 25229753, 24927952, 25088857, 24816448, 24496421, 23300032, 22471589, 21427218, 19877697, 18935023, 17725833, 17225598, 16301838, 15255802, 15196045, 14408955, 13713108, 13779853, 13460328, 13112187, 12901684, 13000764, 12772912, 12620845, 12735066, 12440624, 12920045, 12777137, 12144433, 12609184, 12494474, 12821759, 12553522, 12456745, 12776075]
6467A2776075K42620N2746L67147M15386M30332K68101R88195O80045L84771L72510
6457A6977928J96715R9621n90960L2521k01508n67983k05610J52856k05800K02219
6447A5889999J75130K19193L41158L73611J71462L29686M08859J35184J84221
6438A8228503K52904J41321K84878J42665P68768K41737K55367M10995K21316
6429B0948454K70946L62781K36827L27273j66985j42335K28429O44864m3786J22625
6419B2789093J65197L84727L43444O20548L03889P51683R09632N07221J239808
6410B8015242J350815J543141J644927J736641J580558J163414J111488N89674
6402C8735900M33308Q06468N34394J032851R25633J032502J714044J382156J972990
$$ y = [12776075, 13018695, 13071441, 13438588, 13853974, 14284306, 14552407, 15540602, 16220647, 16605418, 16977928, 17174643, 17274264, 16683304, 16715825, 16514317, 15946334, 15740724, 15893580, 15687780, 15889999, 16065129, 16284322, 16625480, 16999091, 17170553, 17500239, 17909098, 18044282, 18228503, 18481407, 18622728, 18907606, 19050271, 19819039, 20060776, 20316143, 20727138, 20948454, 21219400, 21582181, 21819008, 22146281, 21979296, 21836961, 22065390, 22710254, 22666468, 22789093, 22954290, 23339017, 23682461, 24303009, 24606898, 25358581, 26268213, 26775434, 28015242, 29366057, 30909198, 32554125, 34290766, 35871324, 37034738, 38146226, 38735900, 39169208, 39975676, 40510070, 41542921, 42468554, 43501056, 45215100, 46597256, 48570246]
6393D8570246J350639K528227K514496K093787L326747K810442L292363L369118
6385F9856065L713645L596975L402075L639208L760168L468406L208645K937976
6377I7583163K585205J940907J515615J209117M10237j49493o41422j151143j306996
6368A01995190k031971k057295j816289k117993k240271k107688k264828j767443
6360H5591412j842003j565597j657931j705572j610669j660823j383679j607917
6352G2557221j663346j828987k136163k058975j631538k305676k322005k124277
6344E6486254k073817k329533k242524k108930j687924j605200j744094j222745
6336D1471487j129727j356656j115696j385738j127015r78140j585864m42847
$$ y = [48570246, 49920885, 52449112, 54963608, 57057395, 60384142, 63194584, 66486947, 69856065, 73569710, 77166685, 80568760, 84207968, 87968136, 91436542, 94645187, 97583163, 100168368, 102109275, 103624890, 104834007, 105244244, 105094751, 104453329, 103302186, 101995190, 99963219, 97905924, 96089635, 93971642, 91731371, 89623683, 87358855, 85591412, 83749409, 82183812, 80525881, 78820309, 77209640, 75548817, 74165138, 72557221, 70893875, 69064888, 66928725, 64869750, 63238212, 60932536, 58610531, 56486254, 54412437, 52082904, 49840380, 47731450, 46043526, 44438326, 42694232, 41471487, 40341760, 38985104, 37869408, 36483670, 35356655, 34378515, 32792651, 32349804]
6328C2349804o72981j105389p41604n10896n3560m19892m04888L0217j69204l84082
6318B7917525m7066J8752n2100l88742J05766N8581p5755j34259K00424J81452
6308B7784578K97282l16862J89703K33428M33684J20880M47475k9196J84256K86111
6298B9631339P34373m341M1074Q9061R1194k11572L21038o67398J23495k82559
6288B9865704j15665J40101K81581k41681K37263L80022K66388L91515R43999
6279C2149227O61451J084703Q86720Q18236J372817J133328J812378K090948J940407
6270D3950215J596223P52697Q2963j041971j554777k377743k420861j935298k424852
6261C4626596j496595j626471j148287j133550m18636r62806k5562m79415j98936
$$ y = [32349804, 31676823, 30571434, 29829830, 29318934, 29265374, 28845482, 28440594, 28470811, 28301607, 27917525, 27870459, 27889211, 27837111, 27448369, 27554135, 27612716, 27536961, 27402702, 27603126, 27784578, 28081860, 27764998, 27954701, 28188129, 28621813, 28742693, 29190168, 29160972, 29345228, 29631339, 30365712, 30361371, 30402445, 30491506, 30582700, 30371128, 30692166, 30024768, 30148263, 29865704, 29750039, 29890140, 30171721, 29930040, 30167303, 30547325, 30813713, 31205228, 32149227, 32810678, 33895381, 34782101, 35600337, 36973154, 38106482, 39918860, 42009808, 43950215, 45546438, 46299135, 46382098, 45340127, 43785350, 41407607, 38986746, 37051448, 34626596, 33130001, 31503530, 30355243, 29221693, 28803057, 27840251, 27814689, 27335274, 27136338]
6252B7136338m74307J03496o04275r0326p5994L3558n10191j37661m57493r7999
6242B4825146q81370j89325j95376m420j73433J81584M94869M08201O452L94406
$$ y = [27136338, 26662031, 26765527, 26161252, 26070926, 25994932, 26028490, 25518299, 25380638, 24923145, 24825146, 23943776, 23754451, 23559075, 23554655, 23381222, 23562806, 24057675, 24465876, 24472328, 24866734]
$$ [...]
##END NTUPLES=NMR SPECTRUM
##END=
