##TITLE=abcd
##JCAMPDX= 6.0         $$ Bruker NMR JCAMP-DX V2.0
##DATA TYPE= NMR SPECTRUM
##DATA CLASS= NTUPLES
##ORIGIN= UXNMR, Bruker Analytische Messtechnik GmbH
##OWNER= root
$$ XWIN-NMR		Version 3.5
$$ Fri May 15 15:44:47 2026 Russian Standard Time (UT+4h)  servis@DPX200
##.OBSERVE FREQUENCY= 200.131235884673
##.OBSERVE NUCLEUS= ^1H
##.ACQUISITION MODE= SIMULTANEOUS
##.ACQUISITION SCHEME= undefined
##.AVERAGES= 32
##.DIGITISER RES= 18
##SPECTROMETER/DATA SYSTEM= spect
##.PULSE SEQUENCE= zg
##.SOLVENT NAME= CDCl3
##.SHIFT REFERENCE= (INTERNAL, CDCl3, 0, 16.4885)
##AUDIT TRAIL= $$ (NUMBER, WHEN, WHO, WHERE, WHAT)
$$ ##TITLE= Audit trail, XWIN-NMR		Version 3.5
$$ ##JCAMPDX= 5.01
$$ ##ORIGIN= Bruker BioSpin GmbH
$$ ##OWNER= servis
$$ F:\spectra/data/av/nmr/H1/1/pdata/1/auditp.txt
$$ ##AUDIT TRAIL=  $$ (NUMBER, WHEN, WHO, WHERE, WHAT)
(   1,<2026-05-15 15:38:01.40 +0400>,<servis>,<DPX200>,
      <created by zg, POWCHK disabled, PULCHK disabled
       configuration hash MD5:
       00 E9 B6 7A A2 85 ED C7 34 08 36 98 17 FE 4E 26
       data hash MD5: 32K
       CF AE B5 84 24 E3 6D 67 D7 A0 B4 0B E1 87 02 37>)
(   2,<2026-05-15 15:39:10.04 +0400>,<servis>,<DPX200>,
      <Start of raw data processing
       efp BC_mod = 2 LB = 0.05 FT_mod = 6 PKNL = 1 PHC0 = -412.79 PHC1 = 3.101563 SI = 16K 
       data hash MD5: 16K
       CF 56 5C A7 D4 27 92 1D 5D 1E F5 40 18 64 18 5E>)
(   3,<2026-05-15 15:39:25.57 +0400>,<servis>,<DPX200>,
      <pk PHC0 = 1.6 PHC1 = 0 
       data hash MD5: 16K
       AF 5D F5 27 39 DA 53 CC F5 0D 26 DA CC 42 0D 29>)
$$ ##END=
$$ 
$$ hash MD5
$$ 12 87 BD 21 53 A4 C7 8B EA E1 9D F3 0E CF B8 CF
##$RELAX= 
##$RELAX= 
##$RELAX= 
##$RELAX= 
##$RELAX= 
##$RELAX= 
##$RELAX= 
##$RELAX= 
$$ Bruker specific parameters
$$ --------------------------
##$DU= <F:\spectra>
##$EXPNO= 1
##$NAME= <H1>
##$PROCNO= 1
##$TYPE= <nmr>
##$USER= <av>
##$AMP= (0..31)
100 100 100 100 100 100 100 100 100 100 100 100 100 100 100 100 100 100 
100 100 100 100 100 100 100 100 100 100 100 100 100 100 
##$AQSEQ= 0
##$AQ_mod= 1
##$AUNM= <au_zg>
##$AUTOPOS= <>
##$BF1= 200.13
##$BF2= 200.13
##$BF3= 200.13
##$BF4= 200.13
##$BF5= 500.13
##$BF6= 500.13
##$BF7= 500.13
##$BF8= 500.13
##$BYTORDA= 1
##$CFDGTYP= 0
##$CFRGTYP= 5
##$CHEMSTR= <none>
##$CNST= (0..31)
1 1 145 1 1 1 1 1 1 1 1 1 1 1 1 1 1 1 1 1 1 1 1 1 1 1 1 1 1 1 1 1 
##$CPDPRG= <>
##$CPDPRG1= <>
##$CPDPRG2= <>
##$CPDPRG3= <>
##$CPDPRG4= <mlev>
##$CPDPRG5= <mlev>
##$CPDPRG6= <mlev>
##$CPDPRG7= <mlev>
##$CPDPRG8= <mlev>
##$CPDPRGB= <>
##$CPDPRGT= <>
##$D= (0..31)
0 2 0 0 0 0 0 0 0 0.06 0 0 0 0 0 0 0.0002 0 0 0 0 0 0 0 0 0 0 0 0 0 0 
0 
##$DATE= 1778845080
##$DBL= (0..7)
120 120 120 120 120 120 120 120 
##$DBP= (0..7)
150 150 150 150 150 150 150 150 
##$DBP07= 0
##$DBPNAM0= <>
##$DBPNAM1= <>
##$DBPNAM2= <>
##$DBPNAM3= <>
##$DBPNAM4= <>
##$DBPNAM5= <>
##$DBPNAM6= <>
##$DBPNAM7= <>
##$DBPOAL= (0..7)
0.5 0.5 0.5 0.5 0.5 0.5 0.5 0.5 
##$DBPOFFS= (0..7)
0 0 0 0 0 0 0 0 
##$DE= 6
##$DECBNUC= <off>
##$DECIM= 32
$$ [...]
##$SUBNAM4= <"">
##$SUBNAM5= <"">
##$SUBNAM6= <"">
##$SUBNAM7= <"">
##$SUBNAM8= <"">
##$SUBNAM9= <"">
##$SW= 20.6817932712277
##$SWIBOX= (0..15)
0 0 3 0 0 0 0 0 0 0 0 0 0 0 0 0 
##$SW_h= 4139.07284768212
##$TD= 32768
##$TD0= 1
##$TE= 0
##$TE2= 300
##$TE3= 300
##$TEG= 300
##$TL= (0..7)
0 120 120 120 120 120 120 120 
##$TP= (0..7)
150 150 150 150 150 150 150 150 
##$TP07= 0
##$TPNAME0= <>
##$TPNAME1= <>
##$TPNAME2= <>
##$TPNAME3= <>
##$TPNAME4= <>
##$TPNAME5= <>
##$TPNAME6= <>
##$TPNAME7= <>
##$TPOAL= (0..7)
0.5 0.5 0.5 0.5 0.5 0.5 0.5 0.5 
##$TPOFFS= (0..7)
0 0 0 0 0 0 0 0 
##$TUNHIN= 0
##$TUNHOUT= 0
##$TUNXOUT= 0
##$USERA1= <user>
##$USERA2= <user>
##$USERA3= <user>
##$USERA4= <user>
##$USERA5= <user>
##$V9= 5
##$VALIST= <valist>
##$VCLIST= <CCCCCCCCCCCCCCC>
##$VD= 0
##$VDLIST= <DDDDDDDDDDDDDDD>
##$VPLIST= <PPPPPPPPPPPPPPP>
##$VTLIST= <TTTTTTTTTTTTTTT>
##$WBST= 1024
##$WBSW= 30
##$XGAIN= (0..3)
0 0 0 0 
##$XL= 0
##$YL= 0
##$YMAX_a= 1341404
##$YMIN_a= -1817298
##$ZGOPTNS= <>
##$ZL1= 120
##$ZL2= 120
##$ZL3= 120
##$ZL4= 120
##$ABSF1= 0
##$ABSF2= 0
##$ABSG= 0
##$ABSL= 0
##$ALPHA= 0
##$AQORDER= 0
##$ASSFAC= 0
##$ASSFACI= 0
##$ASSFACX= 0
##$ASSWID= 0
##$AUNMP= <proc_1d>
##$AZFE= 0.1
##$AZFW= 0.1
##$BCFW= 0
##$BC_mod= 2
##$BYTORDP= 0
##$COROFFS= 0
##$CY= 18.4799938201904
##$DATMOD= 1
##$DC= 0
##$DFILT= <>
##$DTYPP= 0
##$F1P= 9.9274215381318
##$F2P= -0.165520771350173
##$FCOR= 1
##$FTSIZE= 16384
##$FT_mod= 6
##$GAMMA= 0
##$GB= 0
##$INTBC= 1
##$INTSCL= 4.127829e-11
##$ISEN= 128
##$LB= 0.05
##$LEV0= 0
##$LPBIN= 0
##$MAXI= 10000
##$MC2= 0
##$MEAN= 0
##$ME_mod= 0
##$MI= 50
##$NCOEF= 0
##$NC_proc= -3
##$NLEV= 6
##$NOISF1= 3.799351
##$NOISF2= 2.8
##$NSP= 0
##$NTH_PI= 0
##$NZP= 0
##$OFFSET= 16.48848
##$PC= 4
##$PHC0= -411.19
##$PHC1= 3.101563
##$PH_mod= 1
##$PKNL= yes
##$PPARMOD= 0
##$PSCAL= 4
##$PSIGN= 0
##$REVERSE= no
##$SF= 200.130005582386
##$SI= 16384
##$SIGF1= 3
##$SIGF2= 2
##$SINO= 400
##$SIOLD= 16384
##$SREGLST= <1H.CDCl3>
##$SSB= 0
##$STSI= 16384
##$STSR= 0
##$SW_p= 4139.07284768211
##$SYMM= 0
##$S_DEV= 0
##$TDeff= 32768
##$TDoff= 0
##$TI= <>
##$TILT= no
##$TM1= 0
##$TM2= 0
##$TOPLEV= 0
##$USERP1= <user>
##$USERP2= <user>
##$USERP3= <user>
##$USERP4= <user>
##$USERP5= <user>
##$WDW= 1
##$XDIM= 16384
##$YMAX_p= 296336600
##$YMIN_p= -469413
$$ End of Bruker specific parameters
$$ ---------------------------------
##NTUPLES= NMR SPECTRUM
##VAR_NAME=  FREQUENCY,     SPECTRUM/REAL,   SPECTRUM/IMAG
##SYMBOL=    X,             R,               I
##VAR_TYPE=  INDEPENDENT,   DEPENDENT,       DEPENDENT
##VAR_FORM=  AFFN,          ASDF,            ASDF
##VAR_DIM=   16384,         16384,           16384
##UNITS=     HZ,            ARBITRARY UNITS, ARBITRARY UNITS
##FACTOR=    0.252644378177508, 1,           1
##FIRST=     3299.83951724647, 0,            0
##LAST=      -839.233330435636, 0,           0
##MIN=       -839.233330435636, -469413,     0
##MAX=       3299.83951724647, 296336600,    0
$$ Real data points
##PAGE= N=1
##DATA TABLE= (X++(R..R)), XYDATA
$$ [...]
12226a27869J12273k57451M7448P6327Q0521o8934j0347R5060n0120j74377J53496
12215a23973q4026O1568J06284r7013o8655o2338J56593j50925K1827J08536J2011
12204a20111K9938j23341J4321N9089j00639N2542Q0942J1245o4600L7318j7949
12193a41245j11648n3939M3971L2007J798J18315j38509J828R9725l7569N4387
12182a30879r0938L8476q690j07489O8330P2415p3017p5561K06478r7552L0403
12171a68024J0739m296R4503j89221R2680o9411J19248l2395q6890R8683j22484
12160b56868R9030K4794o402o1886O3867o5184n0168L2437O0164m6567O5198J4564
12148a27021j62440J25724Q2105j13190k0775Q5929j4761m0083O4333M0343j69676
$$ y = [-127869, -15596, -273047, -225599, -149272, -68751, -137685, -148032, -52972, -103092, -277469, -123973, -207999, -146431, -40147, -137160, -205815, -268153, -111560, -262485, -240658, -132122, -120111, -90173, -213514, -199193, -140104, -240743, -188201, -107259, -96014, -160614, -123296, -141245, -252893, -306832, -262861, -230854, -229056, -110741, -249250, -247422, -147697, -185266, -130879, -221817, -183341, -192031, -299520, -231190, -158775, -231792, -307353, -100875, -198427, -168024, -157285, -161581, -67078, -256299, -163619, -233030, -113782, -146177, -233067, -134384, -256868, -157838, -133044, -139446, -201332, -137465, -202649, -252817, -220380, -160216, -206783, -141585, -127021, -289461, -163737, -81632, -194822, -215597, -129668, -144429, -184512, -120179, -79836, -249512]
12137b49512K05127p0075n5381p149j18387M4639p9254M2472J12776O5414p4322
12126a83652r3630J13270L4423j31366M7440N5870M0910M2172j22128l7556R9397
12115a34850j41428o2105O3782R2077j1199o412j7857O7979j9361o4895J50350
12104h3919J6883q7358j56170K1247L0891J34424o5272J05424j21620J77437q4360
12093a12393j56761J25202j15403J38993j02420P4292p5615K2895J59156n0610
12083i2664j38252l772P4130r6505J49127L3444j31335L1546K7703j57249N9977
12072b43850J27990j0176j732N9435j49651n863N4785m6911L5105J16446m0864
12061a05286j06115R5327o5386L0223L4039J4558r6458l5476K4055n4811Q4976
$$ y = [-249512, -44385, -114460, -169841, -176990, -295377, -250738, -329992, -287520, -174744, -109330, -183652, -277282, -164012, -129589, -260955, -213515, -157645, -116735, -74563, -196691, -234247, -134850, -276278, -338383, -274601, -182524, -193723, -200135, -217992, -150013, -169374, -234269, -83919, -67036, -154394, -310564, -289317, -258426, -124002, -189274, -83850, -205470, -28033, -112393, -269154, -143952, -259355, -120362, -222782, -148490, -224105, -201210, -42054, -92664, -230916, -234688, -160558, -257063, -107936, -74492, -205827, -174281, -146578, -303827, -243850, -115860, -126036, -127768, -68333, -217984, -223847, -169062, -215973, -180868, -64422, -105286, -211401, -116074, -181460, -151237, -117198, -102640, -199098, -234574, -210519, -265330, -180354]
12050a80354j2683m8216K2400p3279Q4189p9075N1041R9712m0034P9101k13158
12039c10356J01288N8360j40390Q1694J22452j30140n3170O4446p8979O0268l9957
12028b64484J25443k4082M0480J4777P3899k03493L9365L6964r36j68158K2954
12017c07271J54299J1307j1426N0456R1724j65384N0397l08351K67637p010m7983
12006b21605L211Q2588L9571j20901k9404Q1414n758r744Q3963K5965j42190p1
11994b12961P7961j80238J35619J01590l7129k14381Q1740P7779p4852J32214
11984a12658o2293J27400j87687O9045K5242j11489K53377l15264J54285j09339
11974b69381J29893o2511N0635K8788j60740Q8123Q8756q2907J06143p1200M7149
$$ y = [-180354, -193037, -241253, -218853, -292132, -207943, -287018, -235977, -136265, -176299, -97198, -310356, -209068, -150708, -291098, -209404, -86952, -217092, -270262, -205816, -284795, -224527, -264484, -139041, -163123, -122643, -107866, -33967, -237460, -198095, -161131, -162067, -330225, -307271, -152972, -141665, -153091, -102635, -10911, -176295, -125898, -434249, -166612, -173622, -221605, -218394, -135806, -96235, -217136, -246540, -165126, -170884, -180628, -96665, -70700, -212890, -212961, -135000, -315238, -179619, -78029, -115158, -329539, -247799, -170020, -244872, -112658, -174951, -47551, -235238, -166193, -140951, -252440, 937, -314327, -160042, -269381, -139488, -201999, -151364, -122576, -283316, -195193, -106437, -189344, -83201, -154401, -107252]
11963a07252j59507r1360J45112K8427M3290q7174N0615l8390L5732J3624J26607
11952d0276k31153J89281n1289l1634j40352J49400l8373o9769J09703M6126q3802
11941a92138P7230Q4100j18680r5263J8204J27112L9442k15331K9830M9509j778
11930a97763P8150Q8316j13159k8842r2395P5018J0796p7014J56375l9272p8071
11919b17861J2875P1961r2703o1409N9738m5140J24924R0129n1133p404j76071
11908b92094K64890j51383O8115Q4854j95456M6574m0432K7480j14449K213J00818
11897a98870K198O0k3776j15374J51213l8212M9888l4479P1290j78084Q0983M5087
11885a88076P7153j13795J23962o7543m928Q5876n3380j5157o8515O7649K4326
$$ y = [-107252, -266759, -358119, -213007, -184580, -141290, -228464, -177849, -216239, -180507, -166883, -40276, -271429, -82148, -133437, -165071, -305423, -156023, -194396, -264165, -154462, -108336, -192138, -114908, -30808, -149488, -244751, -226547, -99435, -59993, -275324, -245494, -195985, -197763, -119613, -31297, -144456, -173298, -265693, -190675, -179879, -256893, -100518, -139790, -217861, -204986, -133025, -225728, -287137, -227399, -272539, -147615, -57486, -108619, -116023, -292094, -27204, -178587, -110472, -25618, -221074, -174500, -214932, -187452, -301901, -299688, -198870, -196672, -196612, -220388, -335762, -184549, -222761, -172873, -207352, -136062, -314146, -233163, -188076, -110923, -224718, -100756, -168299, -173227, -87351, -140731, -155888, -224403, -156754, -132428]
11874a32428k6708O3950n2760k3301o6492K1397K6634n2278o0676M3581j4496
11863b73577J51446N7692n1472j00382K0021p059L6016m7750J9320N8709p5612
11852b12648L2615j07968J43057k5982k6180j11013J00524m3405P5846Q888j3963
11841a80229K121j7725j04698J86954l1385q6777L390K9528K663J0852Q2216q8714
11829a91804r8583l1391J00376J14012j97170P5009J5544J5173Q1646J17820k2223
11818b1591o0794l1465j57237J62769j49525P3252N2472k0653l6497j1866Q896
11807a92239J2221M3310l2089o7187k2150m4917J32070l4915m3396R5212K279
11796a51801J01k9203j5884N6882r9416L3725K5019q3202L6319J13509o8933r6055
$$ y = [-132428, -159136, -95186, -147946, -171247, -237739, -216342, -189708, -241986, -302662, -259081, -273577, -122131, -64439, -115911, -216293, -196272, -203331, -167315, -215065, -195745, -137036, -212648, -180033, -288001, -144944, -170926, -197106, -308119, -207595, -251000, -175154, -166266, -180229, -178108, -195833, -300531, -113577, -144962, -231739, -228349, -198821, -196158, -185306, -103090, -191804, -290387, -321778, -221402, -107390, -304560, -229551, -214007, -198834, -117188, 632, -21591, -82385, -113850, -271087, -108318, -257843, -184591, -132119, -152772, -189269, -201135, -192239, -180018, -136708, -168797, -235984, -258134, -303051, -170981, -205896, -249292, -154080, -151801, -151700, -180903, -196787, -139905, -239321, -205596, -180577, -263779, -227460, -113951, -182884, -278939]
11784b78939R7655N1158j04253M9008N542j4532r2465J49607m7199j698Q5192
11773a00924r0899r5238J02176O8693p2957L2615l9653J5241P8701m6770r4832
11762b43847J02600r8276J52226M9571J3870m3695j53068o4161J66710j11212
11752b29282K79041j77519n7210J06123k7804K9176j69735J12751r3782r48M5238
11741a83951O7264r6832k3885K18641j60965J7309n6914R6445P8179j97156J17514
11730a24351l4597l7721L6272M7408J0827k3249j73857K06512L0516L1156j13683
11719a44767j5577L2954j21266P917O3895P2433J6317j58615Q3416K1952j02066
11708b43407J06426q0070O8552j15554J48943j67014J28733l6931n0254m1472
$$ y = [-278939, -181284, -130126, -234379, -185371, -179829, -194361, -286826, -137219, -184418, -186116, -100924, -191823, -287061, -184885, -116192, -189149, -156534, -196187, -180946, -102245, -149015, -243847, -141247, -239523, -87297, -37726, -23856, -67551, -220619, -284780, -118070, -229282, 49759, -127760, -184970, -78847, -106651, -77475, -247210, -134459, -228241, -229189, -183951, -116687, -213519, -237404, -18763, -179728, -162419, -219333, -122888, -44709, -241865, -124351, -158948, -196669, -160397, -112989, -102162, -125411, -299268, -92756, -62240, -31084, -144767, -160344, -127390, -248656, -240739, -176844, -104411, -88094, -246709, -163293, -141341, -243407, -136981, -217051, -148499, -264053, -115110, -282124, -153391, -190322, -240576, -282048]
11698b82048R6716J04351p8713J11260j56666q7852Q8848m7597m3030J69454j22267
11687b47544Q6431m9094j0337k2737n035J80884q8209R5902p4989j15822O8976
11676a81574o5897N1367n8892R8547Q8994p0367K2993m2729j28450R3941J3368
11665a78699Q2973j19181O3446r9317O4589K7774j9082l0607p5944P5739J01119
11654a07190r5516q3224K55038j64368r675M5896o0009J50855j37275j4984J8896
11643b01556N3316J3061q616p7612J44263k59144J07315k5420K8893J67244j70576
11632b28832J9624L6002O4605l7061k7L5216j24188J6861J7920Q1724m4683J44586
11620a8253l05674J31523o8628n3333K69215j05399k3173m8957j3520j7268R4336
$$ y = [-282048, -185332, -80981, -159694, -48434, -205100, -292952, -204104, -251701, -294731, -125277, -247544, -161113, -210207, -220544, -243281, -248316, -67432, -155641, -59739, -134728, -250550, -181574, -247471, -196104, -254996, -156449, -67455, -137822, -114829, -157558, -286008, -192067, -178699, -95726, -214907, -151461, -250778, -186189, -158415, -177497, -208104, -284048, -208309, -107190, -202706, -285930, -30892, -195260, -204935, -159039, -219048, -68193, -205468, -220452, -201556, -148240, -135179, -143795, -221407, -77144, -336288, -228973, -254393, -225500, -58256, -228832, -209208, -173206, -108601, -145662, -145689, -110473, -234661, -217800, -199880, -118156, -162839, -18253, -323927, -192404, -261032, -314365, -45150, -150549, -173722, -222679, -236199, -253467, -159131]
11609a59131K9856l6185k6657l995Q8514j20583N6479j4663N1116J3615k13639
11598c35273J76483n1585Q0846p2184R617k0180r0011J51059k21319K15830n4749
11587b11466j5447j7084R4064k0546o884j2097J8735j06152K7865J00329j4232
11576a62915K9765n0371j1808k8885q1442R1881O5345j26856O6260J41879j21526
11565a88673j6554k9698k3283R7055J6144M4184m5637j11735L4053l9619R2624
11554a71139K0677j540k3479K4399R0594o9290n0307n1716O757k8565O3038O9058
11542a21513k1701o3760L5717N5663j21674P2583j6368k8158N5350J18613j68430
11531b03678K2457j403j0870J67925j65799j70705J02808P1438n8009q8679J07815
$$ y = [-159131, -129275, -165460, -192117, -196112, -107598, -228181, -171702, -186365, -135249, -121634, -335273, -158790, -210375, -129529, -201713, -192096, -212276, -302287, -151228, -372547, -156717, -211466, -226913, -243997, -149933, -170479, -177363, -189460, -170725, -276877, -249012, -148683, -162915, -133150, -183521, -195329, -224214, -305656, -213775, -148430, -275286, -209026, -67147, -188673, -205227, -234925, -258208, -161153, -145009, -100825, -146462, -258197, -224144, -263763, -171139, -150462, -152002, -175481, -151082, -60488, -129778, -180085, -231801, -225044, -253609, -190571, -121513, -143214, -206974, -171257, -115594, -237268, -164685, -181053, -209211, -153861, -35248, -203678, -181221, -182624, -193494, -25569, -191368, -362073, -259265, -187827, -245836, -334515, -226700]
11520b26700J85426j43732J08221k02889R3978j51601R2846j3444N4891J29335
11510g3669j35320p2866J6752K19452k14133Q7769L3988l9423p3845J02989M0947
11499a07359q4817J70927q0674p8341O6653k1968m7094J4495R8662K2304j48710
11488a95922O6690Q7189j94291O4388j8148p432j9093Q5452p6333Q6563K4062
11477i6875l7294o9750J2672O5696j95676J47042J30386k00420J16613j38992
11467b66598O6946J26238j76078N6124N5085q196j25695L1574L942k6252R8796
11456a64114K8702p5828L8330m8083m0795L572P814N3243P5089l5141J20658j87239
11444b23792J4466j3812l822J97744j27862o0701k3440J62363n7803j18644K4173
$$ y = [-226700, -41274, -185006, -76785, -279674, -185696, -337297, -244451, -257895, -203004, -73669, -208989, -281855, -265103, -45651, -259784, -172015, -138027, -177450, -251295, -148306, -107359, -192176, -21249, -101923, -180264, -113611, -135579, -182673, -168178, -69516, -47212, -195922, -129232, -42043, -236334, -171946, -190094, -197526, -216619, -131167, -207500, -120937, -96875, -134169, -203919, -191247, -125551, -321227, -174185, -43799, -244219, -127606, -266598, -199652, -73414, -249492, -193368, -138283, -146479, -272174, -240600, -236658, -262910, -164114, -135412, -211240, -172910, -220993, -261788, -258216, -250402, -197159, -122070, -157211, -36553, -223792, -209326, -223138, -226960, -29216, -157078, -217779, -241219, -78856, -136659, -255303, -231130]
11433b31130O0558o3113r0163K38071m7292J8248j23774J36509l7040l3563Q45
11422a71844q3247K6766L8417j3216L5199L7911N151r0436L3958p402j07695K21016
11410g5422n5741j87412K00872j36763P8889j09917M5056M7739K7456p0132J05905
11399a29470k5169o6067L7805m8048O3893J9135r7878O0791o808J29903k00300
11388b62213J14526J40149k13189J40346j26657l2291q1179Q6613J04557Q265
11378a21073q4970K54J01178j14773k2170L3274j7906j08653K78398m2081p1559
11367a70081r0585K793P0891Q8702m0199j49179k4609J32398k6965R8731O7527
11356d0576j66588J09071K0889n1600k4944j55346J49879l1413R5458P2510q8668
$$ y = [-231130, -170572, -233685, -323848, -85777, -133069, -114821, -238595, -102086, -139126, -172689, -171844, -255091, -228325, -189908, -203124, -167925, -130014, -124863, -215299, -181341, -188743, -296438, -75422, -131163, -318575, -117703, -254466, -175577, -285494, -240438, -192699, -165243, -235375, -129470, -154639, -220706, -182901, -230949, -167056, -147921, -245799, -185008, -191816, -61913, -262213, -147687, -7538, -220727, -80381, -207038, -239329, -320508, -233895, -129338, -121073, -206043, -205789, -104611, -219384, -241554, -208280, -226186, -334839, -56441, -98522, -170081, -260666, -257873, -186982, -98280, -138479, -287658, -312267, -179869, -206834, -108103, -40576, -207164, -98093, -77204, -128804, -153748, -309094, -159215, -190628, -95170, -22660, -111328]
11345a11328J1231j39808O0589l4345p3342M6993J38862j10654K2983J44070j59170
11334b03919J83373j9953r1828j22259J01208m9338P2218j00763J44953q3910
11324a70218K6183l4023J2008L4781l3305J538K4398j3914K5523K6977j08921
11313b08973k1995L6747M9353l4150P8256o1257k1848O8625k2430N0670j0143
11302i7145p5541L5256j16111m9727O6302J0376J91769q3655J3533j66787K01029
11291g0701j56968J40945L6566j12648J33177l3387r0606n2354j0508J43606l6594
11280a09472j24349r649J33289L7076K307j15236J36396J37778k01014j8802o1573
11269a93249J65742j80583m8078J76780o1023J18528K11394k1267j4198m3389
$$ y = [-111328, -100097, -239905, -179316, -213661, -287003, -240010, -101148, -211802, -188819, -44749, -203919, -20546, -40499, -132327, -254586, -153378, -202716, -130498, -231261, -86308, -170218, -144035, -178058, -166050, -131269, -164574, -163036, -138638, -152552, -127029, -100052, -208973, -230968, -194221, -144868, -179018, -100762, -162019, -183867, -115242, -137672, -87002, -97145, -172686, -137430, -253541, -303268, -236966, -226590, -34821, -118476, -104943, -271730, -70701, -227669, -86724, -50158, -162806, -29629, -63016, -153622, -205976, -216484, -72878, -109472, -233821, -243470, -110181, -73105, -70798, -186034, -49638, 88140, -112874, -131676, -193249, -27507, -208090, -256168, -79388, -140411, -21883, 189511, 168244, 154046, 110657]
11259A10657j9210J07539m1650o182j10394j32920J13510j14111N2788j38254
11249a78227J772J12428l9779L937p046N1956j08992j15450j623J75188n8248
11238a64084Q1549n6116o6094J13382j29214j3545O6080n7057Q0662o0744J11372
11227i3809m2327K2667p3974k1078J5178j20327J98781Q8285r2268o6954q3639
11216b69465P4088P4255j7096R3103j30158Q7021q4817l0963M5837J21564j92074
11205b28705M0682j590P3767N7770p8334M2359p3703P0269j39064l1963J31916
11194a36596k2477O7755o3568o710J1140k948N728k2917j7506O9314j3439N7543
11182g4681N3223j92979q164N6591j76121K53870n1546k7129L469L3884j40203
$$ y = [110657, 91447, 198986, 157336, 151154, 40760, -92160, 21350, -92761, -39973, -178227, -176455, -64027, -103806, -99869, -106915, -54959, -163951, -279401, -281024, -105836, -164084, -82535, -138651, -204745, -91363, -220577, -234122, -168042, -225099, -144437, -205181, -93809, -136136, -113469, -187443, -208521, -193343, -313670, -114889, -26604, -118872, -185826, -269465, -195377, -121122, -138218, -45115, -175273, -88252, -173069, -204032, -158195, -36631, -228705, -188023, -189613, -115846, -58076, -136410, -94051, -167754, -97485, -236549, -268512, -136596, -159073, -91318, -154886, -161596, -150456, -153404, -147676, -170593, -188099, -118785, -132224, -74681, -21458, -214437, -222601, -166010, -342131, -88261, -139807, -166936, -163467, -129583, -269786]
11171b69786J14416J31885j33467O7359O2604j48076o2787M3080J34814n5175
11161a15133R0221J285k35505J10737k8119K7546p0523P2259j16539J01132o4420
11150b27059N851J14275j38078Q4536M0492j02210r208P1452j5791K6534k2137
11139a71343K4574j04689R2790N5571J2272k73287R1016N0553M5359j17210J12725
11128a81669N0000j07890M3952q7161Q9046K4078j09077N2381n2596P3127o520
11117b12329N3027j6967J57L0080n5609o0830M8748K1951r8434M1584P3237o0408
11105b35793M7316k6875q0416J44177m1172J04388j34283R9222o5956o0792J10775
11094a39409J03592r395p1324M1756k70668J95592J36633k01756J70307L6109
$$ y = [-269786, -155370, -23485, -156952, -89593, -26989, -175065, -237852, -194772, -59958, -115133, -24912, -23627, -259132, -148395, -176514, -148968, -219491, -147232, -263771, -162639, -227059, -221208, -106933, -245011, -160475, -119983, -222193, -231401, -159949, -175740, -149206, -171343, -146769, -251458, -158668, -103097, -90825, -364112, -273096, -222543, -177184, -294394, -181669, -131669, -239559, -195607, -282768, -193722, -169644, -278721, -226340, -278936, -205809, -212329, -159302, -176269, -176112, -146032, -201641, -262471, -213723, -191772, -290206, -248622, -175385, -235793, -188477, -215352, -295768, -151591, -192763, -88375, -222658, -123436, -189392, -250184, -139409, -35817, -45212, -116536, -74780, -345448, -149856, -13223, -214979, -44672, -8563]
11084h563j59128o2063Q4016O161m7725j06167J47470K3682o3310J52417q8741
11073a21951k5179P1971m8861K2507j03384N5999L2891j40390Q119J91191j49557
11062b06644q1960K08868j94206Q1532J33265p5051k2749o3266O1038j10707R3254
11051a76626n0557J6712R3520j67304Q1179O8991k8685l8939M0983O0451j19629
11040b19904P6805P1438o7491p0256J07475n5459k2870N5303L6576j47999J06634
11029a29748j50744O5243O3846J31389j83513J8802L3367J16308k23320L9616
11019b18754P7974l1526Q344J2635J38846k17093J48673n7879K4859L5784j37848
11008b15985P5109P6989j75833n3004K21045j12566J9227j18522J78323M7842
$$ y = [-8563, -167691, -229754, -145738, -139577, -187302, -293469, -145999, -122317, -185627, -33210, -121951, -147130, -75159, -124020, -101513, -204897, -148898, -116007, -256397, -248278, -57087, -206644, -288604, -79736, -273942, -192410, -59145, -134196, -156945, -220211, -159173, -269880, -176626, -227183, -210471, -116951, -284255, -203076, -134085, -162770, -201709, -160726, -100275, -219904, -143099, -71661, -139152, -209408, -101933, -157392, -180262, -124959, -88383, -236382, -129748, -280492, -215249, -151403, -20014, -203527, -184725, -151358, -35050, -258370, -218754, -140780, -172306, -163962, -151327, -12481, -229574, -80901, -138780, -113921, -78137, -215985, -140876, -63887, -239720, -292724, -71679, -184245, -165018, -283540, -105217, -57375]
10998e7375k17967K41356j34221J32952j61561N4568p3693J9915J17861k8571
10988a06736j10406P6094n364o521J61785j21708k72253K70864K7063j59985M5344
10977b01823K2848l257j47061J34132j10812O6191k1422Q6613N148m5593O3077
10966a51959J78072j20306n8200q3701N4550N391l0240P5J62260j13852j14143
10955b72053J08046l8819J04702K1683j86172Q0672k9724O8984j3244p3991j5595
10944b45511N3036n6591J64824j55628J07788N8578j00512J87958j65308J8246
10934a33120Q4988m8786o4164L746l844M1150K5987n0445j67994L4553K12699
10923f5230j53795o9766Q2971J44755J7423j60551L9209l9202k3342L782O6335
$$ y = [-57375, -275342, -33986, -168207, -35255, -196816, -142248, -215941, -196026, -78165, -106736, -217142, -141048, -146412, -152933, 8852, -112856, -385109, -114245, -87182, -247167, -201823, -178975, -182232, -329293, -195161, -305973, -239782, -261204, -174591, -169443, -215036, -151959, 26113, -94193, -152393, -236094, -181544, -176153, -206393, -206318, -44058, -157910, -272053, -164007, -202826, -98124, -76441, -262613, -181941, -211665, -142681, -155925, -229916, -245511, -192475, -249066, -84242, -239870, -132082, -73504, -174016, 13942, -151366, -133120, -48132, -96918, -161082, -157336, -161180, -120030, -94043, -144488, -312482, -277929, -65230, -219025, -288791, -205820, -61065, -43642, -204193, -164984, -204186, -227528, -223746, -157411]
10912a57411K3463K15709k50658Q597j23085J31450P6209q9477p950P196l8156
10901b04113q4697J2621M6989O2398J31915l7781n1777j26845J26621j18092K0791
10890b21970R3253n135M7817j9104j17095J38039j94316R7475j04607J01263j7272
10879b01652n0312R179R147J29123j09365k0834p6893J20341l1190J05790N5984
10868f0682r3695q0470J56801k68167J74547Q593Q9522j62191J49366o0384J5914
10857a30846l5293L1263j14000P5343o7263J9167J48234j51410N4335j18465P8151
10846b10784O7336m7953O3928P111n8862J7372R3322n3396K5566n4120k9911L6149
10834a44242o9740M3932P8095j06607J1125O1492q2679J7118N4981j3475k9176
$$ y = [-157411, -133948, 81761, -168897, -160300, -283385, -151935, -75726, -165203, -173153, -165957, -204113, -288810, -276189, -229200, -166802, -34887, -72668, -124445, -251290, -124669, -242761, -221970, -128717, -133852, -86035, -105139, -222234, -84195, -278511, -181036, -285643, -184380, -201652, -251964, -242785, -233638, -104515, -213880, -234714, -311607, -191266, -222456, -116666, -60682, -154377, -234847, -78046, -346213, -171666, -163073, -73551, -235742, -86376, -146760, -130846, -166139, -134876, -248876, -173533, -240796, -221629, -73395, -224805, -170470, -288935, -210784, -143448, -191401, -127473, -120362, -179224, -161852, -68530, -121926, -96360, -150480, -180391, -144242, -213982, -170050, -91955, -198562, -187437, -125945, -208624, -191506, -136525, -150000, -179176]
10823a79176q4991J70850k05688J30184J18345k01355K9941J96651j61478m8183
10813b34900N7015p937l1017P1660M3272j93399J31626Q5726o0441p6584K6186
10802a88793j10762K67608j93241O4214K02473k68830J08266O7830j56943l518
10792b11696J7463P7356k18745J56612R9770j142p194l7028r4656n9264K34616
10781d3908r0801l1275p1705Q3184j8408l5751N1137j4670k0410l3086O326o4927
10769b84294j7599J98065j18616J4256m3030R7838K2339l8521j4021o7442O4004
10758a87021J13106q9052n5503L26415l94880J02703K9187K4979K6082j419p4431
10747a79834M9028j11792J37514j73750J96969j30444J13815j66365R0467p515
$$ y = [-179176, -264167, -93317, -299005, -168821, -50476, -251831, -221890, -25239, -186717, -234900, -177885, -185822, -216839, -145179, -101907, -295306, -163680, -77954, -138395, -214979, -188793, -299555, -31947, -225188, -160974, 41499, -227331, -119065, -51235, -208178, -211696, -194233, -116877, -335622, -179010, -79240, -80382, -87576, -124604, -219260, -278524, -43908, -134709, -165984, -237689, -154505, -172913, -208664, -157527, -172197, -192607, -225693, -219367, -284294, -301893, -103828, -222444, -208188, -251218, -153380, -131041, -169562, -183583, -251025, -187021, -73915, -162967, -218470, 107945, -286935, -184232, -155045, -130066, -103984, -105403, -179834, -130806, -242598, -105084, -278834, -81865, -212309, -98494, -264859, -174392, -181907]
10737a81907j40354J05241J3361J6514j6933Q7399Q1259j62558j19310J27591
10727a89697M4869k0647j5023l916j8000P1709m3000M8263j26261J37217n4279
10716a68765p3717J06148j05056Q9230p6453N1065R9684n2954j49081L8855J53114
10705h7930K7725j10946o9748N0015P7677M1761o3157K4219N8606j18796m1378
10694b11952Q6381l4488n1175J46745p6193L6611k8967J012l808l1317P1062r6749
10682a92838j1554J01985M9789j62796M4402M1472j83575J25218N1466J1690J03863
10671b0878j61601M5967j3094O4943l7817M3347q7864J21606j72773P9951o091
10660a44304N4837j00547j5499N5624n8440M9237J3876m813n9353k0288J46656
$$ y = [-181907, -322261, -217020, -203659, -187145, -204078, -116679, -35420, -197978, -317288, -189697, -144828, -165475, -180498, -184414, -202414, -130705, -173705, -125442, -251703, -114486, -168765, -242482, -136334, -241390, -152160, -228613, -177548, -77864, -130818, -279899, -241044, -87930, -60205, -171151, -240899, -190884, -113207, -71446, -134603, -110384, -51778, -170574, -211952, -125571, -160059, -211234, -64489, -140682, -104071, -133038, -132026, -135834, -167151, -96089, -192838, -204392, -102407, -52618, -215414, -171012, -129540, -313115, -187897, -136431, -124741, -20878, -182479, -136512, -149606, -84663, -122480, -79133, -166997, -45391, -218164, -138213, -144304, -89467, -190014, -205513, -149889, -208329, -159092, -145216, -150029, -209382, -229670, -83014]
10649h3014m7788l9817k6295N4145R6436k47105K48500p304j60173J56094j81493
10638b37814Q8609r0990J92054j69959K30421j57406j5288J57900j91217L9984
10628a53706r0567J25289M048m6117L0181M7981n2477l3039R0605l8484J5836
10617a00450k0269M7733p943r7282L6195J45655q0426l6561r0704P5084k07780
10606c36748L5755K62811k1802q2395p1024J1170K6036N1141j44590J72684M8488
10595d8474O254r3472J1961m6551k3125P4771R9484K3516j50305K652j17638J74358
10583h6569j26345L579J37502m3859l0715o9810R3085j3058j30822J88990r0525
10572a68547J46969l6308p1135L9137j52819J31264N3636p2330r2126L8845N3841
$$ y = [-83014, -130802, -170619, -196914, -142769, -46333, -293438, -44938, -52242, -212415, -56321, -237814, -149205, -240195, -48141, -218100, 12321, -145085, -160373, -2473, -193690, -153706, -244273, -118984, -114936, -161053, -130872, -82891, -135368, -168407, -77802, -116286, -100450, -120719, -72986, -80929, -178211, -142016, 3639, -76787, -113348, -204052, -128968, -336748, -300993, -38182, -59984, -142379, -213403, -202233, -176197, -125056, -269646, -96962, -48474, -42220, -135692, -123731, -170282, -193407, -118636, -19152, 4364, -145941, -143289, -260927, -86569, -212914, -209335, -71833, -115692, -146407, -216217, -123132, -136190, -267012, -78022, -168547, -21578, -57886, -129021, -89884, -242703, -111439, -57803, -130133, -222259, -183414, -129573]
10561a29573k605N4703j01620J23213j10844k6145k8394J65909j73254L9287R4510
10550i4813M6864j44606K4180m741J3782J55211n4256m0649L7015j03316J53318
10539a2011l3169j72519J00516l5340M3041j09981k923J44418n6525J1558j9895
10528a42830j5998M1561m8971k4589J11298j19325P2277m0533J3816o3136K02442
10517a3988l1083k13288J29630o7564Q2397j9296M232j09341L8891j438N8607
10506a42241q2057k0793J8731J29161n7452J27243k43575K18966j05680m4189
10496b01886l705K0429k5104j3920K21678r1233n453n9689j17309J37980n8259
10485a96471N5195l8335J21366m6461j64595J11987n7319P6804J11308j38046
$$ y = [-129573, -132178, -77475, -179095, -55882, -166726, -192871, -221265, -55356, -228610, -189323, -94813, -47949, -192555, -168375, -173116, -159334, -4123, -58379, -99028, -62013, -165329, -12011, -45180, -217699, -117183, -152523, -109482, -219463, -222386, -77968, -134493, -122935, -142830, -158828, -117267, -166238, -190827, -79529, -198854, -126577, -167110, -153294, -216430, -13988, -45071, -258359, -128729, -196293, -113896, -133192, -128960, -238301, -199410, -200848, -142241, -224298, -245091, -226360, -97199, -154651, -27408, -270983, -52017, -157697, -201886, -205591, -185162, -210266, -224186, -2508, -93741, -99194, -158883, -276192, -138212, -196471, -141276, -179611, -58245, -104706, -269301, -157314, -214633, -137829, -26521, -164567]
10475a64567P1213n6997R1107j60283J97873n8063m9994n4657J13949o2121L9023
10464i3517O0788j61426O9721J6537p193L6936j07148j1194K4497R4559j35853
10453b13293K00283p5201q1395p2143J69485p6587n0116J66034j95159J17021
10443a11071O7362j34709r5169K24975q6133J10499j07429j22129R0801P5663
10433h7340J1830l1701j21365J46851n3771r7096L5641n6350K01166n4535j08172
10422b14842J11713p071J5259j10852M9005O8735l7440o5073P790J5860m458K264
10410a69110p603Q5968k4465M7317j81005J32290M1163P656k6229K8866k8348
10399i3500r9281R0165p123p3102R8830j14167o0025R9005N2723N8386r606K7279
$$ y = [-164567, -93354, -150351, -59244, -219527, -21654, -79717, -129711, -184368, -70419, -132540, -93517, -32729, -194155, -124434, -107897, -115090, -78154, -185302, -196496, -171999, -77440, -213293, -13010, -88211, -169606, -241749, -72264, -148851, -198967, -32933, -228092, -111071, -43709, -178418, -273587, -48612, -134745, -24246, -131675, -253804, -163003, -87340, -75510, -107211, -228576, -81725, -135496, -232592, -196951, -253301, -52135, -106670, -214842, -103129, -110200, -94941, -205793, -156788, -88053, -125493, -190566, -182776, -166916, -171374, -169110, -176713, -90745, -115210, -67893, -248898, -116608, -75445, -67789, -94018, -65152, -93500, -192781, -102616, -109739, -182841, -84011, -198178, -258203, -159198, -106475, -48089, -57695, -30416]
10387c0416j91659J91641j28391R1125K6758M8767j07805j07767J77906p8871
10377a08712q8n4978K9120P5735r0492M0746r8672J32135k6674L0253j2425p5958
10365a60010O1153k13185K56878j174j59987O3671O9512j08841J03101n5218K0604
10354a23496q0353J01586J10334k12567m916J58157p8424l8650M5314j30853n9444
10343c13312K21452p7323K283R6172q4799j3317K6851L1163k6670L0903L8977
10332f7620k1389j33332N7616Q5223k01191J53086R6177r2766o5528R6297L2240
10321f1187k09650M1185N9144R9752j45677p1632R8001R8396J0953k3512r842
10310a14069K3202j16713M7012J35989m6071j73116J66346j367l3185j19134m7060
$$ y = [-30416, -222075, -30434, -158825, -67700, -40942, 7825, -99980, -207747, -29841, -108712, -108800, -163778, -134658, -58923, -149415, -108669, -207341, -75206, -101880, -71627, -84052, -160010, -98857, -312042, -55164, -56338, -216325, -152654, -83142, -191983, -88882, -144100, -123496, -203849, -102263, 8071, -204496, -209412, -51255, -129679, -168329, -123015, -253868, -313312, -91860, -169183, -166900, -70728, -155527, -168844, -141993, -110830, -137500, -106597, -67620, -89009, -222341, -164725, -79502, -280693, -127607, -31430, -124196, -189724, -93427, -61187, -270837, -229652, -170508, -70756, -216433, -288065, -190064, -91668, -80715, -104227, -114069, -90867, -207580, -160568, -24579, -70650, -243766, -77420, -78787, -111972, -231106, -278166]
10299b78166K41493j42066J12194J7175M168j34966j12204O0955J39061m6715
10289a39071K5040l4193J7209K5092p394j90134K65038k12487J18779Q6459o9095
10278a14757O5638k7241p6443j26647O6446k9036J30094J10916j68719k3849M0543
10267a53055K5958j4079K753O8681q2145J06557k689j58251O0660r0091K0933
10256b14768J23419j23410J38878L1724m1008j41865o0657O1726J18126r0833
10246a98668J99236j86168m1060J1884l4119J17405L3478j06766P4730q6012N1771
10235a64289J25015j64313N1187m2081N4052J53Q2335m9172K1726k62381J78912
10224a68856p7720J21776j38725J37492q7668P8306j10041J10912j173M7025k80202
$$ y = [-278166, -36673, -178739, -66545, -49370, -45202, -180168, -292372, -231417, -92356, -139071, -114031, -148224, -131015, -105923, -113317, -303451, -38413, -250900, -132121, -45662, -114757, -49119, -76360, -152803, -279450, -213004, -242040, -111946, -1030, -169749, -193598, -153055, -127097, -141176, -138423, -69742, -151887, -45330, -48019, -206270, -145610, -235701, -214768, -91349, -214759, -75881, -44157, -85165, -227030, -287687, -225961, -107835, -198668, 568, -185600, -226660, -214776, -248895, -131490, -98012, -204778, -130048, -216060, -164289, -39274, -203587, -152400, -194481, -140429, -140276, -57941, -107113, -85387, -347768, -168856, -246576, -124800, -263525, -126033, -213701, -135395, -245436, -134524, -135697, -88672, -368874]
10213c68874K47078L5496p1348M6577R8814j72736k32444J46164K12745l4908
10203i3436j1055k6053k6317o1521m284Q4865K4201j6052J5133P2821n7920p2278
10191a71896l2494n633J30353j57097K10136K883j27859r1385m0483J85417j06625
10180b04683J06722o9481J221J83375j85799N3546r8783J50874l5086q1705N3847
10169a25952k5102Q9992o7089j62822J31608j35872P7077R1661l5272l7068j39640
10158c38479J55568n4087J78737o2081j8910n1846N6761O059j03975M4983o4325
10147b51595M4497J14125k2726n7046J4523l8237K38102r7796j46975p831j309
10136b12268M6981k1002K8035J3737p8892J11975j6806L0636j01342J26163j09195
$$ y = [-368874, -121796, -86300, -157648, -111071, -12257, -184993, -417437, -271273, -58528, -93436, -104491, -130544, -156861, -218382, -222666, -137801, -113600, -129652, -114519, -41698, -99618, -171896, -204390, -210023, -79670, -236767, -26631, -23748, -151607, -242992, -283475, -98058, -204683, -97961, -167442, -166221, 17154, -168645, -115099, -213882, -63008, -98094, -179799, -125952, -151054, -61062, -128151, -290973, -159365, -295237, -218160, -126499, -161771, -198839, -338479, -182911, -236998, -58261, -120342, -139252, -191098, -134337, -128278, -232253, -187270, -251595, -207098, -92973, -115699, -172745, -158222, -196459, 41643, -56153, -203128, -210959, -212268, -165287, -186289, -158254, -144517, -223409, -111434, -128240, -97604, -198946, -72783, -181978]
10125a81978O0942L3434K9517j10495p8946J04035p6062P2076Q3801j10711N2569
10114a21818l2459l6056Q5702l182o9054m2769N4160J7963K6591k9161l705o606
10102a60394m9121J19673r8944j2627N8091r222l000J5736O043n785m3765J4074
10090a69241K2855L6308p4312L87J40293K4534j23651p1782J21587o4979L0548
10079a27453k9584k7727k7803P324j15469J82244M4805j17168L5362R9651r622
10068h5440k4724L8122J1087j53453R2770K8038J86633j92122m5656j34157R9238
10057a79664R2790M3463J1124q3957p3423k0298K2212o9807Q9972N1847J15346
10046c95j24536j21168J11125n2956J37843R3316j13063q5651P9385j32423R4508
$$ y = [-181978, -121036, -87602, -58085, -168580, -247526, -143491, -219553, -147477, -63676, -174387, -121818, -154277, -190333, -104631, -107813, -176867, -219636, -165476, -147513, -120922, -150083, -153788, -160394, -209515, -89842, -188786, -201413, -143322, -152544, -155544, -139808, -133765, -139550, -183315, -169241, -146386, -110078, -184390, -184003, -43710, -19176, -142827, -214609, -93022, -158001, -127453, -157037, -184764, -212567, -205243, -320712, -138468, -93663, -210831, -175469, -75818, -85440, -110164, -72042, -60955, -214408, -121638, -93600, 93033, -99089, -144745, -278902, -179664, -86874, -43411, -32287, -116244, -189667, -209965, -187753, -257560, -167588, -115741, -395, -124931, -246099, -134974, -187930, -50087, 43229, -69834, -155485, -76100, -208523, -114015]
10035a14015J03672j45314J5692j6319J05024q6863j11391N9651J31460j30128
10025a88531p7317N6012O005R0219J37655k64167N4726K5543L8680k1226M4989
10014i7412J12349k9346q5611J52346k08963Q3095n0867M553l857J0148n8981
10003a72546r5453Q9503Q5350m2646j8423j0660Q072P9046l6199k5723k8645J81820
9991A3496m1956j08520J00642j88194J81657j25086Q5316o8630Q2873p0943J15736
9980b3609m0130L837M5332o6759j01946R591k0752K5964Q1996k3138m0323J20291
9968b9646K2661j47224J2468J75983j87294Q3734p3466N2716k1585p5393O1839
9957a25207j14901J54419j62145J81941k0751J4464n3925m8158J6142M1612k7470
$$ y = [-114015, -10343, -155657, -139965, -156284, -51260, -138123, -249514, -189863, -58403, -188531, -265848, -209836, -203831, -113612, 24043, -240124, -185398, -159855, -121175, -142401, -97412, 14937, -14409, -100020, 52326, -156637, -73542, -124409, -119856, -123713, -113565, -172546, -267999, -178496, -93146, -135792, -154215, -164875, -156803, -77757, -113956, -139679, -168324, 13496, -28460, -136980, -36338, -224532, -42875, -167961, -82645, -151275, -68402, -139345, -23609, -63739, -59902, -14570, -81329, -183275, -173684, -194436, -168472, -86476, -109614, -149937, -29646, -6985, -154209, -141741, 34242, -153052, -69318, -142784, -90068, -111653, -187046, -125207, -240108, -85689, -247834, -65893, -86644, -72180, -126105, -174263, -158121, -116509, -143979]
9946a43979J00836n9148j8575q5054j7099J99260r7397Q833J06988k07311J22141
9935i0505R417n522K14039k24978j00035P5491j11373J68644j74428J06592l7585
9924a70243L1553K34553j75884j12542Q3343K0826q895P616k4271j4701J5583
9913a13062j8014M6976n5581o7627R2299j9981J5058M9086o4560P8091m8294n8385
9901a63994l6826p7165K32942j90585Q1343L8586O2525j17928j3888j0300K24557
9890B9267m9701q7405M7412m4941Q887l6797k3996o8850J2401j8159J33682q5043
9878a83243J54012l1162o5585R0765q3984q3392p359J15935n0416r181m2985J57239
9866c9356r5447J9248j08767J57718o9086Q3449L2770J7223o7380m4101k1071
$$ y = [-143979, -43143, -102291, -120866, -205920, -223019, -23759, -121156, -112323, -5335, -212646, -90505, -81088, -86610, 127429, -97549, -197584, -122093, -233466, -64822, -239250, -132658, -170243, -138690, 95863, -80021, -192563, -109220, -88394, -97289, -89673, -113944, -128645, -113062, -131076, -84100, -139681, -207308, -115009, -134990, -119932, -70846, -135406, -57315, -105609, -163994, -200820, -277985, -45043, -235628, -154285, -115699, -53174, -171102, -184990, -195290, 29267, -20434, -107839, -60427, -105368, -96481, -133278, -157274, -226124, -213723, -231882, -98200, -183243, -29231, -60393, -125978, -35213, -119197, -202589, -209948, -94013, -144429, -153610, -196595, -39356, -134803, -115555, -224322, -66604, -135690, -52241, -19471, -2248, -69628, -113729, -134800]
9855a34800l8494J61723o1496K6672n8964m4587L5112P2077M953Q5992j58590
9844a10402N5333j07818O6659p3027J19677l9029j92616J45191P5631J45085j00195
9833a5511j43215J38920M616j22017J07572j9498l3776Q1708j00068K2040K21158
9822A41929k9738J3306K8945J99307j15505j8218K4592j01545L2919j31989J36120
9811A80123j58679M6259j76191O1910M639N1033n3657k4080M6492k9505j8156
9800f9812J04209j03389j3869m2873Q4694M112l6442j34761J60246j23170J24472
9789d6583O9088m9200l5937L0292k7892m6958j67455Q6522J42599o3292P3496
9778c5320l5802R6999r6234j31709J50528R5366j16367M9757l4768q2458P118
$$ y = [-134800, -173294, -11571, -73067, -46395, -105359, -149946, -114834, -42757, -37804, 48188, -110402, -55069, -162887, -96228, -169255, -49578, -88607, -281223, -136032, -60401, 84684, -15511, -158726, -19806, -15190, -137207, -29635, -49133, -82909, -1201, -101269, -79229, 141929, 112191, 125497, 154442, 353749, 238244, 220026, 244618, 143073, 175992, 44003, 180123, 21444, 67703, -108488, -46578, -41939, 9094, -44563, -68643, -22151, -51656, -69812, 34397, -68992, -82861, -125734, -41040, -36928, -73370, -208131, -47885, -171055, -46583, 22505, -26695, -62632, -32340, -60232, -107190, -274645, -188123, -45524, -108816, -35320, -71122, 25877, -70357, -202066, -51538, 43828, -72539, -22782, -57550, -140008, -132890]
9767a32890j23319J30558M2070r8977P2620J57948l5341k07536P8355J75348k54206
9756a95370O0466J6546M0266o0516K026N7020o6927K27017k02498N0780j01884
9745a73074J00294n7215J6440N653P5198p7734j496O679q1793J02305q2686j639
9733a69068M3806L9255o2653J4433P844k1260j1411J08746m2707o1315J03026
9722e1304L1371q9868N586J06391j15513N4408k5459O797J7528n8470J25621Q7
9710G175q4323Q98n7655r657M7041o6349q7506J08437N5527J73404j28535j00332
9698a41875j67343J4826K35871j21450J01556J54770k43149N8330n0924L8563
9688a20825J86176k68736J0723J11298k9052J6328J68412O1598j38374r6384j9599
$$ y = [-132890, -256209, -125651, -83581, -182558, -109938, 48010, 12669, -194867, -116512, 58836, -195370, -134904, -118358, -78092, -138608, -136582, -79562, -146489, 80528, -121970, -71190, -173074, -72780, -129995, -113555, -107902, -32704, -110438, -111934, -105255, -187048, -84743, -167429, -169068, -125262, -86007, -148660, -134227, -126383, -147643, -159054, -50308, -93015, -154330, -51304, -19933, -109801, -104215, 2176, -113337, -58929, -84388, -77591, -60063, -118533, 7088, 7175, -77148, -76250, -133905, -143562, -96521, -162870, -250376, -141939, -86412, 86992, -41543, -141875, -309218, -294392, -58521, -179971, -78415, 76355, -166794, -108464, -159388, -120825, 65351, -203385, -192662, -81364, -110416, -94088, 74324, 135922, -2452, -98836, -118435]
9677a18435j6498L4974M7513j08923K2062J02345o0906j1871J50943k06509N0782
9666a14523Q711K4754J17335L5916j32393n3718Q2209o7155R1916j89703J08246
9655h8405k3029L9164m0549k039O8694j14083O8494p0738J26187j38030J50612
9644b3722k8042p5218J64656k52586J06376R1713r1444Q050l7197O7623J12790
9633D2999j27212J5047n3068J17918p3559q4614M3187L4663r0672R4106q7457
9622a68662M5299J10436j11400k2960N8635L2209K1930j03287N4482k1659O4133
9611d0844j7228q2487J40953l4707j0804P5520o6763K7987J82m2392r9659P3682
9599g6560Q3190j07896m506J0033K03105m7846N1619r7442O7851M0147J6627J83666
$$ y = [-118435, -134933, -99959, -52446, -161369, -139307, -36962, -97868, -109739, 41204, -165305, -114523, -105812, -81058, 36277, 72193, -60200, -113918, -31709, -98864, -6948, -196651, -88405, -111434, -72270, -112819, -114858, -46164, -160247, -91753, -162491, -36304, -174334, -23722, -51764, -126982, 37674, -214912, -108536, -16823, -108267, -100217, -137414, -69791, 42999, -84213, -69166, -122234, -4316, -77875, -162489, -119302, -84639, -175311, -81205, -168662, -123363, -12927, -124327, -147287, -88652, -56443, -34513, -137800, -83318, -104977, -40844, -58072, -140559, 394, -34313, -45117, 30403, -36360, -8373, -8191, -50583, -150242, -76560, 6630, -101266, -105772, -95739, 107366, 59520, 111139, 13697, 81548, 121695, 138322, 321988]
9587C21988j01390J37299p2735r450j67691L3843l6092Q8824m4372r6385j09140
9576e5301K90246j9130j07936j91843K07729j34310K5981J01293n5297o9313J68033
9565A60152n4740K5111l8065J63159L0588l0409k9393k1748J81069l859N7800
9554D39665j74811L533q9919J08158o0919L2783J27300k96030j16524K11817k18498
9543c3445M2856k3314Q8317P428J5345j0835o8085M6315L6978p7112R7642j19351
9531B739P6203P6630j73114J29789o3518J4150K9231K8129j84843K10540j18194
9520B7742J6405q5732N1033Q5125j23371R207q115J00853r310P1775k46255K75749
9508A65106m5726M5857j38694K5057Q5808j57922J12650k4726L2574P0404m7458
$$ y = [321988, 220598, 357897, 285162, 275712, 108021, 141864, 105772, 194596, 150224, 53839, -55301, 234945, 215815, 107879, -83964, 123765, -10545, 15436, 116729, 61432, -7881, 160152, 105412, 130523, 92458, 255617, 286205, 255796, 226403, 204655, 385724, 381865, 439665, 264854, 268387, 178468, 286626, 225707, 258490, 385790, 89760, -26764, 185053, -33445, 9411, -13903, 74414, 81842, 97187, 86352, 18267, 64582, 101560, 24448, 122090, 2739, 78942, 155572, -17542, 112247, 48729, 62879, 92110, 120239, -64604, 145936, 27742, 44147, -41585, 9448, 94573, -28798, -19591, -27706, 73147, 63837, 135612, -110643, 165106, 119380, 165237, 26543, 51600, 137408, -20514, 92136, 67410, 99984, 170388, 122930]
9497A22930K9834o4783m7896J83944m4841L9400o0386M591J0899O290M1961P8186
9485C00129o8205O7249j34112O5706q9476L6768j2732k3188L3094N3161M210L1310
9473B63914j37512L6687p528R8747j96365M0854K0190J9161L7844Q3522L0871
9462B90385q0484N5588R4592p6048J711J68090j05421Q8866j8570J37461N8576
9451F14746J8364q1604J1705J00566o9807L4152K7652l0913N9449j5849j9688
9440F48773l2604p5393J16050m447m3040j31831J76656j46939p3082L3891M9493
9429E17527r5222J11740J13772j7495K35476m1468j20128J70180l9064J5526j01003
9418G49841m7269q0618K15204l3595L014k7938k18583K01962K4036J0825j79686
$$ y = [122930, 152764, 87981, 40085, 224029, 179188, 218588, 158202, 162793, 173692, 179982, 221943, 300129, 231924, 299173, 165061, 230767, 141291, 178059, 165327, 142139, 175233, 228394, 232604, 263914, 126402, 163089, 155561, 254308, 57943, 98797, 118987, 138148, 175992, 259514, 290385, 209901, 265489, 360081, 284033, 285744, 453834, 348413, 437279, 418709, 556170, 614746, 633110, 551506, 563211, 663777, 593970, 628122, 655774, 624861, 684310, 668461, 648773, 616169, 540776, 656826, 652379, 609339, 477508, 654164, 507225, 434143, 468034, 517527, 422305, 534045, 647817, 630322, 865798, 824330, 704202, 874382, 835318, 850844, 749841, 702572, 621954, 837158, 803563, 806577, 778639, 560056, 762018, 786054, 796879, 617193]
9407F17193J91247j1121O2711j61379k07159J72849R2436j2064k64757M9976o6373
9396D63559j32855J27628M2065o1567J86856k35380j6835P3011R1800j45192k1747
9385C71343N7079Q7093J24369r3568o9584L4620J41965M5320K6507j47250j6019
9374E61875j2360j2807p2306J49746r0278j654K6563N1797l9022J2263p6195M0493
9362E38115j2176J2075J48326j57834J09006l4696O2j6432q9402O6867O734J70561
9350G41206j3094m3427P4004P706q358m5981m7624k9531j02065R6262j20571K81648
9338G90175j17440p2558P1302M5283J6009j3065q2479n3273O8929Q6900o1919
9327F77864J23035o2637o3295K8880K19157o521p4914Q2087j02711j479r462J96210
$$ y = [617193, 808440, 797319, 860030, 698651, 491492, 664341, 756777, 744713, 479956, 529932, 463559, 330704, 458332, 500397, 438830, 625686, 390306, 373471, 446482, 538282, 393090, 371343, 428422, 515515, 639884, 546316, 476732, 511352, 653317, 698637, 725144, 577894, 561875, 549515, 536708, 464402, 614148, 523870, 522216, 548779, 600576, 561554, 573817, 497622, 538115, 525939, 538014, 686340, 528506, 637512, 602816, 602878, 586446, 497044, 563911, 570645, 741206, 728112, 684685, 758689, 766395, 758037, 712056, 664432, 634901, 532836, 629098, 508527, 790175, 672735, 600177, 671479, 716762, 732771, 719706, 637227, 583954, 652883, 739783, 677864, 800899, 738262, 674967, 703847, 923004, 916483, 841569, 923656, 820945, 819466, 810004, 1006214]
9315A006214j23481r0354M1463l9519J8222k3l9619P1541J15012m4056r7901J25494
9303I42993J2914J3153M1914J5066P3271l6584J26024j34122M0951J43781o7673
9292A171688J32519J3136j31005J76894O5419m302p8281j39276R3060k1325O541
9281A285068L104R8831n5256q7741J72415J35400n6492Q757J12340k7244M9969
9270A639151j17890n557M6440K8704Q8338j05537Q6899O2462k4366p9963L54918
9259A973599j51554P7022o0496P6940r9197p7000K15857r4888J08072k1960k478
9248A943917j26956o0639P0164M8807Q887J49008o9750N9753q7780J62472m3783
9237B054100Q2727o9816R2206J32478j07930M0455K2233k4643p058Q2949J7017
$$ y = [1006214, 882733, 792379, 833842, 794323, 812545, 812522, 772903, 844444, 959456, 915400, 817499, 942993, 955907, 969060, 1010974, 1026040, 1099311, 1062727, 1188751, 1054629, 1095580, 1239361, 1171688, 1304207, 1317343, 1186338, 1363232, 1428651, 1424349, 1346068, 1206792, 1299852, 1278527, 1285068, 1288172, 1387003, 1331747, 1244006, 1416421, 1551821, 1495329, 1504086, 1616426, 1589182, 1639151, 1521261, 1515704, 1562144, 1590848, 1679186, 1573649, 1660548, 1723010, 1698644, 1618681, 1973599, 1822045, 1899067, 1838571, 1915511, 1816314, 1739314, 1955171, 1860283, 1968355, 1946395, 1943917, 1816961, 1756322, 1826486, 1875293, 1884180, 2033188, 1963438, 2023191, 1935411, 2097883, 2054100, 2136827, 2067011, 2159217, 2291695, 2183765, 2224220, 2246453, 2221810, 2214752, 2297701, 2314718]
9226B314718K17795J934J24427m2031J34989K1380N9939n1214K58139k3852L3160
9215C049384J27540j29257J2065m1157K43426J38069n071J90838J50366J79539
9205C915742K20459J81688K79809j17269J42935J92123m165N5730J64559J31620
9195E163231K10138J54354K68635K31405K90261L01936K49268P8814K94586K54160
9185G496788N16215P10857N93002P95851M46993N76196O47934N68549Q78706M89297
9175A3720388L94236K22184j36999k72165k82690P6032J99529J02316o5201K6103
9165A3983733J76976K49072M56543N04546P14516O73227R76042P46272J109381
9156A9590308J770694K088045K639006K648471K163157J784919J106536J530401
$$ y = [2314718, 2532513, 2534447, 2658874, 2616843, 2751832, 2773212, 2833151, 2781937, 3040076, 3016224, 3049384, 3176924, 3047667, 3059732, 3018575, 3262001, 3400070, 3394999, 3585837, 3736203, 3915742, 4136201, 4317889, 4597698, 4480429, 4623364, 4815487, 4811322, 4867052, 5031611, 5163231, 5373369, 5527723, 5796358, 6027763, 6318024, 6619960, 6869228, 6948042, 7242628, 7496788, 8013003, 8723860, 9316862, 10112713, 10559706, 11135902, 11783836, 12352385, 13231091, 13720388, 14114624, 14336808, 14199809, 13927644, 13644954, 13720986, 13920515, 14022831, 13957630, 13983733, 14160709, 14409781, 14866324, 15370870, 16085386, 16758613, 17734655, 18480927, 19590308, 21361002, 23449047, 26088053, 28736524, 30899681, 32684600, 33791136, 35321537]
9148C5321537K103417L491298L765225M018089L043308J298026K618091L281779
9140E8940770L273768K145773k90690L44269P14204O06800M85703Q66402K134455
9131F9221454M845085Q338641J3173289K0448959K9446885L5871251M0493582
9124B21839146L7098922K6327297J1071235k335220j1875822k0227512k5978745
9117B35919301k7533870k5515600k1399347j6347191j1403817p023089m003677
9110A22692710k276155k157826k464630k324829k353335l298963m109469m870949
9102I8836554n128623l947637k403348j093583O9521Q78722R30227J099482Q42204
9093I0083519Q08410K05264r04185k207088l368364m169055l888431m038531l735562
$$ y = [35321537, 37424954, 40916252, 44681477, 48699566, 51742874, 53040900, 55658991, 58940770, 62214538, 64360311, 64069621, 64413890, 65128094, 65734894, 66220597, 67086999, 69221454, 74066539, 82405180, 95578469, 116027428, 145474313, 181345564, 221839146, 258938068, 285265365, 296336600, 294001380, 282125558, 261898046, 235919301, 208385431, 182869831, 161470484, 145123293, 133719476, 126696387, 122692710, 120416555, 118258729, 115794099, 113469270, 111115935, 107816972, 103707503, 98836554, 93707931, 89760294, 87356946, 86263363, 86332884, 87211606, 88141833, 89241315, 90083519, 90891929, 91097193, 90193008, 87985920, 84617556, 80448501, 76560070, 72521539, 68785977]
9084F8785977k998166k061871o19654J6847N69323J015881j628507j308059j674312
9075F0097459k980801l523354l906829l393078k719217k438419k374855j858500
9067C6902406j829902j590778j517635j256469j107547o68864p16040k46477l33334
9058B7635360k63994j48634l09464k05585q46065j101004j193327j068693j216737
9049B1281857q73750r11718l37106m77168l16332n83016n54757o78207p50239
9040A5799564m02344n73854n03472n69011l48576k89803l87925k65905l32339
9031A2126335k92260l30580l24602m01053k83133j49921k03550l19714k66763
9022I554759k22108l35490k84148o7627l49722l12350k4307k92893k82613j09377
$$ y = [68785977, 65787811, 63725940, 63106286, 63123133, 63692456, 64708337, 63079830, 61771771, 60097459, 57116658, 53593304, 49686475, 46293397, 43574180, 41135761, 38760906, 36902406, 35072504, 33481726, 31964091, 30707622, 29600075, 28931211, 28215171, 27968694, 27635360, 27371366, 27222732, 26913268, 26707683, 25861618, 24760614, 23567287, 22498594, 21281857, 20408107, 19496389, 19159283, 18682115, 18365783, 17782767, 17228010, 16549803, 15799564, 15397220, 14823366, 14319894, 13750883, 13402307, 13112504, 12724579, 12458674, 12126335, 11834075, 11503495, 11178893, 10777840, 10494707, 10344786, 10141236, 9821522, 9554759, 9332651, 8997161, 8713013, 8645386, 8295664, 7983314, 7959007, 7666114, 7383501, 7274124]
9012G274124j35470K4785k13228j87880j71201j90378k25642l6225q2294j80929
9002E875662j38110j18601j71661j14949n1587j44261q7588l9199j62879k61032
8992D585795J8153j76470l3666j88737j53078q8425k552q3297O8021k46716q7645
8981C611383K5295j45541j04013O9397l1661p2454q1730o3639k25158P3324j07759
8970B947444N1961m5339j18563j83684O9594j34477J05515p0747j23686r5268
8960B402750M6073j88308J0260N7613j20828K0052j10221L26p4420j2076j82949
8949A848272J16623k6753m8453N081K2752j77233Q8427j25022N6961k23656o0984
8938A476015O9079k4051n621k1807q6538m1962m24M0533p5574n8809m2987J38316
$$ y = [7274124, 7138654, 7163439, 6950211, 6762331, 6591130, 6400752, 6175110, 6138885, 6056591, 5875662, 5737552, 5618951, 5447290, 5332341, 5280754, 5136493, 5048905, 5009706, 4846827, 4585795, 4603948, 4427478, 4393812, 4205075, 4051997, 3963572, 3961020, 3877723, 3945744, 3699028, 3611383, 3636678, 3491137, 3387124, 3456521, 3424860, 3352406, 3270676, 3207037, 2981879, 3055203, 2947444, 2999405, 2954066, 2835503, 2651819, 2721413, 2586936, 2692451, 2621704, 2498018, 2402750, 2448823, 2260515, 2270775, 2328388, 2207560, 2227612, 2117391, 2117717, 2043297, 2031221, 1848272, 1964895, 1938142, 1889689, 1894770, 1917522, 1740289, 1828716, 1703694, 1760655, 1536999, 1476015, 1545094, 1521043, 1515422, 1493615, 1407077, 1365115, 1364691, 1405224, 1329650, 1270841, 1227854, 1366170]
8926A366170j29278J36908k01518j23143K3595R3136K7791K7757J5619k50997
8916I86040P5817k3296j36789N8629r8484O8021k9707m3578j67194O086N7974
8905G53519J0994J11590j14193n8758p2867Q2794J33291j94245J71N1989j19266
8894E85019K1412L4596k7367j14095R9547q4198k957m2948J44142r2340J7373
8883E38184K2520k4475j24194J0217j6991J59586r5118j40715J20401o3697M7285
8872D33003l7958j31672J68581l9471L0872r0177J7749j41318K8678J1953p449
8861B42791l7777M5704K18739r9588p63J1879k8778Q3469r5853R4356j5195j19894
8849B99090J80629l4748J08140n0959o7529k8263N5138m1629o7658J2576j09649
$$ y = [1366170, 1236892, 1373800, 1172282, 1049139, 1072734, 1165870, 1193661, 1221418, 1237037, 986040, 1061857, 1038561, 901772, 960401, 861917, 929938, 900231, 856653, 689459, 695545, 753519, 764513, 876103, 761910, 703152, 630285, 713079, 846370, 652125, 652296, 704285, 585019, 606431, 641027, 613660, 499565, 599112, 514914, 511957, 469009, 613151, 520811, 538184, 560704, 536229, 412035, 422252, 405261, 564847, 469729, 329014, 449415, 385718, 433003, 395045, 263373, 431954, 392483, 423355, 333178, 350927, 209609, 238287, 250240, 242791, 205014, 250718, 469457, 369869, 369106, 380985, 352207, 435676, 339823, 434179, 418984, 299090, 479719, 444971, 553111, 502152, 434623, 406360, 461498, 419869, 352211, 364787, 255138]
8838B55138Q7680K6053L3875j38764m602J41089N7499k12273J50411n2746J99275
8827E42635N5260P9920p6003K24967q0188k6069O4107J26003k3369j30763k5254
8816G31246Q5969M7441r7748n1967R2973j57505j34296L1364p9681O6156k3220
8805E10732q4378P1772j34856J00677J5477P527r7933J70680N2938j22292K52791
8794G43135K4554j3522j5034p6397J58920j84302K2749M8508l1220J3963l3346
8783F58008m5385j9075r132o7403Q9082j34801p696j32372M5061j6381M4560o5255
8771C39211M0295m4184M6045q0482k2311K0300N531n0839J27550M250J27626l21339
8759A91653Q6222l4674l5639N2931j3174L7782p5905J36782j39981r7710O2210
$$ y = [255138, 342818, 368871, 402746, 263982, 259380, 400469, 457968, 245695, 396106, 343360, 542635, 597895, 677815, 601812, 826779, 746591, 720522, 784629, 910632, 887263, 756500, 731246, 817215, 864656, 766908, 714941, 807914, 650409, 516113, 547477, 467796, 533952, 510732, 426354, 498126, 363270, 463947, 479424, 486951, 389018, 559698, 612636, 490344, 743135, 767689, 754167, 739133, 662736, 821656, 637354, 660103, 708611, 677391, 691354, 658008, 612623, 593548, 584416, 517013, 606095, 471294, 463598, 331226, 376287, 359906, 404466, 339211, 379506, 335322, 381367, 300885, 278574, 298874, 304405, 253566, 381116, 385366, 512992, 191653, 277875, 243201, 207562, 260493, 247319, 285101, 209196, 345978, 205997, 108287, 170497]
8748A70497L6176J29901j76141o3438J21812k0441J38466j00349m2101j3521J9861
8737B00722j17813L1466J5089M0621r5701j00737N6660J88097q2422m0610j314
8726I4058j19812Q8335j06112l5920P2033J13717j5609j06162R2863j10328j21080
8715a54017J65209n7060M6167k3986l5170L1618p196j1368J1219L0843m7257j41893
8703a92891K89820j55069n8559J5542m3256m1510M9699J78208k52653J58536m1888
8692i4021P509P6481J04929k11803J15816j04916m2492m6273J50286o0611J133
8681a03962K840J092J5363k2278j686J06848j63528L9466j23056J42627K9680
8670g6594o6229P1401l7314m5131L0780L5615J1677J24039j33198R597N6928j54220
$$ y = [170497, 206673, 336574, 160433, 96995, 218807, 198366, 336832, 236483, 194382, 180861, 200722, 82909, 114375, 129464, 170085, 74384, -26353, 30307, 218404, 135982, 95372, 94058, -25754, 62581, -43531, -79451, -7418, 106299, 90690, -15472, 77391, -32937, -154017, 11192, -45868, 299, -23687, -58857, -27239, -34435, -45803, -34584, -3741, -50998, -192891, 96929, -58140, -116699, -101157, -144413, -185923, -136224, 41984, -210669, -52133, -94021, -86512, -10031, 94898, -116905, -1089, -106005, -148497, -194770, -44484, -105095, -103962, -101122, -100030, -84667, -106945, -108631, -1783, -165311, -125845, -248901, -106274, -76594, -142823, -71422, -108736, -153867, -123087, -87472, -75795, 48244, -84954, -75357, -18429, -172649]
8658a72649K6013L2315J7959j13835J46475r8257j14761J19767Q805Q6609j26098
8647a87657N991n4728J00350O0841r6268M6146M7457k8382J7644q6186L6855J8536
8635a19401O8044p9747k478Q7137k12688J12033k9212r2868Q6707J17850j16617
8624a81240j5245J41243j58769K6153N6139Q9859q2565l6140N1358k784P6710
8613c5281J9135q9519J0893R1178j04062l8737m3618N3395P0221O7660k30556
8602b29291J09292J17221o4398n3734k6303l8756L8738Q5552J9995p1221J63528
8591E0623k95577J66163n4765P1787K8918j29785M6280j0789J0554q2045J41885
8580e6751o8965J7595r9226R7296j27762P9210j27502J8730M9830k9370N6218
$$ y = [-172649, -146636, -114321, -96362, -210197, -63722, -161979, -276740, -156973, -148168, -61559, -187657, -181666, -236394, -136044, -75203, -171471, -125325, -77868, -106250, -88606, -174792, -137937, -119401, -51357, -131104, -133582, -46445, -259133, -147100, -176312, -269180, -182473, -64623, -181240, -196485, -55242, -214011, -187858, -131719, -41860, -124425, -160565, -109207, -111991, -35281, -16146, -105665, -94772, -3594, -107656, -146393, -190011, -136616, -66395, 1265, -229291, -119999, -2778, -67176, -120910, -147213, -185969, -147231, -61679, -41684, -112905, 50623, -244954, -78791, -133556, -61769, -32851, -162636, -116356, -127145, -116591, -198636, -56751, -125716, -108121, -207347, -110051, -237813, -158603, -286105, -267375, -217545, -246915, -190697]
8569a90697Q1558k7258n8463O3844j25639J47428O1764j73351J04038j62774Q0718
8558a98832L8804p4173P2732l524l7284Q913j9482R6404j06728o997m3367J12597
8546a60937q2656J87036j23800m0006Q6610j18211J23280k6266j16954J62163
8536a09741j00148O0055j9809K4373M0099j11790P5045j70716J18619o195k3942
8525b24150J6561N2120l9590j650N2585m6392j38043K59688j4619m5481o1543
8514a90514L2641m3133J048J52234j23828k2558J3307O997p0181J4379P6035l4097
8502a87670N5244K4207r6695J02248k2104M5742j93667J66179o9964L5659n3616
8491a94437j5004M1064j20088L0307K60939j74282k8365J00195r6066n519J09411
$$ y = [-190697, -109139, -136397, -194860, -131016, -256655, -109227, -47463, -220814, -116776, -279550, -198832, -160028, -234201, -161469, -164993, -202277, -193364, -212846, -116442, -223170, -230167, -273534, -160937, -243593, -56557, -180357, -220363, -133753, -251964, -128684, -154950, -271904, -109741, -209889, -149834, -169643, -145270, -105171, -216961, -141916, -312632, -194013, -200208, -224150, -207589, -155469, -195059, -196709, -144124, -190516, -328559, -68871, -83490, -128971, -190514, -157873, -201006, -199958, -47724, -171552, -194110, -180803, -173806, -243987, -229608, -153573, -187670, -132426, -108219, -204914, -102666, -124770, -79028, -272695, -106516, -176480, -140821, -194437, -209441, -168377, -288465, -258158, 2781, -171501, -199866, -99671, -195737, -201256, -91845]
8480i1845j01763L5281Q8751p9224n9564M1081O645L7047j9585j03085m2829Q7655
8468b01435J28802l6152N3127j88497P3976o3993J24797j22108M6827J19526r9433
8457a64563K02849j17313m3344p7545k6117m0267J10069J18640o8224n3143R7330
8446f1628o8660o0830k2557J29997j1515j27892q899O6394q887M3616o3960R2369
8434a02452j84482P3152P4423o8540J4936J8968J04377j12274j04819Q4047O5019
8423a37645m3785k2389o304k4587R0135j07768P4725N7304q1673J13024j06787
8412a95750J09204p9094j29389J10325j08275J43407o678j59981J83922L4602
8402i7707p8091J53379k08252N9221j40741J82419o3560O0189p4264M8661J14847
$$ y = [-91845, -193608, -158327, -69576, -148800, -208364, -167283, -160638, -123591, -143176, -246261, -289090, -201435, -72633, -108785, -55658, -244155, -170179, -234172, -109375, -231483, -184656, -65130, -164563, 38286, -79027, -122371, -199916, -226033, -266300, -156231, -37591, -105815, -158958, -61628, -130288, -191118, -213675, -83678, -95193, -223085, -231984, -165590, -174477, -130861, -194821, -102452, -286934, -213782, -139359, -207899, -192963, -173995, -69618, -181892, -286711, -202664, -137645, -181430, -203819, -210123, -234710, -144575, -252343, -177618, -120314, -201987, -88963, -195750, -86546, -165640, -295029, -184704, -292979, -149572, -156250, -316231, -132309, -97707, -175798, -22419, -230671, -171450, -312191, -129772, -193332, -133143, -207407, -158746, -43899]
8391d3899Q993r5998N0729k7804p8325j18674P3128N6205R8428J0445p8412j6077
8379a61261n8202O6171K1571L3494n8497l5876k1503M6156p597N6602p8198Q6785
8367a10355P831k8463o4840J26597j33804k8989o928J85319j43748R4338K7004
8356g6038o3339K9484q5238K21411l52554J91578O3512q7264m0202Q7080m7393
8345a58963L519j418M5335Q774N818j93057O1322J07823M1135L3089p0231J06660
8333a0194o4233m1596J02069n7605o9632j13610J69624o6595M3666r5528J07097
8322i6537k18307J65185J27053k23592J70694o1835J27838j07671n3297P4724
8312i5745j36604J88572j40045j0505j06937N2638J63470r7158J04810k13628
$$ y = [-43899, -34906, -130904, -80175, -107979, -186304, -304978, -231850, -175645, -77217, -66772, -145184, -161261, -219463, -153292, -131721, -98227, -156724, -192600, -214103, -167947, -175544, -118942, -197140, -110355, -102524, -130987, -195827, -69230, -203034, -232023, -238951, -53632, -197380, -103042, -76038, -139377, -109893, -195131, 26280, -326274, -134696, -71184, -158448, -198650, -111570, -158963, -155444, -156862, -111527, -102753, -96935, -289992, -228670, -120847, -79712, -46623, -116854, -10194, -74427, -116023, -13954, -71559, -141191, -254801, -85177, -151772, -108106, -203634, -96537, -314844, -149659, -22606, -246198, -75504, -137339, -9501, -117172, -170469, -95745, -232349, -43777, -183822, -194327, -301264, -248626, -85156, -182314, -77504, -291132]
8302b91132J34599j40443J09401Q0469j46359l4593O8251P6915O6836l8761l9369
8291a54186r0345J90508j15971j4139q511K1495M8349j06978J50321r7916J10704
8280f6669j38742p0539O6703l2328R8595N5500l7356r2824M4219K9847K4472p6650
8268a95772J57787R1676j62752l6142j18234J48438J5015j34309l8270J911O7641
8257b03011k6278J45851j90674N5465J40581r4536l0101R7414O093j22225K7744
8246a93677P3998q2620P5831J05133j09165q8768J29482J6633q486j10396J2l6674
8234b28697J12146j07963J5288R262Q0562n7565l5724j3151R8052N7378j54791
8223b25203J43305m5583r1993r3203K24308j32435J16981r477J027q4747Q0075
$$ y = [-291132, -156533, -296976, -187575, -107106, -253465, -288058, -219807, -142892, -76056, -114817, -154186, -244531, -54023, -169994, -184133, -192644, -171149, -122800, -229778, -79457, -177373, -66669, -205411, -275950, -209247, -241575, -142980, -87480, -124836, -217660, -173441, -143594, -119122, -195772, -37985, 53691, -109061, -145203, -263437, -114999, -99984, -234293, -272563, -270652, -203011, -229289, -83438, -274112, -218647, -78066, -172602, -202703, -105289, -99196, -221421, -193677, -119679, -202299, -126468, -21335, -130500, -219268, -89786, -73153, -81639, -192035, -192023, -228697, -116551, -224514, -209226, -199964, -119402, -176967, -212691, -225842, -127790, -70412, -225203, -81898, -127481, -219474, -312677, -88369, -220804, -103823, -113300, -112273, -197020, -116945]
8212a16945j42128J53128r4311Q3085k7431j49248J47865n4408R392p0996j4939
8201b76936R7190j10431Q5594J62540j32731J16097j44836L0501R4764J102948
8191A024700j249748M4657m3249k3015m1738K34176J7952k39807K0963R3423l7640
8180a99326M800N4956p6406P7009M3412p031j32260J61183n3609r4380K7889N9265
8168a34498j27161J53327o2792L1045o3634P2033O8853j89854k8263j5466J0623
8157b85787L5459J24545l042N6116j53071Q5142m8016J14939q2127k7864P161
8146a76545n2102M9523k9753K23146k00581M3361n1566J7439J33019o6480k8225
8135a38764P9764o7515m0296O2000K8304j53208l0883J33057o2899O2534m1625
$$ y = [-116945, -259073, -105945, -200256, -117171, -144602, -293850, -145985, -200393, -191001, -261997, -276936, -179746, -290177, -204583, -42043, -174774, -58677, -203513, -173012, -78248, 1024700, -225048, -180391, -223640, -246655, -288393, -54217, -36265, -276072, -255109, -161686, -199326, -194526, -139570, -215976, -138967, -95555, -102586, -234846, -73663, -127272, -221652, -193763, -134498, -261659, -108332, -171124, -140079, -203713, -131680, -62827, -252681, -280944, -296410, -285787, -250328, -125783, -128825, -72709, -225780, -140638, -188654, -73715, -155842, -183706, -176545, -228647, -179124, -208877, 14269, -186312, -142951, -194517, -177078, -44059, -110539, -138764, -59000, -126515, -166811, -104811, -76507, -229715, -260598, -127541, -190440, -127906, -169531]
8124a69531J05674r6908J12235j84123k969j6818J12679n0051K6313p2448K01776
8113c4171k37727J50076j0377k1674j33387J50797j3178J39047j9238j33657o7851
8102b31340J41415q6802L731p1618K16136n2502k7969p5505L7056Q401n1638l3868
8090b24503J24984j02361J28577j62240J54909R7159o1487q3208j3288M4406j59204
8079b56256J37752j09870O9812J12192l9024p3323n551J64001k06294Q262R628
8068a88671N4805q1365O5579k7248o4120Q2891P8392j27186r184l938J18288N7249
8056d4508Q9918j87494J189q8221N4546R6025q1067J01504q2200L8396L3462n7390
8044a25840L4310j09165K7227Q6573o0188J2090p093K121j05572J76597J0783
$$ y = [-169531, -63857, -160765, -48530, -232653, -235622, -252440, -139761, -189812, -163499, -235947, -34171, -271898, -121822, -132199, -153873, -287260, -136463, -149641, -10594, -29832, -163489, -231340, -89925, -176727, -172996, -244614, -28478, -80980, -108949, -184454, -147398, -138997, -190635, -224503, -99519, -201880, -73303, -235543, -80634, 16525, -44962, -128170, -141458, -97052, -256256, -118504, -228374, -158562, -46370, -85394, -158717, -164268, -267, -206561, -198299, -188671, -133866, -215231, -149652, -176900, -241020, -158129, -79737, -206923, -216107, -220045, -101757, -44508, 45410, -142084, -140895, -229116, -174570, -78545, -159612, -58108, -140308, -101912, -68450, -125840, -91530, -200695, -173468, -86895, -147083, -134993, -142086, -139965, -245537, -68940, -58157]
8033e8157j46036k3723R8837M6204j55427J52189o6236j4205Q0010j07651M8757
8022a45438O5071j03763J24443r1011K2188j11119J68992K6430o8476M2310l9138
8011a09511P0752r7343L00l6602J38048j42289l9760O8569L4886q4740L5285N8250
7999a04155r1821J32644k6876j19427j3413J62950r000l439n05O4338k04512J31950
7987h1266o1834k5586L0067J18092M8057r6025j32732k1380l5020J72578r677
7976i4726L9257r8977o420n1450N541J51840j74837J14102r5732J74075O066r5287
7964a26548l3273l3383O6303L1885P0077j21842k0137q3302M5087r2154J82981
7953a14306j1291M1751p6941J237m1356L4245p3677J15899l4048M683L4390m8508
$$ y = [-58157, -204193, -227916, -129079, -82875, -238302, -86113, -152349, -166554, -86544, -194195, -145438, -80367, -184130, -59687, -150698, -128510, -239629, -70637, -44207, -112683, -70373, -109511, -38759, -136102, -135802, -172404, -34356, -176645, -216405, -147836, -112950, -197690, -162405, -104155, -195976, -63332, -90208, -209635, -223048, -60098, -69098, -72537, -73042, -8704, -213216, -81266, -143100, -168686, -138619, -20527, 27530, -68495, -201227, -222607, -257627, -85049, -94726, -55469, -154446, -160866, -212316, -206775, -54935, -229772, -115670, -211402, -37327, -31261, -126548, -159821, -193204, -126901, -95016, -24939, -146781, -166918, -250220, -205133, -297287, -114306, -125597, -83846, -160787, -159550, -200906, -166661, -240338, -124439, -158487, -153804, -119414, -167922]
7941a67922J23052q9362j0258l7764L52J62781j59077q232l3085P9720m8261M4709
7929a43347K0095q5827P0385r4388K6388J56523j3145j06847J11876j54668j1978
7918b24933Q1746l9062N6013l4427k9110J16967p5767M2281O0286j05782m5787
7907a97575q3756J97047j28050R3414J0726O3455k08351J17090L1354j73748J02068
7896a76326J30251j04510l0984P1415J35381k19825Q0443J40310k23460R3027
7886a04278o507m547k9311P1850j06017Q000P6727o0385J46076j99615r1986K41376
7874e8617j7506N8726p0718o5302N604Q2004K0011j13393O5792j5432l0973L9127
7862a00677j23739l8095J92169j81340M6419J31288q6013m1439P2976o0194n7383
$$ y = [-167922, -44870, -134232, -144490, -182254, -181902, -19121, -178198, -186430, -219515, -139795, -188056, -143347, -123252, -209079, -138694, -233082, -206694, -50171, -63316, -170163, -58287, -212955, -224933, -143187, -182249, -126236, -160663, -189773, -72806, -148573, -106292, -46006, -151788, -197575, -281331, -84284, -212334, -118920, -108194, -44739, -253090, -136000, -104646, -278394, -176326, -46075, -150585, -181569, -110154, 25227, -194598, -114155, 26155, -197305, -104278, -110785, -115332, -144643, -72793, -178810, -170810, -94083, -154468, -8392, -208007, -299993, -58617, -76123, -17397, -88115, -153417, -147813, -65809, -45798, -159191, -93399, -108831, -139804, -100677, -224416, -262511, -70342, -251682, -205263, -73975, -159988, -201427, -128451, -188645, -246028]
7851b46028J19629P7140j6657j16386R8764j28765L4385Q5771R0692k18360J20609
7840i9206k2493Q5447k18642J5406J55460j32107Q1010L2932N3860J2924j95601
7829b31010J32935P621k7517L1977j4655R5998O6384k34209J880q3983J32832
7818a21747r3738K33391j48126J19781j19339K0266j49760O0998Q4731L8308J11037
7807C5802k46540J38634j02930P6667L0233N2161q8079q090J13023j74605P5236
7796i8488p8437J57908p0561r2756q4674N8446J87980p5908J5304n1600L2326
7785a00460j44290K13796k537o7966n1200J30043m1580j59089N3806J38836q6686
7774a17327j6925N3868m3364l9350j47797J32662l0113J3992Q2116J3295l7324
$$ y = [-246028, -126399, -49259, -65916, -182302, -83538, -212303, -177918, -92147, -1455, -219815, -99206, -121699, -36252, -254894, -239488, -84028, -216135, -135125, -102193, -48333, -35409, -231010, -98075, -90454, -117971, -85994, -100649, -4651, 61733, -172476, -170596, -254579, -121747, -215485, 17906, -130220, -10439, -129778, -109512, -259272, -198274, -113543, -75235, 35802, -210738, -72104, -175034, -98367, -68134, -15973, -104052, -112142, 881, -173724, -98488, -176925, -19017, -89578, -182334, -267008, -208562, -20582, -96490, -81186, -132786, -100460, -244750, -30954, -33491, -101457, -152657, -22614, -64194, -223283, -169477, -30641, -117327, -134252, -80384, -123748, -163098, -310895, -178233, -208346, -194354, -112238, -98943, -136267]
7763a36267m5846R3795q990L9184q3150r642J3362O6066o1489n1215O7720J39377
7751B2905k20843J3687P9563k2805R830M0554n6133L7516r4879p6098R3555N5727
7739a17421j6173J04467l1249j55198J9285j3355M0641j18023J09123q1948K47607
7728a2244r3067R0139n6155n4993k04530K32207m4601k5357O1603O03j43817Q7456
7716a62756j03616J11549L2555k8511K4549J08704j6426q8108m7989n0909j7589
7705b38547J64763m0540P4230J7725j95969o90K5076L7143l633J19540r7390J21747
7693a6545K0637j94392J76574j68423O5065L2158o6265n9870J85008j82576M7508
7682a61121r2552J89034j14460J23834m30r0725L5476K6405l2104P0829o4670
$$ y = [-136267, -182113, -88318, -97308, -58124, -141274, -150916, -137554, -71488, -132977, -184192, -116472, 22905, -197938, -184251, -104688, -127493, -117663, -77109, -133242, -95726, -190605, -266703, -173148, -117421, -133594, -29127, -60376, -215574, -196289, -209644, -169003, -287026, -177903, -259851, -12244, -105311, -15172, -71327, -126320, -330850, -98643, -143244, -168601, -106998, -106395, -250212, -162756, -266372, -154823, -122268, -150779, -126230, -17526, -33952, -122060, -170049, -220958, -238547, -73784, -114324, -40094, -22369, -218338, -219028, -193952, -156809, -160442, -40902, -138292, -16545, 4092, -190300, -13726, -182149, -117084, -84926, -151191, -211061, -26053, -208629, -161121, -253673, -64639, -179099, -55265, -55695, -146420, -110944, -84539, -116643, -45814, -110484]
7671a10484J29937n0905j27531j6472j2105J51503q658j81524R5173n2435K7775
7660a55726j2911J23359j84175O5641J42075j66986j9883O9108N113K6055Q4182
7649b4148j11890P7719k07554J37856J65613k47940M8195P8242r5319J15610j08520
7638a72136J6852r297j4604J06759k1109l466k8868n8128O6399m356q6190J1402
7626a96742J46044j9745r76M563j59886J20086K5669m3456j39417L51421l36290
7615b48729R9039R3568J03625j60560r272m1396k1614R4403L4097p0411J24749
7604b501r9800M4207M3615k9695p67M1993j64241m9597J54017k90936O5111J42419
7592a46175J83115r2259k3053p7746j47496K01228N1041n6487L8753q9787J42659
$$ y = [-110484, 19453, -31452, -158983, -175455, -187560, -36057, -44715, -226239, -131066, -183501, -155726, -168637, -45278, -229453, -163812, -21737, -188723, -208606, -139498, -134385, -108330, -24148, -136038, -58319, -265873, -128017, 37596, -210344, -162149, -83907, -179226, -63616, -172136, -155284, -164581, -179185, -72426, -93535, -97001, -125869, -183997, -117598, -121954, -208144, -196742, -50698, -70443, -71419, -66856, -226742, -106656, -80987, -124443, -263860, 87561, -248729, -149690, -56122, 47503, -113057, -122329, -163725, -185339, -90936, -56839, -127250, -2501, -102301, -58094, -14479, -44174, -44941, -2948, -167189, -216786, -62769, -353705, -288594, -146175, 36940, -55319, -78372, -156118, -303614, -102386, -51345, -107832, -69079, -158866, -16207]
7581a6207n4957l0504p8766K9557l7925n9565O1958N2906L2825M2801j1301M5529
7569b3649r4501J19038j99630J01674n7863P8721Q7109p9353j2300Q9791K4334
7558C3371P2624q7587j10822N2707q411o7376o8483J49153q0970p5898J2681J26258
7546e2753p8030Q0878l0172J6035R854J3899k7038p1089N739O0357k4975N7306
7534c9989O5322j06659M236P607R4097n3734l0695j23801J64035p0268m8064P979
7522a29934r600M4278P8929p8479r4592J00049n5827J2715J00598O2034j44368
7511a14197n853M2233r095j4092r2012J08210j5908m1589j3497L1807o001J4618
7499a15376J21835k08529J47291j9520l798K9239n8941R7895q215j56647R1624
$$ y = [-16207, -71164, -101668, -180434, -150877, -188802, -248367, -186409, -133503, -100678, -57877, -69178, -23649, -118150, 888, -198742, -97068, -154931, -76210, 10899, -68454, -80754, 9037, 33371, 105995, 18408, -92414, -39707, -48118, -115494, -183977, -34824, -115794, -191692, -179011, -52753, -130783, -49905, -80077, -64042, -54188, -40289, -67327, -138416, -132677, -72320, -97295, -39989, 25333, -81326, -77090, -69483, 24614, -29120, -59815, -183616, -19581, -89849, -137913, -129934, -139534, -95256, -16327, -94806, -189398, -89349, -145176, -132461, -31863, 30171, -114197, -120050, -77817, -86912, -101004, -193016, -84806, -100714, -142303, -155800, -123993, -129994, -115376, 6459, -202070, -54779, -74299, -78097, -48858, -107799, -9904, -18119, -174766, -83142]
7488h3142l6872J22537q1983J5035N8184j14780m3322J60599k2670j79390P4506
7477a31298L4919k0734n7255o7649J33134l2474P4700q0239L3104Q0409j37587
7466a70970J34985o236j7198J6797j25204K01257j22726q2267J05873O6412r0656
7455h9933P3705r1513O3803j94556P8016J49703p6801J16251j49007l5560J38507
7444a7385k00931J32030K0641Q944Q3202m6964J03316k12372Q5653P745R4819
7433E8698k02678P7992m3545O2739O614N5858m6028j13286j6239M4139j5888J14069
7421a7555n5888p7616M4420J16820j2471k28471K62002j44561R436r14O8992J7834
7409a7972j31895K18308k37067J86273j6011o4298O256r0969R1513n6514Q7722
$$ y = [-83142, -120014, 2523, -79460, -64425, -6241, -121021, -164343, -3744, -26414, -205804, -131298, -96379, -117113, -174368, -242017, -108883, -141357, -66657, -146896, -113792, -33383, -170970, -35985, -42221, -59419, -42622, -167826, 33431, -89295, -171562, -65689, 723, -89933, -16228, -107741, -43938, -238494, -160478, -10775, -87576, 28675, -120332, -155892, -17385, -218316, -86286, -65645, -56701, 26501, -20463, 82853, -129519, -43866, -36121, 58698, -143980, -65988, -109533, -46794, -40180, 15678, -30350, -143636, -159875, -115736, -131624, -17555, -73443, -151059, -106639, 10181, -2290, -230761, 31241, -113320, -103884, -104798, -35806, -17972, -149867, 68441, -168626, 17647, 1636, -62662, -56406, -147375, -55862, -112376, -24654]
7398b4654j00376N7674R1857j86977K7449l8400J04138L7494J723L7030q2375
7387g5417N5155l6408j0875k1157o2744Q5842n1224J6013O2355j17727J623J06916
7375d7648n003L1643k5147m7065k6234J0032J08586j71346J83277k41671L06558
7364G5982k44934J05569r3150J67133N452j69261J01353j62712J06878J22490
7354A4800O0801j00928O1247q2582q3767K50728j02387n4945n8287J04371J8703
7343B7754k23444J91738J9379k2963L2763M2766j60775K1929m441K04984Q0557
7332B10247j1742P7552m5067m7877J69722j31260m0008N617N7085k64293m7467
7321f7491J39962j00264l5609N1624L2281m2191R0830j63443j5108K8527k9508
$$ y = [-24654, -125030, -67356, 24501, -162476, -135027, -173427, -69289, -31795, -30072, 6958, -75417, -20262, -56670, -67545, -88702, -151446, -65604, -116828, -100815, -38460, -156187, -154564, -47648, -52651, -21008, -46155, -93220, -119454, -109422, -836, -172182, 11095, -230576, 75982, -168952, -63383, -156533, 10600, 16052, -153209, -51856, -214568, -107690, 14800, 75601, -25327, 35920, -46662, -130429, 120299, 17912, -37033, -95320, 9051, 27754, -195690, -3952, 15427, -7536, 25227, 67993, -92782, -70853, -75294, 129690, 210247, 198505, 276057, 230990, 183113, 352835, 221575, 181567, 187184, 244269, -20024, -67491, 72471, -27793, -63402, -11778, 20503, -21688, 69142, -94301, -109409, -80882, -110390]
7310a10390J63206k5003l6039R1693r6743q7928K9875P248N0608j12827J53775
7299B7475k1386q2157o2822J1022M6233p9130l7262M6056J79468k26669R7390
7288a01782P1138l2012k8549K0257J63520j68024P2579k7071j04654J37741n6441
7277e3298M061J02719j46616J1093j239J23082j16971L525j71176J1491K27407
7266e922K1199j32864J36893k8750p1794O8656r605m9644M4259K0611l7352k0366
7254f4679p29P4228R0136k17314Q3217k0141J61289k72747J48853J08062j79567
7243h9392O9644q1138m0221l146N6668m1548L292J32327j55078Q8872J16290j58590
7231a02020N5550p2043J74208n9200o9863j74345O874K27223p4725J45157j27415
$$ y = [-110390, 52816, 27813, -8226, 83467, -13276, -101204, -71329, -64081, -13473, -126300, 27475, 6089, -76068, -138890, -127868, -81635, -160765, -198027, -151971, 27497, -199172, -101782, -30644, -62656, -91205, -70948, 92572, -75452, -2873, -29944, -134598, 3143, -53298, -49237, 53482, -93134, -82041, -83280, 39802, -77169, -73644, -244820, -233329, -5922, 15277, -117587, 19306, -9444, -81238, -12582, -22187, -71831, -27572, -6961, -44313, -64679, -65408, 8820, 98956, -118358, -35141, -55282, 106007, -166740, -17887, 90175, -89392, -19748, -100886, -141107, -144253, -87585, -129133, -125841, 6486, -148592, -59720, 56570, -102020, -46470, -118513, 55695, -3505, -73368, -247713, -240839, -13616, -88341, 56816, -70599]
7220g0599N4486j21802Q6030N8257l4745k7657K1491J6895J06026j40839J08432
7209E5975P89j14087m0834J58085j57027m0838J29137l3682o3149K6785J89513
7198A10667j84935J6407K9673J1220m4287J02775R476l1545K5752q7005L9387
7187b415O2437m1028m1705J3938j01427K57902k94049L7411J21928M136j98077
7176a80949M5219j998l8508K45320m9853j3171q3377p315k7859p2277R8505J21512
7164C5249L6483j22826n4272J88400m8970m0367O0061l0470l6060J22925m5690
7153F4463j66571J65356j32039J52459j82038K3941J04382J34449j76952N4450
7143D1900l3283J1801L9090j55578L8943m8424O7136n6629J26498n3348M7167
$$ y = [-70599, -16113, -137915, -51885, 6372, -28373, -56030, -34539, -17644, 88382, -52457, 55975, 56764, -57323, -98157, 59928, -97099, -137937, -8800, -42482, -105631, -78846, 110667, -74268, -57861, -28188, -16968, -61255, 41520, 50996, 19451, 45203, -41802, -2415, 60022, 18994, -22711, -8773, -110200, 147702, -146347, -108936, 12992, 17128, -180949, -135730, -137728, -176236, 69084, 19231, 6060, -77317, -84632, -112491, -184768, -86263, 35249, 71732, -51094, -105366, 83034, 34064, -6303, 53758, 23288, -12772, 110153, 64463, -102108, 63248, -68791, 83668, -98370, -74429, 29953, 164402, -12550, 41900, 8617, 20418, 59508, -96070, -57127, -105551, -38415, -95044, 31454, -21894, 25273]
7132B5273q4055r9664J29745J9143k0338R0888r147k42741J08071K08974j58932
7121c2783Q2211j9841K988o5736j02659J29662N9579J4441j88261L5519J71853
7110H6973o944j09028K1236N9770p2140k2593l8861J52696r2118o4236J08282
7099B3037M7636p8061m3878m526J46678P083n9650R7338m2182j95705l722J70555
7087F4603l7577J1597M9005O521n5252P5131l9744J76492j46625l8468L4758J4809
7075A15250r1434J20819L3144J74443j98151J57276J2431o9140N5913L8586j1535
7064C37602P4727L8255m1659J17588J04879n3010J75141J86980J98413J3732J70064
7053A322712L1989k15171r5123j48810j20268N558n3116j70973j1171j78599P0711
$$ y = [25273, -58782, -158446, -28701, -9558, -29896, 60992, 51845, -190896, -82825, 126149, -32783, 49428, 29587, 32575, -33161, -135820, -6158, 53421, 67862, -120399, -84880, 86973, 80029, -28999, -7763, 52007, -20133, -42726, -81587, 71109, -21009, -85245, 23037, 70673, -7388, -51266, -55792, 90886, 97969, 38319, 135657, 93475, -102230, -105952, 64603, 27026, 38623, 87628, 94149, 38897, 114028, 74284, 250776, 104151, 65683, 100441, 115250, 23816, 144635, 177779, 352222, 154071, 311347, 323778, 254638, 310551, 349137, 337602, 412329, 450584, 408925, 526513, 631392, 578382, 753523, 940503, 1138916, 1152648, 1322712, 1354701, 1139530, 1044407, 895597, 775329, 780887, 727771, 556798, 545627, 367028, 437739]
7042D37739q2469o8317n3178K7270j7793N1368q9957J1237J9509N8640k12550
7031H1499M1058L214R9968j14353J88847j68686K1737M3287j23165O6913J30088
7020B70407k3399k48157P9231J84145j12306l1665m7797j6626j16763J79517K1720
7009A38307k0058l3357L2768j01166J2935J64715p0104L5725j0586R3263k16272
6998B6170O400J34034q1425K7027M9336j52693L6382J12879k9240q4142k7901
6987A6827J12217r0934P7211L6652k1427j3645j0650J9657n3073Q1123j70689
6976a6731R5789n0325J3062n9081Q6685J8797l716n5959M0015Q28p5669N8083
6964E1778p6967P2020o0445M7035J3206p3959J69731j05631R7559J26914n0690
$$ y = [437739, 355270, 286953, 233775, 261045, 243252, 294620, 204663, 215900, 235409, 294049, 81499, 122557, 125771, 225739, 111386, 300233, 131547, 153284, 196571, 73406, 140319, 270407, 247008, -1149, 78082, 262227, 149921, 118256, 70459, 53833, -62930, 116587, 138307, 118249, 84892, 117660, 16494, 29429, 194144, 124040, 159765, 149179, 242442, 26170, 32570, 166604, 85179, 112206, 161542, 8849, 45231, 158110, 128870, 44728, 16827, 129044, 38110, 115321, 151973, 130546, 116901, 106251, 125908, 72835, 153958, -16731, 79058, 28733, 41795, -17286, 69399, 88196, 84480, 28521, 68536, 69364, -6305, 51778, -25189, 46831, -13614, 33421, 46627, -27332, 142399, 36768, 134327, 261241, 210551]
6953B10551j77554p8546K54234k7551o7091o7175O2900j2572O5933j74911M4623
6942C2841M5225L7187n8233L7545o6035j7737J18382n3155M3696n4554P3302j12247
6930B6217K08508p4117j13100J1947O9769K0381p3203l2043K7895P7050j58644
6919i340Q8151N240J48776j12404M1979l9762p5788R7810L7986j86733M6272J55936
6907A98123q5506M8605j1286j47204Q8711j04921M4183J89365m0925p3269N6965
6896A62841N7612j06434l190Q4626L3488k07311J33884Q9260j32763O3281o264
6885A69030j01053O8402O4390j3089p8472j93j23324P1898K7521J21916K3749
6874B30775k9070l5208k11785J55180R6949j27798J86966M5538r611l01878K81622
$$ y = [210551, 32997, -45549, 208685, 181134, 114043, 46868, 109768, 97196, 163129, -11782, 32841, 78066, 115253, 57020, 94565, 28530, 10793, 129175, 76020, 119716, 65162, 138464, 26217, 234725, 160608, 47508, 59455, 129224, 149605, 76402, 44359, 72254, 149304, -9340, 78811, 84051, 232827, 120423, 162402, 122640, 46852, 144662, 182648, -4085, 42187, 198123, 112617, 161222, 149936, 2732, 91443, -13478, 30705, 220070, 179145, 105876, 162841, 220453, 114019, 110829, 195455, 228943, 21632, 155516, 244776, 112013, 175294, 169030, 67977, 136379, 200769, 187680, 109208, 109015, -14309, 57589, 85110, 207026, 230775, 201705, 166497, -45288, 109892, 206841, 79043, 266009, 311547, 301936, 58, 281680]
6863B81680j66093J0196J2787J83147k48916K21138o8043m225j46843O3691J05504
6852B44023m9601P5507k1580j07769R4055K14927k29796L9065l3619K4921K7310
6841B77443K06050j42414R9534j8286L9447r6391K1965J33528N3357K1589q4080
6830E11742L4448J06515J85292j11856k7868J928n8015J74105k80063J88197q302
6819G16123J9263n9857L0686o9308J762J9310m7560q0867l2923K4247M4099r5179
6807D69796r5631M0380o0675L1590P5010o0660K2123l878j29393P2553n4688M3794
6795C50321l9500K8323j14785J14041l8777M3312o4729k6966M2044J0297O1357
6784C64938j13040J0104J58642l2306k19778Q4147Q6846o7360O1819m8165j03220
$$ y = [281680, 115587, 125783, 138570, 321717, 72801, 293939, 225896, 221671, 74828, 138519, 244023, 194422, 269929, 248349, 140580, 234635, 449562, 219766, 258831, 225212, 250133, 277443, 483493, 341079, 440613, 422327, 461774, 365383, 387348, 520876, 574233, 595822, 511742, 546190, 652705, 837997, 726141, 698273, 700201, 642186, 816291, 536228, 724425, 716123, 735386, 675529, 706215, 636907, 638669, 657979, 610419, 529552, 496629, 520876, 564975, 469796, 374165, 414545, 353870, 385460, 460470, 399810, 421933, 418055, 288662, 361215, 306527, 350321, 310821, 339144, 224359, 338400, 299623, 342935, 278206, 251240, 293284, 303581, 364938, 251898, 262002, 420644, 388338, 168560, 252707, 339553, 272193, 334012, 285847, 182627]
6773A82627O6850J48145j04124O3344j29315K9390Q2641k04878J99862l0098j62939
6762A41505J21403M9835J00056j34359K2912R9564p0713J17446o4153M882O3529
6751D51907j00745O89j07827O6066L4021k8900j40788J53833M5743O164N1995
6740D32158j70678r3418J72752j4212L5698j19052O0399N2754P0353j26231R8261
6729C98784n0480M0983P1178J9220o7896m0073l4574J06523r3509K4958J27827
6718E02941J21543n5338p4586k9729q4541P728J12718J07895j52091p7752K32451
6707F11239j56052j7207K6025n4497K6874N0710J37353j24304P0024L9394r3682
6696E15877o8583K40832O864r7652m4816O6136j75376k1562J03711J28882m4651
$$ y = [182627, 249477, 397622, 293498, 356842, 227527, 256917, 339558, 134680, 334542, 304444, 141505, 262908, 312743, 412799, 278440, 301352, 400916, 330203, 447649, 383496, 388378, 451907, 351162, 351851, 244024, 310090, 344111, 315211, 174423, 328256, 373999, 380163, 432158, 261480, 168062, 340814, 326602, 362300, 243248, 303647, 356401, 426754, 300523, 398784, 348304, 389287, 460465, 479685, 411789, 371716, 337142, 443665, 350156, 375114, 502941, 624484, 569146, 494560, 464831, 380290, 388018, 500736, 608631, 456540, 378788, 611239, 455187, 437980, 464005, 409508, 436382, 487092, 624445, 500141, 570165, 609559, 515877, 447294, 688126, 694990, 597338, 552522, 618658, 443282, 421720, 525431, 654313, 609662]
6685F09662j59976J08722J704P547k0826k3812j8318P694R2884j90881N7161j7558
6673D54003L9808N6554k2072Q2001R2166m1088n7567j30897K3867j05907J95401
6662E86269r389K1644M1903p206r2344R6388Q4232n1865q5799P4874k8780J44555
6650G74482l07858K06514n8579P8623p175N8932q9775n3558J01397m0636p2406
6639E89961J92380N3397j15956N8932N8434N2300m3391J42370m0100j30545o2756
6628G55026J05585q0863o242p0257o3063o186P4332j3532J04250j39059K5395
6617F85386l7025J95228K4047p6734q5691J6545N7873J40783m2465K8465p092
6606H99320j20801p3297N9472K35981n8497o7378P5873j78070J49441m7553J24255
$$ y = [609662, 449686, 558408, 560112, 567659, 546833, 523021, 504703, 512397, 605281, 414400, 471561, 454003, 493811, 550365, 528293, 610294, 702460, 661372, 603805, 472908, 496775, 390868, 586269, 576880, 598524, 640427, 633221, 540877, 637265, 721497, 669632, 583833, 658707, 629927, 774482, 466624, 673138, 614559, 693182, 686007, 744939, 655164, 601606, 703003, 662367, 589961, 782341, 835738, 719782, 778714, 837148, 889448, 846057, 988427, 948327, 817782, 755026, 860611, 779748, 773506, 703249, 640186, 634000, 708332, 694800, 799050, 659991, 685386, 648361, 843589, 867636, 790902, 705211, 721756, 779629, 920412, 877947, 906412, 899320, 778519, 705222, 764694, 1000675, 942178, 874800, 950673, 772603, 922044, 874491, 998746]
6595I98746l0586N2767q0166J23695o1901J24654J6173N7635j12288J68140L2254
6584A289123M6800q5848J41185j77956m0582M8198J56832j37233P1317r8984P1207
6573A284059j1265r209J00775M9278o1695q8028R3124j987j27284J48891M0384
6562A417043J01511p6052l1970M3370J7974N3812J15836p4127j4226J97258r5562
6551A654867n9846O8857J03723K6194R3087l5744j3474P0985J2439R5682m7331
6540A969439J40429L5549k3328Q4909J97193J52881j03883P2985J79358p2841
6530B632691J46475L422J4501o3408R093J63678m6410Q1068O0305J08335j0883
6519C098867Q3637J17342L2441J68919P5949l725M7585J25326Q5934J28565J23874
$$ y = [998746, 968160, 1020927, 940761, 1064456, 1002555, 1127209, 1143382, 1201017, 1088729, 1256869, 1289123, 1335923, 1250075, 1391260, 1213304, 1172722, 1220920, 1377752, 1240519, 1311836, 1212852, 1284059, 1272794, 1263585, 1364360, 1413638, 1351943, 1263915, 1357039, 1355052, 1227768, 1376659, 1417043, 1518554, 1442502, 1410532, 1453902, 1471876, 1525688, 1641524, 1567397, 1553171, 1750429, 1654867, 1595021, 1663878, 1767601, 1793795, 1886882, 1851138, 1837664, 1908649, 1921088, 2016770, 1969439, 2109868, 2145417, 2122089, 2206998, 2404191, 2557072, 2453189, 2526174, 2705532, 2632691, 2779166, 2782588, 2797089, 2733681, 2742774, 2906452, 2860042, 2941110, 3001415, 3109750, 3098867, 3182504, 3299846, 3332287, 3501206, 3577155, 3573430, 3621015, 3746341, 3832275, 3960840, 4084714]
6508D084714J59236R5528J65896L4929L97313J03865J97274J98336Q0003L01931
6498E819025J47544L71542K53460K44271L59199K52626L94975K80780M39922N64100
6488I127444M65439N74892N33241N50989Q21419P13229O79256Q33421R69409R30383
6478A6199122J153549Q80274J225964J141438J153715J329817J044914J201253
6470B5330046J115135P83785P10126Q10822O00438K98797M22405K32884R0149
6461C0394587m79797n55490q03027j016188j207153j242225r78477j211345j035777
6452B1865108j068881r33466q09650p76780o11442k95258l80159j09133L21888
6443A7202227N33102N59240Q52662L50780J45784l64778o91678q48959r16832
$$ y = [4084714, 4243950, 4339478, 4505374, 4540303, 4937616, 5041481, 5238755, 5437091, 5517094, 5819025, 5966569, 6338111, 6591571, 6835842, 7195041, 7447667, 7842642, 8123422, 8563344, 9127444, 9592883, 10167775, 10701016, 11252005, 12073424, 12786653, 13465909, 14299330, 15268739, 16199122, 17352671, 18232945, 19458909, 20600347, 21754062, 23083879, 24128793, 25330046, 26445181, 27228966, 27939092, 28749914, 29350352, 29649149, 30071554, 30304438, 30394587, 29914790, 29359300, 28556273, 27540085, 26332932, 25090707, 24112230, 22900885, 21865108, 20796227, 19862761, 19053111, 18276331, 17664889, 17369631, 16989472, 16880339, 17202227, 17735329, 18294569, 19147231, 19498011, 19643795, 19279017, 18587339, 17738380, 16821548]
6434A6821548o66996n96878l19909j00082l19121k15110n22162m43958n02631
6425A3134701k1443J24310M70622O85072R50061R05926N12396M31914R4126l10834
6415A6976851l73345k69483j95771L26066N50204N93135L79420L32069l82001
6406A7937145o38148q05512j086719j031738p39400l92172m28371m8450j1792
6397A2754843k07500j99707j63869k70417m4893N48619P49237R62442J045242
6388A5173997P04013O15780k36693n26924q09473r05535j020265r49087p50661
6379A1295152o72078p31940o94403m22026l44203k78711k26975N0903j26329L63919
6369H213309K15993M03592L92074J92744n35k28869l07786n09492l69101n9865
$$ y = [16821548, 16154552, 15557674, 15237765, 15137683, 14818562, 14603452, 14081290, 13637332, 13134701, 13113258, 13237568, 13708190, 14393262, 15343323, 16249249, 16761645, 17193559, 17287685, 16976851, 16603506, 16334023, 16138252, 16464318, 17014522, 17607657, 17987077, 18319146, 17937145, 17298997, 16493485, 15406766, 14375028, 13635628, 13243456, 12815085, 12766635, 12754843, 12547343, 12347636, 12183767, 11913350, 11868457, 12417076, 13166313, 14128755, 15173997, 15878010, 16493790, 16257097, 15730173, 14920700, 14015165, 12994900, 12045813, 11295152, 10623074, 9891134, 9196731, 8774705, 8430502, 8151791, 7924816, 7975719, 7849390, 8213309, 8429302, 8832894, 9224968, 9417712, 9417177, 9188308, 8880522, 8371030, 8001929, 7942064]
6359G942064k55740l39519J46345L0573P0708K11963J32146M36877N01278O38869
6349I515564O52881O13138J52832m5823k62931m00229m80587n65511l14308l79887
6339H485139k62930j07647K2596J41769K20939K92450M86307N38065R87771J628263
6329A2432722K481321L851251M894849N896950N348083L881226J398277n68908
6321C9615771j966474l170001l129017l539681l343196k957027k346362k045459
6313A7118554j889570j170222j073855j048220o32979q19457n13506l29540m28980
6304I212225l54417k87178l03962j29017k3448j33849k33272L1402M5693p8627
6294G745550j50043P9001J0634M5034J52703J34264J59357J95260K22193K47675
$$ y = [7942064, 7686324, 7346805, 7493150, 7523723, 7594431, 7806394, 7938540, 8375417, 8876695, 9515564, 10168445, 10781583, 10934415, 10888592, 10625661, 10225432, 9744845, 9179334, 8865026, 8485139, 8222209, 8114562, 8137158, 8278927, 8499866, 8792316, 9278623, 9816688, 10804459, 12432722, 14914043, 18765294, 23660143, 29557093, 34905176, 38786402, 40184679, 39615771, 37649297, 34479296, 31350279, 27810598, 24467402, 21510375, 19164013, 17118554, 15228984, 14058762, 12984907, 11936687, 11303708, 10484251, 9970745, 9641205, 9212225, 8857808, 8570630, 8266668, 8137651, 8114203, 7980354, 7747082, 7778484, 7824177, 7745550, 7595507, 7674508, 7685142, 7730176, 7882879, 8017143, 8176500, 8371760, 8593953, 8841628]
6284H841628N22239M09574M97693Q32307J136765J181782J956452K882776M825280
6275B3086496O642595Q791853J0083948R656317P100158L261683o60839l320137
6267F4642074m954553n908850o150282n809228n398364m624499l676135l283160
6259B4837003k386725k246836j751022j639130j247821q87496o48007p78734n47707
6250A2703525l23241k49426j74473J6354L0518L63954R8441o571j49057l87262
6240A1922762l62784n01302n04274l99338m50512l67396k82771k18980k57061
6231H578344j7943j30327p6363n3992j22565j01413O6863k62276l6562k7282j1098
6220G805386k15857j37296k16452J15241j50676O47K2355n0089j50627O9251j0083
$$ y = [8841628, 9363867, 9773441, 10271134, 11103441, 12240206, 13421988, 15378440, 18261216, 23086496, 29729091, 38520944, 48604892, 58261209, 65361367, 68623050, 67962211, 64642074, 59687521, 53778671, 47628389, 41819161, 36420797, 31796298, 28120163, 24837003, 22450278, 20203442, 18452420, 16813290, 15565469, 14677973, 14029966, 13251232, 12703525, 12380284, 12130858, 11956385, 11972739, 12003257, 12367211, 12465652, 12459081, 12310024, 11922762, 11559978, 11058676, 10554402, 10155064, 9704552, 9337156, 9054385, 8835405, 8578344, 8560401, 8430074, 8353711, 8299719, 8177154, 8075741, 8142604, 7880328, 7843766, 7816484, 7805386, 7589529, 7452233, 7235781, 7351022, 7200346, 7200993, 7223348, 7173259, 7022632, 7091883, 7081800]
6209G081800J5937M0870N6406J72620j38560J00139J21077K34840J56086M83011
6199H324226J86034M98014M08887M81982O23849Q41701P71250Q27785O37075O04778
6189A4205581K98063o1167l93200n30466n58788o54816o99039l91050o79859k39782
6179A0295477m18716l74561k18094k35719k45251k21562J8390j68905j35404p682
6169H287973j67293J08842O6642J70689m0498K44492J93205R6702L77844J52009
6159I490607M56817N75120O48816Q66929J009086J339195J924192K935337M948632
6150B4194731P265573J0082056J1852726J1558724Q682823L271034j452561m832122
6142G0622984o485373o946724o916586o227119n709474m821162l912977l332591
$$ y = [7081800, 7097737, 7138607, 7195013, 7367633, 7229073, 7329212, 7450289, 7685129, 7841215, 8324226, 8510260, 9008274, 9417161, 9899143, 10522992, 11364693, 12135943, 12963728, 13600803, 14205581, 14503644, 14442477, 14049277, 13518811, 12960023, 12305207, 11606168, 11215118, 10535259, 10295477, 9876761, 9502200, 9284106, 9048387, 8803136, 8581574, 8599964, 8431059, 8295655, 8287973, 8120680, 8229522, 8296164, 8466853, 8426355, 8670847, 8864052, 8960754, 9338598, 9490607, 9947424, 10522544, 11171360, 12038289, 13047375, 14386570, 16310762, 19246099, 24194731, 31460304, 41542360, 53395086, 64953810, 73636633, 76907667, 75455106, 70622984, 64137611, 57190887, 50274301, 44047182, 38337708, 33516546, 29603569, 26270978]
6134B6270978k494985k006559j764691j460687j006025p12000l72222J23729J6267
6125A6593805K74254l24278n70567p88675n72993m67819k60074l78115j82341
6116A3323197j62808P4579K55482M97107P43567R36342J397363J256280J693985
6107B0015094J630870J667646K024863K919483M207063N001077M546826L644484
6099D5657406O56838j68773R48585K397137L648494L776642K751579K05449j598272
6090E8275085k053879j157926O2810J424499J924864J996005P59862k84728m51559
6081F0495033r26681l334047n554108n530893m948162m517640l875122l231113
6073B8577267k945491k270580j398241j228253o19639j67907P22541J837624L113984
$$ y = [26270978, 23775993, 21769434, 20004743, 18544056, 17538031, 16826031, 16453809, 16577538, 16593805, 16868059, 16543781, 15973214, 15184539, 14611546, 14143727, 13883653, 13505538, 13323197, 13160389, 13234968, 13490450, 13987557, 14731124, 15667466, 17064829, 18321109, 20015094, 21645964, 23313610, 25338473, 28257956, 32465019, 37466096, 42012922, 45657406, 46314244, 46145471, 47094056, 49491193, 53139687, 56916329, 59667908, 59873357, 58275085, 56221206, 55063280, 55126090, 56550589, 58475453, 60471458, 61231320, 60946592, 60495033, 59568352, 56234305, 50680197, 45149304, 40201142, 35683502, 31808380, 28577267, 25631776, 23361196, 21962955, 20734702, 20115063, 19947156, 20669697, 22507321, 25621305]
6064B5621305L793942L387931K078201o43985k273171k173093k212736j787478
6056B5790916j775149j437714j634739j243292j129159j036439r64097j089563
$$ y = [25621305, 29415247, 32803178, 34881379, 34237394, 31964223, 29791130, 27578394, 25790916, 24015767, 22578053, 20943314, 19700022, 18570863, 17534424, 16570327, 15480764]
$$ [...]
##END NTUPLES=NMR SPECTRUM
##END=
