##TITLE=C13cpd
##JCAMPDX= 6.0         $$ Bruker NMR JCAMP-DX V2.0
##DATA TYPE= NMR SPECTRUM
##DATA CLASS= NTUPLES
##ORIGIN= UXNMR, Bruker Analytische Messtechnik GmbH
##OWNER= root
$$ XWIN-NMR		Version 3.5
$$ Mon Jul 27 10:24:40 2026 Russian Standard Time (UT+4h)  servis@DPX200
##.OBSERVE FREQUENCY= 50.3277607988526
##.OBSERVE NUCLEUS= ^13C
##.ACQUISITION MODE= SIMULTANEOUS
##.ACQUISITION SCHEME= undefined
##.AVERAGES= 18529
##.DIGITISER RES= 17
##SPECTROMETER/DATA SYSTEM= spect
##.PULSE SEQUENCE= zgpg30
##.SOLVENT NAME= DMSO
##.SHIFT REFERENCE= (INTERNAL, DMSO, 0, 219.126)
##AUDIT TRAIL= $$ (NUMBER, WHEN, WHO, WHERE, WHAT)
$$ ##TITLE= Audit trail, XWIN-NMR		Version 3.5
$$ ##JCAMPDX= 5.01
$$ ##ORIGIN= Bruker BioSpin GmbH
$$ ##OWNER= servis
$$ F:\spectra/data/av/nmr/C13cpd/1/pdata/1/auditp.txt
$$ ##AUDIT TRAIL=  $$ (NUMBER, WHEN, WHO, WHERE, WHAT)
(   1,<2026-07-27 10:20:05.95 +0400>,<servis>,<DPX200>,
      <created by zg, POWCHK disabled, PULCHK disabled
       terminated by command 'halt'
       configuration hash MD5:
       00 E9 B6 7A A2 85 ED C7 34 08 36 98 17 FE 4E 26
       data hash MD5: 32K
       24 96 DA 40 D9 2D 27 3A CF DF C5 B7 2C 12 33 81>)
(   2,<2026-07-27 10:20:10.39 +0400>,<servis>,<DPX200>,
      <Start of raw data processing
       efp BC_mod = 2 LB = 2 FT_mod = 6 PKNL = 1 PHC0 = -406.7621 PHC1 = 31.66493 SI = 32K 
       data hash MD5: 32K
       D1 81 71 35 0F E4 D5 65 F0 A7 DA 0D DE 17 DE F2>)
(   3,<2026-07-27 10:20:20.15 +0400>,<servis>,<DPX200>,
      <abs ABSG = 5 
       data hash MD5: 32K
       B7 4C FB 27 18 0A 54 3B 18 D5 57 2C 95 1B 8E 4A>)
(   4,<2026-07-27 10:20:45.51 +0400>,<servis>,<DPX200>,
      <pk PHC0 = 26.8 PHC1 = 0 
       data hash MD5: 32K
       D4 43 69 10 41 C5 2A 37 9B FA 31 5B 5D 13 01 C7>)
(   5,<2026-07-27 10:23:12.25 +0400>,<servis>,<DPX200>,
      <pk PHC0 = -179.3998 PHC1 = 0 
       data hash MD5: 32K
       E3 44 75 D5 CB 57 46 22 5F DE 81 ED 54 48 A9 1C>)
(   6,<2026-07-27 10:23:19.71 +0400>,<servis>,<DPX200>,
      <abs ABSG = 5 
       data hash MD5: 32K
       11 37 C0 78 EA 56 02 87 BD 74 19 E1 BA 73 08 9F>)
$$ ##END=
$$ 
$$ hash MD5
$$ 48 D0 FF AD 2D 57 CA 15 6D 5C 6C 6C 27 AD 48 3E
##$RELAX= 
##$RELAX= 
##$RELAX= 
##$RELAX= 
##$RELAX= 
##$RELAX= 
##$RELAX= 
##$RELAX= 
$$ Bruker specific parameters
$$ --------------------------
##$DU= <F:\spectra>
##$EXPNO= 1
##$NAME= <C13cpd>
##$PROCNO= 1
##$TYPE= <nmr>
##$USER= <av>
##$AMP= (0..31)
100 100 100 100 100 100 100 100 100 100 100 100 100 100 100 100 100 100 
100 100 100 100 100 100 100 100 100 100 100 100 100 100 
##$AQSEQ= 0
##$AQ_mod= 1
##$AUNM= <au_zg>
##$AUTOPOS= <>
##$BF1= 50.322729
##$BF2= 200.13
##$BF3= 50.322729
##$BF4= 50.322729
##$BF5= 500.13
##$BF6= 500.13
##$BF7= 500.13
##$BF8= 500.13
##$BYTORDA= 1
##$CFDGTYP= 0
##$CFRGTYP= 5
##$CHEMSTR= <none>
##$CNST= (0..31)
1 1 145 1 1 1 1 1 1 1 1 1 1 1 1 1 1 1 1 1 1 1 1 1 1 1 1 1 1 1 1 1 
##$CPDPRG= <waltz16>
##$CPDPRG1= <>
##$CPDPRG2= <waltz16>
##$CPDPRG3= <>
##$CPDPRG4= <mlev>
$$ [...]
##$SUBNAM3= <"">
##$SUBNAM4= <"">
##$SUBNAM5= <"">
##$SUBNAM6= <"">
##$SUBNAM7= <"">
##$SUBNAM8= <"">
##$SUBNAM9= <"">
##$SW= 238.246396889851
##$SWIBOX= (0..15)
0 1 3 0 0 0 0 0 0 0 0 0 0 0 0 0 
##$SW_h= 11990.4076738609
##$TD= 32768
##$TD0= 1
##$TE= 0
##$TE2= 300
##$TE3= 300
##$TEG= 300
##$TL= (0..7)
0 120 120 120 120 120 120 120 
##$TP= (0..7)
150 150 150 150 150 150 150 150 
##$TP07= 0
##$TPNAME0= <>
##$TPNAME1= <>
##$TPNAME2= <>
##$TPNAME3= <>
##$TPNAME4= <>
##$TPNAME5= <>
##$TPNAME6= <>
##$TPNAME7= <>
##$TPOAL= (0..7)
0.5 0.5 0.5 0.5 0.5 0.5 0.5 0.5 
##$TPOFFS= (0..7)
0 0 0 0 0 0 0 0 
##$TUNHIN= 0
##$TUNHOUT= 0
##$TUNXOUT= 0
##$USERA1= <user>
##$USERA2= <user>
##$USERA3= <user>
##$USERA4= <user>
##$USERA5= <user>
##$V9= 5
##$VALIST= <valist>
##$VCLIST= <CCCCCCCCCCCCCCC>
##$VD= 0
##$VDLIST= <DDDDDDDDDDDDDDD>
##$VPLIST= <PPPPPPPPPPPPPPP>
##$VTLIST= <TTTTTTTTTTTTTTT>
##$WBST= 1024
##$WBSW= 20
##$XGAIN= (0..3)
0 0 0 0 
##$XL= 0
##$YL= 0
##$YMAX_a= 5478743
##$YMIN_a= -17370936
##$ZGOPTNS= <>
##$ZL1= 120
##$ZL2= 120
##$ZL3= 120
##$ZL4= 120
##$ABSF1= 219.1257
##$ABSF2= -19.14452
##$ABSG= 5
##$ABSL= 3
##$ALPHA= 0
##$AQORDER= 0
##$ASSFAC= 0
##$ASSFACI= 0
##$ASSFACX= 0
##$ASSWID= 0
##$AUNMP= <proc_1d>
##$AZFE= 0.1
##$AZFW= 0.5
##$BCFW= 0
##$BC_mod= 2
##$BYTORDP= 0
##$COROFFS= 0
##$CY= 12.5
##$DATMOD= 1
##$DC= 0
##$DFILT= <>
##$DTYPP= 0
##$F1P= 99.9999945759776
##$F2P= -179.999992907048
##$FCOR= 0.5
##$FTSIZE= 32768
##$FT_mod= 6
##$GAMMA= 0
##$GB= 0
##$INTBC= 1
##$INTSCL= 0
##$ISEN= 30
##$LB= 2
##$LEV0= 0
##$LPBIN= 0
##$MAXI= 10000
##$MC2= 0
##$MEAN= 0
##$ME_mod= 0
##$MI= 0
##$NCOEF= 0
##$NC_proc= -3
##$NLEV= 6
##$NOISF1= 0
##$NOISF2= 0
##$NSP= 0
##$NTH_PI= 0
##$NZP= 0
##$OFFSET= 219.1257
##$PC= 1.4
##$PHC0= -559.3619
##$PHC1= 31.66493
##$PH_mod= 1
##$PKNL= yes
##$PPARMOD= 0
##$PSCAL= 4
##$PSIGN= 0
##$REVERSE= no
##$SF= 50.322729
##$SI= 32768
##$SIGF1= 0
##$SIGF2= 0
##$SINO= 80
##$SIOLD= 32768
##$SREGLST= <13C.CDCl3>
##$SSB= 0
##$STSI= 32768
##$STSR= 0
##$SW_p= 11990.4076738609
##$SYMM= 0
##$S_DEV= 0
##$TDeff= 32768
##$TDoff= 0
##$TI= <>
##$TILT= no
##$TM1= 0
##$TM2= 0
##$TOPLEV= 0
##$USERP1= <user>
##$USERP2= <user>
##$USERP3= <user>
##$USERP4= <user>
##$USERP5= <user>
##$WDW= 1
##$XDIM= 32768
##$YMAX_p= 423685887
##$YMIN_p= -950556
$$ End of Bruker specific parameters
$$ ---------------------------------
##NTUPLES= NMR SPECTRUM
##VAR_NAME=  FREQUENCY,     SPECTRUM/REAL,   SPECTRUM/IMAG
##SYMBOL=    X,             R,               I
##VAR_TYPE=  INDEPENDENT,   DEPENDENT,       DEPENDENT
##VAR_FORM=  AFFN,          ASDF,            ASDF
##VAR_DIM=   32768,         32768,           32768
##UNITS=     HZ,            ARBITRARY UNITS, ARBITRARY UNITS
##FACTOR=    0.365929370215793, 1,           1
##FIRST=     11027.0033138647, 0,            0
##LAST=      -963.404359996184, 0,           0
##MIN=       -963.404359996184, -950556,     0
##MAX=       11027.0033138647, 423685887,    0
$$ Real data points
##PAGE= N=1
##DATA TABLE= (X++(R..R)), XYDATA
$$ [...]
12422h9873M6032K0586j5867l0288l1780k5046k6071l9493k3360J1981J8740K801
12410a81638J105R571L0882N1097L7305j3111n2431m3129q29K3614J2550n984
12398a30998J132J7772J2926L214K683r681k2543J2204P6877J21206J47133J31712
12386C63637N9411k2487o5993o7068o6548o0559l6342j7034q314L607J0674j9170
12374G3814o1586q8106q0647k8928L8185R5462J20262J00853O2496L663o3856
12363A71612j00359r0445l2231M0208P3864L8103j1261j1984J6820N6206Q4272
12352B34805Q0197M5844J1641q307k8895l8990k6800k0408k7135j3078J8399K4632
12340B51905J2045J0953L4139O8591P0545M8002K4296l353j2568P674J9289j531
$$ plain form
12422 -89873 -43841 -23255 -39122 -69410 -101190 -126236 -152307 -191800 -215160 -203179 -184439 -181638
12410 -181638 -180533 -170962 -140080 -88983 -51678 -64789 -117220 -160349 -161178 -137564 -125014 -130998
12398 -130998 -129866 -112094 -99168 -95954 -93271 -102952 -125495 -113291 -36414 84792 231925 363637
12386 363637 423048 400561 334568 267500 200952 140393 104051 87017 78703 82310 92984 73814
12374 73814 12228 -75878 -156525 -185453 -147268 -51806 68456 169309 231805 235468 171612
12363 171612 71253 -19192 -51423 -11215 62649 100752 89491 77507 94327 150533 234805
12352 234805 315002 360846 372487 364180 335285 296295 269495 249087 221952 208874 227273 251905
12340 251905 263950 274903 309042 377633 448178 496180 520476 517123 504555 512229 531518 529987
12328E29987k4467l6006n9771o7263m4535l9252o3714q1353o1889l1016k1402
12317f81k0394j8844m4109p8561n0833L2442R1526P1525K3614o803k9909m7003
12305g8030l2468K1291P1297P2332M0601K4191L5446M7998L2206p680m9280p8104
12293I9800q0260n2964j8890J2688L0012P759k7371m7178n7569n3274m2848o1083
12281b91178q2513k5728P9372J32392J13765N9100J2620J650K1402M4156M3619
12270A08657M3013O3190Q1122Q6870N9848k898o8096j02700r3889n2917k4284
12259I7916k1951j9365J1864N0070O5729R4871J45097J76033J85478K07283K47929
12248A240954K90981L33367L77342M46122N85542Q09700J149786J598690K042424
$$ plain form
12328 529987 505520 469514 409743 342480 297945 258693 194979 113626 51737 20721 -681
12317 -681 -21075 -39919 -84028 -162589 -213422 -180980 -89454 -17929 5685 -1118 -31027 -78030
12305 -78030 -110498 -89207 -17910 54422 95023 119214 154660 202658 234864 227184 177904 99800
12293 99800 19540 -33424 -52314 -39626 -9614 -1855 -29226 -76404 -133973 -187247 -230095 -291178
12281 -291178 -373691 -399419 -320047 -187655 -73890 -14790 -2170 -520 20882 65038 108657
12270 108657 151670 214860 295982 382852 442700 439802 371706 269006 175117 122200 97916
12259 97916 75965 56600 68464 118534 184263 279134 424231 600264 785742 993025 1240954
12248 1240954 1531935 1865302 2242644 2688766 3274308 4084008 5233794 6832484 8874908
12239H874908K162705J386618l03996j766737k169544j851255j392089j036957
12231C903653p88773n94937m43891l52571k93679k37348j80687j45112j35124
12222G31531j23086j11663j22379j35250j09477m1225J6388M4727N8153L0485
12212B38204k3829o3421q6443p8892m8862l5466j8816J1101K5106L6412O1174
12201A6268O0592K3069M80N680L332q843j7709m0449o4234m3154K0950P9401R6139
12188A31522O6361n479p8577j12406j05686o2496k3985l217L0205O1396N7362
12177d5000J7657o563Q184M0879M3940Q589O01K6857N0412O0410P3003P7926M0691
12164C97586j8787n3650m7672m4213n8895n3375l0303M302L5194N6494N9320K7242
$$ plain form
12239 8874908 11037613 12424231 12120235 10353498 8183954 6332699 4940610 3903653
12231 3903653 3114880 2519943 2076052 1723481 1429802 1192454 1011767 866655 731531
12222 731531 608445 496782 374403 239153 129676 88451 104839 149566 207719 238204
12212 238204 214375 150954 64511 -14381 -63243 -98709 -117525 -106424 -81318 -44906 16268
12201 16268 76860 99929 100409 106089 109421 100578 82869 42420 -21814 -64968 -44018 35383 131522
12188 131522 197883 192404 113827 1421 -104265 -166761 -190746 -193963 -163758 -102362 -45000
12177 -45000 -27343 -33906 -25722 15157 59097 67686 68287 95144 145556 205966 278969 356895 397586
12164 397586 378799 325149 277477 233264 174369 120994 90691 94993 130187 186681 246001 273243
12152B73243j7554l9217n1076m8234p184K0223o289m9167o6071m9099j2096j470
12140e3991j3473k6338l9279k9562J663M4771P0299M8646J1955n571j9192m9354
12128e9426o3382k1963K6516L1416O898j2106l061M207k3333l7423J082O2102
12116h8473J13708J25877Q5325R843m8685o4751m4524j6005j504l160j5979k5989
12104B5683k4835j1431M149j3109k9618J248N0716P5762O3100K1689j3327k1212
12092A28815k717K2264J4334l3268o9010o7381n0140m6111l2020J6339N7243O6178
12080D526N3603M0719K7670L7032M3542K2650j1088m7046n6907l3636m552Q239
12068H4752J277q559P102L4447N0983N2377M8053K1509k7012m6401m9831o5720
$$ plain form
12152 273243 255689 216472 165396 117162 109978 130201 123912 74745 8674 -40425 -52521 -53991
12140 -53991 -67464 -93802 -133081 -162643 -160980 -116209 -45910 2736 14691 9120 -10072 -59426
12128 -59426 -122808 -144771 -118255 -86839 -79941 -92047 -95108 -90901 -114234 -151657 -150575 -88473
12116 -88473 25235 151112 236437 246280 197595 132844 88320 72315 70811 67651 51672 25683
12104 25683 848 -10583 -6434 -19543 -49161 -47913 2803 78565 141665 163354 150027 128815
12092 128815 126098 148362 162696 129428 60418 -6963 -57103 -103214 -135234 -118895 -61652 4526
12080 4526 58129 98848 126518 163550 207092 229742 218654 171608 114701 81065 76513 84752
12068 84752 86029 77470 84572 119019 170002 222379 270432 291941 264929 218528 168697 102977
12056A02977n6736j1695K6981K8597j880k7277m3963n8580o3698o2227m8554l5384
12044b51439k6111l579L2041L2086K1060M2130K9958P104N7332J20274R7011K5054
12032A82921l642R206L286k3426o7491j14051j30897j10624n8970K6154J01183
12021a86351J16835J08784J07011P6356J7390l0091m4210l5956k1M2733M8133
12010B20613J8536j9221n3905r3895j22897j11735n9518K512N0422O1397M5167
11999f2524J5905K862J5764M9266N1808j4161j12292j70039j44967o7965R164
11988d27179N7105N8131J6416l354L7876Q5284R5920O7760J0184m0015o6676q1878
11976a90426o1130k32N2007N6939J0957m0493l7402L1717J09742J38387R9351
$$ plain form
12056 102977 46241 34546 61527 90124 88244 60967 17004 -41576 -105274 -167501 -216055 -251439
12044 -251439 -277550 -281129 -249088 -217002 -195942 -153812 -123854 -116750 -59418 60856 157867 182921
12032 182921 179279 188485 191771 168345 100854 -13197 -144094 -254718 -313688 -287534 -186351
12021 -186351 -69516 39268 146279 222635 240025 209934 165724 129768 129747 172480 220613
12010 220613 239149 219928 166023 72128 -50769 -162504 -222022 -219510 -169088 -107691 -62524
11999 -62524 -46619 -43757 -27993 21273 73081 58920 -53372 -223411 -368378 -436343 -427179
11988 -427179 -370074 -311943 -295527 -298881 -261005 -175721 -79801 -12041 -1857 -41872 -108548 -190426
11976 -190426 -251556 -251788 -199781 -142842 -131885 -172378 -209780 -178063 -68321 70066 169417
11965A69417L4857q973m4946p5990q3613p3200m8745j1125J9242K9043K9277K6303
11953c8453J7364r098k9615k6337l5648o2580o2393k3628J7346J1302k3759m6428
11941c11927n0247m1707j1822L9438O9788O4809J1806q1205j25666q9852j9431
11930e46016M5156Q0032P3247O0181P3218O9614L9826L8964N6147N8243L8065
11919H6677K0424N435l3131p2840o4203l0468k5491l6864l3787k8698j5854J7343
11907b11457M8050L2618j8003n3082n8273k8484P986K0341L2539O1303O9491O1586
11895c5385N1545J7992q243J1272O9481J27168J11512L4389l3848r3039j55440
11884I7404j93286j90686j66129j21603o1913j6971K700J1777J0835J7493K6708
$$ plain form
11965 169417 204274 195301 150355 74365 -9248 -82448 -131193 -142318 -123076 -94033 -64756 -38453
11953 -38453 -21089 -30187 -59802 -86139 -121787 -184367 -246760 -270388 -253042 -241740 -265499 -311927
11941 -311927 -362174 -403881 -415703 -376265 -306477 -241668 -229862 -311067 -436733 -526585 -546016
11930 -546016 -500860 -420828 -347581 -287400 -214182 -144568 -104742 -65778 -9631 48612 86677
11919 86677 107101 112536 79405 6565 -57638 -88106 -113597 -150461 -184248 -212946 -228800 -211457
11907 -211457 -163407 -130789 -148792 -201874 -260147 -288631 -280645 -260304 -227765 -166462 -96971 -35385
11895 -35385 16160 34152 25909 37181 106662 233830 345342 379731 345883 252844 97404
11884 97404 -95882 -286568 -452697 -574300 -636213 -653184 -650484 -638707 -627872 -610379 -583671
11873e83671J5214J0013L0169N5884R0219Q8607L2769j741O539J1268J3290K8892
11861b02548K7417P926j9541l1761k4718j2131j1760Q497O7497J18339J13755
11850D0972O5416J9992n356j1644N482L4565L4129J787k6606l4578k8271j1821
11838H4067r786k8498l8914q294K1017j9217o9410o7332l0531K7629Q9504J31399
11826H1634J19079M8071m0367q8587p8383n9910p1904r8909r4750o2455l3778
11815c80259L985M6716P9014J09836J34763J12497L4668m0122o3196n8469o2380
11804h2947m8174J5020O5606M1295j9163n7843p3154p9580p0985m1802p640J4443
11792c44924J8076J0187K3598N0827P8097R9259Q0768K2027l7593n5552l1989
$$ plain form
11873 -583671 -568457 -558444 -528275 -472391 -382172 -293565 -260796 -262537 -255998 -244730 -231440 -202548
11861 -202548 -175131 -167205 -186746 -218507 -243225 -255356 -267116 -258619 -191122 -72783 40972
11850 40972 106388 126380 121024 109380 114862 149427 183556 185343 158737 124159 95888 84067
11838 84067 74281 45783 6869 -1425 19592 375 -69035 -136367 -166898 -139269 -49765 81634
11826 81634 200713 248784 208417 119830 41447 -18463 -90367 -189276 -284026 -346481 -380259
11815 -380259 -376274 -329558 -250544 -140708 -5945 106552 141220 101098 37902 -20567 -82947
11804 -82947 -131121 -116101 -50495 -9200 -28363 -86206 -159360 -238940 -309925 -351727 -359367 -344924
11792 -344924 -326848 -316661 -293063 -242236 -164139 -64880 15888 37915 322 -55230 -87219
11781h7219l0829o1104q0156n5783Q32L2090K5722N046k888K006J3395L1652M5239
11768a61997N7970N8601L9915J2031j6885j9719Q48J5365N31k8669k1422J5384
11756d8047L1631N352j0944L216J6503J6519n611l0425n6826q2335o3775j1024
11744b35766K5883K5906O158j679j191N651J1787r392l2292j4813M3770P6558
11732i9420O7236M2279J4621m370k2730m1655j1053M6570N7423O681n5184n3307
11720e2909P013N3356M7674K1077R547R138N581Q235J4069k9655r2249j09987
11708a09110j01784o7120j2924K7381N2919N2570L6253M5310P1840J06857J40369
11697B42561J23611M4755m4784r8785r4266m9978k8937k8842n2114p5463n0084
$$ plain form
11781 -87219 -118048 -179152 -259308 -315091 -314259 -282169 -256447 -251401 -254289 -252283 -238888 -207236 -161997
11768 -161997 -104027 -45426 -5511 6520 -10365 -30084 -29236 -13871 -13340 -42009 -63431 -48047
11756 -48047 -16416 -11064 -22008 -18792 -2289 14230 8619 -21806 -78632 -160967 -224742 -235766
11744 -235766 -209883 -183977 -177819 -179498 -180689 -175038 -163251 -172643 -204935 -219748 -175978 -99420
11732 -99420 -32184 10095 24716 20346 -2384 -44039 -55092 -8522 48901 55582 398 -52909
11720 -52909 -45896 7460 55134 76211 85758 94896 100477 108712 122781 93126 877 -109110
11708 -109110 -210894 -278014 -290938 -263557 -210638 -158068 -121815 -76505 -4665 102192 242561
11697 242561 366172 410927 366143 267358 173092 123114 94177 65335 13221 -62242 -112326
11686a12326k7815m4628n1826q889N5037J00690J09930P2150J5585r982K75k671
11674I5530k7215l3598j6738K0342L1351j1704l3493M36M7197M9897J7458K878
11662A42341j1048n9093j07546j19492q1696k4227M520O054K0807M1947L6077
11651a51356J8992M470p004K176J9685P750j7038j0725K6729L9996L7986O4164
11639C5825R6273M2427j22748k19976j55979q0463n0993k7463j1047J6023P3457
11628d04664J16264J06045N3288j9982n6973l2025Q237P498k3740k7520m66K5779
11616b48259L3835R03m1234m1514j1114J1573O634j057Q953L0259M5804J6030
11604a89187m8644r2131q9308m5026K5023Q8863R6702N5533J8046o170j7862j1413
$$ plain form
11686 -112326 -140141 -184769 -236595 -245484 -190447 -89757 20173 92323 107908 97926 98201 95530
11674 95530 68315 34717 17979 38321 69672 57968 24475 24911 72108 122005 139463 142341
11662 142341 131293 72200 -35346 -154838 -236534 -260761 -256241 -250187 -229380 -187433 -151356
11651 -151356 -132364 -127894 -134898 -132722 -113037 -105287 -122325 -133050 -106321 -66325 -28339 35825
11639 35825 132098 174525 51777 -168199 -324178 -404641 -455634 -483097 -494144 -478121 -404664
11628 -404664 -288400 -182355 -129067 -149049 -206022 -238047 -229810 -222312 -246052 -273572 -274038 -248259
11616 -248259 -214424 -213521 -254755 -296269 -307383 -295810 -289176 -290233 -281280 -251021 -205217 -189187
11604 -189187 -237831 -329962 -419270 -464296 -439273 -350410 -253708 -198175 -180129 -186299 -204161 -215574
11592b15574k5352n1039j7939L9238O2654P1982P5542O9113N6153L8648K3727
11581A27153R101k9564p8253j07467j16800j09205p3636k2561J4959M5505R1430
11570b49338J17450Q5845K6031K863J3931K228k9555m8660l5712j1043L005k0403
11558a43358n7786o4488o0751o3348o4589m6299j1685L1949N9844M6658J2315
11547c61538l6647r3789j17502q5194j1082N5853P6040P3368Q7586J25585J34359
11536a52961P1482k1054p7157r2787p6331l6965J3618O3362R4016Q7786L8640
11525h8351l6931p5617m9013k2183j2107J712L4339O0002N7186L4101P025q38
11513i0675q554l1439l3655q892L432m386j7841k5571j2087J0504L1610L5114
$$ plain form
11592 -215574 -240926 -291965 -309904 -270666 -208012 -136030 -60488 8625 64778 103426 127153
11581 127153 136254 106690 28437 -79030 -195830 -305035 -378671 -401232 -386273 -340768 -249338
11570 -249338 -131888 -46043 -20012 -17149 -3218 -990 -30545 -79205 -114917 -125960 -122955 -143358
11558 -143358 -201144 -265632 -326383 -389731 -454320 -500619 -512304 -480355 -420511 -373853 -361538
11547 -361538 -398185 -491974 -609476 -694670 -705752 -649899 -573859 -500491 -412905 -287320 -152961
11536 -152961 -81479 -102533 -179690 -272477 -348808 -385773 -372155 -308793 -214777 -126991 -88351
11525 -88351 -125282 -200899 -249912 -272095 -284202 -282490 -248151 -188149 -130963 -96862 -89837 -90675
11513 -90675 -99229 -130668 -164323 -173215 -169783 -174169 -192010 -217581 -229668 -219164 -187554 -152440
11501a52440M1729O8361P5972O8628P0718O1945M4236K7651K083l0084n7933p1292
11489A49574p0632q8319q9827n4969l629L8446N6928N8014K9129j7275n2737m3066
11477h8363l9K1631J9070K5628M6234M9043J9947q224k1300m0707p5767p7172
11465a30019l3299J0828K2423M983k602J0508J1929N371J6995J5617m04J3469
11453e4201L4679m224o0910m8778j3590k0109m5419n0472m5082m0405l1421J546
11441c78386M0308L9593J5449r111l7581o0557p6752p9123n4428k0013K5408P5398
11429e19795R7707R9382Q9523N3612K374l9656k8145M7720J15899J14872P7287
11418A10780O3167P0414N3467N241k2263k5650m8016q9136j16630j23452j09102
$$ plain form
11501 -152440 -110711 -42350 33622 102250 172968 234913 279149 306800 308883 278799 220866 149574
11489 149574 78942 -9377 -99204 -154173 -157802 -119356 -62428 -4414 24715 7440 -45297 -88363
11477 -88363 -88402 -66771 -47701 -22073 24161 73204 93151 84927 63627 22920 -52847 -130019
11465 -130019 -163318 -152490 -130067 -125084 -127686 -117178 -105249 -99878 -82883 -67266 -67670 -54201
11453 -54201 -19522 -23746 -84656 -133434 -147024 -167133 -212552 -263024 -308106 -348511 -379932 -378386
11441 -378386 -338078 -298485 -283036 -292147 -329728 -390285 -467037 -546160 -600588 -620601 -595193 -519795
11429 -519795 -422088 -322706 -233183 -179571 -177197 -216853 -244998 -197278 -81379 33493 110780
11418 110780 173947 244361 297828 303069 280806 255156 207140 118004 1374 -122078 -231180
11407b31180q4265o5506l7309p268n196k659K5729M2439J6929j5684j6958L196
11395c77732K5545L2934N466l1459n4326o3371l0941L0423Q3595R2427N0189m748
11383b41998k2538J516J7282p766m1757l6001K172K2212J2219j2909l5161l5813
11371c78542n285M5440Q0868O0639K971n3166p7500o2449n2391q5086j32526j23146
11359g80173m9048L7583N9487O570k8258l150L2315M5559L0299Q396J2861L7324
11347e90235O4529Q3516Q2508O7624M4910N1802Q9310R5829Q5375O6642J8689
11336A60499l2139n1109m1437j3477J0698l036l2798m6698l9949j6638J4381M0270
11324e1433L7458k438m2995m6913l5411l1607j8844l04J728J4016L8568K4237
$$ plain form
11407 -231180 -315445 -380951 -418260 -425528 -430724 -433383 -407654 -365215 -348286 -363970 -380928 -377732
11395 -377732 -352187 -319253 -313787 -345246 -399572 -462943 -493884 -463461 -379866 -287439 -237250 -241998
11383 -241998 -264536 -263020 -245738 -253504 -295261 -331262 -329090 -306878 -294659 -307568 -342729 -378542
11371 -378542 -383827 -338387 -257519 -196880 -193909 -247075 -324575 -387024 -439415 -524501 -657027 -780173
11359 -780173 -829221 -791638 -732151 -725581 -753839 -756989 -724674 -679115 -648816 -640420 -627559 -590235
11347 -590235 -525706 -442190 -359682 -292058 -247148 -195346 -106036 -10207 75168 141810 160499
11336 160499 128360 77251 35814 22337 33035 29999 -2799 -49497 -89446 -106084 -91703 -51433
11324 -51433 -13975 -16413 -59408 -106321 -141732 -173339 -192183 -192487 -190759 -176743 -138175 -113938
11312a13938j0481l5552n0755o4146p1581p8530o8719j5211K0503N346j7008j3009
11300e13081K0157N5612M0826j626j972L4436N8085N4241K2579j7921k9622N295
11288b72991M7275M9119M7378O3393N9328J4314m8415o8911m2988k2371j4629
11277a89498k1272n0379o4125k5031L6830P6474P7184M9436Q921k3376m4111o7386
11265b36333q6937r0996p3105k8471L7730J01442J25188Q7200K5284m009J1598
11254a31409M6086P0099Q2402O2749M2047M0706j0452j07037j29035n4395J8041
11243g0198K6265K0105K3451K8175J9941k081r750o551j4255p267K0485K9877
11231E8197K5424L9385N6922L3516j4814l9461m0706m7059m3156l2469m8046p6655
$$ plain form
11312 -113938 -124419 -159971 -210726 -274872 -346453 -424983 -493702 -508913 -488410 -483064 -500072 -513081
11300 -513081 -492924 -437312 -396486 -398112 -400084 -365648 -307563 -253322 -230743 -248664 -278286 -272991
11288 -272991 -225716 -176597 -129219 -65826 -6498 7816 -40599 -109510 -152498 -174869 -189498
11277 -189498 -210770 -261149 -325274 -350305 -313475 -237001 -159817 -110381 -101460 -124836 -168947 -236333
11265 -236333 -323270 -414266 -487371 -515842 -478112 -376670 -251482 -164282 -138998 -143007 -131409
11254 -131409 -85323 -15224 67178 129927 171974 212680 202228 95191 -33844 -88239 -70198
11243 -70198 -43933 -23828 -377 27798 47739 45658 35908 29357 15102 7835 28320 58197
11231 58197 83621 123006 179928 213444 198630 159169 118463 71404 28248 -4221 -52267 -128922
11219a28922o7261k8917J34R546l551k4817k1519J9260N9172P5366O9300M9285
11207G076M2794M6745L6418j457m7658q8690j25403j24274q9219o9480k9603O4937
11195c77814J34222J10221O1934M2873J6245m565J5159M4250M9950K3596p207
11184A08864p337K2535N7403N6780K685n5840n3939j1094J4846o246m9633o7672
11172A1352n0506j4522J3293L0056L9871K6543L676q645r107j733J2805M782k3633
11159C4232l6518k5022j678K5369N0926N4428J3301l8658m5883k9571p338K3857
11147A7445J4194m4146q7321o5424o61L3134P867j3573n605O91j539n9J1431J6137
11133a17429J7868K0490J2245J4011L4656M4240N758n7562q6944o9568q008M6855
$$ plain form
11219 -128922 -196183 -225100 -224966 -215420 -218971 -243788 -265307 -246047 -186875 -111509 -42209 7076
11207 7076 49870 96615 133033 131576 83918 -4772 -130175 -254449 -343668 -413148 -442751 -377814
11195 -377814 -243592 -133371 -71437 -28564 -12319 -16884 -1725 42525 92475 116071 108864
11184 108864 101527 124062 181465 238245 240930 185090 131151 120057 134903 128657 79024 11352
11172 11352 -39154 -53676 -40383 -10327 29544 56087 59763 51118 42011 40278 53083 57865 34232
11159 34232 -2286 -27308 -28986 -3617 47309 101737 115038 76380 30497 926 -6412 17445
11147 17445 31639 -12507 -99828 -165252 -165913 -132779 -124912 -138485 -144090 -143399 -144938 -144997 -133566 -117429
11133 -117429 -99561 -79071 -66826 -52815 -18159 26081 31839 -25723 -112667 -182235 -190243 -143388
11121a43388L9337n476l5169l4448M15M3863L2019k8978o0918l6025j819L376
11109b27211J2811L3955K6670Q171K0010N0507O6533O2373L0025k7211p7409j17570
11097a38346j39608j19972o8937l1909j3070Q063K5646J9387q964k9409j9308
11086e16427M485K6329M0499L3354L2099K4632j9753n2276k8839L0676O2320L5236
11074c27665r604k2188k1704j2701J4531L4820K8200K1229K4918K4281K3303K1482
11062b01098J4449L7007O4290M1875j828l7428n7757o6171n3905k4812o105j3673
11050c05156k2485j0948P399M776j6180k7653j4325R795M1217O8641O0892L4541
11038a69486N1913Q2197N8286K0564J4538J6412J4319O115p76j6028m6128n1528
$$ plain form
11121 -143388 -104051 -109527 -144696 -179144 -178729 -134866 -102847 -131825 -192743 -228768 -230587 -227211
11109 -227211 -214400 -180445 -153775 -145604 -125594 -75087 -8554 53819 83844 56633 -20776 -138346
11097 -138346 -277954 -397926 -466863 -498772 -511842 -503779 -478133 -458746 -467710 -497119 -516427
11086 -516427 -511942 -485613 -445114 -411760 -379661 -355029 -374782 -427058 -455897 -425221 -362901 -327665
11074 -327665 -337269 -359457 -381161 -393862 -379331 -344511 -316311 -295082 -270164 -245883 -222580 -201098
11062 -201098 -186649 -149642 -85352 -43477 -45305 -82733 -140490 -206661 -260566 -285378 -291483 -305156
11050 -305156 -327641 -338589 -331190 -326414 -342594 -370247 -384572 -374777 -333560 -264919 -204027 -169486
11038 -169486 -117573 -35376 22910 43474 58012 74424 88743 94858 94082 78054 31926 -19602
11026a9602l1165j0560M305J2747q684p2416j33236j24186m3932K5442L9672M0080
11014c21535N5232O1377L3466j3855n7255p2983m3497J7942O3771M8966r906m5709
11002b83986j9682J2199k2163p3628o8082l4555j4876L231J4484J3351K0180L7774
10990d15753L5627P718m4859q9020p8601k8132K1536N1069O9534Q9682R3232P9044
10978b08923L8555r445j3155K1779N5730O6955M6653O482k5670m2126m3380l3392
10966a39937k2422j7700q963M770J0458K0711M3418N7206N0846K0213j5691j6171
10954a3262L3080R4469J10602R1720P9541N8455R591m7311q2583r2510r7111r2857
10942E1824o4251o94O3504P4162K3973l7627p1428o9240m3744m1052n0474l2206
$$ plain form
11026 -19602 -50767 -61327 -57022 -44275 -52959 -125375 -258611 -382797 -426729 -401287 -361615 -321535
11014 -321535 -266303 -204926 -171460 -185315 -242570 -315553 -359050 -341108 -277337 -228371 -238277 -283986
11002 -283986 -303668 -291469 -313632 -387260 -455342 -489897 -504773 -501542 -487058 -473707 -453527 -415753
10990 -415753 -380126 -372408 -417267 -506287 -584888 -613020 -591484 -540415 -470881 -381199 -287967 -208923
10978 -208923 -170368 -179813 -192968 -171189 -115459 -48504 -1851 4631 -21039 -63165 -106545 -139937
10966 -139937 -162359 -180059 -189022 -184252 -173794 -153083 -109665 -52459 -1613 18600 2909 -13262
10954 -13262 19818 114287 224889 316609 396150 454605 464196 416885 334302 241792 144681 51824
10942 51824 -12427 -13121 50383 124545 148518 110891 39463 -29777 -73521 -114573 -165047 -197253
10930a97253p299q176j7555n493J7940L0251K5854J3766k93j8761l5095l7145
10918b39259q69O3817P0433k486o0597l9853J4536N6744P1815O0751L9031J2205
10906D6268j276j3393l3101n7542p6834o4506m8581m3692l1987k4371k5610j2761
10894c87386J2868R273j5350l6711m5356j8900K3994M8028M6031K8691J7984J5003
10882c01831J8925M1907O1582M0195N669j1665l1811m4267l6959j5571O202J0422
10870b57202K0231K5560q46j4690N629L0377M9502O9839P2430M5918J2904j328
10858E8324K0135K5506k6568p2206n8113K064N7904N4787J5208k4860o8238j01613
10846a17670q7720k7640O2927J48072J60456R4357J1671m5858o1238n4094o1543
$$ plain form
10930 -197253 -204552 -212728 -230283 -235776 -217836 -187585 -161731 -147965 -148258 -167019 -202114 -239259
10918 -239259 -240128 -176311 -105878 -108364 -168961 -208814 -194278 -137534 -65719 -4968 34063 46268
10906 46268 44992 31599 -1502 -59044 -135878 -200384 -248965 -292657 -324644 -349015 -374625 -387386
10894 -387386 -374518 -365245 -380595 -417306 -462662 -481562 -457568 -409540 -363509 -334818 -316834 -301831
10882 -301831 -282906 -240999 -179417 -139222 -133553 -145218 -177029 -221296 -258255 -273826 -267624 -257202
10870 -257202 -236971 -211411 -212257 -226947 -221318 -190941 -141439 -71600 830 46748 59652 58324
10858 58324 78459 103965 77397 5191 -52922 -50858 7046 61833 77041 52181 -16057 -117670
10846 -117670 -205390 -233030 -170103 -22031 138425 232782 244453 198595 137357 83263 21720
10835B1720q6290j05969j12113j05845r0210n1122J1578Q7839J33408J06577M6022
10824a44405J3901R931O988p265k3788k0224k3055k8243j1359Q235K4605L8226
10812a56453N8430R8895J20230R6219M7506M479l5869r2317j34816j28021q5863
10801b07580k6976N3755J20057J29619R1897M8007J4824k9674j04338j76958j86814
10790b74181j22500l5665J7772J8289J1574K6334L2921J0362k6790o0339q5360
10779d87583q1447l0270L9549R4415J01180N9394M2510Q3367J36101J39133R3747
10768A90096N4341L0643L222k0375k5974j0935J2392L1017K4485m35m0715p8842
10756A68920p8385n5879m9018l2371P504J7930J3516K0011P74l8320n6343m9239
$$ plain form
10835 21720 -64570 -170539 -282652 -388497 -478707 -529829 -518251 -430412 -297004 -190427 -144405
10824 -144405 -130504 -120573 -113585 -120850 -144638 -164862 -187917 -216160 -227519 -219284 -194679 -156453
10812 -156453 -98023 872 121102 217321 264827 269306 233437 141120 6304 -121717 -207580
10801 -207580 -234556 -180801 -60744 68875 160772 208779 223603 193929 89591 -87367 -274181
10790 -274181 -396681 -432346 -414574 -396285 -384711 -358377 -325456 -315094 -341884 -402223 -487583
10779 -487583 -569030 -599300 -559751 -465336 -364156 -304762 -262252 -178885 -42784 96349 190096
10768 190096 244437 275080 278302 257927 231953 221018 233410 264427 288912 288477 247762 168920
10756 168920 90535 34656 -14362 -46733 -39229 -21299 -7783 12228 13002 -25318 -81661 -130900
10744a30900l3293j9005k4491l8610k7868j7718k9279l3554p207L8227O3298N6690
10732b03710L6687L512l0562m2717l7520l7474l0662j0117J9125L3242J5363R618
10720b75215J6833R753p028j8718l5416l7562k913L8211M6980K8130N221M51J0853
10707b20420N781k1114n6237n4863o109M3254O3045N0622L9177N0753N2338J4118
10695c9655k7720n7297q5427r8357r5391p7521m8812l5011l7579l3239j7779K738
10683f51050M0239M8028J3563j7039l1356j0720M2060P9516O5413K4154J534r607
10671d05265l0818j6879M5926P7578N0680K6938L6584M9859L5073L247o411M708
10659a28780r228j4184J9254P1436J06542Q3420K7307n55j7067l8763m8564n2227
$$ plain form
10744 -130900 -164193 -183198 -207689 -246299 -274167 -291885 -321164 -354718 -361925 -323698 -260400 -203710
10732 -203710 -167023 -163511 -194073 -236790 -274310 -311784 -342446 -352563 -333438 -300196 -284833 -275215
10720 -275215 -258382 -248629 -255657 -274375 -309791 -347353 -350266 -312055 -265075 -236945 -231724 -231273 -220420
10707 -220420 -214639 -235753 -291990 -346853 -352962 -309708 -246663 -196041 -156864 -106111 -53773 -39655
10695 -39655 -67375 -124672 -210099 -308456 -403847 -481368 -530180 -565191 -602770 -636009 -653788 -651050
10683 -651050 -610811 -562783 -549220 -566259 -597615 -608335 -566275 -486759 -421346 -397192 -395658 -405265
10671 -405265 -436083 -452962 -407036 -329458 -278778 -251840 -215256 -165397 -130324 -127077 -133488 -128780
10659 -128780 -138008 -152192 -132938 -61502 45040 128460 155767 155212 138145 99382 50818 -1409
10647a409n3364l4104K0046O8770O7964K4294k3265n0210o1598o1654l2855l532
10635a40917k227L731J7046K0392J9361R972K106J0676J7247r592l6685r283N0670
10622d7503P9404O6171K3025l9925o5305j0070M5173J2024n4766o5793n1916l3323
10610a42804Q279L9584N9159O7816M9017j1135p4698q4756m7939j5206j883m896
10598a59462l533Q142J5636L848o967J1559N1627R5729R9735M1346k3814l1266
10586A02580Q658M8464N4185J7857k7302o0981p5995n7902m6619n9631p4538q9848
10574b61072q1709m2540k0989l5026n2066l8375O113O7389R0054M0524m274l176
10562c35147j2824l7457o3932j08783j20630r6526o2812k0290J6033L3019K5284
$$ plain form
10647 -1409 -54773 -88877 -68831 -61 67903 92197 68932 18722 -42876 -104530 -137385 -140917
10635 -140917 -143144 -139413 -122367 -101975 -82614 -72642 -70536 -59860 -42613 -52205 -88890 -98173 -47503
10622 -47503 31901 98072 121097 81172 15867 5797 50970 62994 8228 -57565 -109481 -142804
10610 -142804 -134525 -94941 -35782 32034 81051 69916 -4782 -89538 -137477 -152683 -154566 -159462
10598 -159462 -162995 -154853 -139217 -135369 -142336 -130777 -79150 16579 116314 157660 133846 102580
10586 102580 111238 159702 213887 231744 204442 143461 67466 9564 -37055 -96686 -171224 -261072
10574 -261072 -342781 -385321 -406310 -441336 -493402 -531777 -525664 -458275 -368221 -327697 -331971 -335147
10562 -335147 -347971 -385428 -449360 -558143 -678773 -775299 -838111 -858401 -842368 -809349 -784065
10551g84065L7692O8361P0045M3966K0473M2847R0597Q3954K8654k7595n5327
10540c80398m0875J0398O2382O8845M2718J5888M446O058k933k398N434j1733
10528b22168l2600l0661j0341K3266M0911K2378N993K4068K9660j2391n1954m5715
10516b59554r575r80k5397k7443j0398J276M783l901k2945m0679l9684r020L5123
10503d08394O2557N6290J7053m4628r1079q5573n1266j5937K3963N1867N9480
10492d25667M3080j803o006N2614R4877P1773L4316L3695M8039N5975L5843l472
10480C3264l0982m6752m6985l4161N64N5446P6444M3033J930j7053q279k230k5457
10467a218o3344j08871j20132r3800m3228J0763M0993M9755L3061j1049n3681
$$ plain form
10551 -784065 -746373 -678012 -607967 -564001 -543528 -500681 -410084 -326130 -297476 -325071 -380398
10540 -380398 -421273 -410875 -348493 -279648 -236930 -221042 -216596 -210538 -213471 -215869 -210435 -222168
10528 -222168 -254768 -285429 -295770 -272504 -231593 -209215 -203222 -179154 -149494 -161885 -213839 -259554
10516 -259554 -269129 -270109 -295506 -322949 -333347 -332071 -327288 -331189 -354134 -394813 -434497 -443517 -408394
10503 -408394 -345837 -289547 -272494 -317122 -408201 -493774 -545040 -560977 -537014 -485147 -425667
10492 -425667 -382587 -384390 -390396 -337782 -242905 -171132 -136816 -103121 -55082 893 36736 33264
10480 33264 2282 -44470 -91455 -125616 -125052 -69606 6838 49871 51801 34748 26469 24239 -1218
10467 -1218 -64562 -173433 -293565 -387365 -430593 -419830 -378837 -329082 -296021 -307070 -360751
10456c60751o7904o4494m6110j7444K6249N6457M1298J4309J6250J3856Q524J4019
10444c65741L814m736L281J9453J9492j628k5739k7187L501L9802O1959O5310
10432b08419O7414P0779M3182l330l2439m8857q2908j22993r8871P495Q4822P0450
10420b53675J7701j0813l984J4655L4238N0901N6264N0053J7927j5520j6343j1327
10408f9923k6236n2247m4440L91q904r2245j52851j36834q5465o2162o4809n5534
10396h51259k4311K5689R1424J33365J26479R4928O3001K9906L190j7917l3936
10385c59441m0516m5309n4426l1324N3489J13009O5045j0993l6510l3963m8282
10374d29221o2082l9687m360J047k3735n2671p0248m7372J2780P1203J12970J31396
$$ plain form
10456 -360751 -428655 -493149 -539259 -556703 -530454 -473997 -432699 -418390 -402140 -388284 -379760 -365741
10444 -365741 -361927 -366663 -363382 -343929 -324437 -326065 -351804 -378991 -375490 -335688 -273729 -208419
10432 -208419 -141005 -70226 -27044 -30374 -62813 -111670 -194578 -317571 -416442 -408947 -324125 -253675
10420 -253675 -235974 -246787 -250771 -236116 -201878 -150977 -94713 -44660 -26733 -42253 -58596 -69923
10408 -69923 -96159 -148406 -192846 -192455 -201359 -293604 -446455 -583289 -668754 -730916 -795725 -851259
10396 -851259 -875570 -849881 -758457 -625092 -498613 -403685 -340684 -310778 -307588 -325505 -359441
10385 -359441 -399957 -445266 -499692 -531016 -477527 -364518 -299473 -310466 -346976 -380939 -429221
10374 -429221 -491303 -530990 -535350 -534303 -558038 -610709 -680957 -728329 -715549 -644346 -531376 -399980
10362c99980J00328M9625L7172N1804P6724J18410J31735P4432q188m4722j2888
10351A74452M4682N0024J8759k2736j00531j65042j62611j02063k4023J9006L0962
10340b39121J5586r320j5691k4456m1146m9740k9806L777M4089J00812J27613
10329a17403J08096O4117L0739K5478K9853K6653R891L429r502k1000j2198N23
10317A38676M143J6290K8871J1167k0835m1437n6761n5685k0619J4403K5993L1000
10305G5206L3734K9041K4290K1246M815k3180n4466p3639n6231j9959j1318m8427
10293i8888r3550j16399j01501m2095K0442M2723M3690P7470J23453J27097R0330
10282G2772M1976j5187q0185j18527r9297m0922m060j1116j0655J9434M9045N6712
$$ plain form
10362 -399980 -299652 -250027 -212855 -161051 -84327 34083 165818 240250 232062 187340 174452
10351 174452 219134 269158 287917 265181 164650 -392 -163003 -265066 -289089 -270083 -239121
10340 -239121 -223535 -232855 -248546 -273002 -314148 -363888 -393694 -389917 -345828 -245016 -117403
10329 -117403 -9307 54810 85549 111027 140880 167533 177424 180853 171351 150351 138153 138676
10317 138676 142819 159109 187980 199147 178312 136875 80114 24429 3810 18213 44206 75206
10305 75206 108940 137981 162271 183517 188332 165152 110686 37047 -19184 -39143 -50461 -98888
10293 -98888 -192438 -308837 -410338 -452433 -431991 -389268 -345578 -268108 -144655 -17558 72772
10282 72772 114748 99561 19376 -99151 -198448 -239370 -243430 -254546 -265201 -245767 -196722 -140010
10270a40010N4497P0232P7235M2397n634r979J5606M466l3145m5231l7656l7627
10258d4849m6999n4757n9936p0626m8994N348M4182O9173Q6341Q6019N6621K0884
10246D2407N490p548m0057o8848p3016p2997p8515o6686l8744j5740K881L0392
10234c80981Q3159J41128J69007J46373R9058M7768j6969o8928q4281r5044j23938
10223h3648j32494j07553p0877l7529o32J9474j770k4794j8506P088J7080J7128
10211d17033M3436P3481R9111J14408R4865O5065L7572O057m0300p9187o2508
10200f5033j2819M890l3173n1647J7127J05774J01245K3461l2395n7506q0256
10189h0332r2255q6358n4269N644N2737P0773Q4157J09805J16070Q2520K9297
$$ plain form
10270 -140010 -85513 -15281 61954 104351 98717 88738 104344 108810 75665 30434 -7222 -44849
10258 -44849 -91848 -146605 -206541 -277167 -326161 -320813 -276631 -207458 -121117 -35098 21523 42407
10246 42407 47897 40349 292 -68556 -141572 -214569 -293084 -359770 -398514 -414254 -411373 -380981
10234 -380981 -297822 -156694 12313 158686 257744 305512 288543 219615 135334 40290 -83648
10223 -83648 -216142 -323695 -394572 -432101 -432733 -413259 -415029 -439823 -458329 -451241 -434161 -417033
10211 -417033 -373597 -300116 -201005 -86597 8268 73333 110905 116962 76662 -2525 -65033
10200 -65033 -77852 -72962 -106135 -157782 -140655 -34881 66364 89825 57430 -76 -80332
10189 -80332 -172587 -258945 -313214 -307570 -254833 -184060 -99903 9902 125972 208492 237789
10178B37789l7156j00358r3947n133P6758N6375l5140j02285r6888k6283L8893
10167h7375M6837L4511M1796M2249J0816l1702n9529p6134q0771p0161o8090j04598
10155d02151j39239j00158r208O6736Q5242M1185r521k4756j3972O910J9080J8518
10143d61334J7729n83l3088l6850q353N082R04J1263L3131L5715K8470N3611Q1238
10130b73065O1379M2815N0735L1481j4078l6491k4968j1229k4968l7325k2918
10119b58632J0815L8554N7056O0416M1431J9342l649j1061n779j5583l1866l2299
10107a31255M689M3341N9342O2389L2178n4667j30727j14266l0392L4479M3947
10096a80942L6639K0968k583j2506J306J067j8008k9397k8164j7724j1288k556
$$ plain form
10178 237789 200633 100275 6328 1195 77953 134328 99188 -3097 -99985 -126268 -87375
10167 -87375 -40538 -6027 35769 78018 88834 57132 -2397 -78531 -159302 -229463 -297553 -402151
10155 -402151 -541390 -641548 -650756 -584020 -498778 -457593 -467114 -491870 -505842 -498932 -479852 -461334
10143 -461334 -443605 -444188 -477276 -514126 -522479 -517397 -516493 -505230 -472099 -436384 -407914 -354303 -273065
10130 -273065 -211686 -168871 -118136 -86655 -100733 -137224 -162192 -173421 -198389 -235714 -258632
10119 -258632 -247817 -209263 -152207 -91791 -50360 -31018 -34667 -45728 -51507 -67090 -98956 -131255
10107 -131255 -126566 -83225 -23883 38506 70684 16017 -114710 -228976 -259368 -224889 -180942
10096 -180942 -144303 -123335 -125918 -138424 -137118 -136051 -154059 -183456 -211620 -229344 -240632 -243188
10084b43188q357m3698n7195j3021M7671O5451M9041M2780N9479O2511K0872l4437
10072e2091q2979j02478p0412j1991M9686Q9447J07870R9404N2432P588p383k2815
10060E6278m4389m5875m0531m3814n4043m4615P475P1158J08108Q7706L3931P739
10048I9128Q303o670k9824j6651K6488O0810N0643P808k9097m0068l029N5827
10036A83668Q1445O2604J5281l0270o6278j09161j22547p7451j3575K0876L5817
10025a9591O3001P4001K2357l6085n5567n3573m2407j7409L7403Q7442O8462J0979
10013A39013k7419m3399m5113l3934j2450J209K396P88K0726M8417M3032P662
10001A00928l1029o9123q6650n8991j1382O359M683N829M750q472j2607m647k2122
$$ plain form
10084 -243188 -251545 -295243 -352438 -365459 -317788 -252337 -203296 -160516 -101037 -38526 -17654 -52091
10072 -52091 -135070 -237548 -307960 -319951 -270265 -180818 -72948 26456 78888 86476 79093 56278
10060 56278 11889 -33986 -74517 -118331 -172374 -216989 -209514 -138356 -30248 57458 91389 99128
10048 99128 107431 100761 70937 54286 80774 141584 192227 200035 170938 130870 127841 183668
10036 183668 265113 327717 342998 312728 246450 137289 14742 -62709 -76284 -55408 -19591
10025 -19591 43410 117411 139768 103683 48116 -5457 -47864 -65273 -27870 59572 128034 139013
10013 139013 111594 68195 23082 -10852 -23302 -22093 -19697 -18909 1817 50234 93266 100928
10001 100928 69899 776 -85874 -144865 -156247 -149888 -145205 -139376 -134626 -143098 -155705 -160352 -182474
9988a82474o8000j03778r3864l9422J3212M6530N9766K8557n308j7542l2914m2885
9976d38122l4257l9714l8776q204J6437J5786k342j0336J7981O5128Q7029O2997
9964c06393K4958J0077J592l817j3038k1742l737M7008Q9684O8681J2153k6775
9952a21349l6084l1640j5695L381P608J7534M2943N1632L1131o682k1029O468
9940g1782J8744J771j3581k6343m6770n2386k4465K682N774J2329M6380N4717
9928i2930J0717k1403q912o6j6936m5137q8610j01814p6641m7501l272M9412R1463
9915c51630J20258J23395Q2346K9238j0375m2685n9849n6194l9432k2217n095
9904b32240J1385j042m2423n3555j594O4441R4072P7653L8844K002k3130r590
$$ plain form
9988 -182474 -250474 -354252 -448116 -487538 -474326 -427796 -368030 -339473 -344781 -362323 -395237 -438122
9976 -438122 -472379 -512093 -550869 -559073 -542636 -526850 -529192 -539528 -521547 -456419 -369390 -306393
9964 -306393 -281435 -271358 -269766 -273583 -286621 -308363 -312100 -265092 -175408 -106727 -94574 -121349
9952 -121349 -157433 -189073 -204768 -201387 -193779 -176245 -133302 -81670 -50539 -57221 -78250 -71782
9940 -71782 -53038 -51267 -64848 -91191 -137961 -190347 -214812 -212130 -206356 -194027 -147647 -92930
9928 -92930 -82213 -103616 -112528 -112594 -129530 -174667 -263277 -365091 -441732 -489233 -492505 -443093 -351630
9915 -351630 -231372 -107977 -25631 3607 -6768 -49453 -109302 -165496 -204928 -227145 -232240
9904 -232240 -220855 -221897 -264320 -317875 -319469 -255028 -160956 -83303 -44459 -42457 -65587 -75177
9892g5177K0255r409r0039j30495j01297n5212j1264M8256P8897Q1523P7174N7494
9880a09294L4203J7768k953j9588j4232j7449o7420j15702j01289n2288k7059
9869d75303l4356n8201o8149n3942l9852m0120k8741J11K9100M7810M6255O2467
9857f12921J07831J15692N7903l490J295M4176O3622M9221K2138J0809K1313J9500
9845a02911J801r785j5665j5022j1027j9472l7306m2575l9276k0837L2385R9202
9833a80488J14364R0090R2317R6854Q5111P2323N4399L2321J8234o755k9153m4848
9821C94769q3742j18218j29024j39815j34419r2736l7713K759K1454K6137J4194
9810b76354j0270m4025m9913j9073L9921Q6072Q2119M6326J6916J0183O505J7291
$$ plain form
9892 -75177 -54922 -64331 -154370 -284865 -386162 -441374 -452638 -404382 -325485 -243962 -166788 -109294
9880 -109294 -75091 -57323 -60276 -79864 -94096 -111545 -178965 -294667 -395956 -448244 -475303
9869 -475303 -509659 -567860 -636009 -689951 -729803 -769923 -798664 -798553 -769453 -721643 -675388 -612921
9857 -612921 -505090 -389398 -331495 -334985 -333690 -289514 -225892 -176671 -154533 -143724 -122411 -102911
9845 -102911 -101110 -110895 -126560 -141582 -152609 -172081 -209387 -251962 -291238 -312075 -279690 -180488
9833 -180488 -66124 23966 116283 213137 298248 370571 424970 457291 475525 468770 439617 394769
9821 394769 311027 192809 63785 -76030 -210449 -303185 -340898 -338139 -316685 -290548 -276354
9810 -276354 -286624 -330649 -380562 -399635 -359714 -273642 -191523 -145197 -128281 -118098 -111593 -94302
9798i4302L3849J3937j2667p916n855k5006l9783k3463L2727O8096J0256q7335
9786a37462j18803r5058o5191l7100K218L8987N4777N1144K8719m904n385L7931
9774b50127P9107R2583P9418N9470N7648Q2039R0933M1588j5435j6778K8261N7752
9762C86459M5814j6082q4328j13002j14973r1632o2715o5637o3286m3997k6917
9751b50296J2709N9547P8404O9571N1680M4347M0689L6924L2142J6957m846j1627
9739A76201M858J9194K2911L8110N9307M9662L049n4901r0188p0620k0624J3633
9727A50592M1998N6370N0194K0324l6075p8720o9593l7300k0925n403R986l301
9715G8147l8604n5889n845Q1803J36147J30503Q2160N2269L9757R396o124J6994
$$ plain form
9798 -94302 -60453 -46516 -59183 -67099 -72954 -97960 -137743 -161206 -128479 -60383 -50127 -137462
9786 -137462 -256265 -351323 -416514 -453614 -451396 -412409 -357632 -306488 -277769 -282673 -288058 -250127
9774 -250127 -171020 -78437 981 60451 118099 200138 291071 332659 317224 300446 328707 386459
9762 386459 432273 416191 331863 218861 103888 12256 -50459 -116096 -179382 -223379 -250296
9751 -250296 -237587 -178040 -99636 -30065 21615 65962 106651 143575 175717 192674 187828 176201
9739 176201 181059 200253 223164 261274 320581 370243 373292 318391 228203 157583 136959 150592
9727 150592 192590 248960 299154 319478 283403 204683 135090 97790 76865 71462 81448 78147
9715 78147 39543 -16346 -22191 59612 195759 326262 408422 460691 500448 509844 503720 520714
9703E20714M5975N0120K8467k8164r1262r6787l8266K1550N9078P6069O8087M5284
9691F60865Q375k6894l1513j482O9708J54445K20398K63079L03716M02735N63763
9680B587195P48406R77434J283220J630933J883219J603687M39316r85926j726715
9671H440769j711882j379303j046312q01391o06759m72438l95578l24625k24561
9662A477920j11710m5459m0074n6374p5471j03228j03257p3187m9487l2345j1484
9651G75844J1075M8199O6895M9270R110l5181n5231o3424p6310o5214l2748j5019
9639F17266j7749j6040M01K7435N4533L5103k3956m2688k2357l1102p2144r0322
9627D18380m4837K1650N0884K4979l509p026j70L514j4637k3996k3603m7070m7516
$$ plain form
9703 520714 566689 616809 645276 617112 525850 429063 390797 412347 471425 547494 615581 660865
9691 660865 669240 642346 610833 609351 679059 833504 1053902 1316981 1620697 2023432 2587195
9680 2587195 3335601 4313035 5596255 7227188 9110407 10714094 11153410 10167484 8440769
9671 8440769 6728887 5349584 4303272 3501881 2895122 2422684 2027106 1702481 1477920
9662 1477920 1366210 1320751 1280677 1224303 1148832 1045604 942347 869160 819673 787328 775844
9651 775844 786919 835118 902013 951283 960393 925212 869981 806557 730247 665033 632285 617266
9639 617266 599517 583477 583878 611313 665846 700949 676993 634305 611948 580846 508702 418380
9627 418380 373543 395193 446077 471056 467547 460521 460351 463865 449228 425232 401629 354559 307043
9614C07043k007O0073J02429R9602M2351k8661o1829n4637l5896M862N7259N8685
9602E49274K7679J3728J3816j874k8662n0013p2417r5050q9415l7037J3109M5281
9590B88419P3705P4574N8603K7891j4657k9499J995L7805N2379N8617M9670K8212
9578G07714j4422p6452r8208o9865k4102K3415L8829J0717k5984l2680j299N1858
9566D89521R3303Q7240L5969m741o155J1086J3241j4106n7478o9713j8517M7948
9554F07598O0742K1358k9133o7835p9749m6718j0035j9160n2168n4750j3524K0212
9542C36838Q125k0984k1751k2904m8541o8198o5833k1673L8080N9269L5759l89
9530B07798j9704l7283n3542l5244M609L4257M0817M0636M1881M6827O7932J08315
$$ plain form
9614 307043 305036 365109 467538 567140 609491 580830 519001 464364 428468 433330 490589 549274
9602 549274 576953 590681 604497 602623 573961 523948 451531 356481 267066 230029 243138 288419
9590 288419 362124 436698 495301 523192 508535 479036 481031 518836 571215 629832 679502 707714
9578 707714 693292 616840 518632 448767 424665 448080 486909 497626 471642 438962 437663 489521
9566 489521 582824 670064 706033 701292 695137 706223 719464 705358 647880 578167 559650 607598
9554 607598 668340 689698 660565 592730 512981 466263 456228 437068 384900 330150 316626 336838
9542 336838 344963 323979 302228 279324 230783 162585 96752 75079 113159 172428 208187 207798
9530 207798 188094 150811 97269 62025 66634 100891 141708 182344 224225 271052 338984 447299
9518D47299J42522J44029J18515P6575M9480N0531L2534j4661n9313q9977q3848
9507H13686m6610j7847L331J7513J3353P593N452O601J7071J3031l453j288P167
9494H35600m444j0715K316K289k1982j0312J6228q774k8202M484N2682Q5495O8066
9481I82731J3209j6249k1846k6065l3591l2973k7258l2897m7021m2782j6559J5924
9469G14623O6174J29955J71851J52993P5550j1238m7031k8093m024j3825l8238
9458A168697o3667j10645j37600j13417o2455j2923K9112M7928K4931m357k203
9447G63401J651j4678l3996m7695l3384j1400j0617q871N734j159l4615l3007
9435E41364N1455J43093J49105J02427O2528L7725J9801L347O630K4299M2588
$$ plain form
9518 447299 589821 733850 852365 928940 978420 1028951 1061485 1046824 987511 897534 813686
9507 813686 767076 749229 752560 770073 783426 791019 796471 803072 820143 833174 829721 828433 835600
9494 835600 831156 820441 822757 825046 803064 792752 808980 800206 772004 776488 829170 914665 982731
9481 982731 995940 979691 957845 931780 898189 865216 837958 805061 758040 715258 698699 714623
9469 714623 780797 910752 1082603 1235596 1311146 1299908 1252877 1224784 1220760 1206935 1168697
9458 1168697 1105030 994385 856785 743368 680913 667990 697102 745030 769961 765604 763401
9447 763401 765052 750374 716378 668683 635299 623899 613282 604411 610145 608986 574371 541364
9435 541364 592819 735912 885017 987444 1049972 1087697 1107498 1110845 1117475 1141774 1184362
9424A184362O5619N3822J3220o024j6350m7061p2977n9670j8169J7991L8561M9354
9412A202678L1299r210m0918l9216j0945M043M363J5831M7817P4476P1274O2099
9400A413591O6089Q0582R2137J01008J17069J26035J24234J20385J09642R6063
9390B446835Q7531P0887O6418P7741Q1787R6603J63342K70612L45041L59119L66290
9379D432206M02545M80650N75462O95777Q70648J056320J251453J507852J880797
9370A3153710K433844L211479M259198N619639P251449Q811081R141499O456960
9362F0338859M98179n645907q686317q586377p062793n411771m097002l113645
9354A8233226k384931j877374j507108j181115q87212o26528l95394k01000m907
$$ plain form
9424 1184362 1249981 1303803 1317023 1310999 1294649 1247588 1174611 1114941 1096772 1114763 1153324 1202678
9412 1202678 1233977 1224767 1183849 1144633 1133688 1137731 1142094 1157925 1205742 1280218 1351492 1413591
9400 1413591 1479680 1560262 1652399 1753407 1870476 1996511 2120745 2241130 2350772 2446835
9390 2446835 2534366 2605253 2671671 2749412 2831199 2927802 3091144 3361756 3706797 4065916 4432206
9379 4432206 4834751 5315401 5890863 6586640 7457288 8513608 9765061 11272913 13153710
9370 13153710 15587554 18799033 23058231 28677870 35929319 44740400 53881899 60338859
9362 60338859 60837038 55191131 46504814 37918437 30855644 25443873 21346871 18233226
9354 18233226 15848295 13970921 12463813 11282698 10395486 9768958 9373564 9172564 9167657
9345I167657J74247J96387o1938m35870o52383o33564m91049l42216j99730o7439
9335F654102R13O683L593K8872Q1238J59697K32751K65858L11304M01111N10105
9324H656227O06559P08417Q75730J094769J296402J482380J736676K111471K635419
9315B1204050L302246M116549N159267O562942Q455133J0981167J4383926J8850581
9307I3015861K3970411K7734905K5499900J2574054p456461k2733039k7202200
9300A25403431k4446300j9506633j4889521j1243362q527406o533375n068844
9293C5187990l941649l048930k364689j814783j316200q26184l40152R302l4595
9284B1510110n41827j152484j457075j393284j110981p97787n63866l79043k02506
$$ plain form
9345 9167657 9341904 9538291 9476353 9040483 8388100 7754536 7263487 6921271 6721541 6654102
9335 6654102 6655015 6661698 6665291 6694163 6775401 6935098 7167849 7433707 7745011 8146122 8656227
9324 8656227 9262786 9971203 10846933 11941702 13238104 14720484 16457160 18568631 21204050
9315 21204050 24506296 28622845 33782112 40345054 48800187 59781354 74165280 93015861
9307 93015861 116986272 144721177 170221077 182795131 175338670 152605631 125403431
9300 125403431 100957131 81450498 66560977 55317615 46790209 40256834 35187990
9293 35187990 31246341 28197411 25832722 24017939 22701739 21875555 21535403 21544705 21510110
9284 21510110 20968283 19815799 18358724 16965440 15854459 15056672 14492806 14113763 13911257
9275A3911257o6972J8080J04431K31812L59222M59682N50258O64133Q13962J012916
9265A8058781J247374J503804J788693K130298K561685L111617L799780M668023
9257C8870055N760670P161685Q965056J1310838J4440395J8712728K4536019L2304011
9249A62061457M1965504N1739430N5505749M2506349Q345827l0448076n1794678
9242B79881562n3135630m4747729l4765404k6370405k0058264j5405929j1951913
9235G3446288r363332p403378n861615m603056l523008k547400j650286r10173
9227C7584040n32109q38454j737062k498343k640293k358744j987309j626062
9219B3365664j259271r01209n86900l77826k64034j66307j3745J67976L56767
$$ plain form
9275 13911257 13844285 13862365 13966796 14198608 14557830 15017512 15567770 16231903 17045865 18058781
9265 18058781 19306155 20809959 22598652 24728950 27290635 30402252 34202032 38870055
9257 38870055 44630725 51792410 60757466 72068304 86508699 105221427 129757446 162061457
9249 162061457 204026961 255766391 311272140 353778489 362124316 331676240 279881562
9242 279881562 226745932 181998203 147232799 120862394 100804130 85398201 73446288
9235 73446288 64082956 56679578 50817963 46214907 42691899 40144499 38494213 37584040
9227 37584040 37051931 36213477 34476415 31978072 29337779 26979035 24991726 23365664
9219 23365664 22106393 21205184 20618284 20240458 19976424 19810117 19796372 19964348 20321115
9210B0321115N28963O96872Q97164J141788J430027J756774K141311K616653L184652
9201C4715319L873929M747090N870533P291619R120617J1502612J4635685J8811462
9193A10568866K4460398L2126159M2222840N4093197O3810475O1431972L4971980
9186D23685887j1033197m9846939o3664056n8704912m7327234l6301927k7549875
9179A29257747k1059987j6309678j2773360j0086160q041304o471029n215341
9172D9300888m147494l210980k386023j726427j403278j585565k095580k433084
9164C0312457k352437k034187j672288j334359j053603q46410o79558n24454m01931
9155A9413230k80718r8682J15972L03089M60985O27484Q48148J085876J309337
$$ plain form
9210 20321115 20850078 21546950 22444114 23585902 25015929 26772703 28914014 31530667 34715319
9201 34715319 38589248 43336338 49206871 56498490 65619107 77121719 91757404 110568866
9193 110568866 135029264 167155423 209378263 263471460 327281935 388713907 423685887
9186 423685887 412652690 362805751 299141695 240436783 193109549 156807622 129257747
9179 129257747 108197760 91888082 79114722 69028562 60987258 54516229 49300888
9172 49300888 45153394 41942414 39556391 37829964 36426686 34841121 32745541 30312457
9164 30312457 27960020 25925833 24253545 22919186 21865583 21019173 20339615 19815161 19413230
9155 19413230 19132512 19033830 19149802 19452891 19913876 20541360 21389508 22475384 23784721
9146B3784721J583379J942472K375292K902549L580150M423380N438455O742158
9138E2772556Q466119J0738073J3782101J7939332K3558652L1023700M0457364
9131A98737897N0462599N5664640M5653121J3915693k5973148n0585419n4195264
9124B33680119m6509850l6458660k7764681k1130851j6229977j2612800r945603
9117F3027697p945241o404868n204282m237441l434728k742697k174258j770239
9109B9113943j552224j543290j658212j710628j636890j468132j250224j035192
9101A7259151q57969p07745n81292m59569l37865k48607j86727j10971q285J07346
9091A3867467J95853K79305L93736N22733O78211R06173J177211J501109J892410
$$ plain form
9146 23784721 25368100 27310572 29685864 32588413 36168563 40591943 46030398 52772556
9138 52772556 61238675 71976748 85758849 103698181 127256833 158280533 198737897
9131 198737897 249200496 304865136 350518257 364433950 338460802 287875383 233680119
9124 233680119 187170269 150711609 122946928 101816077 85586100 72973300 63027697
9117 63027697 55082456 48677588 43473306 39235865 35801137 33058440 30884182 29113943
9109 29113943 27561719 26018429 24360217 22649589 21012699 19544567 18294343 17259151
9101 17259151 16401182 15693437 15112145 14652576 14314711 14066104 13879377 13768406 13760121 13867467
9091 13867467 14063320 14342625 14736361 15259094 15937305 16843478 18020689 19521798 21414208
9082B1414208K337205K876940L594986M583835N952848P755851J0124706J3314927
9074G1955506J7511924K2514815K6939293K6936013J7167697j955858j9797850
9067A61271540k7311881k5992095k1245928j6360585j2398987r464388p344312
9060D1153364n796511m621743l718458l019259k480377k090011j819997j588741
9052A6018267j348463j129344r63189q51642p61264o56543n60307n16140m91378
9043H739997m35071l68409l32410l01972k49009k17720k01431j68512j27354p0901
9033F267208J0579Q6765J23429J54131K16555K75189L13979L54754M23704N50643
9023H776936P24540R54914J265752J671121K190174K861833L756168M958331O522677
$$ plain form
9082 21414208 23751413 26628353 30223339 34807174 40760022 48515873 58640579 71955506
9074 71955506 89467430 111982245 138921538 165857551 183025248 181069390 161271540
9067 161271540 133959659 107967564 86721636 70361051 57962064 48497676 41153364
9060 41153364 35356853 30735110 27016652 23997393 21517016 19427005 17607008 16018267
9052 16018267 14669804 13540460 12577271 11725629 10964365 10307822 9747515 9231375 8739997
9043 8739997 8304926 7936517 7604107 7302135 7053126 6835406 6633975 6465463 6338109 6267208
9033 6267208 6277787 6364552 6487981 6642112 6858667 7133856 7447835 7802589 8226293 8776936
9023 8776936 9501476 10456390 11722142 13393263 15583437 18445270 22201438 27159769 33682446
9014C3682446Q254343R307733Q043984L209312l466239q082232r160650q107540
9006C3681157o456114m902217l660399k774702k187264j772967j442339j151503
8998I333652r07142p23581n93952n02747m26589l86047l96270m06922l74635l09557
8988D306210k37991j71133j23322r5219r7565j02925q8906q5972p8636n0012k4522
8977C150007m3026r6655j24841j31411j17264r0543q0349o9446p8736j04327r8088
8966B115321q0839p1145n9120m2106k8934l1108l9225m4517n3224m4064k6927
8955A594112l0531k0832O338J3122j3195m7245p1742q0484p4278q0421r6742p5217
8943A022885j1532K3107j3624n9636m6150K9746N9734M742o5294q9105n3486k4776
$$ plain form
9014 33682446 41936789 51244522 59288506 62497818 59031579 50949347 41788697 33681157
9006 33681157 27225043 22322826 18662427 15887725 13700461 11927494 10485155 9333652
8998 9333652 8426510 7702929 7108977 6606230 6179641 5793594 5397324 4990402 4615767 4306210
8988 4306210 4068219 3897086 3773764 3678545 3580980 3478055 3389149 3303177 3224541 3174529 3150007
8977 3150007 3106981 3010326 2885485 2754074 2636810 2546267 2465918 2396472 2317736 2213409 2115321
8966 2115321 2034482 1963337 1904217 1862111 1833177 1802069 1762844 1718327 1665103 1621039 1594112
8955 1594112 1563581 1542749 1549087 1562209 1549014 1501769 1430027 1349543 1275265 1194844 1098102 1022885
8943 1022885 1011353 1034460 1020836 961200 915050 944796 1004530 1009272 943978 854873 801387 776611
8931G76611l0437j0611K9218M4446L0115q79k5564l2520k9863m9001o7546m3569
8919E90400p807K816Q6k5083n0915m1785j2427P149K2414K6412K2439L2572M7371
8906F13642N7232O8800M0189l2356o8140l8464j0888J7096O3301O4401J8614k751
8894G90676R346n776l7995p408K6669j1243o0384p7801p5795o7539m3853J0894
8882D49791Q0588J09366Q7542N1051p242q4427j21405j05172n1570L0426N1738
8871D90686p162m7302j3403K8666J2028k7715m6481k6789K8275O3220N1148M0800
8859E45971N8838P5109P6852N9620K8316l879k8048l9764l3062j9518o722j364
8847G12349j328r105l5381p0342q6478o5052l8824l9552k4737L1049Q4576J02242
$$ plain form
8931 776611 746174 735563 764781 809227 839342 838463 812899 780379 750516 701515 633969 590400
8919 590400 582593 585409 585495 560412 509497 467712 455285 462434 484848 511260 533699 566271 613642
8906 613642 670874 739674 779863 747507 679367 640903 630015 647111 710412 774813 793427 790676
8894 790676 800022 794246 756251 748843 775512 764269 703885 626084 550289 482750 438897 449791
8882 449791 530379 639745 727287 778338 771096 686669 565264 460092 408522 438948 490686
8871 490686 483524 436222 422819 451485 463513 435798 389317 362528 390803 454023 505171 545971
8859 545971 604809 679918 756770 816390 844706 840827 812779 773015 739953 720435 713713 712349
8847 712349 711021 701916 666535 596193 509715 444663 405839 366287 341550 372599 457175 559417
8835E59417R0306O8752O6144P1941L2252l8161n7017k5420m901p43R938J4178
8823G86686N295m047j3356l8271q3600j27717j35523r3725l4337J3616M1751M8067
8811C64839M9516K0982m1885o4583k7654K5858O7221R4564J11359R6792M6848
8800G43857k1965p6051p6672l9284o131J715j0545j0610L050K364r780q37L1957
8787E31068O9727P0808J9347l0551n4115n4298l6479J7495P4845Q4395M4495p045
8775G29692m9733q3157q1309n0956l6196n1067o6939n9890l8069k0281p699J3633
8763A98029M3747N7338N8807N4647L1404J0587J1001M1343R3398J18204Q3976
8752H02481K5302k4008o1620r1978j06419r1563o5675p4196r3088o3909p493J2743
$$ plain form
8835 559417 649723 718475 784619 856560 888812 850651 793634 768214 763313 762570 772508 786686
8823 786686 791981 787934 774578 736307 652707 524990 389467 295742 261405 275021 316772 364839
8811 364839 414355 435337 393452 328869 301215 327073 394294 488858 600217 697009 743857
8800 743857 721892 645841 569169 529885 523754 525469 514924 504314 507364 509728 499948 499111 531068
8787 531068 600795 671603 690950 660399 606284 551986 515507 533002 607847 692242 736737 729692
8775 729692 679959 596802 515493 464537 428341 377274 310335 250445 212376 192095 184396 198029
8763 198029 241776 299114 357921 412568 443972 454559 465560 506903 600301 718505 802481
8752 802481 827783 803775 742155 650177 543758 452195 386520 312324 219236 155327 147834 160577
8740A60577L969j896j9434j0080L9094P3781P9013O5333J7679m1867o5133n0491
8728B50545j2765P784k0987k8446M087L4296O5204Q3337P1425M3752L3935O0862
8716E93029J12556J43160J22907Q8059J22434K26215L22065M06097N15600O52471
8706C304593Q35598J140842J581052J947815J836320Q73240o13437j650608j862655
8697G392760j616091j252806r24107o69844m81620l73385l31742k99493k49168
8688A194504j99730j77891j66898j29511q0033m7372l0358k8376k7056l3798m3476
8677B30005k1130K5061N7925O6137M6250n970n9057q3210n9315j1679J4928K9309
8665B29254L5287L7808M6867O4401N0160K907k6406j5654n227j1707j6799q666
$$ plain form
8740 160577 164546 162650 143216 133136 172230 246011 325024 390357 408036 366169 301036 250545
8728 250545 237780 245564 224577 196131 200218 234514 299718 383055 454480 498232 532167 593029
8716 593029 705585 848745 971652 1059711 1182145 1408360 1730425 2136522 2652122 3304593
8706 3304593 4140191 5281033 6862085 8809900 10646220 11519460 10906023 9255415 7392760
8697 7392760 5776669 4523863 3599756 2929912 2448292 2074907 1743165 1443672 1194504
8688 1194504 994774 816883 649985 520474 440441 393069 362711 334335 307279 273481 230005
8677 230005 208875 233936 291861 357998 404248 398278 339221 256011 196696 185017 199945 229254
8665 229254 264541 302349 349216 413617 463777 466684 440278 424624 419397 407690 390891 382225
8653C82225P520J9373J4544n579p864J2177J9990O55j7819n029J6370K9049L6447
8640E02059K8326K7036L3001j2166p9344q2278n7446l9446r09M3145L2813q380
8628C86411l7342m3071l4471l0304k4632j8609j9788k1409j6204k2421k3939q314
8616H5907R435K2320Q603m7084r7395r1077n5778k1832K506J1395K2536N3611
8604i6853O9244M3836M115l4466o0447o7757m3522J2943L3423J1565L236K9173
8592i5510N7303M6151R863p101R563K1080l498l9839l2257J0242K3470K7704M2333
8579F9504L3441K0376K1705J6764n5k6156p1683j04875p7018J324O4669R2760
8567D0756Q5823M2977j6191n4565l5632p33n612l5202o7214p0042j1658N4646
$$ plain form
8653 382225 389745 409118 423662 418083 410219 422396 442386 443041 425222 420193 436563 465612 502059
8640 502059 530385 557421 590422 578256 498912 416634 359188 319742 318833 361978 394791 386411
8628 386411 349069 305998 271527 241223 216591 197982 178194 156785 140581 118160 94221 85907
8616 85907 95342 117662 126265 79181 -18214 -109291 -165069 -186901 -184395 -173000 -150464 -96853
8604 -96853 -27609 16227 20342 -14124 -74571 -142328 -185850 -172907 -139484 -127919 -124683 -95510
8592 -95510 -38207 7944 17807 10706 20269 41349 37851 -1988 -34245 -24003 -533 27171 69504
8579 69504 102945 123321 145026 161790 161735 135579 63896 -40979 -117997 -116673 -52004 40756
8567 40756 126579 169556 153365 98800 63168 62435 56823 21621 -45593 -115635 -127293 -72647
8555g2647O0225K5833K258J642m507k0280j8078J7921M7186N4197N3486M6054
8543A93290R550n5985q1427l9059K7672P7305R9097P8513N1906L3739J7726J8369
8531D30696J3976j4995k9546n748K6670M6136K7200j6196k7000K2141M5950j2104
8519E07180q3878j16110r8154n3057j4761p827m6220j03307j24204r7105o1695
8508b99138k4009J9985O8631J24584J41664R1657L2143J1931J7793J4507R977
8497B09725L5546P1232P3019L8420j6140o7389r3280r9967j18276j34887j12968
8486b14965l5373P1066J22854Q7500K8782q608k8860j8263K9356P6807P1633L3713
8474B15642O383r14L079l505k2306k6539j9696k9016k2850K0524N0705M0694K9605
$$ plain form
8555 -72647 -12422 13411 15669 17311 12804 -7476 -25554 -7633 39553 93750 147236 193290
8543 193290 202840 146855 65428 26369 54041 131346 230443 308956 360862 394601 412327 430696
8531 430696 444672 429677 400131 394383 421053 467189 494389 478193 451193 473334 519284 507180
8519 507180 423302 307192 209038 155981 141220 133393 87173 -16134 -140338 -237443 -299138
8508 -299138 -323147 -303162 -234531 -109947 31717 123374 155517 167448 185241 199748 209725
8497 209725 245271 316503 389522 427942 411802 344413 251133 151166 32890 -101997 -214965
8486 -214965 -250338 -179272 -56418 31082 59864 51256 22396 4133 33489 110296 181929 215642
8474 215642 222025 221111 224190 220685 198379 171840 152144 123128 100278 120802 171507 212201 241806
8461B41806M0317L9077m88n1197q3672p8495k1528M4684O9729M3484j917k2640
8449B19160j9044j8837m4775p8759q7783q3073p7054n6679k1487O378N0007J08767
8437a03179J13513O0324J3488o355o090m963q703K718K2942L3096N0899O2982
8425B30672M4372L1263J8582l3018q9909r6818p8597p1444n5099k4758J4262N3577
8413e6915N8519Q756o6520j02612p5444k9554J6063O2906J03661J21089J00850
8402A40799N9774L6287N2119O0052K1810k9397n4939m2871k5978n4987q9837q1802
8390h970p0222n6887k7715J2145M1848K4847j2309k8965J659O2484O2868K2081
8378B2864K3683M0699M6673O0898O9325N4320J0233n3786r4439q7295m2708K0970
$$ plain form
8461 241806 282123 321200 320712 269515 185843 107348 85820 130504 200233 243717 241800 219160
8449 219160 200116 181279 136504 57745 -30038 -113111 -190165 -246844 -268331 -261953 -211946 -103179
8437 -103179 10334 70658 84146 77791 71701 66738 58035 60753 83695 116791 167690 230672
8425 230672 275044 306307 324889 291871 201962 105144 26547 -44897 -99996 -124754 -110492 -56915
8413 -56915 1604 10360 -56160 -158772 -234216 -263770 -247707 -184801 -81140 39949 140799
8402 140799 200573 236860 288979 349031 370841 341444 286505 243634 217656 162669 72832 -8970
8390 -8970 -79192 -136079 -163794 -151649 -109801 -84954 -97263 -126228 -124569 -62085 783 22864
8378 22864 46547 87246 133919 194817 264142 318462 328695 274909 180470 93175 50467 71437
8366G1437Q2555R7922M7766j5715o4986r7243p8563r360L3895Q248k1416L998
8354E8538N5396O0241P698l3772m0590m6891m8127k4456J3966M1414M8763M2965
8342A35145M0208M4063M7866O0047N6121O345m7059n3087k7619J8717O1949O6066
8330D08762M5294K6666J1201J289j0728l8830n3067l3753O173O9837J25101J14705
8318F72650N1727j9291p0955j15304j61606j69258j23172o3127j3661J3114K7081
8307B8198L9914K5477n244p356j6980o0966n9878o374K1194J5863J5106L4192
8295B3146N5059M2249J505j7464k744J7045K7357L1106L1225M0435O0685O9353
8283C78957L7901j1832m5369n9979m2738M95M7234Q2167Q3158M2772j8472o9429
$$ plain form
8366 71437 153992 251914 299680 283965 218979 121736 43173 33813 67708 75956 54540 58538
8354 58538 113934 174175 181873 148101 107511 60620 12493 -11963 2003 43417 92180 135145
8342 135145 175353 219416 267282 327329 383450 389795 342736 289649 262030 280747 342696 408762
8330 408762 454056 480722 491923 493212 482484 443654 390587 356834 363007 432844 557945 672650
8318 672650 724377 705086 634131 518827 357221 187963 64791 1664 -11997 1117 28198
8307 28198 68112 93589 88345 80989 64009 3043 -56835 -63209 -42015 -26152 -11046 23146
8295 23146 78205 120454 121959 104495 101751 118796 146153 177259 208484 248919 309604 378957
8283 378957 416858 405026 359657 299678 256940 257435 304669 386836 469994 512766 494294 424865
8271D24865r8656j14288j08852r7604r0865p3109m0555J4327O3538N9138J1528
8260e0533k5283m2103m1499j4726L000k8599o9067o3948l7226q40L1525K9084
8248c10215J5926L526k264m335j4992p76J5409K659k9157o6692p7363n5602j3389
8235e37265N1509R9459P6351R142j4686N315K9519N2807O9373M0986k7009o2522
8223b07021n7361l7675k3732k8563k4901j2338r006J603K4529K8161J2746O973
8211c26585O748J8800L3845M3655N1177O0582Q9868J14123J09679Q6156O9157
8200C57205N4289M405m8224o2130m4718r519L682j6389m1710m4775l8551m4914
8188F8651l8610l1227k8190j5615p607Q672L8229L6544j987k4773n935K576j4349
$$ plain form
8271 424865 326209 211921 103069 5465 -85400 -158509 -199064 -184737 -121199 -62061 -50533
8260 -50533 -75816 -117919 -159418 -174144 -171144 -199743 -268810 -332758 -369984 -370824 -339299 -310215
8248 -310215 -294289 -290763 -293027 -297362 -312354 -313130 -297721 -295062 -324219 -390911 -468274 -523876 -537265
8235 -537265 -485756 -386297 -309946 -300804 -315490 -310175 -280656 -227849 -158476 -117490 -144499 -207021
8223 -207021 -264382 -302057 -325789 -354352 -379253 -391591 -400597 -398994 -374465 -346304 -333558 -326585
8211 -326585 -319837 -301037 -267192 -223537 -172360 -111778 -21910 92213 201892 288048 357205
8200 357205 411494 415899 367675 305545 260827 251308 254990 238601 196891 152116 113565 68651
8188 68651 30041 -1186 -29376 -44991 -52598 -43926 -5697 30847 28860 4087 -1848 728 -13621
8175a3621j4654J1585M6312P5685O8652K4942k924K070K5868N2466M2669j9366
8163B99684q8946j24463j21268q1745m0426o1662j15194j17583o3759J3349O7623
8152d34390Q7059R2330P0375L0014j0720m3793l6660Q720M1772J3110l8803l9539
8140b60525r594O872L8646J00976J48186J33214Q9795O5315M0759j1404m5744
8129B96496m2008n3612r5635j26435q9397j9913J4931K5734M1346N2962M4224
8118D8693L7737M1338L7150M9805Q1225P1040N33o4442n4585L939K2128j2135
8106B62426m9033o5841o3891n1510k8850J1863M8951L7268o312n1207p0905m6710
8094g3751j1750m371o8607j43327j43645r8231n4076N782P4599J22704J14410
$$ plain form
8175 -13621 -28275 -16690 29622 105307 173959 198901 195977 198047 223915 276381 319050 299684
8163 299684 210738 86275 -34993 -116738 -157164 -218826 -334020 -451603 -515362 -502013 -434390
8152 -434390 -347331 -255001 -184626 -154612 -165332 -209125 -245785 -237065 -195293 -182183 -220986 -260525
8140 -260525 -270119 -263247 -224601 -123625 24561 157775 247570 312885 353644 342240 296496
8129 296496 254488 200876 105241 -21194 -110591 -130504 -115573 -89839 -48493 4469 48693
8118 48693 86430 127768 164918 214723 295948 366988 367521 303079 248494 252433 274561 262426
8106 262426 213393 147552 83661 32151 3301 15164 64115 101383 95071 43864 -27041 -73751
8094 -73751 -85501 -89872 -158479 -301806 -445451 -543682 -597758 -591976 -517377 -394673 -280263
8083b80263P8737R0260J28824J14501O7322L5414J1515J2067N4754Q0251N9250
8072D52632R753l0067l3043l4222n9901q4345q6402o8876l2925M837J7844P798
8060F3083q881j3122p409j595J7564O2188Q5046O4612M1138M1981K8493k5119
8048C47979p2369p7912n1107l0552l3114l4802k5092q451k355l1882n8779l1725
8036a10161K3001K9785J0457J4246K6120M0860P1152R6555R3728P0825L2229j4739
8024C84058m3529n4775p5651q7195p5193o5538o0708l1832K5616N8211L3474j8173
8012a1235l1124J3709N7643N0768L3812L7670L2135J9779J9075J4695k2203q7835
8000A26889j26260j24298r2814m7148r967J6455M2577N1899N4517P2550Q5287
$$ plain form
8083 -280263 -201526 -111266 17558 132059 199381 234795 246310 258377 313131 393382 452632
8072 452632 462385 432318 399275 365053 305152 220807 134405 65529 32604 37441 55285 63083
8060 63083 54202 41080 33671 32076 49640 111828 196874 261486 302624 344605 373098 347979
8048 347979 275610 197698 146591 116039 82925 48123 23031 14580 12225 -19657 -78436 -110161
8036 -110161 -87160 -57375 -46918 -32672 -6552 34308 105460 202015 295743 366568 398797 384058
8024 384058 340529 285754 210103 122908 47715 -17823 -78531 -110363 -84747 -26536 6938 -11235
8012 -11235 -42359 -28650 28993 79761 113573 151243 183378 203157 222232 236927 214724 126889
8000 126889 629 -123669 -216483 -263631 -273598 -257143 -214566 -162667 -108150 -35600 49687
7989D9687M5959l8679r4405p5154k6979J354J7563J6018L987J0055L0535L6933
7977b3126M3197O0010O9316N6544J5637l6728q7467j04300p0567k1365Q917p41
7965i0673m4751o7031n8675n9756o3493k7476M4076J07009J31222J06684O8730
7954D5866N5934M2707L652l6733n6351o8696o2256k2881K7532N8738O8918N9649
7942A16079L8950K5844K4100L0630L5477R005k5160n4837p6227n2179R609M5520
7930A26811K9084l59k2084l5346l7671l4223k3579j2795j9411l7175l6604j6076
7918a19428k2670l5863k519M8445P3255P3149M7478P198m8586j05314j03959m1022
7906b29836k123j3320p206L3519P5862J05459J01257N3972j1318l6318J5840P3030
$$ plain form
7989 49687 95646 56967 -37438 -112592 -139571 -138217 -120654 -104636 -100649 -90594 -60059 -23126
7977 -23126 20071 80081 149397 205941 221578 184850 97383 -6917 -77484 -98849 -89932 -90673
7965 -90673 -135424 -202455 -261130 -320886 -384379 -411855 -367779 -260770 -129548 -22864 45866
7954 45866 101800 144507 148159 111426 55075 -13621 -75877 -98758 -71226 -12488 56430 116079
7942 116079 155029 180873 204973 235603 271080 280085 254925 200088 123861 71682 81291 126811
7930 126811 155895 155536 133452 98106 60435 26212 2633 -10162 -29573 -66748 -103352 -119428
7918 -119428 -142098 -177961 -180480 -132035 -58780 14369 61847 69045 20459 -84855 -188814 -229836
7906 -229836 -231959 -245279 -252485 -218966 -143104 -37645 63612 117584 106266 69948 85788 158818
7894A58818O8249M2811L3269J4674k2138m9077k9209J7158L5285L4644O5993P7919
7882D48396M4351O249j6460j5650j5645m2206m7561k7578k2854k8663l4686l4799
7870B12894k0564q949k7915o9364q8789n0903R882K9539q672m2094j2073L2791
7858d4217K7014K1897M5393L5373j4021m1695l5784k9073k4078l1447m1059j8572
7846a50269J6834L3580L5841L3751K6266L5378O1482P8248L6588j8306l4746k2030
7834A32617K0560O0391O1265J9207l3377o2700o6339n6108m8752l7219j9585L33
7822b9707M942R561K8448L4501L7497L2366J9583K8084N7634P4651N2874L818
7810C54252m6710q1572j02414r3537n2654k0621j1296n900N158p064m0421m0265
$$ plain form
7894 158818 227067 269878 303147 317821 295683 246606 217397 234555 269840 304484 370477 448396
7882 448396 492747 498996 482536 466886 451241 409035 361474 333896 311042 282379 247693 212894
7870 212894 192330 183381 155466 86102 -2687 -53590 -43708 -14169 -22841 -64935 -77008 -44217
7858 -44217 -17203 4694 50087 85460 71439 29744 -6040 -35113 -59191 -90638 -131697 -150269
7846 -150269 -133435 -99855 -64014 -30263 -3997 31381 92863 171111 207699 189393 154647 132617
7834 132617 153177 213568 274833 294040 260663 197963 131624 75516 26764 -10455 -30040 -29707
7822 -29707 -24765 -15204 13244 47745 85242 117608 137191 165275 222909 297560 350434 354252
7810 354252 307542 225970 123556 30019 -22635 -43256 -54552 -60452 -55294 -62358 -102779 -143044
7798a43044j6261K493K4012N7262O1690K2826L241J8668L6949M9021N7145N1760
7786B25762L2901J6463j7561n9370n3748j8086n669r339O079K7264K5275O27l2753
7773A37845l8898l0726l1017r392M0648O3065L1878k3478n0644l8167k4690p307
7761A9117K3776L7122K8879Q883M7M320o23j4660m0139q3350j16767j05101m2953
7748b81449M7511J24884J32881P6581L3029L928j2572o695k5294o8867q9229p8835
7736a44127n7422k1750L2366P2657P5989M6132o434m2857m0021l2065j4706J1952
7724a20286Q114j6141k3087j2274j0297k1711o991J2910m026k5417l2928k9839
7712b81973j6311K3985P1803O9007L2573K0701L7062M4013K8620K185j4968j2629
$$ plain form
7798 -143044 -159305 -156812 -132800 -75538 -13848 8978 12219 30887 67836 116857 174002 225762
7786 225762 258663 275126 257565 198195 144447 126361 120692 111353 117432 144696 169971 170598 137845
7773 137845 98947 68221 37204 27812 68460 131525 163403 139925 89281 51114 26424 19117
7761 19117 42893 80015 108894 117777 117824 122144 121521 106861 66722 -16628 -133395 -238496 -281449
7748 -281449 -233938 -109054 23827 100408 133437 137365 124793 118098 92804 23937 -65292 -144127
7736 -144127 -201549 -223299 -190933 -118276 -42287 3845 -2589 -45446 -85467 -117532 -132238 -120286
7724 -120286 -112172 -128313 -151400 -163674 -173971 -195682 -202673 -189763 -193789 -219206 -252134 -281973
7712 -281973 -298284 -274299 -202496 -133489 -100916 -80215 -43153 860 29480 31665 16697 4068
7700D068r591j7686k6036j4739J5673L1135K9268O3301J05767P4687j5828r6759
7688A43260j51640j61505j06771j1894O6144J05372J13506R0344O7577N7656L0196
7677B42245n023j8696j7284j1208m487k1292l6949m0390l7112L048O9561R7478
7665B19891O1517N917j0756J4404L0909J4927j5458k3748p798o408m6134j01528
7653A35735j35526j33336r3003k9156L7279Q3420P4142L8482K7069K9362K6496
7642F0964L1213L7393K7999J5556P528J4377K6544O353l8949q6369p7183Q477
7630C3903P9250P6593K5819l0459o7695q0633r3887j22372j43036j12753n7418
7619d92688j6286J8288N3378P8457Q1170O2089J9670P635L4857O7212P9796P0335
$$ plain form
7700 4068 -5523 -23209 -49245 -63984 -48311 -17176 12092 75393 181160 255847 240019 143260
7688 143260 -8380 -169885 -276656 -288550 -222406 -117034 -3528 86816 154393 212049 242245
7677 242245 237222 218526 201242 190034 185547 164255 127306 86916 49804 52852 122413 219891
7665 219891 281408 287325 276569 290973 321882 336809 321351 297603 289805 283397 237263 135735
7653 135735 209 -133127 -226130 -255286 -218007 -134587 -60445 -21963 5106 34468 60964
7642 60964 92177 129570 157569 173125 180653 195030 221574 227927 188978 102609 25426 33903
7630 33903 113153 189746 215565 185106 117411 36778 -57109 -179481 -322517 -435270 -492688
7619 -492688 -508974 -490686 -437308 -358851 -277681 -215592 -195922 -188287 -153430 -86218 -6422 63913
7607F3913L8974O127j0845k0967l1442p0525j07010r6178n3631K0721P5463P8343
7595a07057N1984K3875L0605N2758N0646O0404J05552J34603J04281M4842n297
7584E47196m3630p4350q9132q4945o4017k9731j0779j0326k458J8548M1845M1918
7572B40139O619l1269l9639j5857P70k0585n2754p2757o7448k0170K8064K6752
7560a8135J7888L0595M1360N3315O7482N7561K6824p768l6420l4583j5575J0825
7548A93369L4980L2218O06k8953o9896j31571j48951r4120q824O4856J02220R6516
7536D2450O0711J3228j0226P86J5566J5010Q343J0676J8555R166k559Q896L5555
7523B26157P2915Q1122L8261q818k0760q13P696M363Q471m303k4914k8191p799
$$ plain form
7607 63913 102887 109014 98169 77202 45760 -24765 -131775 -227953 -281584 -260863 -185400 -107057
7595 -107057 -55073 -31198 -593 52165 102811 163215 268767 403370 507651 552493 547196
7584 547196 503566 429216 340084 255139 191122 161391 150612 140286 137828 156376 198221 240139
7572 240139 246758 215489 175850 159993 160763 140178 87424 14667 -52781 -72951 -44887 -18135
7560 -18135 -247 30348 71708 125023 192505 250066 276890 269122 232702 198119 182544 193369
7548 193369 228349 260567 261173 232220 162324 30753 -118198 -212318 -221142 -156286 -54066 42450
7536 42450 103161 116389 106163 106949 122515 137525 145868 156544 175099 184265 181706 190602 226157
7523 226157 299072 380194 418455 409637 388877 388064 395760 400123 408594 404291 379377 351186 343387
7510C43387O875j0351k4148j9230l2157n0615m9507p1010j10877r3469l7760L266
7498a45596J9597J6121J4255K4097M2309L4714J028l636L8556P2802M1564k8804
7486A27007p5524q8776o5098k0377p092j7566o06K8473K9846K0471L7995R2605
7474F1358J53032J49144O9710j4987n4111n6218k9427O934J5067j3832m8675n9678
7462A78317o0805n5799l9481k5769j0861Q833J0164j7153n4689p2346n8858k5225
7450b23672K947K3150M8179O1007M2285K2462K9203M5263M2507M584n1555p5578
7438b9218m3467j242K3781M6144O2382O5653M3781j3230o0563o1817l5284r295
7426a2375O360J0469J3266J7537K2987K0500J934k7643l0437n834J0539L2305
$$ plain form
7510 343387 350262 339911 315763 296533 264376 213761 164254 93244 -17633 -111102 -148862 -145596
7498 -145596 -125999 -109878 -95623 -71526 -29217 5497 6525 2889 41445 114247 155811 127007
7486 127007 51483 -37293 -102391 -122768 -129860 -147426 -148032 -119559 -89713 -69242 -31247 61358
7474 61358 214390 363534 433244 418257 364146 307928 278501 285435 300502 286670 237995 178317
7462 178317 117512 61713 22232 -3537 -14398 -5565 4599 -12554 -67243 -139589 -198447 -223672
7450 -223672 -220725 -197575 -149396 -88389 -46104 -23642 5561 50824 93331 97915 46360 -29218
7438 -29218 -72685 -73927 -50146 -4002 58380 124033 167814 154584 94021 32204 -3080 -12375
7426 -12375 -6015 4454 17720 35257 58244 78744 80678 53035 22598 16764 27303 59608
7414E9608N2542L2839k5180o6676o5354l5819p634l3438r9592j35745j19678o9425
7402e13552k1091j0343l2820m6520n1788o7885q1921q2443m2193N2458J38924
7391g59174J53850J21755P5373O384m6775l1410P204L1020P0314J21771J34380
7380a15308P4388j5476p5567r5655p8649l6833R806P0485R8797O3970O827l4349
7368a27564l4926j8063q091n74o928j4393k990M735j0326j6807J1936M6462N8829
7355a18700M3449L4899K9392Q446Q733K8443L7749L0722L0215N3500Q5133R8128
7343C70109Q5375M5472j6314p4709j12522j14655q1042k3235L4293M5282J4312
7332A72366m3647q8514q2813n7344k9716J2541M0671J6907j5264k1202N452N6293
$$ plain form
7414 59608 112150 144989 119809 53133 -12221 -48040 -55674 -89112 -188704 -324449 -444127 -513552
7402 -513552 -534643 -544986 -577806 -624326 -676114 -743999 -825920 -908363 -950556 -898098 -759174
7391 -759174 -605324 -483569 -408196 -401812 -448587 -479997 -472793 -441773 -371459 -249688 -115308
7380 -115308 -40920 -56396 -131963 -227618 -306267 -343100 -333294 -262809 -164012 -100042 -93215 -127564
7368 -127564 -162490 -180553 -188644 -189218 -196146 -210539 -213529 -208794 -219120 -235927 -223991 -177529 -118700
7355 -118700 -75251 -40352 -10960 -2514 6219 34662 72411 103133 133348 186848 271981 370109
7343 370109 455484 500956 484642 409933 297411 182756 101714 78479 112772 158054 172366
7332 172366 128719 40205 -42608 -99952 -129668 -117127 -76456 -59549 -74813 -96015 -90563 -34270
7320c4270P8936N3350R321L897K5060J1917k4180k3372J5619L6590P979k4382
7308A36465j3189L5090O7171L5552j3163j1681J7826J7489j2579k4856k1109j3580
7296A99436K2315M1698J5557j3238k6138k3925l496N5257J16704J13793M0745
7285E38708n0786j00046r6034p4591n6547m1136k7023k2818j6152L168J7371K0167
7273I4281Q611N149L7933N8888L6772L2020M7887L1697Q455P466j4759n3450n3800
7260B47150l7032n6283j03552j18121p9133l7846j6554K539K2162M1585O7517
7249f7568Q4274N9532l0382j39804j79559j45750q8571n6528o4133p7726n3039
7238g59254K4357R9868J37303J48101J26416P7681L3046J8685N0441J02340J22060
$$ plain form
7320 -34270 44666 98016 107337 111234 136294 148211 124031 100659 116278 152868 160847 136465
7308 136465 123276 158366 225537 261089 247926 236245 254071 271560 258981 234125 213016 199436
7296 199436 221751 263449 279006 265768 239630 215705 212209 267466 384170 497963 538708
7285 538708 487922 387876 291842 217251 160704 119568 92545 69727 53575 56743 74114 94281
7273 94281 102892 108041 145974 204862 241634 273654 321541 353238 361693 369159 354400 300950 247150
7260 247150 210118 153835 50283 -67838 -146971 -184817 -201371 -198832 -176670 -135085 -67568
7249 -67568 16706 76238 45856 -93948 -273507 -419257 -507828 -564356 -628489 -706215 -759254
7238 -759254 -734897 -635029 -497726 -349625 -223209 -145528 -112482 -93797 -43356 58984 181044
7227A81044Q3971M874o3148q1327m9082J0652M8839M5907K0817l1386p1168n0762
7215D9231k7360n0295p0313n1922q032M7084Q3627O7897J5727l1850n5829o5015
7203i7050n2394M94N9366O3549R115m8998p0264n1468j2259J4878J4558O911M145
7190a59417L3026P8729R3556P6758M7889M7753P7540P5517J4643n8571p9519n2637
7178A95267j2298J3056K9265N0424L5506k2514o3070p6341q1986p4424n9886l4564
7166a01565o356J9011M7184N1175L4966K9403K8082K8451M5418O4052O6184L2891
7154C38896j8768m8744m3327j6169J3309K8513r79m9015l6651L532j4071o9872
7142H6654p6913l5106n633k0510l7343k4099j8228l4883m5567k6577Q65J2146
$$ plain form
7227 181044 265015 269889 206741 125414 76332 86984 135823 181730 202547 171161 99993 49231
7215 49231 21871 -28424 -98737 -150659 -158691 -111607 -27980 39917 55644 23794 -32035 -97050
7203 -97050 -149444 -148950 -89584 -26035 -16920 -65918 -136182 -187650 -199909 -185031 -170473 -163562 -159417
7190 -159417 -126391 -47662 45894 122652 170541 218294 295834 371351 385994 327423 247904 195267
7178 195267 182969 196025 225290 275714 311220 288706 225636 149295 67309 -7115 -67001 -101565
7166 -101565 -107921 -88910 -41726 9449 44415 73818 101900 130351 175769 239821 306005 338896
7154 338896 320128 271384 228057 211888 225197 253710 252731 203716 167065 170597 156526 86654
7142 86654 9741 -25365 -30998 -51508 -88851 -112950 -131178 -166061 -211628 -238205 -237340 -225194
7130b25194O913o913j1694R677N4124R1371J06977J26538J38443J04687M8193
7119D43122O35l0170k4912o272j2228l4690l1249J7J0709l980k1116l7623m0807
7106B11436j0865K3349K8788M0172M1518L220l3233k5288j438k619o314j0215
7094B58511l0071m4850k2614K0348M1420L4028M944m5986j06676j32699r8953
7083a22598m6209j1482J2930M4512P0700O0439R748n7922r5772p4186l6936k4472
7071b71248k2263o926L7575Q2469Q1125N6948L7543K8818M1772O2656O6133M1773
7059B36375O811m4621q2813q9503j02291j04548o8574o918K9922L9133O6738Q1650
7047c8639K6955l9633l0118J3370L3278L7382K0244k0804n5264n0709O497N6454
$$ plain form
7130 -225194 -218281 -225194 -236888 -227211 -173087 -81716 25261 151799 290242 394929 443122
7119 443122 443757 413587 388675 382403 370175 335485 304236 304253 314962 310982 289866 252243 211436
7106 211436 200571 223920 252708 292880 334398 337618 304385 279097 277659 275040 268726 258511
7094 258511 228440 183590 160976 181324 222744 256772 261716 215730 109054 -23645 -122598
7083 -122598 -168807 -180289 -167359 -122847 -52147 8292 18040 -39882 -135654 -209840 -246776 -271248
7071 -271248 -293511 -300437 -262862 -180393 -99268 -42320 -4777 24041 65813 128469 194602 236375
7059 236375 243186 198565 115752 26249 -76042 -180590 -249164 -256082 -226160 -187027 -120289 -38639
7047 -38639 -11684 -51317 -81435 -68065 -34787 2595 22839 2035 -53229 -103938 -97441 -40987
7035d0987N2235J9300J9344N0218N3411L0517K0105K2556J5587J9879L8158K3426
7023C23749j2310k5811j4012o357k6270m4749m4955m8846m1805J130L3398J4033
7011A07195m2457q3369k5601J06643J95279J85434J30609P4399P139n8373q4241
7000E12657o1801l6236o5017r6086o5614r061L2473L5388J8953K3933K9139P01
6988C19429m1174o2998p9985j15551j24020m7631O0715J26011J45279J28662R2837
6977D01574M3138k2336p9982q9243n7039k7106j7935l8900o4451k6495O6472J09455
6965A97152O6123N816l0590o6043r8106q7552l6551K0374O3953Q8131Q4721L3977
6953B41405k8199n2528j8394N6702P9220O159q2132j30710j32400r4364m6088
$$ plain form
7035 -40987 11248 30548 49892 100110 153521 184038 204143 226699 242286 262165 300323 323749
7023 323749 311439 285628 271616 265259 238989 194240 149285 100439 58634 59764 93162 107195
7011 107195 64738 -18631 -44232 62411 257690 443124 573733 648132 655271 596898 512657
7000 512657 450856 414620 349603 253517 187903 178842 211315 246703 265656 289589 318728 319429
6988 319429 278255 215257 135272 19721 -104299 -151930 -91215 34796 180075 308737 401574
6977 401574 444712 422376 342394 253151 196112 169006 151071 112171 47720 21225 87697 197152
6965 197152 263275 269091 238501 172458 74352 -13200 -49751 -29377 34576 122707 207428 241405
6953 241405 213206 160678 142284 198986 278206 284365 202233 71523 -60877 -155241 -201329
6942b01329l269J4436K472K663K7930M1056N1314P1563O8279J6049m5951p2302
6930b7089n5133k1952l054m223J5324M3291L4633j87k7155m5567m9067j6046K3729
6917a32496L3152K9066L2275M3120M2296L5153L5308K7465J4353m732k2487l1044
6905A01429n7601p8866o3534k5591J3496N1206R4136J05009M0343l7832o1517
6894H0678l8741j2726O023K2556J2890Q424L3385L6017J2898J187k0129m9303
6882I3159m2685k4288k4011l4850l5112L768N7313M9001j2342l2997O30K5783
6870B3369K5392L4871N5724O4861M9944J9025J160L48j914k2725n7037o5780k3731
6857A03507K4457L9332M6690P9225J55508K53247L02143K84185K78851L15458
$$ plain form
6942 -201329 -204598 -190162 -187690 -185027 -157097 -116041 -64727 6836 75115 91164 45213 -27089
6930 -27089 -82222 -104174 -107228 -111451 -96127 -52836 -18203 -18390 -45545 -91112 -140179 -156225 -132496
6917 -132496 -99344 -70278 -38003 5117 47413 82566 117874 145339 159692 154960 132473 101429
6905 101429 43828 -35038 -98572 -124163 -110667 -59461 34675 139684 180027 142195 80678
6894 80678 41937 29211 35234 57790 70680 79104 112489 148506 161404 162591 142462 93159
6882 93159 50474 26186 2175 -32675 -67787 -64019 -6706 42295 29953 -3044 -2414 23369
6870 23369 48761 83632 139356 204217 254161 273186 274346 274694 272780 250055 193018 127238 103507
6857 103507 127964 167296 213986 293211 448719 701966 1004109 1288294 1567145 1882603
6847A882603L68738M46431O12392R25477J343247J797726K110729J791604N26192
6838A1805139j053055j916087j905096j521822j130670q42871o60647n48495m49577
6829A776819l54286k89533k19808j43682j06585j20526j41521j21779o7301j5472
6819A96326j177k1853m8202p8201r6186q8532q3431q5495p9918n3246j6409J3308
6807d43016L5778M6600N6523P2522P9552O7132N8412N0580J8066l2124m2583K1567
6795a0991R0753Q8077J2072q1234j28225j00287m6385k7162m4560m2716j2806
6784c03464J263k1265n0372m2869M634P0067J26087J50941J53067J20027L8718
6773B46834l4565p0668m4659K3998M3356l548p3060j15879j03658m9680l914J7691
$$ plain form
6847 1882603 2251341 2697772 3310164 4235641 5578888 7376614 9487343 11278947 11805139
6838 11805139 10752084 8835997 6930901 5409079 4278409 3435538 2774891 2226396 1776819
6829 1776819 1422533 1133000 913192 769510 662925 542399 400878 279099 211798 196326
6819 196326 195149 173296 125094 46893 -49293 -137825 -221256 -306751 -386669 -439915 -456324 -443016
6807 -443016 -407238 -360638 -304115 -231593 -152041 -84909 -26497 24083 42149 10025 -32558 -10991
6795 -10991 79762 167839 179911 98677 -29548 -129835 -176220 -203382 -247942 -290658 -303464
6784 -303464 -302201 -323466 -373838 -416707 -412073 -342006 -215919 -64978 88089 208116 246834
6773 246834 212269 141601 96942 120940 164296 160748 87688 -28191 -131849 -181529 -185443 -167752
6761a67752L7830N6715N2247K7980K563j0149n822R366K3528K6295K4113K3193
6749A00107M1565P5070N8741J394l9318n8920m3393n277J3675K2428M8425P3724
6737B88221O9309K7453k3694m6444l5883l0759n8181r0426r6194p8656m0854J7320
6725i8788P9722Q6559M0373J4233K3450L8911N2020O1286M7686Q939j7055j5802
6713C21534n522J8980M8956O8294P0866L4736k4962m5629l4881l4702o1677r3744
6701B62249r8032p9224o7035q5659j08514q5747m3723j154M3087O2195N6239M8904
6689i6414M4808N1004N4599M2044J4282k7526n8556n0140K256M1399K8648J4212
6677F0616K9154L5829M088m2172o3378n2933m281L5974O324n1016o6436m5432
$$ plain form
6761 -167752 -129922 -73207 -20960 7020 9583 -566 -6388 2978 26506 52801 76914 100107
6749 100107 141672 216742 275483 276877 237559 178639 135246 129969 143644 166072 214497 288221
6737 288221 357530 384983 361289 314845 278962 248203 190022 99596 3402 -75254 -116108 -98788
6725 -98788 -19066 67493 107866 122099 145549 184460 236480 297766 345452 354391 337336 321534
6713 321534 316012 334992 383948 452242 523108 557844 532882 487253 452372 417670 355993 262249
6701 262249 164217 84993 17958 -67701 -176215 -261962 -305685 -306839 -263752 -201557 -145318 -96414
6689 -96414 -51606 -602 53997 96041 110323 82797 24241 -25899 -23643 17756 46404 60616
6677 60616 89770 125599 129687 87515 24137 -28796 -33077 2897 9221 -41795 -108231 -153663
6665a53663j4791L6199R0449J22821J29990J04812N8932K2295q035n1904m9984
6654B87121P813L7353Q487l8687n4658l5980k1232k4742l6267o8327r1472p8620
6642a09211l0166K7598O3050Q0536O8532L7087K6777L6982M2199L0646j2604q5180
6630A76246j40025j52280j19637n4432n197m160m2852o5187m9084l4337l2710
6619e23655r727L5490P2821Q4829P6672Q6655J26781J32492P9238J5072k3168
6608A53500k8095j2264m088j1875j9332j6782k5977m3432m2731l075N5758Q4524
6596H6131P7548O6861O3011N7291M0664O719j9916j4468K63N134j5519n4892m8978
6583B49849l355K6551P651k9430l9917j4926M3622Q2129N8439J7367r772j3702
$$ plain form
6665 -153663 -168454 -132255 -41806 81015 211005 315817 374749 397044 389009 337105 287121
6654 287121 294934 332287 340774 302087 247429 211449 190217 165475 129208 60881 -30591 -109211
6642 -109211 -139377 -111779 -48729 31807 100339 137426 164203 201185 243384 274030 261426 176246
6630 176246 36221 -116059 -235696 -290128 -295325 -299485 -342337 -407524 -456608 -490945 -523655
6619 -523655 -533382 -497892 -425071 -340242 -263570 -176915 -50134 82358 161596 176668 153500
6608 153500 125405 113141 109053 97178 77846 61064 35087 -8345 -51076 -54151 1607 86131
6596 86131 163679 230540 293551 350842 391506 398225 378309 363841 364104 369238 353719 298827 249849
6583 249849 246494 273045 280696 251266 211349 196423 240045 322174 380613 397980 388208 374506
6571C74506P984K6395J4400m118J980J7787L652l4708m6048k3858n338o662r812
6558C16160k3939l0111k4475l0000l9972l9548j9634k784p600q101J1165L4526
6546A35687O0339Q0936N9517M638l9371o1194n7824l2858l5383n4372n1471k0425
6534a1781R196J1984K1278N2800P3733N7052J7913j6212l3278k2669J6206M6821
6522B23043N1426N2745O6521P9370O2998L436n8095p4354n4010k8032l5505o5388
6510B24155o1956m8058l7637p214K8771N2791L7013J4507K0922K6098J5744J6233
6498B81369L881l4884m8916k6707j402N694K796k381j4369k3539k0955j6809k3189
6485H0589l5273m9165o0719m2194J6769L7399j0542o7654r5204p4426k9791q60
$$ plain form
6571 374506 382490 408885 423285 419167 421147 438934 442586 407878 361830 337972 332634 325972 316160
6558 316160 292221 262110 237635 207635 167663 128115 108481 105697 98097 89996 101161 135687
6546 135687 196026 276962 336479 341117 301746 240552 182728 149870 114487 60115 8644 -11781
6534 -11781 -2585 9399 30677 83477 157210 214262 232175 215963 182685 160016 176222 223043
6522 223043 274469 327214 393735 473105 536103 539539 481444 407090 353080 325048 289543 224155
6510 224155 162199 114141 76504 69290 98061 150852 187865 202372 223294 249392 265136 281369
6498 281369 285250 250366 201450 174743 173341 179035 181831 179450 165081 141542 120587 103778 80589
6485 80589 45316 -3849 -64568 -106762 -89993 -52594 -63136 -130790 -225994 -300420 -330211 -331071
6473c31071J6131L4925K6917L523P179N1747P4016L7288j2278l2850j2563L9640
6461i7396P1078M8289J8872L2189N8920M5669K346k1848l0297l1534r709J5725
6449A02304K6503K4241K7184L8064K2716m513Q49M3895R2662R0559N1911K9602
6437E45977K1595J825k6529l3634k0644j8311k8603l3991k4950k3171l8347m1027
6425B80190o385K1354K627m8682r8611j09413p3607j8049J8908L1573J8008j0230
6413G683j9797Q389J5173k8571n0619m0242k9419k1935j1489K9531P8384Q6862
6401B3950M3744J1704N2644R8449Q8988N3787J7557k6301m4247r989M4055J22074
6389D76415K11131K89430L45809L98129M63970N57253P24119R95100J377095J835142
$$ plain form
6473 -331071 -314940 -280015 -253098 -249575 -242396 -190649 -116633 -79345 -91623 -124473 -137036 -97396
6461 -97396 -26318 21971 40843 73032 131952 177621 179967 158119 127822 96288 86579 102304
6449 102304 128807 153048 180232 218296 241012 236499 237348 281243 373905 464464 516375 545977
6437 545977 567572 569397 542868 509234 488590 470279 441676 407685 382735 359564 321217 280190
6425 280190 273805 295159 297786 249104 150493 41080 -32527 -50576 -31668 -95 17913 7683
6413 7683 -12114 -3725 11448 -17123 -67742 -107984 -137403 -159338 -170827 -141296 -62912 23950
6401 23950 67694 79398 132042 230491 319479 373266 390823 364522 320275 310286 354341 476415
6389 476415 687546 976976 1322785 1720914 2184884 2742137 3466256 4461356 5838451 7673593
6379G673593K165991J914238P24962q76208j865172k013246j720228j323447r80930
6370C699553p26697n40247l87415k72273k08251j79143j65009j35559q1331l6889
6360I66739k9377m3513n4865n0179l4023l9012n7410p4858p7838l2903L3372P7715
6348E83848J02095J07666Q5212N4323N0167N2950N5673Q1550J50796K41097L00408
6337A865785L20610L41014M10836N47509P65642J094270J498317J868912J953049
6328A0665944J338188j565j283239j829607j758676j450759j125050q58613o57550
6319C039073m93953l51272k51231k18379k08294j78340j40085r8879n4030m3006
6309A001604m2544k4513k6180m2277n7579q4776q8653m1461J2744M6163N6123
$$ plain form
6379 7673593 9839584 11753822 12478784 11602576 9737404 7724158 6003930 4680483 3699553
6370 3699553 2972856 2432609 2045194 1772921 1564670 1385527 1220518 1084959 1003628 966739
6360 966739 937362 893849 838984 788805 754782 715770 658360 583502 505664 472761 506133 583848
6348 583848 685943 793609 878821 933144 983311 1036261 1091934 1173484 1324280 1565377 1865785
6337 1865785 2186395 2527409 2938245 3485754 4251396 5345666 6843983 8712895 10665944
6328 10665944 12004132 12002567 10719328 8889721 7131045 5680286 4555236 3696623 3039073
6319 3039073 2545120 2193848 1942617 1724238 1515944 1337604 1197519 1098640 1044610 1001604
6309 1001604 959060 934547 908367 866090 808511 723735 635082 593621 606365 652528 708651
6298G08651M4579J0450m7441j01064j39256j58738j45446j12086p9126o2703n7241
6287a39421n0087k6722L1075Q7566Q7931P2915N3745K3563J8525L7399N9573M2143
6275B98205p379r943Q607k6840p8928j00888n9671L8615J11401Q9049R704l9379
6263B32553l3065j6701L147N1022Q0396O4854M157n7300n8930m8301n5801n0904
6251A15127k2436j2547l8465n6428l9005Q001M5529N3819J8805l0489j7673M3668
6239F7906P8044N0406l1493r9752r5186l2482J6804J0275j9815k9903R404O2900
6227a2892P4635J5700q0986j26720r5745n5286l3934j3307J3368N1286O6717L2623
6215a64541m1756r2013p0758j7627J8974M1616M1395K1307R24j8617l7271l3846
$$ plain form
6298 708651 753230 763680 716239 615175 475919 317181 171735 59649 -19477 -82180 -139421
6287 -139421 -189508 -216230 -185155 -97589 -9658 63257 117002 140565 159090 196489 256062 298205
6275 298205 290826 280883 289490 262650 183722 82834 23163 61778 173179 262228 271932 232553
6263 232553 199488 182787 185934 236956 317352 382206 386363 329063 270133 221832 166031 115127
6251 115127 92691 80144 41679 -14749 -53754 -45753 -224 53595 72400 41911 24238 67906
6239 67906 145950 196356 164863 65111 -30075 -62557 -45753 -35478 -55293 -85196 -75792 -12892
6227 -12892 61743 77443 -3543 -130263 -226008 -281294 -315228 -328535 -315167 -263881 -197164 -164541
6215 -164541 -206297 -298310 -369068 -386695 -367721 -326105 -284710 -263403 -262479 -281096 -318367 -352213
6203c52213K546M1457O2230N1981L8849N2046O6218N8318L7340K9443L7146K4741
6191A50102j8086m4201l9701k4453q918m15J3018M6804Q2163R3595P2338L2877
6179C55123k2068o5534q4924j02599r7466m8249J8633O1672Q5896P1744K6264
6168A98492k8657q2440j09438j00169o6687l6608k762L5173L2668n896k8300r103
6156b03727J4793M2154P0015O6547N4400P6539R7881P5647J9717k3431k7083l595
6144B59857K5914N5735O5946L5040J382k099L46j6161l7809n1238m2857k8068
6132B65988l5701m1717k2697q319j5660j0690K2634M1446J0649k1315M852P0980
6120B60450Q8941M8991j92m6861p9748r7870r7716o9092m6243l5699k7480k158
$$ plain form
6203 -352213 -349667 -308210 -245980 -193999 -155150 -103104 -36886 21432 58772 88215 125361 150102
6191 150102 132016 87815 48114 23661 14743 14328 27346 74150 156313 249908 322246 355123
6179 355123 333055 267521 182597 79998 -17468 -65717 -47084 14588 100484 172228 198492
6168 198492 169835 87395 -22043 -122212 -188899 -225507 -228269 -193096 -160428 -166324 -194624 -203727
6156 -203727 -188934 -146780 -76765 -10218 44182 120721 218602 294249 313966 290535 263452 259857
6144 259857 285771 341506 407452 442492 443874 441775 442121 425960 388151 336913 294056 265988
6132 265988 230287 188570 165873 157554 141894 131204 153838 195284 205933 184618 189470 260450
6120 260450 349391 398382 398190 351329 271581 173711 75995 6903 -39340 -75039 -102519 -104677
6108a04677N1118P8706M3440p891q725L2728M9634O503l9942k5813O503K925p867
6095G6642Q780M7422P0027O6809N4312K6281j3586m2735m2842j1802J7449K5426
6083B82183K9988J3145n4896j18292j08334q2391q1031n2932l7433p1450q3103
6072c64546l9488K6448O3541L5076n3568j16452r4085j2575O9787R6297P4044
6061c15521M9972N6552P9366P6461P1855Q1729O1452R902l6339n0283m4707l2044
6049H395j2474J9539M2684M1625L3283L6652M6735K1519n0649j04564q0472k7164
6037b4891k031K1033M8355M5908K0236q48l7821p8973p0099j5993M5395P2281
6025B2552N7297M0010K9924N279k496K5212M6704L7478J1588p296j8126l14M4674
$$ plain form
6108 -104677 -53559 25147 68587 60696 51971 84699 134333 140836 100894 75081 81584 84509 76642
6095 76642 85422 132844 202871 269680 323992 350273 336687 293952 251110 239308 256757 282183
6083 282183 312171 325316 270420 152128 43794 -38597 -119628 -172560 -209993 -281443 -364546
6072 -364546 -404034 -377586 -314045 -278969 -332537 -448989 -543074 -555649 -485862 -389565 -315521
6061 -315521 -265549 -208997 -129631 -53170 18685 100414 161866 171768 135429 85146 40439 8395
6049 8395 -4079 15460 58144 99769 133052 169704 216439 237958 187309 82745 2273 -24891
6037 -24891 -26922 -5889 42466 88374 108610 107762 69941 -9032 -79131 -95124 -49729 22552
6025 22552 79849 119859 149783 155062 152566 177778 224482 261960 273548 266252 248126 247812 292486
6012B92486P9051R1868O1358j5042p4515q2536o2747n2606n6719n7415m0234m114
6000G8835J7257J0957j1891k1554J1963N9951P8435O3997L2214j613k2852m1972
5988B53727n4182l1359J8485N0990N6812L2684m690k7289l3569l5720l2387j4543
5976A78959Q129J7442q133m4305o5869o0101k9361J5916L7212K2581L712o183
5964F9999q24M703k2770o0040n9803m3992m0885l5015K72N9180J01022Q8379N1706
5951A11932K4658R453M862n485j6976J674J1476o395j8051j2742L326J1414j4462
5938A04684o7382r0554q2171p0539n2873j6785K1304K6092M633j8976l1061l0992
$$ plain form
6012 292486 371537 463405 524763 509721 435206 352670 289923 237317 180598 123183 82949 78835
6000 78835 96092 107049 95158 73604 85567 145518 223953 287950 320164 318551 295699 253727
5988 253727 199545 168186 186671 237661 294473 327157 322467 295178 261609 225889 193502 178959
5976 178959 187088 204530 196397 152092 86223 26122 -3239 12677 49889 72470 76182 69999
5964 69999 69175 73878 51108 -8932 -68735 -112727 -153612 -188627 -188355 -129175 -28153 60226 111932
5951 111932 136590 146043 150905 145420 128444 130118 141594 135199 117148 104406 107732 119146 104684
5938 104684 37302 -53252 -135423 -205962 -258835 -275620 -254316 -228224 -223591 -242567 -273628 -304620
$$ [...]
##END NTUPLES=NMR SPECTRUM
##END=
