##TITLE= 10.03.10
200.13MHz,DMSO
SerBB-383
##JCAMPDX= 5.0         $$ Bruker NMR JCAMP-DX V1.0
##DATA TYPE= NMR FID
##DATA CLASS= NTUPLES
##ORIGIN= UXNMR, Bruker Analytische Messtechnik GmbH
##OWNER= root
$$ XWIN-NMR		Version 2.1
$$ Thu May  6 06:02:16 2010 PDT (UT-7h)  anp
##.OBSERVE FREQUENCY= 200.13128668345
##.OBSERVE NUCLEUS= ^1H
##.DELAY= (6, 6)
##.ACQUISITION MODE= SIMULTANEOUS
##.AVERAGES= 1
##.DIGITISER RES= 18
##SPECTROMETER/DATA SYSTEM= spect
$$ Bruker specific parameters
$$ --------------------------
##$AQSEQ= 0
##$AQ_mod= 1
##$AUNM= <au_zg>
##$BF1= 200.13
##$BF2= 200.13
##$BF3= 200.13
##$BF4= 500.13
##$BF5= 500.13
##$BF6= 500.13
##$BF7= 500.13
##$BF8= 500.13
##$BYTORDA= 1
##$CFDGTYP= 0
##$CFRGTYP= 5
##$CNST= (0..31)
1 1 145 1 1 1 1 1 1 1 1 1 1 1 1 1 1 1 1 1 1 1 1 1 1 1 1 1 1 1 1 1 
##$CPDPRG= <>
##$CPDPRG1= <>
##$CPDPRG2= <>
##$CPDPRG3= <>
##$CPDPRG4= <mlev>
##$CPDPRG5= <mlev>
##$CPDPRG6= <mlev>
##$CPDPRG7= <mlev>
##$CPDPRG8= <mlev>
##$CPDPRGB= <>
##$CPDPRGT= <>
##$D= (0..31)
0 2 0 0 0 0 0 0 0 0 0 0.03 0 0 0 0 0 0 0 0 0 0 0 0 0 0 0 0 0 0 0 0 
##$DATE= 1273150854
##$DBL= (0..7)
120 120 120 120 120 120 120 120 
##$DBP= (0..7)
150 150 150 150 150 150 150 150 
##$DBP07= 0
##$DBPNAM0= <>
##$DBPNAM1= <>
##$DBPNAM2= <>
##$DBPNAM3= <>
##$DBPNAM4= <>
##$DBPNAM5= <>
##$DBPNAM6= <>
##$DBPNAM7= <>
##$DBPOAL= (0..7)
0.5 0.5 0.5 0.5 0.5 0.5 0.5 0.5 
##$DBPOFFS= (0..7)
0 0 0 0 0 0 0 0 
##$DE= 6
##$DECBNUC= <off>
##$DECIM= 32
##$DECNUC= <off>
##$DECSTAT= 4
##$DIGMOD= 1
##$DIGTYP= 9
##$DL= (0..7)
0 120 120 120 120 120 120 120 
##$DP= (0..7)
150 150 150 150 150 150 150 150 
##$DP07= 0
##$DPNAME0= <>
##$DPNAME1= <>
##$DPNAME2= <>
##$DPNAME3= <>
##$DPNAME4= <>
##$DPNAME5= <>
##$DPNAME6= <>
##$DPNAME7= <>
##$DPOAL= (0..7)
0.5 0.5 0.5 0.5 0.5 0.5 0.5 0.5 
##$DPOFFS= (0..7)
0 0 0 0 0 0 0 0 
##$DQDMODE= 0
##$DR= 18
##$DS= 0
##$DSLIST= <SSSSSSSSSSSSSSS>
##$DSPFIRM= 0
##$DSPFVS= 10
##$DTYPA= 0
##$EXP= <>
##$F1LIST= <111111111111111>
##$F2LIST= <222222222222222>
##$F3LIST= <333333333333333>
##$FCUCHAN= (0..9)
0 1 0 0 0 0 0 0 0 0 
##$FL1= 90
##$FL2= 90
##$FL3= 90
##$FL4= 90
##$FOV= 20
##$FQ1LIST= <freqlist>
##$FQ2LIST= <freqlist>
##$FQ3LIST= <freqlist>
##$FQ4LIST= <freqlist>
##$FQ5LIST= <freqlist>
##$FQ6LIST= <freqlist>
##$FQ7LIST= <freqlist>
##$FQ8LIST= <freqlist>
##$FS= (0..7)
83 83 83 83 83 83 83 83 
##$FTLPGN= 0
##$FW= 93750
##$GP031= 0
##$GPNAM0= <sine.100>
##$GPNAM1= <sine.100>
##$GPNAM10= <sine.100>
##$GPNAM11= <sine.100>
##$GPNAM12= <sine.100>
##$GPNAM13= <sine.100>
##$GPNAM14= <sine.100>
##$GPNAM15= <sine.100>
##$GPNAM16= <sine.100>
##$GPNAM17= <sine.100>
##$GPNAM18= <sine.100>
##$GPNAM19= <sine.100>
##$GPNAM2= <sine.100>
##$GPNAM20= <sine.100>
##$GPNAM21= <sine.100>
##$GPNAM22= <sine.100>
##$GPNAM23= <sine.100>
##$GPNAM24= <sine.100>
##$GPNAM25= <sine.100>
##$GPNAM26= <sine.100>
##$GPNAM27= <sine.100>
##$GPNAM28= <sine.100>
##$GPNAM29= <sine.100>
##$GPNAM3= <sine.100>
##$GPNAM30= <sine.100>
##$GPNAM31= <sine.100>
##$GPNAM4= <sine.100>
$$ [...]
0.5 0.5 0.5 0.5 0.5 0.5 0.5 0.5 0.5 0.5 0.5 0.5 0.5 0.5 0.5 0.5 
##$SPOFFS= (0..15)
0 0 0 0 0 0 0 0 0 0 0 0 0 0 0 0 
##$SW= 19.0423779955203
##$SWIBOX= (0..15)
0 0 3 0 0 0 0 0 0 0 0 0 0 0 0 0 
##$SW_h= 3810.9756097561
##$TD= 8192
##$TE= 300
##$TL= (0..7)
0 120 120 120 120 120 120 120 
##$TP= (0..7)
150 150 150 150 150 150 150 150 
##$TP07= 0
##$TPNAME0= <>
##$TPNAME1= <>
##$TPNAME2= <>
##$TPNAME3= <>
##$TPNAME4= <>
##$TPNAME5= <>
##$TPNAME6= <>
##$TPNAME7= <>
##$TPOAL= (0..7)
0.5 0.5 0.5 0.5 0.5 0.5 0.5 0.5 
##$TPOFFS= (0..7)
0 0 0 0 0 0 0 0 
##$TUNHIN= 0
##$TUNHOUT= 0
##$TUNXOUT= 0
##$USERA1= <user>
##$USERA2= <user>
##$USERA3= <user>
##$USERA4= <user>
##$USERA5= <user>
##$V9= 5
##$VCLIST= <CCCCCCCCCCCCCCC>
##$VD= 0
##$VDLIST= <DDDDDDDDDDDDDDD>
##$VPLIST= <PPPPPPPPPPPPPPP>
##$VTLIST= <TTTTTTTTTTTTTTT>
##$WBST= 1024
##$WBSW= 8
##$XGAIN= (0..3)
0 0 0 0 
##$XL= 0
##$YL= 0
##$YMAX_a= 0
##$YMIN_a= 0
##$ZL1= 120
##$ZL2= 120
##$ZL3= 120
##$ZL4= 120
##$ABSF1= 15.95049
##$ABSF2= -3.09201
##$ABSG= 0
##$ABSL= 0
##$ALPHA= 0
##$AQORDER= 0
##$ASSFAC= 0
##$ASSFACI= 0
##$ASSFACX= 0
##$ASSWID= 0
##$AUNMP= <proc_1d>
##$AZFE= 0.1
##$AZFW= 0.1
##$BCFW= 1
##$BC_mod= 2
##$BYTORDP= 1
##$COROFFS= 0
##$DATMOD= 1
##$DC= 2
##$DFILT= <>
##$DTYPP= 0
##$FCOR= 1
##$FTSIZE= 16384
##$FT_mod= 6
##$GAMMA= 1
##$GB= 0
##$INTBC= 1
##$INTSCL= 3.876899e-10
##$ISEN= 128
##$LB= -0.5
##$LEV0= 0
##$LPBIN= 0
##$MAXI= 10000
##$MC2= 0
##$MEAN= 0
##$ME_mod= 0
##$MI= 0.3374128
##$NCOEF= 0
##$NC_proc= -7
##$NLEV= 6
##$NOISF1= 3.799351
##$NOISF2= 2.8
##$NSP= 1
##$NTH_PI= 0
##$NZP= 0
##$OFFSET= 15.95049
##$PC= 1
##$PHC0= -285.2023
##$PHC1= 10.4
##$PH_mod= 1
##$PKNL= yes
##$PPARMOD= 0
##$PSCAL= 0
##$PSIGN= 0
##$REVERSE= no
##$SF= 200.13
##$SI= 16384
##$SIGF1= 3
##$SIGF2= 2
##$SINO= 400
##$SIOLD= 16384
##$SREGLST= <1H.CDCl3>
##$SSB= 0
##$STSI= 0
##$STSR= 0
##$SW_p= 3810.97560975609
##$SYMM= 0
##$S_DEV= 0
##$TDeff= 0
##$TDoff= 0
##$TI= <>
##$TILT= no
##$TM1= 0
##$TM2= 0
##$TOPLEV= 0
##$USERP1= <user>
##$USERP2= <user>
##$USERP3= <user>
##$USERP4= <user>
##$USERP5= <user>
##$WDW= 1
##$XDIM= 8192
##$YMAX_p= 279962416
##$YMIN_p= -14123450
$$ End of Bruker specific parameters
$$ ---------------------------------
##NTUPLES=NMR FID
##VAR_NAME=  TIME,          FID/REAL,        FID/IMAG,        PAGE NUMBER
##SYMBOL=    X,             R,               I,               N
##VAR_TYPE=  INDEPENDENT,   DEPENDENT,       DEPENDENT,       PAGE
##VAR_FORM=  AFFN,          ASDF,            ASDF,            AFFN
##VAR_DIM=   4096,          4096,            4096,            2
##UNITS=     SECONDS,       ARBITRARY UNITS, ARBITRARY UNITS,
##FIRST=     0,             0,               0,               1
##LAST=      1.074528,      -93,             98,              2
##MIN=       0,             -8169,           -6426,           1
##MAX=       1.074528,      6084,            8054,            2
##FACTOR=    0.0002624,     1,               1,               1
$$ Real data points
##PAGE= N=1
##DATA TABLE=(X++(R..R)), XYDATA
0 0 0 0 0 0 0 0 0 0 0 0 0 0 0 0 0 0 0 0 0 0 0 0 0 0 0 0 0 0 0 1 -1 1 -1 1 -1 1 -1 1 -1 2 -2 2 -2 2 -3 3 -3 3 -4 4 -5 5 -6 6 -7 8 -9 10 -11 13 -15 18 -23 29 -38 52 -79 137 -305 1585
70 1585 5947 -907 3962 4784 -8169 -3314 3351 -3608 1377 4885 -2955 1515 2063 -6244 2423 6084
86 6084 -4406 -428 2183 -5090 769 3042 -2283 5345 3982 -7058 -672 1782 -5391 1493 3881
101 3881 -1691 4028 1603 -5984 2358 2248 -5830 1584 2844 -3167 3119 1968 -3381 3997 810 -6606
117 -6606 2042 1948 -4151 3014 2018 -2905 3677 93 -4790 4220 1212 -5493 2308 1094 -3070 4188
133 4188 1379 -2290 4514 -1509 -6812 2649 879 -2798 4940 1709 -2423 2800 -2772 -4711 4790
148 4790 550 -3184 4375 78 -3465 3047 -714 -1509 5177 -1764 -4519 3262 -1293 -2759 5000 758
164 758 -1186 3288 -3617 -3908 4004 -1219 -1664 5500 -346 -2282 2695 -2706 -1484 4644 -2300 -2062 4508
181 4508 -2025 -2276 3932 -1218 -619 3390 -3725 -1777 4209 -2659 -1091 5041 -1471 -1186 2746 -3238
197 -3238 -438 3865 -3222 -411 4456 -2892 -1076 3538 -2428 -88 2845 -3742 -36 3691 -3297
212 -3297 164 4149 -2671 -324 2409 -3386 775 3279 -3387 863 3557 -3550 -139 2715 -2832
227 -2832 1032 2356 -3657 1255 2744 -3918 911 3194 -2944 830 1893 -3262 1783 2148 -3639 1982
243 1982 2638 -3848 933 1984 -3036 1856 1645 -3282 2280 1510 -4192 1822 2034 -3169 2025 1553 -2961
260 -2961 2383 886 -3629 2674 1452 -3534 2183 1196 -2938 2486 641 -3005 2940 403 -3836 2457
276 2457 923 -2768 2806 731 -2380 2882 -442 -3433 3076 469 -2811 3042 526 -2402 2563
291 2563 -632 -2552 3210 -572 -2894 3184 -78 -2402 3079 -162 -1873 2950 -1310 -2531 3263
306 3263 -741 -2019 3657 -295 -1818 2763 -1586 -2052 3088 -1525 -1829 3720 -779 -1507 3125 -1450
322 -1450 -1542 2790 -2137 -1359 3785 -1242 -1153 3385 -1540 -1331 2590 -2120 -755 3270 -2243 -1089 3299
339 3299 -1745 -694 3195 -1764 -703 2175 -2973 -564 3474 -1525 364 3477 -2348 -1209 1581
354 1581 -2797 338 3422 -1819 394 2568 -3120 -639 2368 -1992 859 2542 -2885 40 2186
369 2186 -2605 1012 3261 -2027 275 1129 -3626 503 2483 -1980 1900 2750 -3113 -223 905 -3019
385 -3019 1435 2453 -2031 1843 1656 -3514 761 1737 -2384 1680 1703 -2667 1305 925 -2919 2056 1911
402 1911 -2532 1501 839 -3176 1265 918 -2157 2739 1568 -2568 1619 353 -3155 1611 909 -1772
418 -1772 2874 896 -2715 1698 12 -2895 2123 863 -1740 2482 -67 -2732 2134 112 -2080
433 -2080 2937 586 -2277 1792 -625 -2204 2821 368 -1399 2973 -646 -3021 1716 -475 -1476
448 -1476 3303 152 -1540 2275 -1522 -2506 2702 -76 -968 3133 -768 -1972 2059 -1333 -1323 3361
464 3361 -469 -1364 2289 -1649 -1735 2520 -861 -523 3166 -1381 -1664 2113 -1592 -900 3031 -788 -401
481 -401 2435 -2136 -1256 2443 -1488 -391 2974 -1374 -819 1884 -2170 -447 2675 -1533 -18 2643
497 2643 -2084 -747 2105 -1782 213 2671 -1800 35 2059 -2500 -208 2341 -1767 430 2205
512 2205 -2329 33 1842 -2354 534 2433 -1964 500 1792 -2470 512 1900 -2152 1024 2066
527 2066 -2396 528 1550 -2385 869 1677 -2149 1148 1457 -2581 1002 1543 -2316 1150 1520 -2151
543 -2151 1248 1173 -2294 1484 1245 -2388 1419 1222 -2294 1370 928 -2273 1563 863 -2280 1717 885
560 885 -2279 1618 686 -2164 1875 726 -2073 1961 495 -2288 1808 463 -1990 2048 322 -2070
576 -2070 1973 6 -2171 2160 280 -1920 2139 35 -1905 2098 -181 -1729 2456 -162 -1852
591 -1852 2337 -223 -1783 2199 -385 -1593 2265 -607 -1604 2429 -525 -1523 2352 -628 -1449 2290
607 2290 -768 -1297 2466 -745 -1200 2446 -867 -1224 2233 -1113 -1157 2345 -1079 -952 2487 -1083 -992 2192
625 2192 -1330 -907 2240 -1286 -511 2571 -1319 -616 2353 -1511 -716 2123 -1551 -352 2264 -1605
641 -1605 -191 2340 -1764 -437 2035 -1874 -281 2096 -1658 255 2347 -1732 62 1922 -2131
656 -2131 -87 1901 -1851 444 2165 -1839 340 1771 -2196 231 1643 -2087 520 1771 -1911
671 -1911 867 1930 -1919 639 1413 -2420 371 1399 -1773 1400 1890 -1920 846 920 -2719 614
687 614 1358 -1720 1470 1427 -2060 1111 955 -2160 1419 1159 -2231 1074 763 -2059 1803 1466 -1593
704 -1593 1550 230 -2956 855 508 -1574 2560 1420 -1768 1306 -277 -2686 1565 750 -1393 2274
720 2274 456 -2039 1677 138 -1707 2153 110 -2231 1399 -241 -1627 2532 707 -1124 1967
735 1967 -880 -2579 1498 -212 -1032 2906 425 -1232 1842 -950 -1954 1807 -592 -1255 2432 -288
751 -288 -1086 2324 -638 -1429 1859 -1107 -1375 2187 -614 -754 2530 -706 -929 2179 -1139 -1120 1896
768 1896 -1458 -1071 2300 -658 -47 2688 -1242 -1219 1179 -2256 -836 2810 -269 484 2477 -1850 -1276
785 -1276 1238 -1740 173 2784 -1148 -285 1605 -2014 -139 2411 -1098 83 1355 -2625 -655 1868
801 1868 -917 1442 2785 -1751 -700 448 -2696 335 2602 -631 1214 1630 -2564 -363 1077 -1794
817 -1794 1069 1914 -1934 379 1198 -1898 1139 1915 -1655 592 612 -2621 797 1688 -1229 1702 1469
834 1469 -2291 399 485 -2210 1290 1292 -1690 1450 1001 -1959 1358 854 -2141 1044 526 -1934 1740
851 1740 1202 -1415 1641 317 -2407 1099 420 -1638 1967 670 -1871 1395 170 -1728 1938 541
867 541 -1718 1393 -268 -1886 2091 763 -1022 2071 -279 -2307 1109 -263 -1107 2596 382 -1456
883 -1456 1505 -852 -1869 2041 149 -955 2074 -629 -1688 1775 -319 -788 2443 -549 -1562 1559
899 1559 -942 -1031 2477 -274 -881 1787 -1335 -1352 2059 -588 -504 2291 -1061 -1129 1801 -1060 -517 2374
917 2374 -918 -772 1719 -1386 -544 2236 -1020 -460 1787 -1631 -676 2026 -946 27 2014 -1584 -659
934 -659 1533 -1454 198 2385 -1181 -155 1489 -1894 -239 1842 -1252 359 1710 -1839 -78 1600
950 1600 -1541 477 1805 -1754 26 1300 -1775 683 1987 -1318 613 1209 -2257 199 1277 -1608
966 -1608 1066 1726 -1687 574 1022 -2028 712 1175 -1771 995 1220 -1761 1138 1301 -1687 983 820
983 820 -2088 817 870 -1573 1500 1175 -1630 1160 520 -2180 939 632 -1614 1551 941 -1440 1533
1000 1533 545 -1859 1191 241 -1840 1498 614 -1334 1830 516 -1635 1324 -134 -1928 1400 145
1016 145 -1310 2074 434 -1318 1691 -192 -1791 1428 -233 -1338 2045 154 -1033 2025 -293
1031 -293 -1536 1500 -692 -1520 1850 -198 -842 2226 -274 -1070 1691 -914 -1394 1739 -612 -781 2233
1048 2233 -333 -710 1927 -924 -1185 1477 -1144 -906 2032 -513 -255 2233 -895 -977 1349 -1435 -770
1065 -770 1971 -639 -4 2135 -1087 -610 1585 -1355 -491 1716 -1264 -380 1752 -1059 154 2082
1081 2082 -1199 -347 1159 -2018 -401 1907 -738 794 2167 -1442 -452 830 -2006 167 1957 -1001
1097 -1001 596 1526 -1786 20 1386 -1465 514 1403 -1825 130 1214 -1341 1143 1905 -1404 313
1113 313 572 -2352 314 1453 -922 1437 1471 -1800 260 445 -1993 897 1312 -1323 1120 996 -1683
1130 -1683 919 919 -1566 997 645 -1809 1030 848 -1376 1452 889 -1605 952 264 -1879 1096 569
1147 569 -1368 1598 749 -1353 1395 220 -1870 1078 171 -1397 1806 703 -1114 1487 -174 -1870
1163 -1870 1199 54 -1174 1876 219 -1403 1374 -211 -1276 1802 130 -1176 1444 -552 -1452 1795
1179 1795 180 -650 1975 -426 -1626 1052 -719 -862 2206 78 -731 1529 -979 -1417 1558 -340
1195 -340 -477 2027 -591 -1003 1438 -780 -569 2008 -599 -764 1417 -1154 -793 1851 -530 -251 1721
1212 1721 -1140 -816 1433 -1023 -194 1965 -862 -308 1559 -1208 -352 1660 -1057 -184 1521 -1236
1228 -1236 -148 1606 -1182 -34 1528 -1403 -168 1458 -1174 208 1592 -1298 66 1327 -1369
1243 -1369 280 1527 -1298 234 1257 -1512 239 1358 -1262 479 1204 -1556 300 1134 -1375 679
1259 679 1347 -1377 495 961 -1537 637 1181 -1267 807 943 -1597 637 834 -1466 898 988 -1449
1276 -1449 802 747 -1510 917 772 -1390 1071 730 -1447 1046 655 -1458 1077 585 -1433 1128 515
1293 515 -1388 1176 387 -1466 1202 401 -1337 1285 331 -1386 1209 230 -1193 1465 312 -1227
1309 -1227 1297 -20 -1369 1354 175 -1039 1534 19 -1279 1216 -196 -1095 1567 19 -985
1324 -985 1461 -288 -1177 1474 -121 -834 1580 -294 -1030 1356 -453 -851 1646 -306 -796 1468 -661
1341 -661 -951 1485 -464 -587 1653 -568 -720 1421 -777 -596 1683 -541 -493 1551 -843 -613 1445
1358 1445 -781 -362 1596 -828 -428 1393 -1012 -371 1550 -848 -221 1495 -976 -271 1398 -974
1374 -974 -76 1493 -1033 -141 1325 -1148 -74 1404 -1033 67 1266 -1199 -21 1210 -1122 245
1390 245 1385 -1112 217 1192 -1268 172 1210 -1138 366 1151 -1246 356 1071 -1271 453 1082 -1293
1407 -1293 402 920 -1312 589 1104 -1136 670 838 -1423 545 807 -1246 900 1018 -1227 684
1423 684 603 -1432 720 707 -1167 950 659 -1343 836 592 -1220 1039 626 -1290 832 348 -1265
1440 -1265 1114 635 -981 1148 214 -1481 802 216 -1079 1362 499 -1005 1049 -14 -1299 1113
1456 1113 211 -903 1379 131 -1122 1164 35 -932 1349 33 -1042 1098 -293 -1030 1391 67
1472 67 -714 1383 -266 -1114 1072 -351 -756 1534 -41 -606 1399 -454 -897 1228 -496 -707 1459
1489 1459 -316 -566 1372 -546 -679 1245 -609 -546 1392 -545 -515 1344 -596 -400 1462 -541 -384
1506 -384 1208 -905 -547 1253 -594 -11 1597 -694 -484 938 -1122 -367 1409 -468 188 1364 -1025
1523 -1025 -388 1038 -915 157 1454 -814 -121 949 -1120 63 1344 -717 228 956 -1362 -153
1539 -153 1040 -802 577 1388 -974 15 658 -1293 339 1226 -773 550 897 -1300 224 859 -1015
1556 -1015 607 944 -1162 347 700 -1062 729 946 -1063 486 577 -1234 637 855 -905 764 565
1573 565 -1226 571 588 -995 879 552 -1210 659 445 -1018 989 628 -1040 731 211 -1114 1017
1590 1017 597 -794 1012 185 -1266 779 289 -772 1238 309 -1076 751 -129 -989 1243 365 -738
1607 -738 1077 -117 -1077 1040 115 -643 1254 -71 -963 993 -163 -696 1356 -19 -827 953 -417
1624 -417 -836 1246 -19 -493 1245 -391 -813 1104 -315 -554 1281 -305 -616 1170 -306 -411 1262
1641 1262 -511 -692 942 -620 -398 1448 -207 -270 1083 -815 -686 1048 -454 -33 1368 -593 -365
1658 -365 1034 -708 -154 1313 -632 -325 815 -972 -155 1380 -327 215 1061 -1160 -540 741 -789
1675 -789 371 1576 -476 43 735 -1197 -119 999 -716 324 1039 -985 49 942 -782 382
1691 382 963 -1068 -28 585 -989 542 1259 -548 537 702 -1332 -10 582 -890 668 1056 -729
1708 -729 532 602 -1163 322 532 -1070 528 712 -822 797 835 -842 585 372 -1197 478 436 -853
1726 -853 932 744 -775 776 335 -1113 513 148 -1041 840 519 -621 1126 442 -962 615 -83
1743 -83 -1139 820 369 -535 1231 342 -829 791 -146 -1061 818 41 -734 1104 230 -559 1141 -8
1761 -8 -842 771 -327 -875 1057 111 -355 1376 36 -731 734 -518 -891 936 -127 -337 1347 -69
1779 -69 -538 981 -451 -720 904 -387 -445 1206 -148 -220 1254 -349 -524 800 -769 -604 1062 -262
1797 -262 4 1369 -364 -375 753 -884 -450 1057 -431 44 1270 -488 -158 984 -692 -178 925
1814 925 -803 -189 947 -588 213 1285 -567 -113 645 -1152 -266 925 -440 548 1284 -707 -70 569
1832 569 -1101 71 1001 -613 339 890 -883 213 837 -741 319 663 -1084 130 715 -693 715
1849 715 1086 -699 277 334 -1203 314 765 -601 786 781 -919 367 393 -990 527 570 -865 595
1867 595 541 -775 794 573 -873 562 258 -1030 686 557 -639 892 377 -927 621 196 -881
1884 -881 827 268 -861 794 269 -700 978 303 -826 632 -70 -864 1005 357 -477 1016 -41
1901 -41 -990 643 -27 -574 1144 137 -678 762 -239 -693 1092 108 -491 948 -312 -793 931 -7
1919 -7 -281 1190 -232 -725 723 -404 -452 1235 -63 -431 874 -561 -608 1031 -175 -195 1096 -478
1937 -478 -514 914 -401 -172 1191 -408 -407 826 -581 -185 1135 -410 -230 828 -753 -304 1063 -372
1955 -372 57 1050 -733 -351 775 -576 155 1181 -532 -117 729 -841 9 1057 -506 78 753 -939
1973 -939 -96 884 -504 423 996 -858 -126 514 -863 371 1158 -456 326 597 -1082 58 705 -669
1991 -669 544 836 -885 212 560 -848 494 777 -781 359 458 -938 516 768 -595 677 552
2008 552 -1015 318 396 -851 657 622 -691 688 428 -901 527 289 -924 615 459 -661 858
2025 858 471 -793 625 125 -906 744 357 -649 876 224 -855 709 175 -687 840 114 -842 704
2043 704 23 -592 1111 332 -581 748 -261 -981 765 131 -304 1223 84 -739 635 -398 -723 1043
2061 1043 86 -407 977 -235 -650 931 -131 -359 1048 -322 -639 805 -324 -288 1245 -93 -388
2078 -388 802 -630 -643 847 -254 -77 1211 -319 -393 799 -593 -374 1006 -372 -140 1020 -461
2095 -461 -211 947 -511 -174 909 -641 -237 858 -545 -19 1039 -479 -28 837 -742 -149 840 -626
2113 -626 126 1025 -551 81 794 -787 -31 723 -727 186 878 -649 241 774 -802 167 728 -768
2131 -768 260 740 -743 357 769 -713 405 673 -853 284 583 -812 413 712 -712 466 541 -861
2149 -861 378 491 -797 571 634 -736 553 525 -788 537 456 -791 572 377 -798 644 439 -722
2167 -722 674 328 -870 588 267 -752 760 379 -650 774 204 -800 724 206 -705 828 210
2184 210 -703 765 101 -706 819 115 -671 817 -12 -687 884 68 -572 931 -1 -632 788 -106 -572
2203 -572 956 -30 -506 924 -180 -615 858 -170 -477 965 -164 -494 864 -267 -456 971 -219
2220 -219 -377 966 -301 -437 918 -298 -301 971 -337 -319 896 -466 -331 926 -391 -215 966 -425
2238 -425 -263 877 -495 -177 973 -425 -86 905 -579 -167 892 -540 -59 901 -546 -64 805 -655
2256 -655 -28 880 -587 76 844 -678 19 818 -643 146 860 -622 140 727 -746 169 771 -692
2274 -692 223 730 -731 205 707 -719 284 676 -729 300 656 -716 425 664 -736 346 570 -784
2292 -784 408 600 -704 455 477 -820 471 513 -728 539 457 -801 475 426 -710 688 523 -695
2310 -695 544 237 -842 634 431 -591 782 300 -822 525 132 -685 807 333 -652 704 82 -749
2328 -749 787 270 -555 808 60 -771 685 87 -493 978 144 -608 682 -191 -736 830 93 -397 967
2347 967 -46 -585 760 -163 -530 917 -57 -424 909 -135 -454 885 -197 -472 861 -255 -425 875
2365 875 -270 -369 946 -226 -298 907 -352 -427 784 -393 -218 1048 -168 -109 893 -572 -484 673
2383 673 -469 -49 1123 -263 -120 719 -701 -261 856 -392 57 904 -570 -176 762 -461 150 972
2401 972 -546 -177 527 -786 47 1014 -289 300 764 -848 -248 486 -634 392 1023 -421 209 563
2419 563 -862 89 701 -564 336 676 -743 219 621 -599 440 654 -767 176 367 -804 442 772
2437 772 -440 556 511 -832 221 300 -737 550 605 -555 592 452 -792 400 275 -778 513 383
2455 383 -580 672 420 -632 580 231 -756 569 252 -640 673 304 -554 759 256 -642 578 14
2473 14 -794 627 202 -437 939 267 -572 582 -120 -732 687 147 -374 936 112 -550 678 -98 -585
2492 -585 732 -50 -493 781 -51 -378 931 -14 -432 715 -279 -573 749 -77 -222 1006 -67 -368
2510 -368 690 -409 -499 784 -221 -216 923 -223 -265 793 -345 -303 782 -388 -230 807 -316 -89
2528 -89 948 -304 -193 707 -552 -271 747 -370 31 927 -404 -98 663 -606 -143 740 -433 51
2546 51 807 -470 36 744 -511 53 670 -599 22 683 -531 196 789 -491 129 528 -716 77 631
2565 631 -486 356 714 -577 194 519 -649 262 626 -535 320 520 -646 342 568 -595 366 442 -735
2584 -735 305 462 -536 531 528 -616 372 310 -682 495 468 -538 527 331 -659 473 352 -553 564
2603 564 264 -661 503 243 -537 660 296 -606 505 136 -595 678 305 -466 631 80 -645 579
2621 579 159 -421 783 122 -583 518 -24 -486 771 132 -408 667 -84 -531 729 85 -339 748
2639 748 -130 -542 608 -80 -281 873 -38 -416 586 -303 -443 780 -22 -200 789 -219 -349 676
2657 676 -210 -246 747 -263 -296 728 -202 -111 811 -275 -307 541 -431 -192 824 -187 -41 724 -422 -221
2677 -221 689 -317 -29 722 -417 -118 700 -311 150 800 -438 -209 404 -622 16 883 -126 241 599
2696 599 -691 -200 478 -444 318 845 -395 69 446 -582 201 723 -380 159 373 -762 103 624 -240
2715 -240 519 626 -679 -68 179 -647 465 804 -222 450 357 -777 127 359 -481 472 501 -526 352 355 -500
2736 -500 460 376 -591 292 182 -593 505 496 -336 562 291 -613 326 140 -578 528 314 -399 640 310 -483
2757 -483 425 17 -655 418 192 -301 813 316 -422 464 -102 -618 565 189 -294 690 37 -473 564
2776 564 54 -338 657 -71 -560 445 -114 -268 925 263 -231 532 -361 -644 494 27 -15 969 27 -365
2796 -365 412 -338 -360 692 -27 -155 634 -228 -281 692 -106 -101 670 -335 -370 493 -228 -10 893 -51 -96 484
2818 484 -542 -333 558 -220 51 798 -219 -101 542 -415 -112 579 -356 -7 620 -309 72 680 -334
2837 -334 10 501 -493 -27 536 -362 141 635 -362 106 513 -478 40 464 -472 161 603 -343 255 545 -476
2858 -476 78 360 -536 205 560 -356 307 475 -488 172 355 -501 272 437 -437 330 438 -440 363 423 -481
2879 -481 266 268 -511 326 390 -380 449 319 -511 302 212 -495 425 310 -369 484 256 -440 427 211 -440 453
2901 453 177 -449 494 203 -391 519 163 -432 439 45 -437 541 151 -333 568 102 -411 494 30 -354 573
2922 573 65 -299 558 0 -358 574 -20 -338 573 -43 -332 558 -25 -250 606 -52 -285 565 -112 -256 608
2943 608 -76 -201 615 -140 -242 559 -167 -186 615 -164 -173 579 -203 -168 605 -195 -135 597 -237 -108 585 -232
2965 -232 -85 612 -277 -101 568 -281 -53 566 -292 -54 544 -316 -15 562 -299 34 562 -369 19 527 -305
2986 -305 81 535 -372 68 476 -358 121 538 -347 78 447 -447 130 527 -328 215 489 -417 129 397 -416
3007 -416 265 516 -378 226 383 -451 210 410 -364 309 365 -460 213 315 -420 353 406 -392 305 282 -472 318
3029 318 342 -331 450 303 -447 316 198 -451 419 293 -363 430 205 -451 364 177 -366 512 251 -357 444
3050 444 110 -436 442 201 -312 512 114 -408 401 40 -349 549 184 -314 498 -2 -428 472 87 -216 614
3071 614 74 -354 434 -88 -322 572 90 -209 545 -122 -365 465 -55 -169 656 -25 -241 464 -205 -278 597
3092 597 -19 -97 603 -169 -258 453 -175 -94 660 -118 -133 472 -295 -194 537 -129 17 613 -223 -172 451 -294
3114 -294 -30 666 -131 28 518 -360 -140 455 -234 84 623 -263 -39 406 -428 30 566 -206 121 507 -397
3135 -397 -13 448 -281 221 575 -323 61 347 -472 95 518 -242 238 423 -458 42 317 -392 284 523 -300
3156 -300 228 331 -470 186 394 -313 310 390 -419 186 301 -376 315 391 -364 269 238 -447 279 325 -291 423
3178 423 330 -392 303 183 -433 380 283 -304 431 241 -408 333 150 -403 408 205 -336 443 167 -384 416
3199 416 149 -332 463 138 -360 430 77 -331 511 141 -295 463 13 -400 428 54 -259 566 74 -269 459
3220 459 -64 -326 527 55 -214 552 -10 -268 492 -66 -222 541 -70 -228 511 -134 -212 553 -49 -164 529
3241 529 -149 -216 514 -143 -88 597 -135 -147 514 -201 -143 543 -173 -75 553 -236 -90 510 -202 -51 515 -241
3263 -241 -59 519 -233 0 534 -241 -3 502 -291 -5 487 -274 35 483 -303 25 450 -329 72 476 -307
3284 -307 109 435 -330 125 451 -315 148 444 -338 142 411 -334 162 399 -378 176 374 -364 236 404 -339
3305 -339 240 363 -396 215 334 -334 310 375 -353 276 314 -386 274 299 -355 312 263 -358 323 276 -340 347
3327 347 228 -405 321 219 -308 435 296 -326 337 133 -380 375 201 -277 441 174 -377 405 140 -321 440
3348 440 117 -324 391 81 -277 533 184 -242 446 -31 -402 401 91 -160 570 74 -280 406 -93 -313 494
3369 494 21 -198 508 -1 -228 507 -15 -178 470 -103 -262 472 -71 -102 607 -41 -185 419 -213 -223 463
3390 463 -110 -52 576 -94 -77 516 -180 -151 428 -230 -92 547 -82 48 521 -256 -160 379 -272 -12 547 -145
3412 -145 14 467 -268 -8 507 -221 20 408 -350 -17 487 -136 218 568 -304 -105 220 -433 110 588 -72
3433 -72 260 423 -445 -41 315 -306 247 536 -259 121 318 -336 242 462 -265 135 206 -484 123 437 -164
3454 -164 417 417 -419 56 124 -425 323 474 -157 391 267 -427 196 222 -331 324 282 -314 322 262 -280 377 236
3477 236 -382 239 139 -354 390 276 -211 443 180 -317 336 98 -365 360 145 -242 470 215 -249 373 8
3498 8 -420 281 56 -171 580 207 -220 373 -54 -343 420 96 -186 471 -26 -282 439 60 -146 503 -61
3519 -61 -324 310 -112 -152 638 152 -61 402 -247 -365 355 -29 -5 631 -12 -175 360 -188 -154 504 -58 -113 424
3542 424 -213 -112 522 -49 -8 463 -225 -175 362 -188 35 575 -92 -8 400 -300 -96 438 -166 58 482 -219
3564 -219 10 446 -223 60 403 -286 11 408 -214 135 488 -221 71 334 -318 85 411 -233 153 409 -295
3585 -295 106 361 -271 177 340 -325 137 347 -257 252 388 -270 164 261 -348 190 353 -218 261 296 -336
3606 -336 197 260 -296 289 300 -273 259 244 -295 311 283 -247 288 194 -328 293 236 -257 354 201 -303 282 148
3629 148 -270 367 199 -260 350 144 -271 362 165 -222 388 136 -243 355 113 -236 392 84 -260 378 73
3650 73 -220 421 96 -222 377 29 -219 411 58 -152 452 16 -181 413 -6 -188 421 -5 -183 426 -20
3671 -20 -157 422 -63 -168 421 -83 -146 442 -40 -84 464 -78 -110 408 -116 -115 437 -64 -50 454 -113 -100 389
3694 389 -148 -73 420 -133 -15 431 -130 7 439 -151 -26 373 -214 -8 434 -111 80 420 -197 -25 331
3715 331 -240 46 437 -160 96 401 -219 40 356 -239 104 372 -222 97 351 -215 178 401 -242 92 251
3736 251 -315 109 363 -144 238 382 -275 87 221 -288 192 359 -173 222 271 -265 184 280 -239 243 229 -291
3758 -291 195 248 -211 301 279 -241 202 141 -302 271 271 -161 368 234 -255 236 121 -290 278 169 -196 352
3780 352 177 -222 310 114 -257 328 136 -201 354 122 -187 345 110 -205 357 62 -213 314 57 -190 390
3801 390 139 -132 366 -22 -261 291 32 -118 481 123 -118 332 -76 -228 350 47 -74 434 -17 -161 328
3822 328 -46 -90 442 5 -124 310 -106 -132 414 36 0 422 -108 -184 302 -110 -4 489 -4 -21 316 -177
3844 -177 -120 357 -82 28 438 -121 -41 353 -130 32 409 -112 8 349 -188 16 381 -116 101 376 -160
3865 -160 6 289 -205 71 359 -121 110 337 -206 61 277 -211 108 361 -139 131 305 -210 102 291 -195
3886 -195 166 310 -194 149 264 -204 174 298 -192 178 249 -230 156 244 -180 238 299 -190 165 172 -248 196
3908 196 245 -154 259 213 -237 207 183 -207 261 208 -179 249 167 -216 262 186 -170 302 145 -224 261 116 -186
3931 -186 314 155 -181 283 106 -210 300 103 -163 332 112 -168 311 76 -167 324 85 -159 328 72 -147
3952 -147 335 37 -149 313 32 -139 347 34 -130 342 26 -94 333 -5 -93 339 -12 -91 356 -15 -84 347
3974 347 -26 -92 326 -42 -80 322 -62 -41 358 -43 -49 336 -65 -44 344 -79 -4 362 -86 -25 352 -103 -28 347
3998 347 -101 -9 317 -96 13 331 -121 41 323 -129 22 310 -117 66 347 -134 56 292 -177 43 300
4019 300 -151 90 298 -143 53 274 -170 111 301 -172 118 278 -162 153 287 -150 149 257 -194 116 270
4040 270 -176 176 277 -176 156 216 -194 166 231 -158 211 259 -166 201 205 -172 196 190 -185 187 182 -172 240 195
4064 195 -158 238 143 -223 213 161 -151 281 204 -147 255 112 -217 251 143 -146 291 148 -148 267 118 -155
4086 -155 287 114 -182 253 82 -144 321 150 -93
4095i3          $$ checkpoint
$$ Imaginary data points
##PAGE= N=2
##DATA TABLE=(X++(I..I)), XYDATA
0 0 0 0 0 0 0 0 0 0 0 0 0 0 0 0 0 1 -1 1 -1 1 -1 2 -2 2 -3 3 -4 4 -5 5 -6 7 -8 9 -10 12 -13 15 -16 18 -20 23 -25 28 -31 34 -37 41 -45 50 -55 61 -67
53 -67 74 -82 90 -100 112 -125 141 -159 182 -211 248 -299 372 -486 693 -1184 4703 1615 -4744 2527
73 2527 -5232 -3552 3656 -1457 1488 7399 -4673 -4017 4545 -2273 -1576 4632 -3006 -1249 2856 -5226
89 -5226 142 8054 -1670 -1159 3381 -4963 -2754 2376 -3355 2783 6865 -3882 -1110 3811 -4857 -1908
105 -1908 2830 -3112 1686 3949 -4425 1723 5280 -4768 -1158 2934 -4104 369 2894 -3222 3188
120 3188 3954 -5632 471 3645 -4572 147 2411 -3833 1909 2362 -4114 3698 4208 -5231 6 1313
136 1313 -5011 1655 3020 -1976 4630 2224 -6426 537 1334 -4638 2537 3008 -2631 2792 152 -5179
152 -5179 3469 2438 -4194 2443 1202 -4539 1784 861 -2055 5368 1211 -5221 1909 -254 -4955 2892
168 2892 2097 -1436 3978 -817 -4720 3183 -162 -3984 3981 1163 -3148 2769 -577 -2535 4473 -534
184 -534 -3728 3594 -837 -3957 3443 270 -1688 4010 -1618 -3351 3700 -1549 -3203 4355 -114 -2218
200 -2218 3344 -1565 -1861 4181 -2038 -2674 4182 -1517 -2685 3638 -940 -1168 3489 -2715 -1982 3918
216 3918 -2396 -1956 4437 -1206 -1555 3003 -2392 -936 3701 -2652 -1002 4177 -2490 -1696 3342 -2032
232 -2032 -571 3182 -2914 -543 3468 -3192 -783 3908 -2251 -592 2838 -2914 24 3152 -3174
247 -3174 260 3792 -3093 -602 2699 -2883 301 2677 -3146 963 3075 -3806 39 2999 -2982
262 -2982 415 2457 -2918 1222 2325 -3605 1306 2886 -3557 541 2182 -3168 1050 1972 -2966 1999
278 1999 2067 -3946 1018 1823 -3450 1394 2055 -2577 2103 1396 -3606 1806 1556 -3513 1686 1622 -2899
295 -2899 1904 1019 -2939 2525 1041 -3711 1833 943 -3234 2093 1137 -2224 2872 396 -3390 2391
311 2391 375 -3411 2450 958 -2322 2713 174 -2660 2678 -472 -3405 2686 238 -2546 2990
326 2990 337 -2194 2668 -844 -2754 3024 -362 -2458 3097 -206 -2231 2799 -612 -1848 3132
341 3132 -1245 -2811 2615 -927 -1806 3523 -112 -1254 2643 -2210 -2655 2809 -930 -1017 3928 -580
357 -580 -1693 1982 -2249 -1451 3319 -1256 -1041 3078 -2012 -1860 2725 -1083 -244 3132 -2195 -1531 2189
374 2189 -2460 -589 4014 -753 -300 2261 -3048 -1480 2211 -2081 434 3799 -1862 -794 1894 -2868
390 -2868 -383 2707 -2011 458 2746 -2804 -417 2474 -2050 530 2545 -2484 91 1713 -3179
405 -3179 393 2842 -1934 776 2166 -2848 -60 1206 -2883 1230 2669 -2105 1147 1903 -3110 142
421 142 1332 -2373 1614 2069 -2468 1141 1238 -3271 922 1759 -2114 1605 1201 -3055 1017 1022 -2541 2173
439 2173 1987 -2307 1185 243 -3245 1573 1318 -1871 2635 1179 -3171 845 51 -2601 2369 1253
455 1253 -1904 2211 -11 -3304 1708 732 -1841 2619 564 -2430 1632 -466 -2395 2784 685 -1970
471 -1970 2223 -417 -2764 1757 -148 -1487 3024 -20 -2223 2012 -817 -2211 2525 79 -1234
486 -1234 2677 -819 -2214 2133 -815 -1589 2853 -374 -1498 2169 -1408 -1800 2571 -777 -1136 2854
502 2854 -976 -1646 2122 -1300 -1045 2840 -1015 -950 2561 -1690 -1505 2433 -1189 -740 2600 -1494 -958
519 -958 2192 -1959 -781 2817 -1380 -586 2408 -1835 -697 2207 -1776 -193 2623 -1825 -463 2190
535 2190 -2035 -340 2203 -1927 -30 2239 -2121 -142 2136 -2034 49 2107 -2004 238 2014
550 2014 -2197 341 2023 -2229 292 2006 -2092 350 1677 -2296 566 1677 -2358 777 1874
565 1874 -2313 595 1530 -2258 883 1540 -2158 1170 1470 -2531 937 1371 -2324 1173 1323 -2286 1197
582 1197 993 -2505 1273 1141 -2287 1456 1023 -2298 1479 848 -2311 1632 869 -2289 1600 752 -2197
599 -2197 1651 587 -2159 1733 351 -2324 1808 483 -2153 1854 421 -1974 1850 88 -2011
614 -2011 2012 67 -2024 2143 234 -1870 2016 -108 -1962 1918 -372 -1861 2223 -172 -1689
629 -1689 2263 -328 -1772 2058 -605 -1672 2272 -468 -1423 2430 -527 -1432 2226 -923 -1544 2151
645 2151 -995 -1325 2486 -752 -1146 2343 -1077 -1319 1993 -1330 -1034 2528 -992 -757 2531 -1213 -1097
662 -1097 1983 -1469 -837 2187 -1417 -578 2396 -1383 -610 2210 -1625 -811 1807 -1808 -415 2391
678 2391 -1171 133 2330 -1879 -756 1534 -2049 -84 2426 -1347 229 1943 -2154 -321 1736
693 1736 -1885 202 1854 -2081 120 1854 -1754 795 2233 -1981 -96 939 -2609 462 2118
708 2118 -1256 1416 1797 -2708 -267 748 -2378 1074 2051 -1531 1104 1110 -2544 756 1355 -1984 1133
725 1133 1073 -2455 847 1194 -1621 1826 1383 -2295 549 23 -2730 1342 1484 -1213 2061 904 -2489
742 -2489 766 80 -2319 1600 965 -1557 1949 625 -1996 1548 155 -2352 1364 186 -1851 1947
758 1947 523 -1566 1936 -25 -2081 1695 -150 -1996 1790 -35 -1529 2383 376 -1275 1957
773 1957 -881 -2550 1282 -552 -1028 3121 490 -1229 1514 -1600 -2353 1786 -207 -514 2819 -558
789 -558 -1628 1624 -1013 -937 2637 -633 -1472 1379 -1597 -1131 2729 22 -106 2069 -2101 -2255 1208
806 1208 -1137 122 3390 -268 -678 1226 -2357 -1215 2140 -814 72 2297 -1641 -899 1794 -1317
822 -1317 0 2165 -1759 -839 1317 -1840 199 2724 -950 129 1515 -2427 -657 1583 -1524 579
838 579 2229 -1597 115 1549 -2026 137 1487 -2146 144 1649 -1653 824 1975 -1755 261 932
854 932 -2414 529 1726 -1518 1028 1437 -2200 397 1156 -1836 1006 1237 -2207 533 885 -1874 1485
871 1485 1694 -1742 726 356 -2584 899 1294 -1177 1856 983 -2383 571 254 -1944 1717 1185 -1728
888 -1728 1161 161 -2228 1447 875 -1430 1649 126 -2322 1304 424 -1421 2138 546 -1958 1152
904 1152 -301 -1824 1972 463 -1440 1716 -380 -2062 1697 108 -1291 2052 -213 -1785 1581
919 1581 -337 -1233 2230 -205 -1572 1611 -671 -1380 2151 -162 -1149 1713 -1033 -1631 1854 -390
935 -390 -689 2282 -772 -1440 1526 -1031 -959 2314 -481 -810 1779 -1239 -1043 1976 -886 -658 1952
952 1952 -1355 -1073 1799 -985 -269 2253 -1134 -807 1459 -1710 -549 2192 -910 11 2049 -1571
968 -1571 -698 1488 -1583 -205 1896 -1435 -86 1808 -1556 -44 1758 -1655 -206 1450 -1800 98
984 98 1881 -1265 496 1690 -1829 -60 1162 -1977 280 1663 -1426 628 1570 -1741 299 1067 -2033
1001 -2033 358 1234 -1676 892 1567 -1535 820 1130 -2051 405 816 -1918 965 1290 -1482 1210
1017 1210 1034 -2015 614 530 -2091 956 964 -1483 1541 1028 -1698 1091 387 -2125 998 485 -1672
1034 -1672 1619 893 -1449 1444 276 -2026 1008 -1 -1827 1615 590 -1319 1803 357 -1684
1049 -1684 1300 -194 -1852 1424 95 -1246 2034 345 -1281 1560 -489 -2027 1179 -301 -1175 2104
1065 2104 223 -1033 1711 -609 -1646 1522 -460 -1168 1872 -353 -1075 1914 -311 -898 1811 -902
1081 -902 -1570 1252 -995 -815 2443 -34 -521 1693 -1438 -1658 1275 -877 -243 2529 -491 -669 1508
1098 1508 -1451 -910 1849 -900 -536 1647 -1353 -664 1843 -782 41 1906 -1564 -1052 1092 -1523
1114 -1523 -10 2426 -531 159 1412 -1992 -832 1243 -1332 310 2019 -1190 -61 1350 -1667
1129 -1667 -86 1472 -1486 63 1325 -1563 340 1661 -1289 466 1348 -1803 7 1073 -1666
1144 -1666 521 1505 -1341 681 1222 -1766 308 826 -1945 506 1272 -1289 1110 1303 -1663 463
1160 463 505 -1989 856 1214 -1287 1150 836 -1922 643 651 -1549 1194 796 -1780 768 398 -1607 1482
1178 1482 1059 -1331 1062 73 -2158 884 620 -994 1863 639 -1726 769 -252 -1759 1519 646
1194 646 -1145 1427 -39 -1767 1225 181 -1101 1700 22 -1588 1230 -182 -1214 1846 207
1209 207 -1197 1300 -569 -1524 1487 -120 -890 1814 -356 -1314 1417 -506 -1072 1740 -379 -1004 1584
1226 1584 -575 -899 1749 -582 -953 1561 -827 -969 1670 -606 -692 1620 -893 -869 1544 -817 -556
1243 -556 1743 -873 -695 1543 -976 -513 1744 -823 -488 1440 -1201 -539 1574 -976 -238 1591 -1217
1260 -1217 -516 1363 -1147 -137 1627 -1053 -163 1350 -1376 -147 1500 -1164 100 1470 -1361 -80
1276 -80 1262 -1361 109 1325 -1347 187 1256 -1450 221 1252 -1422 301 1236 -1415 409 1194
1292 1194 -1429 424 1057 -1499 529 1091 -1490 540 963 -1585 535 1003 -1378 775 913 -1534
1308 -1534 613 759 -1499 877 974 -1330 839 643 -1629 740 654 -1337 1062 659 -1492 826 391
1325 391 -1547 1038 656 -1293 1061 370 -1515 1025 391 -1233 1298 370 -1377 1054 96 -1399 1291
1342 1291 316 -1180 1234 5 -1409 1168 -20 -1144 1473 74 -1221 1270 -171 -1206 1401
1357 1401 -29 -981 1451 -254 -1180 1303 -337 -1017 1516 -277 -1025 1354 -459 -1031 1425 -372
1373 -372 -792 1479 -538 -889 1425 -528 -737 1541 -519 -738 1358 -741 -772 1423 -640 -534 1475
1390 1475 -780 -680 1336 -842 -564 1507 -700 -415 1414 -907 -411 1389 -910 -331 1402 -1009
1406 -1009 -386 1327 -991 -193 1419 -1024 -254 1157 -1228 -170 1358 -955 136 1404 -1196 -162
1422 -162 1077 -1232 109 1304 -1078 197 1111 -1344 90 1111 -1195 289 1060 -1348 145 1005
1438 1005 -1161 560 1175 -1173 327 695 -1523 375 1059 -1015 764 977 -1380 289 524 -1409
1454 -1409 686 934 -1118 722 621 -1436 649 722 -1176 818 605 -1350 667 500 -1178 1065 690
1471 690 -1231 760 202 -1499 786 462 -1033 1190 483 -1224 852 67 -1339 1001 283 -1055 1246
1488 1246 332 -1134 998 21 -1218 1039 32 -1055 1202 22 -1103 1144 -39 -996 1253 -62
1504 -62 -1056 1046 -281 -949 1358 68 -653 1327 -414 -1258 923 -376 -696 1564 -16 -702 1041
1521 1041 -735 -1055 1186 -266 -437 1453 -507 -868 1061 -527 -464 1501 -419 -646 976 -960 -634
1538 -634 1450 -327 -216 1290 -972 -856 934 -778 -124 1584 -590 -337 1017 -1086 -366 1317 -679
1555 -679 -110 1183 -1019 -334 1110 -804 57 1187 -1060 -266 964 -1020 94 1297 -849 6 910
1572 910 -1146 67 1136 -883 233 936 -1179 90 990 -944 340 938 -1198 54 721 -1061
1588 -1061 532 1044 -1041 268 582 -1294 426 1004 -829 622 648 -1378 269 580 -990 841 817 -1170
1606 -1170 410 351 -1268 682 750 -927 737 366 -1276 674 538 -917 940 431 -1260 594 263
1623 263 -996 1020 532 -986 726 36 -1215 841 285 -912 992 200 -1039 932 217 -884 939
1640 939 -40 -1130 871 107 -695 1297 120 -1025 717 -385 -1051 1094 183 -581 1136 -287 -1011
1657 -1011 966 -162 -639 1212 -247 -949 907 -317 -494 1445 -65 -716 746 -891 -979 1130 -76
1674 -76 -109 1490 -478 -910 673 -782 -486 1367 -257 -289 1118 -721 -525 1156 -492 -330 974 -908
1692 -908 -596 996 -488 53 1382 -603 -439 656 -1135 -401 1186 -390 206 1254 -755 -284 733
1709 733 -1038 -203 951 -792 57 1128 -713 93 955 -1007 -164 677 -1045 105 1044 -662 409
1726 409 1039 -959 22 623 -1160 76 755 -853 528 1027 -781 366 575 -1293 52 481 -1008
1743 -1008 630 1001 -676 619 558 -1200 234 356 -1075 605 715 -834 723 622 -970 498 264
1760 264 -1239 420 324 -906 921 718 -712 784 220 -1280 372 119 -934 973 583 -651 926
1777 926 170 -1152 547 -42 -1031 815 263 -714 1051 270 -754 840 -126 -1088 663 -113 -737 1206
1795 1206 341 -531 994 -250 -1096 581 -358 -708 1198 92 -502 1049 -283 -845 862 -335 -688
1812 -688 975 -297 -542 1126 -127 -372 1110 -499 -885 630 -641 -497 1313 -3 -147 1039 -749
1829 -749 -827 686 -601 -209 1327 -294 -287 925 -668 -372 1008 -565 -321 820 -814 -299 1112 -382
1847 -382 75 1047 -875 -539 575 -856 47 1256 -384 133 845 -1002 -259 747 -801 106 958 -771
1865 -771 57 842 -787 155 760 -979 -18 665 -908 326 1000 -692 268 634 -1053 166 684 -825
1883 -825 388 695 -931 338 688 -855 422 540 -1085 191 443 -822 720 787 -809 424 253
1900 253 -1176 442 613 -643 773 464 -1066 372 252 -848 801 468 -938 495 107 -1001 783
1917 783 532 -651 744 65 -1104 588 215 -619 1059 274 -940 560 -92 -863 943 281 -694 744
1935 744 -169 -924 848 89 -585 993 -101 -899 758 -59 -562 1077 -59 -785 729 -299 -624 1107
1953 1107 -13 -586 814 -493 -821 912 -91 -290 1077 -378 -712 754 -412 -375 1172 -253 -520
1970 -520 736 -590 -453 1113 -186 -263 853 -781 -660 820 -391 10 1277 -421 -468 621 -812
1987 -812 -294 1089 -341 -11 939 -798 -352 833 -590 -24 945 -756 -258 746 -706 66 1037 -611
2005 -611 -26 684 -968 -103 845 -636 235 935 -749 62 632 -942 37 700 -821 252 859 -702
2023 -702 270 663 -980 82 558 -862 430 837 -727 375 557 -994 305 617 -840 395 469 -977
2041 -977 366 549 -709 655 544 -1024 228 170 -968 706 768 -518 715 247 -1164 314 179 -766
2059 -766 888 529 -810 552 79 -976 701 309 -731 711 58 -952 711 244 -562 983 154
2076 154 -941 499 -164 -824 929 280 -506 908 -137 -964 622 -127 -682 955 65 -606 862 -164
2094 -164 -674 863 -153 -630 870 -255 -645 939 -136 -470 948 -268 -644 737 -447 -553 959
2111 959 -241 -342 1025 -342 -503 796 -501 -459 945 -356 -244 996 -457 -359 826 -607 -380 886
2129 886 -526 -258 896 -555 -189 911 -598 -190 831 -689 -204 893 -567 -22 935 -644 -122
2146 -122 744 -781 -97 810 -663 85 853 -750 -12 761 -783 38 736 -760 125 746 -729 205 775
2165 775 -766 158 641 -884 154 676 -753 316 700 -811 236 501 -908 323 618 -786 417
2182 417 578 -854 379 524 -825 455 500 -860 435 397 -856 527 466 -828 524 331 -907 490
2200 490 349 -765 689 379 -812 570 201 -882 637 298 -735 708 185 -825 625 114 -777
2217 -777 753 151 -750 705 79 -796 748 113 -676 807 27 -720 753 -39 -677 863 -3 -637 819
2236 819 -124 -716 779 -142 -603 875 -122 -602 838 -243 -598 894 -177 -490 904 -237 -557 812
2254 812 -321 -445 914 -306 -469 835 -440 -462 889 -361 -341 911 -417 -393 830 -462 -283 931
2272 931 -445 -267 886 -536 -284 845 -527 -205 816 -614 -204 832 -569 -134 834 -646 -147
2289 -147 805 -613 -45 869 -611 -44 726 -716 23 793 -675 18 695 -798 28 749 -653 204 712
2308 712 -816 24 542 -784 310 810 -635 241 539 -927 145 598 -674 435 618 -848 203
2325 203 427 -835 446 602 -754 341 347 -905 425 555 -617 589 421 -923 333 263 -818 628
2343 628 525 -668 522 218 -917 440 259 -740 693 328 -727 600 227 -767 609 201 -731 652
2361 652 169 -702 699 111 -696 724 89 -745 648 -30 -762 680 55 -525 926 87 -649 604
2379 604 -266 -795 782 90 -357 976 -91 -721 538 -362 -564 929 -53 -421 804 -370 -595 834
2397 834 -134 -316 877 -397 -641 658 -323 -205 1138 -142 -408 575 -742 -608 799 -171 4 1036
2415 1036 -447 -483 553 -634 -277 960 -329 -151 800 -567 -211 842 -432 -91 725 -702 -292 688
2433 688 -543 115 980 -489 -105 533 -841 -170 707 -523 241 896 -565 53 584 -820 -36 607 -676
2452 -676 191 750 -580 217 592 -777 91 480 -794 219 620 -641 331 628 -657 301 486 -813
2470 -813 199 382 -778 417 656 -550 482 422 -902 128 237 -762 514 578 -539 539 331 -850
2488 -850 351 274 -727 519 342 -677 557 330 -639 588 232 -812 397 59 -731 668 366 -486
2506 -486 709 109 -793 437 -26 -652 740 215 -513 727 28 -693 592 -63 -650 643 -41 -570 754
2525 754 16 -481 765 -121 -649 581 -201 -510 816 22 -333 803 -233 -604 598 -308 -457 815
2543 815 -155 -351 765 -282 -432 726 -310 -371 721 -359 -344 838 -239 -212 801 -394 -388 587 -477
2562 -477 -240 825 -306 -112 738 -530 -314 632 -476 -112 792 -445 -125 681 -508 -41 731 -513
2580 -513 -88 616 -617 -42 725 -453 62 621 -663 -82 558 -597 125 722 -558 75 541 -662
2598 -662 123 618 -562 161 495 -685 152 561 -580 261 501 -721 130 445 -613 361 559 -630
2616 -630 209 324 -730 352 525 -522 410 332 -762 238 339 -589 481 403 -682 318 215 -683 494
2635 494 385 -584 411 123 -705 486 322 -473 595 168 -767 373 58 -568 666 281 -541 495 -16
2654 -16 -688 541 79 -541 611 32 -566 648 93 -466 633 -66 -622 504 -34 -407 791 34 -482
2673 -482 533 -241 -547 639 -34 -401 649 -191 -435 703 -41 -298 664 -349 -593 511 -193 -150 963
2692 963 -65 -373 404 -586 -492 687 -78 -18 805 -376 -433 494 -347 -111 805 -318 -298 469 -494 -91 874
2713 874 -140 -52 487 -757 -449 498 -266 230 937 -305 -194 324 -744 -137 678 -289 163 653 -527
2732 -527 -56 536 -495 66 515 -606 -55 462 -468 235 686 -467 63 357 -692 35 464 -477 319
2751 319 598 -472 224 409 -675 49 292 -650 308 551 -362 420 377 -709 58 170 -617 438 537 -417
2771 -417 375 258 -630 332 312 -521 342 140 -716 331 315 -341 651 310 -670 128 -119 -680 561 483 -192
2792 -192 639 48 -786 234 -2 -451 655 265 -453 438 -33 -533 576 109 -466 450 -141 -606 534
2811 534 157 -235 728 4 -566 287 -257 -476 701 128 -206 665 -138 -528 444 -222 -388 607 -116 -295
2831 -295 618 -135 -293 611 -222 -365 502 -259 -276 653 -122 -160 630 -289 -317 508 -361 -280 583 -226 -123 661
2853 661 -249 -159 523 -429 -228 501 -311 -13 703 -281 -111 510 -478 -186 485 -382 -25 565 -402 -34 537
2874 537 -422 -22 501 -481 -63 479 -418 88 597 -377 84 415 -576 -18 417 -460 145 519 -443 85 369
2895 369 -527 106 404 -489 196 421 -482 231 420 -480 226 333 -545 175 318 -496 301 368 -488 254 245 -577
2917 -577 241 290 -497 341 291 -483 317 228 -513 349 215 -496 363 195 -495 386 200 -462 376 117 -517 374
2939 374 89 -463 464 152 -438 435 75 -471 432 89 -426 474 50 -430 447 -3 -421 486 26 -445 470
2960 470 -44 -387 506 -40 -354 510 -82 -358 528 -75 -326 525 -110 -345 500 -138 -303 547 -155 -292 504
2981 504 -200 -303 554 -151 -254 532 -235 -248 524 -211 -175 556 -252 -249 489 -292 -168 569 -237 -147 480 -359
3003 -359 -195 504 -277 -34 556 -331 -144 468 -369 -46 548 -301 -21 465 -417 -79 465 -344 43 495 -415
3024 -415 -40 391 -447 54 510 -328 102 404 -491 18 397 -403 155 461 -409 89 333 -520 116 383 -413
3045 -413 216 384 -486 105 317 -471 232 411 -412 200 280 -518 201 307 -411 336 323 -474 194 159 -521 302
3067 302 315 -382 348 190 -545 221 178 -397 444 287 -436 284 66 -524 357 218 -334 461 111 -514 304
3088 304 35 -411 501 181 -363 388 -35 -486 400 93 -281 544 42 -454 358 -66 -392 534 69 -275 475
3109 475 -130 -461 402 -61 -234 612 -20 -331 378 -211 -354 530 10 -151 564 -188 -358 396 -208 -201 607
3130 607 -109 -231 432 -299 -293 526 -130 -96 557 -304 -279 410 -291 -105 637 -144 -128 408 -412 -235 466 -229
3152 -229 14 570 -308 -187 367 -387 -64 541 -238 -17 432 -401 -67 473 -329 63 486 -398 -57 378 -397
3173 -397 59 498 -322 91 389 -467 3 372 -379 160 478 -356 121 350 -476 66 358 -420 183 395 -414
3194 -414 149 310 -485 148 321 -419 210 295 -453 211 289 -411 281 323 -438 213 185 -480 273 300 -366 327
3216 327 231 -511 233 130 -467 351 238 -387 340 139 -478 327 154 -401 395 128 -419 346 104 -370 426
3237 426 109 -395 358 5 -428 407 71 -315 445 4 -402 402 -15 -365 480 20 -300 439 -53 -336 461
3258 461 -54 -314 446 -82 -338 465 -82 -286 473 -109 -288 443 -156 -245 500 -133 -235 479 -191 -248 480
3279 480 -157 -203 486 -210 -217 460 -244 -171 476 -209 -175 465 -238 -144 465 -257 -97 456 -306 -86 455 -286 -71
3302 -71 474 -299 -90 414 -350 -74 452 -285 -1 443 -357 -33 408 -359 32 453 -361 37 394 -365 86
3323 86 404 -382 48 351 -437 83 392 -342 154 371 -443 38 301 -408 189 402 -335 187 294 -438 143
3344 143 306 -392 197 258 -455 201 288 -341 290 272 -446 172 140 -464 319 343 -295 353 193 -486 188 108 -421
3367 -421 363 233 -356 316 128 -411 309 130 -396 306 64 -390 383 161 -284 432 73 -436 267 3 -376
3388 -376 430 137 -279 459 11 -380 364 -64 -404 364 17 -263 527 50 -282 382 -168 -394 380 -57 -182
3409 -182 542 -29 -286 391 -146 -274 462 -128 -282 392 -184 -211 545 -33 -127 415 -309 -391 317 -146 -13 664
3431 664 -57 -164 278 -419 -294 430 -116 0 534 -272 -203 372 -249 -25 501 -278 -170 303 -324 12 610
3452 610 -87 12 310 -498 -237 299 -246 181 596 -224 -34 274 -464 -48 387 -264 108 395 -336 78 381
3473 381 -319 77 313 -428 17 324 -335 219 414 -315 123 248 -456 68 267 -360 199 359 -301 247 300
3494 300 -405 95 123 -475 196 338 -217 351 255 -479 84 98 -389 294 293 -275 289 140 -396 311 197 -313
3516 -313 293 48 -488 238 175 -224 502 185 -401 154 -97 -451 395 253 -147 439 25 -461 230 0 -288
3537 -288 448 91 -312 333 -34 -292 443 54 -295 300 -150 -382 381 44 -132 506 -42 -343 288 -165 -257
3558 -257 466 -16 -171 415 -118 -245 373 -144 -231 360 -174 -223 457 -83 -124 417 -201 -229 353 -194 -109 458
3580 458 -145 -103 396 -235 -152 395 -199 -113 354 -256 -105 415 -182 -29 389 -290 -128 338 -265 2 461 -187
3602 -187 -9 318 -325 -60 358 -263 41 373 -305 -7 317 -300 58 354 -305 41 294 -331 100 373 -291
3623 -291 92 271 -351 64 297 -300 144 298 -341 87 252 -348 160 270 -334 161 240 -344 152 270 -324
3644 -324 206 217 -332 194 217 -321 217 192 -344 205 153 -336 240 181 -303 246 130 -344 231 122 -313 302
3666 302 159 -291 290 105 -296 271 87 -326 292 56 -295 335 77 -284 290 23 -312 280 23 -267 364
3687 364 65 -226 347 -32 -293 300 -20 -256 363 1 -225 350 -58 -243 348 -89 -261 332 -59 -195 415
3708 415 -29 -171 347 -134 -245 333 -119 -136 430 -79 -165 329 -177 -215 343 -136 -136 359 -160 -126 382 -135 -80
3731 -80 362 -198 -162 294 -197 -33 441 -129 -34 308 -311 -158 285 -202 26 406 -182 -37 281 -267 -38 340
3753 340 -219 11 301 -272 9 347 -206 60 282 -309 -20 226 -276 95 372 -191 91 249 -359 8 243
3774 243 -280 133 315 -225 135 233 -320 85 204 -309 138 256 -257 162 212 -305 162 192 -279 161 188 -315
3796 -315 175 202 -253 264 214 -258 143 64 -352 189 179 -182 310 171 -338 123 59 -324 275 201 -183 258 64
3819 64 -315 222 92 -217 318 67 -326 192 11 -229 354 121 -218 248 -72 -336 266 87 -109 401 40
3840 40 -270 217 -81 -228 337 70 -159 322 -77 -257 288 -50 -165 361 -51 -208 273 -91 -136 365 -40
3861 -40 -126 289 -134 -219 279 -102 -99 390 -91 -138 284 -185 -149 293 -120 -65 352 -127 -92 304 -180 -97 321 -155
3885 -155 -43 333 -189 -68 290 -184 -42 334 -188 -69 256 -240 -28 338 -167 48 305 -232 -43 259 -211
3906 -211 47 338 -165 15 251 -272 9 258 -208 89 258 -244 35 222 -242 79 265 -207 84 207 -243
3927 -243 106 258 -231 139 228 -265 88 198 -275 131 213 -234 147 156 -265 154 186 -244 160 180 -233 173 166 -238
3951 -238 174 154 -241 197 144 -245 208 133 -244 210 104 -238 219 91 -243 226 100 -221 246 93 -241 231
3973 231 57 -244 235 47 -217 264 40 -210 259 8 -235 250 22 -187 281 8 -189 283 9 -174 275
3994 275 -11 -166 300 -13 -155 280 -34 -156 273 -64 -148 242 -72 -143 300 -41 -110 300 -92 -161 268 -122
4016 -122 -116 302 -94 -80 283 -118 -111 282 -127 -97 300 -118 -64 285 -126 -78 289 -153 -71 268 -161 -59 296 -131
4040 -131 -6 296 -166 -59 231 -201 -21 283 -147 8 287 -178 -12 266 -209 32 255 -178 45 257 -181
4061 -181 69 253 -215 9 206 -232 39 242 -177 112 229 -234 44 166 -234 98 240 -180 112 220 -215
4082 -215 100 186 -235 123 176 -253 136 176 -201 180 185 -253 98
4095I8          $$ checkpoint
##END NTUPLES=NMR FID
##END=
