##TITLE=C13
SL61-Dau(rechrom)
 15.09.2022
##JCAMPDX= 6.0         $$ Bruker NMR JCAMP-DX V2.0
##DATA TYPE= NMR SPECTRUM
##DATA CLASS= NTUPLES
##ORIGIN= UXNMR, Bruker Analytische Messtechnik GmbH
##OWNER= root
$$ TOPSPIN		Version 1.3
$$ 2023-08-07 10:03:27.421 +0400  Irina@DPX200
$$ Compression mode = diff/dup
##.OBSERVE FREQUENCY= 50.32789651
##.OBSERVE NUCLEUS= ^13C
##.ACQUISITION MODE= SIMULTANEOUS
##.ACQUISITION SCHEME= undefined
##.AVERAGES= 100
##.DIGITISER RES= 17
##SPECTROMETER/DATA SYSTEM= spect
##.PULSE SEQUENCE= zgpg30
##.SOLVENT NAME= CDCl3
##.SHIFT REFERENCE= INTERNAL, CDCl3, 1, 222.6533
##AUDIT TRAIL= $$ (NUMBER, WHEN, WHO, WHERE, WHAT)
$$ ##TITLE= Audit trail, TOPSPIN		Version 1.3
$$ ##JCAMPDX= 5.01
$$ ##ORIGIN= Bruker BioSpin GmbH
$$ ##OWNER= Irina
$$ $$ F:/spectra/data/iren/nmr/c13 she/1/pdata/1/auditp.txt
$$ ##AUDIT TRAIL=  $$ (NUMBER, WHEN, WHO, WHERE, VERSION, WHAT)
(   1,<2023-08-07 10:02:13.531 +0400>,<Irina>,<DPX200>,<TOPSPIN 1.3>,
      <created by zg
	started at 2023-08-07 09:56:20.734 +0400,
	POWCHK disabled, PULCHK disabled
       configuration hash MD5:
       BE 6D 3F 07 2A EA 11 49 91 17 2B D3 AF B3 58 0D
       data hash MD5: 32K
       E6 93 77 8B 47 E4 FF 43 DE B7 52 63 52 9F 73 8D>)
(   2,<2023-08-07 10:02:26.718 +0400>,<Irina>,<DPX200>,<TOPSPIN 1.3>,
      <Start of raw data processing
       efp BC_mod = 2 LB = 3 FT_mod = 6 PKNL = 1 PHC0 = 71.56116 PHC1 = -1.101521 SI = 32K 
       data hash MD5: 32K
       1B 33 37 77 44 69 C7 2B 24 D6 D1 E3 54 FF 35 02>)
(   3,<2023-08-07 10:02:29.187 +0400>,<Irina>,<DPX200>,<TOPSPIN 1.3>,
      <apk 
       data hash MD5: 32K
       3F 66 6C 0D C8 30 B6 C8 69 0A ED A8 4C 47 C2 90>)
(   4,<2023-08-07 10:03:11.671 +0400>,<Irina>,<DPX200>,<TOPSPIN 1.3>,
      <abs n ABSG = 5 
       data hash MD5: 32K
       F0 B8 6B A7 04 9C 3B 3E 82 F9 39 E9 6D F7 9B 13>)
$$ ##END=
$$ 
$$ $$ hash MD5
$$ $$ F6 6C CA 80 87 5F 9B A3 F1 FF 37 9D 30 48 0B E7
##$RELAX= 
##$RELAX= 
##$RELAX= 
##$RELAX= 
##$RELAX= 
##$RELAX= 
##$RELAX= 
##$RELAX= 
##$RELAX= 
$$ Bruker specific parameters
$$ --------------------------
##$DU= <F:/spectra>
##$EXPNO= 1
##$NAME= <c13 she>
##$PROCNO= 1
##$TYPE= <nmr>
##$USER= <iren>
##$AMP= (0..31)
100 100 100 100 100 100 100 100 100 100 100 100 100 100 100 100 100 100 
100 100 100 100 100 100 100 100 100 100 100 100 100 100 
##$ANAVPT= -1
##$AQSEQ= 0
##$AQ_mod= 1
##$AUNM= <au_zg>
##$AUTOPOS= <>
##$BF1= 50.322709
##$BF2= 200.13
##$BF3= 50.322709
##$BF4= 500.13
##$BF5= 500.13
##$BF6= 500.13
##$BF7= 500.13
##$BF8= 500.13
##$BYTORDA= 1
##$CFDGTYP= 0
##$CFRGTYP= 5
##$CHEMSTR= <none>
##$CNST= (0..63)
1 1 145 1 1 1 1 1 1 1 1 1 1 1 1 1 1 1 1 1 1 1 1 1 1 1 1 1 1 1 1 1 1 1 
1 1 1 1 1 1 1 1 1 1 1 1 1 1 1 1 1 1 1 1 1 1 1 1 1 1 1 1 1 1 
##$CPDPRG= <waltz16>
##$CPDPRG1= <>
##$CPDPRG2= <waltz16>
##$CPDPRG3= <>
##$CPDPRG4= <mlev>
##$CPDPRG5= <mlev>
##$CPDPRG6= <mlev>
##$CPDPRG7= <mlev>
##$CPDPRG8= <mlev>
##$CPDPRGB= <>
##$CPDPRGT= <>
##$D= (0..63)
$$ [...]
##$SWIBOX= (0..15)
0 1 3 0 0 0 0 0 0 0 0 0 0 0 0 0 
##$SW_h= 12077.2946859903
##$TD= 32768
##$TD0= 1
##$TE= 300
##$TE2= 300
##$TE3= 300
##$TEG= 300
##$TL= (0..7)
120 120 120 120 120 120 120 120 
##$TP= (0..7)
150 150 150 150 150 150 150 150 
##$TP07= 0
##$TPNAME0= <>
##$TPNAME1= <>
##$TPNAME2= <>
##$TPNAME3= <>
##$TPNAME4= <>
##$TPNAME5= <>
##$TPNAME6= <>
##$TPNAME7= <>
##$TPOAL= (0..7)
0.5 0.5 0.5 0.5 0.5 0.5 0.5 0.5 
##$TPOFFS= (0..7)
0 0 0 0 0 0 0 0 
##$TUNHIN= 0
##$TUNHOUT= 0
##$TUNXOUT= 0
##$USERA1= <user>
##$USERA2= <user>
##$USERA3= <user>
##$USERA4= <user>
##$USERA5= <user>
##$V9= 5
##$VALIST= <valist>
##$VCLIST= <CCCCCCCCCCCCCCC>
##$VD= 0
##$VDLIST= <DDDDDDDDDDDDDDD>
##$VPLIST= <PPPPPPPPPPPPPPP>
##$VTLIST= <TTTTTTTTTTTTTTT>
##$WBST= 1024
##$WBSW= 4
##$XGAIN= (0..3)
0 0 0 0 
##$XL= 0
##$YL= 0
##$YMAX_a= 572136
##$YMIN_a= -323081
##$ZGOPTNS= <>
##$ZL1= 120
##$ZL2= 120
##$ZL3= 120
##$ZL4= 120
##$ABSF1= 222.6533
##$ABSF2= -17.34351
##$ABSG= 5
##$ABSL= 3
##$ALPHA= 0
##$AQORDER= 0
##$ASSFAC= 0
##$ASSFACI= 0
##$ASSFACX= 0
##$ASSWID= 0
##$AUNMP= <proc_1d>
##$AXLEFT= 0
##$AXRIGHT= 0
##$AXTYPE= 0
##$AXUNIT= <>
##$AZFE= 0.1
##$AZFW= 0.5
##$BCFW= 0
##$BC_mod= 2
##$BYTORDP= 0
##$COROFFS= 0
##$CY= -3
##$DATMOD= 1
##$DC= 0
##$DFILT= <>
##$DTYPP= 0
##$F1P= 0
##$F2P= 0
##$FCOR= 0.5
##$FTSIZE= 32768
##$FT_mod= 6
##$GAMMA= 0
##$GB= 0
##$INTBC= 1
##$INTSCL= 1.329259e-009
##$ISEN= 128
##$LB= 3
##$LEV0= 0
##$LPBIN= 0
##$MAXI= 10000
##$MC2= 0
##$MEAN= 0
##$ME_mod= 0
##$MI= 0.9312502
##$NCOEF= 0
##$NC_proc= -4
##$NLEV= 6
##$NOISF1= 120.0001
##$NOISF2= 80.00006
##$NSP= 0
##$NTH_PI= 0
##$NZP= 0
##$OFFSET= 222.6533
##$PC= 1.4
##$PHC0= -17.07728
##$PHC1= 35.19776
##$PH_mod= 1
##$PKNL= yes
##$PPARMOD= 0
##$PPDIAG= 0
##$PPIPTYP= 0
##$PPMPNUM= 100
##$PPRESOL= 1
##$PSCAL= 0
##$PSIGN= 0
##$REVERSE= no
##$SF= 50.3227306370915
##$SI= 32768
##$SIGF1= 140
##$SIGF2= 120
##$SINO= 35.31775
##$SIOLD= 32768
##$SREGLST= <13C.CDCl3>
##$SSB= 0
##$STSI= 32768
##$STSR= 0
##$SW_p= 12077.2946859903
##$SYMM= 0
##$S_DEV= 0
##$TDeff= 32768
##$TDoff= 0
##$TI= <>
##$TILT= no
##$TM1= 0
##$TM2= 0
##$TOPLEV= 0
##$USERP1= <user>
##$USERP2= <user>
##$USERP3= <user>
##$USERP4= <user>
##$USERP5= <user>
##$WDW= 1
##$XDIM= 32768
##$YMAX_p= 276383594
##$YMIN_p= -5471554
$$ End of Bruker specific parameters
$$ ---------------------------------
##NTUPLES= NMR SPECTRUM
##VAR_NAME=  FREQUENCY,     SPECTRUM/REAL,   SPECTRUM/IMAG
##SYMBOL=    X,             R,               I
##VAR_TYPE=  INDEPENDENT,   DEPENDENT,       DEPENDENT
##VAR_FORM=  AFFN,          ASDF,            ASDF
##VAR_DIM=   32768,         32768,           32768
##UNITS=     HZ,            ARBITRARY UNITS, ARBITRARY UNITS
##FACTOR=    0.368581032318806, 1,           1
##FIRST=     12077.2946859903, 829269,       1138453
##LAST=      0,             804733,          -903875
##MIN=       0,             -5471554,        0
##MAX=       12077.2946859903, 276383594,    0
$$ Real data points
##PAGE= N=1
##DATA TABLE= (X++(R..R)), XYDATA
$$ [...]
22779h89501L55853J73590p9548l09040l91234k85222o9985J17058J75000R7367
$$ -889501 -533648 -360058 -439606 -748646 -1139880 -1425102 -1495087 -1378029 -1203029 -1105662
22769a105662m0414j24814p6178Q8887K69222L92050M61760M92541M63480L33351
$$ -1105662 -1146076 -1270890 -1347068 -1258181 -988959 -596909 -135149 357392 820872 1154223
22759A154223J02765j42159k81699k57325j24321j4406n762m9164k5164J13599
$$ 1154223 1256988 1114829 833130 575805 451484 437078 431316 382152 356988 470587
22749D70587K75007L34944K56849Q4549r5061j90056j49979K063J66161K34251
$$ 470587 745594 1080538 1337387 1421936 1326875 1136819 986840 988903 1155064 1389315
22739A389315J77782O7054j3392l5768j777N3439M2081r2461k68663l59592l36835
$$ 1389315 1567097 1634151 1620759 1584991 1583214 1636653 1678734 1586273 1317610 958018 621183
22728F21183k34465q1016Q4013J86863J70430P5989J2703K3777P4545J32935J90393
$$ 621183 386718 305702 389715 576578 747008 822997 835700 859477 934022 1066957 1257350
22717A257350K25482K33841K55105L11956L79613M07036L56230K22509M3081j32319
$$ 1257350 1482832 1716673 1971778 2283734 2663347 3070383 3426613 3649122 3692203 3559884
22707C559884k73981l74204m57841n48595o16072o13923n34991m12609l05781
$$ 3559884 3285903 2911699 2453858 1905263 1289191 675268 140277 -272332 -578113
22698e78113k56301k28622j49203j0845J12847J60891J45459J07300Q4529J09144
$$ -578113 -834414 -1063036 -1212239 -1223084 -1110237 -949346 -803887 -696587 -612058 -502914
22688e02914J74668K38527K58588J92844L0118j57756k73787k98484k72532k05810
$$ -502914 -328246 -89719 168869 361713 391831 234075 -39712 -338196 -610728 -816538
22678h16538p9491J04182L09672M52205M56213L36379J39723j13166l80159n82128
$$ -816538 -896029 -791847 -482175 -29970 426243 762622 902345 789179 409020 -173108
22668a73108o33886m94615k12679J02447L42640M66024N16916N48988N49062M66501
$$ -173108 -806994 -1301609 -1514288 -1411841 -1069201 -603177 -86261 462727 1011789 1478290
22658A478290K91424P0864r9815j26725l3950P7384J62378J90220J04299p8076
$$ 1478290 1769714 1840578 1740763 1614038 1580088 1657472 1819850 2010070 2114369 2036293
22648B036293k54294l39760l14414k28340j55709j42821k01542k80915l03550
$$ 2036293 1781999 1442239 1127825 899485 743776 600955 399413 118498 -185052
22639a85052k52489j69324r1717m2604l8824o8741q7620m5539N3782J44998J82897
$$ -185052 -437541 -606865 -698582 -741186 -780010 -848751 -936371 -981910 -928128 -783130 -600233
22628f00233J78779J75575K17476L06662L81419L66460K61409J30884Q167j00891
$$ -600233 -421454 -245879 -28403 278259 659678 1026138 1287547 1418431 1426598 1325707
22618A325707j68384j74610j32826p0133j9431Q607N1840J14560J35339P3158
$$ 1325707 1157323 982713 849887 779754 760323 768930 820770 935330 1070669 1143827
22608A143827n1838j85842k81248l22641l34679l52275l76833l91610m02448m41973
$$ 1143827 1091989 906147 624899 302258 -32421 -384696 -761529 -1153139 -1555587 -1997560
22598a997560n15123n44274m50922k39654L0438K74434M08473M01515K80964J18289
$$ -1997560 -2512683 -3056957 -3507879 -3747533 -3717095 -3442661 -3034188 -2632673 -2351709 -2233420
22588b233420k199k2140P5719K35417L37386L03864J87864J13029J40971K06584
$$ -2233420 -2235619 -2257759 -2182040 -1946623 -1609237 -1305373 -1117509 -1004480 -863509 -656925
22578f56925J99505Q1526q3863j91036j86905j02244J033R3589J72712K06802
$$ -656925 -457420 -375894 -459757 -650793 -837698 -939942 -938909 -845320 -672608 -465806
22568d65806J49538M1210j0641M3140J62653K59540K55205J62020O2610J7965
$$ -465806 -316268 -275058 -285699 -242559 -79906 179634 434839 596859 659469 677434
22558F77434L7679P9615Q4761L8644j2389j4674N4510J71091K71903K96350K31427
$$ 677434 715113 794728 879489 918133 905744 891070 945580 1116671 1388574 1684924 1916351
22547A916351J05484m1095j78669l00553l97659m65482n09540m85264l35861q8293
$$ 1916351 2021835 1980740 1802071 1501518 1103859 638377 128837 -356427 -692288 -780581
22537g80581J53393L08666L73872L59434K70590J57508P7020K1452n279K1618
$$ -780581 -627188 -318522 55350 414784 685374 842882 919902 941354 936075 957693
22527I57693L9650l5160j78551k96793l20572k34272q3982N5573J63702K50473
$$ 957693 997343 962183 783632 486839 166267 -68005 -151987 -96414 67288 317761
22517C17761K87964K38150J32017M6785j9025j25985k67218l68659l86157l34275
$$ 317761 605725 843875 975892 1022677 1003652 877667 610449 241790 -144367 -478642
22507d78642k35945j09607J658L4162k0882r3724j18568n6497R1802K36373K67377
$$ -478642 -714587 -824194 -822536 -788374 -809256 -902980 -1021548 -1078045 -986243 -749870 -482493
22496d82493J65376r242j83192k94996l19864l00979l06446l39707l49010k90635
$$ -482493 -317117 -326359 -509551 -804547 -1124411 -1425390 -1731836 -2071543 -2420553 -2711188
22486b711188j70695m5588K4391J8374k4133l4414n082J567n2712j41298j82717
$$ -2711188 -2881883 -2927471 -2903080 -2884706 -2908839 -2943253 -2948335 -2946768 -2999480 -3140778 -3323495
22475c323495j11021K4699J02044N7185m4869p4242L5276K51061M92234O74478
$$ -3323495 -3434516 -3409817 -3307773 -3250588 -3295457 -3369699 -3334423 -3083362 -2591128 -1916650
22465a916650P35097O42195M03392P9927k27854m21921m70494m30790l66369k77918
$$ -1916650 -1181553 -539358 -135966 -56039 -283893 -705814 -1176308 -1607098 -1973467 -2251385
22455b251385j36593L7324J61347J99971J94854J59852R9927O2048N9555M2147
$$ -2251385 -2387978 -2350654 -2189307 -1989336 -1794482 -1634630 -1534703 -1472655 -1413100 -1370953
22445a370953K784J4886J21237K77721M25479N34562N61781M67048K86974J16256
$$ -1370953 -1368169 -1353283 -1232046 -954325 -528846 5716 567497 1034545 1321519 1437775
22435A437775J0327m7525r9755j60287k14710k53211k75998k59650j58916o791
$$ 1437775 1448102 1400577 1300822 1140535 925825 672614 396616 136966 -21950 -28741
22425b8741R0560R2579M6217K0776N9926J43874K06211J95573J17903L0117k3897
$$ -28741 61819 154398 200615 221391 281317 425191 631402 826975 944878 974995 951098
22414I51098l1243N604O2892J10048J20341Q7953M8259M2207P2803J13523J24072
$$ 951098 919855 925459 988351 1098399 1218740 1306693 1354952 1397159 1469962 1583485 1707557
22403A707557O5398n4968j71774k25570k18984j76757j32572j23595j29263r5132
$$ 1707557 1772955 1717987 1546213 1320643 1101659 924902 792330 668735 539472 444340
22393D44340l3012j9608q8224k00092l03667l59588l53005k92461j91158q2698
$$ 444340 411328 391720 303496 103404 -200263 -559851 -912856 -1205317 -1396475 -1479173
22383a479173j238M1461M7827K7285j7369p0646j04944r7999l3021Q9656K29077
$$ -1479173 -1480411 -1438950 -1391123 -1363838 -1381207 -1451853 -1556797 -1654796 -1687817 -1598161 -1369084
22372a369084L13106K93312J71785j5304k20470l68742l78709k66538j38432o8422
$$ -1369084 -1055978 -762666 -590881 -606185 -826655 -1195397 -1574106 -1840644 -1979076 -2047498
22362b047498l1456L4061J17166J49462R9218L1410N5517J84369K94924K83310
$$ -2047498 -2078954 -2044893 -1927727 -1778265 -1679047 -1647637 -1592120 -1407751 -1112827 -829517
22352h29517K12957K09458K66381K79721K14259J58353J91240K52942K61039K50317
$$ -829517 -616560 -407102 -140721 139000 353259 511612 702852 955794 1216833 1467150
22342A467150K67622K54409J55124K6971m9923p8871r8404q8894k9027N1417J24654
$$ 1467150 1734772 1989181 2144305 2171276 2121353 2042482 1944078 1855184 1826157 1877574 2002228
22331B002228J78469K18252K48659K43682J76831L4736j60262l33914m27422m43954
$$ 2002228 2180697 2398949 2647608 2891290 3068121 3102857 2942595 2608681 2181259 1737305
22321A737305m02296l12300k26477k17879k91271l59253l27571j98284n4609K6464
$$ 1737305 1335009 1022709 796232 578353 287082 -72171 -399742 -598026 -652635 -626171
22311f26171K0926l6448q0440q1024o6972m4169L4903J68235K56946K21256J02027
$$ -626171 -605245 -641693 -722133 -803157 -870129 -914298 -879395 -711160 -454214 -232958 -130931
22300a30931l2710j85468l60067m76144m27385k16868O6638L44132N34531N83311
$$ -130931 -163641 -349109 -709176 -1185320 -1612705 -1829573 -1762935 -1418803 -884272 -300961
22290c00961N06171L43698J23719j09095k88359l91778m57231n11245n23265m45978
$$ -300961 205210 548908 672627 563532 275173 -116605 -573836 -1085081 -1608346 -2054324
22280b054324k87617r1526J19004L10634M28360M53283L90271K37208L2797j27861
$$ -2054324 -2341941 -2433467 -2314463 -2003829 -1575469 -1122186 -731915 -494707 -461910 -589771
22270e89771j96429j88963r7349Q5815L04016M47427M39066L01446J12551n4441
$$ -589771 -786200 -975163 -1072512 -986697 -682681 -235254 203812 505258 617809 563368
22260E63368j44775j54946j32143r5453k3304N8947R1884O1162j328n9849r8130
$$ 563368 418593 263647 131504 36051 12747 71694 163578 224740 223412 163563 65433
22249F5433j07482r6362r1044r5245q1195q319J37269K96340L98795M47534M65680
$$ 65433 -42049 -138411 -229455 -324700 -405895 -414214 -276945 19395 418190 865724 1331404
22238A331404M35050L15844J05963j16508k56894k99875k83337k36372k11574
$$ 1331404 1766454 2082298 2188261 2071753 1814859 1514984 1231647 995275 783701
22229G83701k86171m52431n76683n25797l18219r0246N3033J04160J16341J27714
$$ 783701 497530 45099 -531584 -1057381 -1375600 -1465846 -1412813 -1308653 -1192312 -1064598
22219a064598J18628K8162j63823l80445n05852m75743l13288j13164L6584J19311
$$ -1064598 -945970 -917808 -1081631 -1462076 -1967928 -2443671 -2756959 -2870123 -2833539 -2714228
22209b714228J69893K27954K83952K95473K42493J40462J9725q6941j53104j65041
$$ -2714228 -2544335 -2316381 -2032429 -1736956 -1494463 -1354001 -1334276 -1421217 -1574321 -1739362
22199a739362j40040j24411j17300m6303J30138L60569N43806N88133M70766K74639
$$ -1739362 -1879402 -2003813 -2121113 -2167416 -2037278 -1676709 -1132903 -544770 -74004 200635
22189B00635J15299K7934k9674r1484j09367k2228J26050K52337L41248L98137
$$ 200635 315934 343868 314194 222710 113343 91115 217165 469502 810750 1208887
22179A208887L94499K97931J33616k8502j15929r0345M773P0131O5601N5709R5078
$$ 1208887 1603386 1901317 2034933 2006431 1890502 1800157 1804930 1875061 1940662 1996371 2091449
22168B091449J60531K02856J80981Q0121p1773k22078l32278l89328l87171l18118
$$ 2091449 2251980 2454836 2635817 2715938 2644165 2422087 2089809 1700481 1313310 995192
22158I95192j81250l303J53478K32236K17613J23441n92j00029j44680j07485
$$ 995192 813942 810639 964117 1196353 1413966 1537407 1536815 1436786 1292106 1184621
22148A184621l099J01816J72801K10896J80952L9036j82262l85776n22117o09685
$$ 1184621 1181522 1283338 1456139 1667035 1847987 1887023 1704761 1318985 796868 187183
22138A87183o31948n40649l63428j79767j4466J45511K95672M07686M33632L62138
$$ 187183 -444765 -985414 -1348842 -1528609 -1543075 -1397564 -1101892 -694206 -260574 101564
22128A01564K39915J23419M0105k4579q9008j34427j15722j7879J24030K56810
$$ 101564 341479 464898 505003 480424 391416 256989 141267 123388 247418 504228
22118E04228L40549L60956L24073K47825J55673R5810J20444J99567K45525K13292
$$ 504228 844777 1205733 1529806 1777631 1933304 2029114 2149558 2349125 2594650 2807942
22108B807942J28844N6639M7100Q6286J10611Q3388L1516j2952o1210j22540j64736
$$ 2807942 2936786 2993425 3040525 3126811 3237422 3320810 3352326 3339374 3278164 3155624 2990888
22097B990888j61678j38667j25005j17003j15681j23572q2725N7678K56771M83591
$$ 2990888 2829210 2690543 2565538 2448535 2332854 2209282 2126557 2184235 2441006 2924597
22087B924597P71043J099869J356054J478081J550529J740823K159345K757562
$$ 2924597 3695640 4795509 6151563 7629644 9180173 10920996 13080341 15837903
22079A5837903L418495M094752M743229N181498N030660L768928J157172k044022
$$ 15837903 19256398 23351150 28094379 33275877 38306537 42075465 43232637 41188615
22071D1188615m420057n335572n207466m617240l862691l061630k323017j782662
$$ 41188615 36768558 31432986 26225520 21608280 17745589 14683959 12360942 10578280
22063A0578280j515043j452604j444277j363226j151206q33421m91508k05922
$$ 10578280 9063237 7610633 6166356 4803130 3651924 2818503 2326995 2121073
22055B121073k3314O5005R5769Q3378J3190j14333k43829l12869l02647k49320
$$ 2121073 2097759 2162764 2258533 2341911 2355101 2240768 1996939 1684070 1381423 1132103
22045A132103k10397k04795k19368k39557k43093k46447l04357l99267m20889
$$ 1132103 921706 716911 497543 257986 14893 -231554 -535911 -935178 -1356067
22036a356067k95768p5831J26816K62079L43158L67896L07561J57363l5557j90434
$$ -1356067 -1651835 -1727666 -1600850 -1338771 -995613 -627717 -320156 -162793 -198350 -388784
22026c88784k42211j63861P117J78721L13387M07392M21076L50404K42021J22868
$$ -388784 -630995 -794856 -787739 -609018 -295631 111761 532837 883241 1125262 1248130
22016A248130K0490m21R5231K59656L88776L80707J92568j22676m24591n80394
$$ 1248130 1268620 1268199 1363430 1623086 2011862 2392569 2585137 2462461 2037870 1457476
22006A457476n64058m50015l34632k76662k84697l39831m10522m36564l66589
$$ 1457476 893418 443403 108771 -167891 -452588 -792419 -1202941 -1639505 -2006094
21997b006094k39229j41896r2311m3450L4270J31843K38537L46818M15439L82970
$$ -2006094 -2245323 -2387219 -2479530 -2522980 -2488710 -2356867 -2118330 -1771512 -1356073 -973103
21987i73103K32895J3309j93594k94078k55147j36024j4346Q4108J72391K39016
$$ -973103 -740208 -726899 -920493 -1214571 -1469718 -1605742 -1620088 -1535980 -1363589 -1124573
21977a124573K53379K00364J17195R2587J68508K83974L49578L36181K83729K60183
$$ -1124573 -871194 -670830 -553635 -461048 -292540 -8566 341012 677193 960922 1221105
21967A221105K91952L42695L37440K38481R5327l4008j18464j45303j61492k15303
$$ 1221105 1513057 1855752 2193192 2431673 2527000 2492992 2374528 2229225 2067733 1852430
21957A852430k41223j29393J12657L61669N03570N12702M34030K76331K3663k38164
$$ 1852430 1611207 1481814 1594471 1956140 2459710 2972412 3406442 3682773 3706436 3468272
21947C468272l68091l32604k26534j57160j60972k11639k52573k43652j89512
$$ 3468272 3100181 2767577 2541043 2383883 2222911 2011272 1758699 1515047 1325535
21938A325535j06942n984J01240J95499K39348K00268Q1148q2922k44846l50577
$$ 1325535 1218593 1212609 1313849 1509348 1748696 1948964 2030112 1947190 1702344 1351767
21928A351767l51208k83433k45035k75034l25313l43666l25529k76279k20045
$$ 1351767 1000559 717126 472091 197057 -128256 -471922 -797451 -1073730 -1293775
21919a293775k03314k29792k54875k37156j67149n9225P6088K11887K69170J84466
$$ -1293775 -1497089 -1726881 -1981756 -2218912 -2386061 -2445286 -2369198 -2157311 -1888141 -1703675
21909a703675J2775j07721j08877l5642M7666J25164K19457L35949M29712M66989
$$ -1703675 -1690900 -1798621 -1907498 -1943140 -1895474 -1770310 -1550853 -1214904 -785192 -318203
21899c18203M58158L98738K67534Q0851j01871k01105j50756K8330K07519K57500
$$ -318203 139955 538693 806227 887078 785207 584102 433346 461676 669195 926695
21889I26695J80858J00993J13294J88710K02390P1299j44746l00454l00948k19379
$$ 926695 1107553 1208546 1321840 1510550 1712940 1784239 1639493 1339039 1038091 818712
21879H18712j93828k33761k29762j04306Q3351J99526J70775M2745q0818j32190
$$ 818712 624884 391123 161361 57055 140406 339932 510707 553452 472634 340444
21869C40444q7435L7174J71409K79413L83497M43162L75901J91393O89j11810
$$ 340444 253009 290183 461592 741005 1124502 1567664 1943565 2134958 2135647 2023837
21859B023837j63175k20107l14907l94829l96977l30535k45133j86566j63295
$$ 2023837 1860662 1640555 1325648 930819 533842 203307 -41826 -228392 -391687
21850c91687j54767j37580q5414l809Q1706J48591J31583l5895l02899m93999
$$ -391687 -546454 -684034 -769448 -773257 -691551 -542960 -411377 -447272 -750171 -1244170
21840a244170m48794j83028J35582L37885L42431K00479N3150J4414R5093K09445
$$ -1244170 -1692964 -1875992 -1740410 -1402525 -1060094 -859615 -806465 -792051 -696958 -487513
21830d87513K54911J88765M1232j05963j79657j85459j80706j88440j94081j84812
$$ -487513 -232602 -43837 -2605 -108568 -288225 -473684 -654390 -842830 -1036911 -1221723
21820a221723j51213q3878K842N7063J7809j04983k00152j87013j08150l0501
$$ -1221723 -1372936 -1456814 -1453972 -1396909 -1379100 -1484083 -1684235 -1871248 -1979398 -2009899
21810b009899P584j3663m8067k6264O9953K17287L52598L92802L28033K20535
$$ -2009899 -2002315 -2015978 -2064045 -2090309 -2020356 -1803069 -1450471 -1057669 -729636 -509101
21800e09101R4270o2935k22850l29241l45590k84815j72731l6331O7992J05090
$$ -509101 -414831 -477766 -700616 -1029857 -1375447 -1660262 -1832993 -1869324 -1801332 -1696242
21790a696242P8975Q850m5931l3011K257q953n6711p9201j2831J52773L26110
$$ -1696242 -1617267 -1608417 -1654348 -1687359 -1685102 -1694055 -1750766 -1829967 -1842798 -1690025 -1363915
21779a363915L91164L35772K45536J61285J9848j94420l55423l43193j99812m4481
$$ -1363915 -972751 -636979 -391443 -230158 -210310 -404730 -760153 -1103346 -1303158 -1347639
21769a347639Q7351J88609K09674J56162J20211J79295L04464L90326L64629K15954
$$ -1347639 -1260288 -1071679 -862005 -705843 -585632 -406337 -101873 288453 653082 869036
21759H69036M20j79479k73601l06549k90133k06558p2832P7937K30012L44527
$$ 869036 869456 689977 416376 109827 -180306 -386864 -459696 -381759 -151747 192780
21749A92780L59058K57962J09962O870j1732L3436O5546J4896r4549j73747j39422
$$ 192780 551838 809800 919762 926632 914900 948336 1013882 1028778 934229 760482 621060
21738F21060Q809J51375J60489L7315j22600k26907k05117n3114J12596J52451
$$ 621060 629869 781244 941733 979048 856448 629541 424424 371310 483906 636357
21728F36357O3702l1813n0946j5279K6432L8676M218n9608j29195j96786k53410
$$ 636357 700059 668246 617300 602021 628453 667129 671347 611739 482544 285758 32348
21717C2348k74477k32929j22596L9884K21299L56365L77272K77197J00157r9536
$$ 32348 -242129 -475058 -597654 -557770 -336471 19894 397166 674363 774520 674984
21707F74984k67771l63610l64936k84962j83009j21028j19902j38989j04317M387
$$ 674984 407213 43603 -321333 -606295 -789304 -910332 -1030234 -1169223 -1273540 -1269153
21697a269153J31965K10690K05586J52258J41810J82451J73273Q1977k4560j26501
$$ -1269153 -1137188 -926498 -720912 -568654 -426844 -244393 -71120 10857 -13703 -140204
21687a40204k39952l18534l06398k21361j15902j6232Q0908J86617K77402K87596
$$ -140204 -380156 -698690 -1005088 -1226449 -1342351 -1358583 -1277675 -1091058 -813656 -526060
21677e26060J89048M5366p2410j30906r5834O865O4318J6167o4774o4618M4149
$$ -526060 -337012 -291646 -364056 -494962 -590796 -583931 -519613 -503446 -568220 -632838 -588689
21666e88689J62192J65968N2952p5366j46448j61612j52749j40908j37726j39783
$$ -588689 -426497 -260529 -207577 -282943 -429391 -591003 -743752 -884660 -1022386 -1162169
21656a162169j22722o3842K2929R3792J01719K205j85214l91028n51591n94069
$$ -1162169 -1284891 -1348733 -1325804 -1232012 -1130293 -1128088 -1313302 -1704330 -2255921 -2849990
21646b849990m64082j90366J14007L26512M06661L97239L28605K03809P0951j6894
$$ -2849990 -3314072 -3504438 -3390431 -3063919 -2657258 -2260019 -1931414 -1727605 -1656654 -1673548
21636a673548p3302j32072k10091l14898l94986l48263j76235k6433M524J8172
$$ -1673548 -1746850 -1878922 -2089013 -2403911 -2798897 -3147160 -3323395 -3349828 -3345304 -3327132
21626c327132J62609M24442O54508P13067N78280L42316J25347p425p6466j29271
$$ -3327132 -3164523 -2740081 -2085573 -1372506 -794226 -451910 -326563 -333988 -410454 -539725
21616e39725j65214j44800j02649j29225k02401k21210j77473j20715k2900J52254
$$ -539725 -704939 -849739 -952388 -1081613 -1284014 -1505224 -1682697 -1803412 -1826312 -1674058
21606a674058L43099M43704M29121L75244L40812L16752K84464K17313O3768j86913
$$ -1674058 -1330959 -887255 -458134 -82890 257922 574674 859138 1076451 1140219 953306
21596I53306m53477o16174o17089n08775l97603l12336k29987j78967j78182j80809
$$ 953306 499829 -116345 -733434 -1242209 -1639812 -1952148 -2182135 -2361102 -2539284 -2720093
21586b720093j25595L522J75102L31407M30080M71159M63704M08675L20738K44461
$$ -2720093 -2845688 -2842166 -2667064 -2335657 -1905577 -1434418 -970714 -562039 -241301 3160
21576C160K40020L21860M22200M49624L71261K18806N3652m2414k8929M0482O4501
$$ 3160 243180 565040 987240 1436864 1808125 2026931 2080583 2038169 2009240 2049722 2114223
21565B114223m085j18623j93665j81544j12758o5672q9250j55662k08647k40027
$$ 2114223 2110138 1991515 1797850 1616306 1503548 1437876 1348626 1192964 984317 744290
21555G44290k70132l00439l25692l19324k54365j58288p8945l7497k8850m5581
$$ 744290 474158 173719 -151973 -471297 -725662 -883950 -962895 -1000392 -1029242 -1074823
21545a074823o1750k4223P3269J78471K53253K85987K60314J67579N7166J7224
$$ -1074823 -1136573 -1160796 -1087527 -909056 -655803 -369816 -109502 58077 115243 132467
21535A32467N8020J11430J15428J9573j76768l72502m30296l11712j27132n4335
$$ 132467 190487 301917 417345 436918 260150 -112352 -542648 -854360 -981492 -1035827
21525a035827j53509k86786l13971k49999j56043n745K34155N02894O94765P29446
$$ -1035827 -1189336 -1476122 -1790093 -2040092 -2196135 -2201880 -1967725 -1464831 -770066 -40620
21515d0620O10613M62531L96480L53462K09746j1715j80750k62905l35882m25224
$$ -40620 569993 1032524 1429004 1782466 1992212 1980497 1799747 1536842 1200960 775736
21505G75736m68165m05848k34793p203J86443K76876K80152K47442J70979K5514
$$ 775736 307571 -98277 -333070 -340273 -153830 123046 403198 650640 821619 847133
21495H47133j37947k29766k18580j26419j3848L6241j2180j36491k78918l72675
$$ 847133 709186 479420 260840 134421 120573 156814 144634 8143 -270775 -643450
21485f43450l72668k61678p4204J18839K76323L78022L96230L32833K21714P6062
$$ -643450 -1016118 -1277796 -1352000 -1233161 -956838 -578816 -182586 150247 371961 448023
21475D48023r9994k53983l22265k86399j71235j5731J62317L36185M43017M04284
$$ 448023 348029 94046 -228219 -514618 -685853 -701584 -539267 -203082 239935 644219
21465F44219J96116j05756l96731o07211o80241o02699m21850j90888K6171J59649
$$ 644219 840335 734579 337848 -269363 -949604 -1552303 -1974153 -2165041 -2138870 -1979221
21455a979221J94840J59664P2152l4491j06043j11229m8383K2127j6309j90636
$$ -1979221 -1784381 -1624717 -1552565 -1587056 -1693099 -1804328 -1852711 -1830584 -1846893 -2037529
21445b037529l62408l73474k06869L9715K81363M81608N90044N65690M64287M02746
$$ -2037529 -2399937 -2773411 -2980280 -2940565 -2659202 -2177594 -1587550 -1021860 -557573 -154827
21435a54827M34110M94606M74110L14376N3192k17823m20839n29376n53168m85761
$$ -154827 279283 773889 1247999 1562375 1615567 1397744 976905 447529 -105639 -591400
21425e91400l05527m4859K16110M10050M96462M25168J65930j95617n04455o52596
$$ -591400 -896927 -941786 -725676 -315626 180836 606004 771934 576317 71862 -580734
21415e80734n94432l50697j1316K93881M38063L96942K69567J82956K00567K97554
$$ -580734 -1175166 -1525863 -1537179 -1243298 -805235 -408293 -138726 44230 244797 542351
21405E42351L98433M18433L02589O7112k12605m52939n93059o08589n12424l45233
$$ 542351 940784 1359217 1661806 1728918 1516313 1063374 470315 -138274 -650698 -995931
21395i95931j48261M8002K11292L17546L83313M20461L90250K50822J8623k25938
$$ -995931 -1144192 -1096190 -884898 -567352 -184039 236422 626672 877494 896117 670179
21385F70179l82606l86543k37655r875J91419L12528L94469M89000N52182N13667
$$ 670179 287573 -98970 -336625 -346500 -155081 157447 551916 1040916 1593098 2106765
21375B106765L73267J77236m4232k81855n05087o56851o83004n63604l35193r0579
$$ 2106765 2480032 2657268 2613036 2331181 1826094 1169243 486239 -77365 -412558 -503137
21365e03137P8471J36123P5039p5411k32834l14296k67428r2959J25102K76975
$$ -503137 -424666 -288543 -213504 -288915 -521749 -836045 -1103473 -1196432 -1071330 -794355
21355g94355L00462K11288J05860O7780P8406P1948K5466m8496j24228j69216
$$ -794355 -493893 -282605 -176745 -108965 -30559 41389 66855 18359 -105869 -275085
21345b75085j72432j59820j54408j45693j25276j01993o3047J4324Q6247O6595
$$ -275085 -447517 -607337 -761745 -907438 -1032714 -1134707 -1197754 -1183430 -1097183 -1030588
21335a030588n4343j95892k74760k70457k13916j44463q3972l6908L827M9832
$$ -1030588 -1084931 -1280823 -1555583 -1826040 -2039956 -2184419 -2268391 -2305299 -2301472 -2251640
21325b251640R1321J18680J42864J67508J98476K68461L61445L97040L29457J98660
$$ -2251640 -2160319 -2041639 -1898775 -1731267 -1532791 -1264330 -902885 -505845 -176388 22272
21315B2272J13723J44605K46084L14331K90463J96241O0258j22566l21871m45704
$$ 22272 135995 280600 526684 841015 1131478 1327719 1387977 1265411 943540 497836
21305D97836m38906l41429k33839j62910j30643j25105j13896o1064J8595R0088
$$ 497836 58930 -282499 -516338 -679248 -809891 -934996 -1048892 -1109956 -1091361 -1001273
21295a001273J38578J46469J22516J39533K37506L45299L75566L00931J37449
$$ -1001273 -862695 -716226 -593710 -454177 -216671 128628 504194 805125 942574
21286I42574o0319k35144l72291m41838l98159k51334m7325J58479L26852M59478
$$ 942574 882255 647111 274820 -167018 -565177 -816511 -863836 -705357 -378505 80973
21276H0973N63182O03545N19844L18094R0511r3260k30690l27359l66889l26959
$$ 80973 644155 1247700 1767544 2085638 2176149 2082889 1852199 1524840 1157951 830992
21266H30992k15667q6149J7422Q5961J06881N2089o6068j79265k26694k19286
$$ 830992 615325 529176 546598 632559 739440 791529 725461 546196 319502 100216
21256A00216k22301k61171k82838k52864k34780k85366l53876l71343l48215l39370
$$ 100216 -122085 -383256 -666094 -918958 -1153738 -1439104 -1792980 -2164323 -2512538 -2851908
21246b851908l55673l70988l59112k84550j23391J16959L68366N09959M91887
$$ -2851908 -3207581 -3578569 -3937681 -4222231 -4345622 -4228663 -3860297 -3350338 -2858451
21237b858451L77810K40659Q6627p7121j74977j37608k937J26809K26772L35333
$$ -2858451 -2480641 -2239982 -2153355 -2230476 -2405453 -2543061 -2545998 -2419189 -2192417 -1857084
21227a857084M34187M44075L23354J11771j03904k60121l41722l33841k39754
$$ -1857084 -1422897 -978822 -655468 -543697 -647601 -907722 -1249444 -1583285 -1823039
21218a823039j22227o1039o7424q7885q2687m2489K9440J29161K38902L16488
$$ -1823039 -1945266 -2006305 -2073729 -2161614 -2244301 -2286790 -2257350 -2128189 -1889287 -1572799
21208a572799L36435L17101K60087J40552O84n4142J7246J65888L63079N81212
$$ -1572799 -1236364 -919263 -659176 -518624 -517940 -572082 -554836 -388948 -25869 555343
21198E55343P03872O04536K78230j37877m55345n52509m32112k09622l4794L1555
$$ 555343 1259215 1863751 2141981 2004104 1548759 996250 564138 354516 319722 351277
21188C51277M0021K8091l3069j49209k49791k44928j33866j3023K4847k8831r8384
$$ 351277 391298 419389 386320 237111 -12680 -257608 -391474 -404497 -379650 -408481 -506865
21177e06865j09955q3732r7460j63825k15268j81709n3929J01857K08466K69172
$$ -506865 -616820 -700552 -798012 -961837 -1177105 -1358814 -1412743 -1310886 -1102420 -833248
21167h33248L18662L38444L04268K24462J18123L4890L1027P7198O4742n7890
$$ -833248 -514586 -176142 128126 352588 470711 505601 536628 613826 678568 620678
21157F20678k19357l36061m08215m67267m79095l74202j72276K4408J42757J62190
$$ 620678 401321 65260 -342955 -810222 -1289317 -1663519 -1835795 -1811387 -1668630 -1506440
21147a506440R3404m8685k35873l82376m10986l40804k02801J1297K58585M41773
$$ -1506440 -1413036 -1461721 -1697594 -2079970 -2490956 -2831760 -3034561 -3023264 -2764679 -2322906
21137b322906N10253M87404M04855K82659J72309J37545K00052L10784L76120
$$ -2322906 -1812653 -1325249 -920394 -637735 -465426 -327881 -127829 182955 559075
21128E59075L43467K31497R9311k3999j68392l34109m60509n14968n24952n01696
$$ 559075 902542 1134039 1233350 1209351 1040959 706850 246341 -268627 -793579 -1295275
21118a295275m10822k51127o4897J17932K85460M35219N74098O95468P23159N87191
$$ -1295275 -1706097 -1957224 -2022121 -1904189 -1618729 -1183510 -609412 86056 809215 1396406
21108A396406L42575R6278o3546r1438m2691k9488r7326k24322l95634n66468
$$ 1396406 1738981 1835259 1771713 1680275 1637584 1608096 1510770 1286448 890814 324346
21098C24346o23674m86496k18621L8080J96547K66042L12535L54406L47839K65075
$$ 324346 -299328 -785824 -1004445 -966365 -769818 -503776 -191241 163165 511004 776079
21088G76079J47306P8528Q3347J02123R9337J12378J67441K33904K43446J33865
$$ 776079 923385 1001913 1085260 1187383 1286720 1399098 1566539 1800443 2043889 2177754
21078B177754p5171k73190l69133l83982l78245l54086l10294k65329k12064j49074
$$ 2177754 2102583 1829393 1460260 1076278 698033 343947 33653 -231676 -443740 -592814
21068e92814j22189j65448k35758k75191k62064j87192q7001k7987o610L4594
$$ -592814 -715003 -880451 -1116209 -1391400 -1653464 -1840656 -1927657 -1955644 -1962254 -1927660
21058a927660J04766J40898R7942K0198j3695J0163M9723R4332J52626K10716
$$ -1927660 -1822894 -1681996 -1584054 -1563856 -1577551 -1567388 -1517665 -1423333 -1270707 -1059991
21048a059991K70541L45342M17353M56994M52372M00373K90900J20723q3687k72837
$$ -1059991 -789450 -444108 -26755 430239 882611 1282984 1573884 1694607 1610920 1338083
21038A338083l88749m07440l53936k59120j30218M5402K51373M06552M20531K67153
$$ 1338083 949334 541894 187958 -71162 -201380 -155978 95395 501947 922478 1189631
21028A189631M934k77384n16307o29337n43542l20869j05873M1894J58300K62484
$$ 1189631 1194565 917181 400874 -228463 -772005 -1092874 -1198747 -1156853 -998553 -736069
21018g36069L35500L58602L20065K28575J06420k8172j57254k65050l24895l14565
$$ -736069 -400569 -41967 278098 506673 613093 584921 427667 162617 -162278 -476843
21008d76843k72277k42020j94825r8814P953Q6376J52892K26783K83130K87357
$$ -476843 -749120 -991140 -1185965 -1284779 -1276826 -1190450 -1037558 -810775 -527645 -240288
20998b40288K54818K02328J10321k1125j58088k46972k45411j58414j1924J29771
$$ -240288 14530 216858 327179 306054 147966 -99006 -344417 -502831 -514755 -384984
20988c84984J70380Q6306l1923n9455L7289J73866K53837K60088K24215J69224
$$ -384984 -214604 -128298 -160221 -219676 -182387 -8521 245316 505404 729619 898843
20978H98843J17506R5559R7368J05525J29755J69967J59315K3402k09831m22738
$$ 898843 1016349 1111908 1209276 1314801 1444556 1614523 1773838 1797240 1587409 1164671
20968A164671n42946o15958o92851p30139o58267m96224l40474k46317j68684
$$ 1164671 621725 5767 -687084 -1417223 -2075490 -2571714 -2912188 -3158505 -3327189
20959c327189k6977J85295M02898N75302O66104O27103M66797K67490J00789k701
$$ -3327189 -3354166 -3168871 -2765973 -2190671 -1524567 -897464 -430667 -163177 -62388 -65089
20949f5089k4000N0064J99331L61872M61410M22473K17067o1170k54953l01928
$$ -65089 -89089 -39025 160306 522178 983588 1406061 1623128 1561958 1307005 1005077
20939A005077k63073k02642j10701K1537J27871J24939K2317o2033m2201M8536
$$ 1005077 742004 539362 428661 450198 578069 703008 725325 663292 621091 669627
20929F69627J09000P7924j1798q1511q0051k3088L0409J7471p7422k01962k79708
$$ 669627 778627 856551 844753 763242 683191 660103 690512 707983 630561 428599 148891
20918A48891k68892j73130m0375N2684N1799k2859o9504j4717J05842K14512K70102
$$ 148891 -120001 -293131 -333506 -280822 -229023 -251882 -321386 -336103 -230261 -15749 254353
20907B54353K59890J71465J3064j60605k93359l85000m41464m34513l54377k02106
$$ 254353 514243 685708 698772 538167 244808 -140192 -581656 -1016169 -1370546 -1572652
20897a572652K266J58355J51989J5144q6119n4372L8770P8558M4628K0484R0839
$$ -1572652 -1570386 -1412031 -1260042 -1244898 -1331017 -1385389 -1346619 -1268061 -1223433 -1202949 -1112110
20886a112110K11256K54091J95104J52514J99753K60749K42622J47722J9254j17328
$$ -1112110 -900854 -646763 -451659 -299145 -99392 161357 403979 551701 570955 453627
20876D53627k20747k34765j57123m7348L5581N5688j3228j42430k25934j91945
$$ 453627 232880 -1885 -159008 -206356 -170775 -115087 -128315 -270745 -496679 -688624
20866f88624j03689r3046j93063l20843l56951k39713l9355J38192K38777K47909
$$ -688624 -792313 -885359 -1078422 -1399265 -1756216 -1995929 -2035284 -1897092 -1658315 -1410406
20856a410406J75149M1019r9551j56680j01562J0145J18902J96074K45133K92946
$$ -1410406 -1235257 -1194238 -1293789 -1450469 -1552031 -1541886 -1422984 -1226910 -981777 -688831
20846f88831L34564K95859J47902j0889q1188o1039N962Q0348J37152J69640J53453
$$ -688831 -354267 -58408 89494 78605 -2583 -63622 -57660 22688 159840 329480 482933
20835D82933M8327j53791l97447n71051n59243l30093L391K71024L94971M07502
$$ 482933 531260 377469 -19978 -591029 -1150272 -1480365 -1476974 -1205950 -810979 -403477
20825d03477L57463K63800J47779M5356l4238j13158j91556k30847j96829j37877
$$ -403477 -46014 217786 365565 410921 376683 263525 71969 -158878 -355707 -493584
20815d93584j54005k55663l38541l09859j75141p615R6968P0095m8041j30121
$$ -493584 -647589 -903252 -1241793 -1551652 -1726793 -1734408 -1637440 -1567345 -1615386 -1745507
20805a745507p8366J03957L25471M71178M49281K71970R0300M4029J22764K15153
$$ -1745507 -1823873 -1719916 -1394445 -923267 -473986 -202016 -111716 -67687 55077 270230
20795B70230K13013J03996j4348q9513j57142k39530l31285m02302l96864k94201
$$ 270230 483243 587239 572891 483378 326236 86706 -244579 -646881 -1043745 -1337946
20785a337946j29590O0848K49858L75212L80885K90524J71774N6315m8710j22710
$$ -1337946 -1467536 -1406688 -1156830 -781618 -400733 -110209 61565 117880 69170 -53540
20775e3540j53981j74795k17899k42380j68386N031J93335L28514L99287M04375
$$ -53540 -207521 -382316 -600215 -842595 -1010981 -1005950 -812615 -484101 -84814 319561
20765C19561L37279K24139J08390O894r9395k16670k86892k54302j14743J20273
$$ 319561 656840 880979 989369 996263 896868 680198 393306 139004 24261 144534
20755A44534L97047O00966O39442N35083L72420K01158M7397m2998m3084R387
$$ 144534 541581 1142547 1781989 2317072 2689492 2890650 2938047 2895049 2851965 2861352
20745B861352M7786J3493j00465k23748k91678l19788l47543l67385l46580k94689
$$ 2861352 2909138 2922631 2822166 2598418 2306740 1986952 1639409 1272024 925444 630755
20735F30755k62828k68021k63722k08417j26715p2946o9673p5959k0556J16666
$$ 630755 367927 99906 -163816 -372233 -498948 -571894 -641567 -717526 -738082 -621416
20725f21416K73255L64269L66002L08383K24276J24541J0065j04231k09399k99975
$$ -621416 -348161 16108 382110 690493 914769 1039310 1049375 945144 735745 435770
20715D35770l53393l72192l78068l51822k61376j23879k215K8355p3307k34452
$$ 435770 82377 -289815 -667883 -1019705 -1281081 -1404960 -1407175 -1378820 -1452127 -1686579
20705a686579l19453k90984k03961j12166n8521n8221o3443K827J52303L06659
$$ -1686579 -2006032 -2297016 -2500977 -2613143 -2671664 -2729885 -2793328 -2790501 -2638198 -2331539
20695b331539L83271L68738L08814K30244J37482N1509k5702r8644j56941j97825
$$ -2331539 -1948268 -1579530 -1270716 -1040472 -902990 -851481 -877183 -975827 -1132768 -1330593
20685a330593k08780j64017o3255N4265J44280J84182J69072J19059Q3594J11993
$$ -1330593 -1539373 -1703390 -1766645 -1712380 -1568100 -1383918 -1214846 -1095787 -1012193 -900200
20675i00200K00649K88849L30300L40947L29926K76259J92634J00975K0827l4073
$$ -900200 -699551 -410702 -80402 260545 590471 866730 1059364 1160339 1181166 1147093
20665A147093q0309j24517j54527j74263j86737j81555j64131j50915j26321n9889
$$ 1147093 1066784 942267 787740 613477 426740 245185 81054 -69861 -196182 -256071
20655b56071L4084J07277J27059J14383J04647J07223J23974J50235J78984K22429
$$ -256071 -221987 -114710 12349 126732 231379 338602 462576 612811 791795 1014224
20645A014224L00099L91003M35436M09196L47693K87252K29539J69418R9583L902
$$ 1014224 1314323 1705326 2140762 2549958 2897651 3184903 3414442 3583860 3683443 3687345
20635C687345r6692j71109k52820l66725m45304m10048k77153j23475J5975J36934
$$ 3687345 3590653 3419544 3166724 2799999 2354695 1944647 1667494 1544019 1559994 1696928
20625A696928J99147J67377P0812m9998j87019l11284l54993k64861m6932K44202
$$ 1696928 1896075 2063452 2134264 2084266 1897247 1585963 1230970 966109 919177 1163379
20615A163379N33001P32488P70915O43043L88226O4424k22151l59669l24784k03105
$$ 1163379 1696380 2428868 3199783 3842826 4231052 4295476 4073325 3713656 3388872 3185767
20605C185767j19213j25050j96169l13330m44752n26743n20310m21862k46927
$$ 3185767 3066554 2941504 2745335 2432005 1987253 1460510 940200 518338 271411
20596B71411o4827K8213K4585N553Q472o72l9200q2755r1807n3812j3333j0600
$$ 271411 206584 234797 259382 264935 273407 272735 233535 150780 58973 5161 -8172 -18772
20584a8772m2429r9557j62462j81281j13730J1270J20690J65205J35056M7470
$$ -18772 -61201 -160758 -323220 -504501 -618231 -606961 -486271 -321066 -186010 -138540
20574a38540n0642j05020q8949L078J37587K45769K77434K24487J24514N6680
$$ -138540 -189182 -294202 -383151 -380073 -242486 3283 280717 505204 629718 686398
20564F86398R0000J92893K55237K26522J44276O3746K9071L9298K6303m3077j31851
$$ 686398 776398 969291 1224528 1451050 1595326 1659072 1688143 1727441 1753744 1710667 1578816
20553A578816k13255k79225k99918k29441o5808J15664K17547K00220R8598l3069
$$ 1578816 1365561 1086336 786418 556977 491169 606833 824380 1024600 1123198 1090129
20543A090129j62660k62308l14390l26712k93139k06078r9925O099J14406J75857
$$ 1090129 927469 665161 350771 24059 -269080 -475158 -575083 -568984 -454578 -278721
20533b78721J50895Q8117N4489N0674K8472m7097j61142k63742l11534k87125
$$ -278721 -127826 -39709 14780 65454 93926 46829 -114313 -378055 -689589 -976714
20523i76714j92986o0499O1270J24796Q5992l6324j55044k15601k21944k01301
$$ -976714 -1169700 -1230199 -1168929 -1044133 -958141 -994465 -1149509 -1365110 -1587054 -1788355
20513a788355j85093j65775j03224j5810L7990N3899N6386N5228N6326N0380K6024
$$ -1788355 -1973448 -2139223 -2242447 -2258257 -2220267 -2166368 -2109982 -2054754 -1998428 -1948048 -1922024
20502a922024K9090J21634K70329L59934L21711J82140K0706p8690o8725N7500
$$ -1922024 -1892934 -1771300 -1500971 -1141037 -819326 -637186 -616480 -695170 -763895 -706395
20492g06395K19455K75516K29460K28798L30427M46788M86550M27521K79562N4976
$$ -706395 -486940 -211424 18036 246834 577261 1024049 1510599 1938120 2217682 2272658
20482B272658k15317m60993n96382n57606l39357k7597K43691L85332M05524L56868
$$ 2272658 2057341 1596348 999966 442360 103003 75406 319097 704429 1109953 1466821
20472A466821K86839K15632J14843m6472k35908l73431m20385l89939k95574j58140
$$ 1466821 1753660 1969292 2084135 2037663 1801755 1428324 1007939 618000 322426 164286
20462A64286k7709N9930J14065J45182J37732R6463M5368j1552q0195j53156j92237
$$ 164286 136577 196507 310572 455754 593486 689949 735317 723765 643570 490414 298177
20451B98177j44963L43J97527L71529M75572N01427M44963L40877K56780K19403
$$ 298177 153214 153557 351084 722613 1198185 1699612 2144575 2485452 2742232 2961635
20441B961635K12969K13319J78651L4142k43286n53207p80405q60085p65651n44598
$$ 2961635 3174604 3387923 3566574 3600716 3357430 2804223 2023818 1163733 398082 -146516
20431a46516k71877j1808J36421Q9813j05955l05421l96637l71608k69778j20128
$$ -146516 -418393 -430201 -293780 -203967 -309922 -615343 -1011980 -1383588 -1653366 -1773494
20421a773494M5954J70332K12113K16316K30297K23455J48328o581k09788l66472
$$ -1773494 -1727540 -1557208 -1345095 -1128779 -898482 -675027 -526699 -533280 -743068 -1109540
20411a109540l58674j62283J36677M05344N38912N34036M30210K37561k012j73832
$$ -1109540 -1468214 -1630497 -1493820 -1088476 -549564 -15528 414682 652243 650231 476399
20401D76399j84509m8805J23285K16588K18942K21498K95896M14699N19756N59060
$$ 476399 291890 243085 366370 582958 801900 1023398 1319294 1733993 2253749 2812809
20391B812809M70467K59586L5386j12260j95089k67610l52319m15922l92035k72377
$$ 2812809 3283276 3542862 3578248 3465988 3270899 3003289 2650970 2235048 1843013 1570636
20381A570636j51924j11722j47470k48509l95802m96249m47775k64663o4536N7952
$$ 1570636 1418712 1306990 1159520 911011 515209 18960 -428815 -693478 -758014 -700062
20371g00062J00396J24633K08377L73167N25800N39600L97138J82969k4666j76190
$$ -700062 -599666 -475033 -266656 106511 632311 1171911 1569049 1752018 1727352 1551162
20361A551162k27354j96828j80792k18126k58730k63669k39349k25090k52910
$$ 1551162 1323808 1126980 946188 728062 469332 205663 -33686 -258776 -511686
20352e11686k87841k60568j32748O6466K30715K74234K21487J49927Q4514R574
$$ -511686 -799527 -1060095 -1192843 -1126377 -895662 -621428 -399941 -250014 -165500 -155926
20342a55926n3812o6124m7464m4944o5991q8854p7721K2670K37212N07858P25854
$$ -155926 -209738 -275862 -323326 -368270 -434261 -523115 -600836 -578166 -340954 166904 892758
20331H92758Q00154P25041N66427L71141J63155k5192j80339l08249l99107m50205
$$ 892758 1692912 2417953 2984380 3355521 3518676 3493484 3313145 3004896 2605789 2155584
20321B155584m82844n17450n67546n98933n27772l40634j22587P0376K29549L12171
$$ 2155584 1672740 1155290 587744 -11189 -538961 -879595 -1002182 -931806 -702257 -390086
20311c90086K86809J68102J3357r1214j09855o3745L9620K26420M74998O75888
$$ -390086 -103277 64825 78182 -13032 -122887 -186632 -147012 79408 554406 1230294
20301A230294P39856O60196M54899J63982j29978l41216m26466m07151l64055
$$ 1230294 1970150 2630346 3085245 3249227 3119249 2778033 2351567 1944416 1580361
20292A580361l58980l64524l44005k99459k28907j59596j59369k32910k86289
$$ 1580361 1221381 856857 512852 213393 -15514 -175110 -334479 -567389 -853678
20283h53678k31191o3282J50986L15733L73537L41530K58579J63880R4586Q4896
$$ -853678 -1084869 -1148151 -997165 -681432 -307895 33635 292214 456094 550680 635576
20273F35576J42907K01529J79861Q3658k7592j19708j74968j74629j43443j33934
$$ 635576 778483 980012 1159873 1243531 1215939 1096231 921263 746634 603191 469257
20263D69257j66139k23447k65571k35399j33936l8197P874J7991J6860L3399Q5434
$$ 469257 303118 79671 -185900 -421299 -555235 -593432 -585558 -567567 -550707 -517308 -431874
20252d31874J56855K12048K32360K37095K49391K62616K73575K68915J97195O2196
$$ -431874 -275019 -62971 169389 406484 655875 918491 1192066 1460981 1658176 1720372
20242A720372m4974p3742p8994j50108l11691m87234n68490m81482k12762J48218
$$ 1720372 1675398 1601656 1522662 1372554 1060863 573629 5139 -476343 -689105 -540887
20232e40887M36540N32081M12949J48645r2634j65810q9208J7808P0526O4472
$$ -540887 -104347 427734 840683 989328 896694 730884 641676 659484 730010 794482
20222G94482M1256M4321Q4487J40686J68789J46176J00539M9348k5419j30573
$$ 794482 835738 880059 964546 1105232 1274021 1420197 1520736 1570084 1544665 1414092
20212A414092k41804l10784k89323j89375q2763r519L3114J4039j03117k80888
$$ 1414092 1172288 861504 572181 382806 300043 290524 323638 337677 234560 -46328
20202d6328m26851m60962l84228k61768j27960N618J11927J64177J44940N9717
$$ -46328 -473179 -934141 -1318369 -1580137 -1708097 -1702479 -1590552 -1426375 -1281435 -1221718
20192a221718k5177j7964P6340J27225K6287j78821l40016l65774k75578j50690
$$ -1221718 -1246895 -1264859 -1188519 -1061294 -1035007 -1213828 -1553844 -1919618 -2195196 -2345886
20182b345886m2572O6423J89240K87447L02513K16335J04442P8373J50860K39804
$$ -2345886 -2388458 -2322035 -2132795 -1845348 -1542835 -1326500 -1222058 -1143685 -992825 -753021
20172g53021K87086K75569J97449Q0056j9097n8171n4897o3532j05420j67703
$$ -753021 -465935 -190366 7083 87139 68042 9871 -45026 -108558 -213978 -381681
20162c81681k20678k24883j60222n2896P0469J96264K84208K96108K49918J87654
$$ -381681 -602359 -827242 -987464 -1040360 -969891 -773627 -489419 -193311 56607 244261
20152B44261J42957J52111J89600J46415n588j38029j53046p2828N5339J96103
$$ 244261 387218 539329 728929 875344 869756 731727 578681 505853 561192 757295
20142G57295K93429L17033L26960M09930N57529O63739O51258N25768L19031N7292
$$ 757295 1050724 1367757 1694717 2104647 2662176 3325915 3977173 4502941 4821972 4879264
20132D879264k28543m72549o16542o58108o07469n01137m07530l42592k51896
$$ 4879264 4650721 4178172 3561630 2903522 2296053 1794916 1387386 1044794 792898
20123G92898j08385N0236J57406J76275J35894R4627R2346J35178J89977J97296
$$ 792898 684513 734749 892155 1068430 1204324 1298951 1391297 1526475 1716452 1913748
20113A913748J15884l4074j84526k74396k71197j87802q9826l6098j2879K0651
$$ 1913748 2029632 1995558 1811032 1536636 1265439 1077637 987811 951713 938834 959485
20103I59485N4050N9609L6823R248o977j4387J566N9849J31214J61558J45769
$$ 959485 1013535 1073144 1109967 1119215 1112238 1097851 1099417 1159266 1290480 1452038 1597807
20092A597807J17261R7357J11124J96809L59454N53297O99943P16867N78046L35195
$$ 1597807 1715068 1812425 1923549 2120358 2479812 3033109 3733052 4449919 5027965 5363160
20082E363160Q3613p8793j24312j26001j83986l31429m90133n61643n43689m99804
$$ 5363160 5446773 5367980 5243668 5117667 4933681 4602252 4112119 3550476 3006787 2506983
20072B506983m67439m35521l74556k65381j24445k0560j0076p9327j65643j85337
$$ 2506983 2039544 1604023 1229467 964086 839641 819081 809005 729678 564035 378698
20062C78698r4060O6762K25326L42796L88982L43080K30025J16519M5730j2174
$$ 378698 284638 351400 576726 919522 1308504 1651584 1881609 1998128 2043858 2031684
20052B031684r2878j63777j71929j29832j04428j22858j53687j81069k21707k68035
$$ 2031684 1938806 1775029 1603100 1473268 1368840 1245982 1092295 911226 689519 421484
20042D21484k68626j75470n775J66042K75332L00125K49006J42285M2079J1260
$$ 421484 152858 -22612 -28387 137655 412987 713112 962118 1104403 1146482 1157742
20032A157742M2972J02030J39331J15699O2024L0484J4405j5495k6284K2628R8138
$$ 1157742 1200714 1302744 1442075 1557774 1619798 1650282 1664687 1649192 1622908 1645536 1743674
20021A743674J53597J79395J86734J93085J87565J34061M9073j3790n7086j01767
$$ 1743674 1897271 2076666 2263400 2456485 2644050 2778111 2827184 2813394 2756308 2654541
20011B654541j22575j07077r8074j34317j85592j94372j79170k16094l09717l82708
$$ 2654541 2531966 2424889 2326815 2192498 2006906 1812534 1633364 1417270 1107553 724845
20001G24845l73689k86268j92451j59936j61822j03880N6192K36067L28293L42290
$$ 724845 351156 64888 -127563 -287499 -449321 -553201 -497009 -260942 67351 409641
19991D09641L60700M05013M33470L94951K57223O1310q1933r4930N070J32041
$$ 409641 770341 1175354 1608824 2003775 2260998 2322308 2240375 2145445 2150515 2282556
19981B282556J94435J53350M1010l4050J210Q5423J22187Q5159M34r6439j48734
$$ 2282556 2476991 2630341 2671351 2637301 2638511 2723934 2846121 2931280 2931714 2835275 2686541
19970B686541j18348o5203p1923j18776j37190j45223k04702l11031l90683l77321
$$ 2686541 2568193 2502990 2431067 2312291 2175101 2029878 1825176 1514145 1123462 746141
19960G46141k97422k04449r6861J8010Q1679O2904Q009k4754k4005j2021r001
$$ 746141 448719 244270 147409 165419 247098 310002 318011 293257 269252 257231 248230
19949B48230K1998J62185M09996O56881Q13546Q54763P63314N36462K38715k8618
$$ 248230 270228 432413 842409 1499290 2312836 3167599 3930913 4467375 4706090 4677472
19939D677472j84096j92217r3438M6926K08871L73460M91919N46670N69168N73036
$$ 4677472 4493376 4301159 4207721 4254647 4463518 4836978 5328897 5875567 6444735 7017771
19929G017771N54128N47258N93234O74925P59260Q40148R36475J071304J252438
$$ 7017771 7571899 8119157 8712391 9387316 10146576 10986724 11923199 12994503 14246941
19920A4246941J476869J740698K044965K395638K812909L313965L898498M562166
$$ 14246941 15723810 17464508 19509473 21905111 24718020 28031985 31930483 36492649
19912C6492649N321682O237825P369698Q759495J0497196J2688601J5360770J8503586
$$ 36492649 41814331 48052156 55421854 64181349 74678545 87367146 102727916 121231502
19904A21231502K2083351K5900427K9288469L0573234K6671187J4619054m025096
$$ 121231502 143314853 169215280 198503749 229076983 255748170 270367224 266342128
19897B66342128k1600230l1181813l2504527k9222100k4508250j9921104j5991401
$$ 266342128 244741898 213560085 181055558 151833458 127325208 107404104 91412703
19890I1412703j2829332j0366851q428662o845708n560358m584996l874305l316081
$$ 91412703 78583371 68216520 59787858 52942150 47381792 42796796 38922491 35606410
19882C5606410k819922k389068k058409j793834j518481j228772r84421q23322
$$ 35606410 32786488 30397420 28339011 26545177 25026696 23797924 22813503 21990181
19874B1990181p46337p33492p71651q62311r59372r69149q59908o67892m00746
$$ 21990181 21243844 20510352 19738701 18876390 17917018 16947869 16087961 15420069 15019323
19865A5019323m9874L69177Q08677J181078J404522J445420J351255J249035J253447
$$ 15019323 14969449 15338626 16147303 17328381 18732903 20178323 21529578 22778613 24032060
19856B4032060J434014J848598K496735L268052M088065N005667O055084P189144
$$ 24032060 25466074 27314672 29811407 33079459 37167524 42173191 48228275 55417419
19848E5417419Q394634R760896J1412121J3494404J6183521J9567776K3507457
$$ 55417419 63812053 73572949 84985070 98479474 114662995 134230771 157738228
19841A57738228K7519201L0480336L0074508K2967487P603834j1666775k6529304
$$ 157738228 185257429 215737765 245812273 268779760 276383594 264716819 238187515
19834B38187515l2642294l1845711k7769116k2880958j8377715j4694168j1823685
$$ 238187515 205545221 173699510 145930394 123049436 104671721 89977553 78153868
19827G8153868r608948p925586o681533n769907n056973m421394l835600l343152
$$ 78153868 68544920 60619334 53937801 48167894 43110921 38689527 34853927 31510775
19819C1510775k952096k600857k240416j905866j660246j504713j378327j216153
$$ 31510775 28558679 25957822 23717406 21811540 20151294 18646581 17268254 16052101
19811A6052101j002722p43124m50259j73435J4400N4340l4087j64332k79965l73367
$$ 16052101 15049379 14306255 13855996 13682561 13696961 13751301 13717214 13552882 13272917 12899550
19801A2899550m42043m90160n47872o36003p34387p84037p65745p17214o41524
$$ 12899550 12457507 11967347 11419475 10783472 10049085 9265048 8499303 7782089 7140565
19792G140565n17988l86158l02546k47379j91275j72247k23658l11564l62309
$$ 7140565 6622577 6236419 5933873 5686494 5495219 5322972 5099314 4787750 4425441
19783D425441l32711k33084j13985m2688j9245L2684J36624K15041J98247J05603
$$ 4425441 4092730 3859646 3745661 3702973 3683728 3716412 3853036 4068077 4266324 4371927
19773D371927K335q0332j61049k35763k68580k61899k63965l13336l89987m17128
$$ 4371927 4374262 4293930 4132881 3897118 3628538 3366639 3102674 2789338 2399351 1982223
19763A982223l32013j57705K6568J79616L02845L85664M11626L81729L03037K01550
$$ 1982223 1650210 1492505 1519073 1698689 2001534 2387198 2798824 3180553 3483590 3685140
19753C685140J16422N1514l8855j80667l08805l31902k35084q5332M2994J12556
$$ 3685140 3801562 3853076 3814221 3633554 3324749 2992847 2757763 2672431 2715425 2827981
19743B827981J11253N2422j9736k8251O4700J79514K03285J00152p4579j99881
$$ 2827981 2939234 2991656 2971920 2943669 3008369 3187883 3391168 3491320 3416741 3216860
19733C216860j95671j00748l386N2949O4377M0232K55m9036j02737j42199j65553
$$ 3216860 3021189 2920441 2917055 2970004 3034381 3074613 3074868 3025832 2923095 2780896 2615343
19722B615343j83536j81001j36864p2067j7766M8793J71926L05833L38691K55502
$$ 2615343 2431807 2250806 2113942 2041875 2024109 2072902 2244828 2550661 2889352 3144854
19712C144854J49002O3555k1392r4325j07820o6475k1156L2067J33705K57388
$$ 3144854 3293856 3357411 3336019 3241694 3133874 3067399 3046243 3078310 3212015 3469403
19702C469403K96702J63104j08361l71563n06756n05517m34277l59548l04452
$$ 3469403 3766105 3929209 3820848 3449285 2942529 2437012 2002735 1643187 1338735
19693A338735k55573j91048r0060L5738J30580J59901J56232J72656K22044K97395
$$ 1338735 1083162 892114 802054 837792 968372 1128273 1284505 1457161 1679205 1976600
19683A976600L70483L55846J91079o4381k74049l45539k83014j79273j52832k30510
$$ 1976600 2347083 2702929 2894008 2829627 2555578 2210039 1927025 1747752 1594920 1364410
19673A364410l12599k88317j35019R2616K78830L13746K06871P3555j2628o9470
$$ 1364410 1051811 763494 628475 721091 999921 1313667 1520538 1594093 1581465 1511995
19663A511995j19649j28970n5459O0707J26863J07868O1729N5110P9830R1264
$$ 1511995 1392346 1263376 1207917 1268624 1395487 1503355 1565084 1620194 1700024 1791288
19653A791288Q0450R9969K04560L59094M54540L99246J95119o6550l06471m94679
$$ 1791288 1871738 1971707 2176267 2535361 2989901 3389147 3584266 3517716 3211245 2716566
19643B716566o09881o32875n62767m26157k51785p2308M8585Q2290P8717P9073
$$ 2716566 2106685 1473810 911043 484886 233101 160793 209378 291668 370385 449458
19633D49458O1106J209p2102j13662j14914p8537L353R3978J09916L1220o1064
$$ 449458 510564 511773 439671 326009 211095 132558 135911 229889 339805 371025 309961
19622C09961j04112j38467k02690k42460j87471o1653Q606m7170j40901j66232
$$ 309961 205849 67382 -135308 -377768 -565239 -626892 -618286 -665456 -806357 -972589
19612i72589r0022P1124K38142L13511K72876J98651J97551K96113M15685M48343
$$ -972589 -1062611 -991487 -753345 -439834 -166958 31693 229244 525357 941042 1389385
19602A389385L42852J43310k9698p4028J7530J70670K87962L18634K97537K41421
$$ 1389385 1732237 1875547 1845849 1771821 1789351 1960021 2247983 2566617 2864154 3105575
19592C105575J17613j0081l3250L9005J26322J60648R2349p8144k68439l54191
$$ 3105575 3223188 3213107 3179857 3218862 3345184 3505832 3598181 3520037 3251598 2897407
19582B897407k65174q5460k0620j39431k68595k32418m3341J84967L88673N43396
$$ 2897407 2632233 2546773 2526153 2386722 2118127 1885709 1842368 2027335 2416008 2959404
19572B959404O15035O01042N30668M32699L18227J78570J5157j43475k58038l16148
$$ 2959404 3574439 4175481 4706149 5138848 5457075 5635645 5650802 5507327 5249289 4933141
19562D933141l22147k82136j87843k9076J46264K50179K64592K71045L40862M89574
$$ 4933141 4610994 4328858 4141015 4111939 4258203 4508382 4772974 5044019 5384881 5874455
19552E874455P03438R13926J033373J044492J012897J032569J153736J365657
$$ 5874455 6577893 7491819 8525192 9569684 10582581 11615150 12768886 14134543
19544A4134543J650336K004728K423725K900052L417602L942017M480451N173412
$$ 14134543 15784879 17789607 20213332 23113384 26530986 30473003 34953454 40126866
19536D0126866O219502P675611R440354J1363486J3333327J5196818J6362596
$$ 40126866 46346368 54021979 63462333 74825819 88159146 103355964 119718560
19529A19718560J5363498J0342787J158961q864752j5419862j7277399j6076240
$$ 119718560 135082058 145424845 146583806 137719054 122299192 105021793 88945553
19522H8945553j3749578j1358580r264166p535065o150617n065823m230617l571126
$$ 88945553 75195975 63837395 54573229 47038164 40887547 35821724 31591107 28019981
19514B8019981l019741k540143k113282j736215j430156j227658j132403j113919
$$ 28019981 25000240 22460097 20346815 18610600 17180444 15952786 14820383 13706464
19506A3706464j157131j252216j334545j309849j125945p99772m28223j23380
$$ 13706464 12549333 11297117 9962572 8652723 7526778 6727006 6298783 6175403
19498F175403P4456J57948J27647N8569P5231J89957K72208K55282K14984K06901
$$ 6175403 6249859 6407807 6535454 6594023 6669254 6859211 7131419 7386701 7601685 7808586
19488G808586J97553J49501O8687n6155k62121n35220p95207r49564r50742q26502
$$ 7808586 8006139 8155640 8224327 8168172 7906051 7370831 6575624 5626060 4675318 3848816
19478C848816o81287n69804m38785k75079j49313r9282j00074j29043j94733k98165
$$ 3848816 3167529 2597725 2158940 1883861 1734548 1635266 1535192 1406149 1211416 913251
19468I13251l71764l09624j05892J08710K14915K02325J20848L2904q4M0058J04139
$$ 913251 541487 231863 125971 234681 449596 651921 772769 805673 805589 845647 949786
19457I49786J23624P2024k6684j28073j95973k21217k15368k00280j80944j20844
$$ 949786 1073410 1145434 1118750 990677 794704 573487 358119 157839 -23105 -143949
19447a43949r626R3736J44531J58052J58936J44512J29064J62605K73115M17002
$$ -143949 -153575 -59839 84692 242744 401680 546192 675256 837861 1110976 1527978
19437A527978M96657M41896K58432K4226j25974j43025j32178j44360j27752j06565
$$ 1527978 2024635 2466531 2724963 2749189 2623215 2480190 2348012 2203652 2075900 1969335
19427A969335j42998k00756k19333k19284k34650k43056k16911j51540p7517m6610
$$ 1969335 1826337 1625581 1406248 1186964 952314 709258 492347 340807 263290 216680
19417B16680n7295n7761k7748J6368N8087Q5229J06296J38331J48119P8280l8307
$$ 216680 159385 101624 73876 90244 148331 233560 339856 478187 626306 704586 666279
19406F66279r9969q5276n1694m2503n0240n8891r4749j90950l33338m32486l84026
$$ 666279 566310 481034 429340 386837 336597 277706 182957 -7993 -341331 -773817 -1157843
19395a157843j93120L3071K04386L16439M09119M76370M67031L60031K12701J14047
$$ -1157843 -1350963 -1317892 -1113506 -797067 -387948 88422 555453 915484 1128185 1242232
19385A242232R5328J30879J75432J87892J72375J63421J71784J65754J04811k1404
$$ 1242232 1337560 1468439 1643871 1831763 2004138 2167559 2339343 2505097 2609908 2588504
19375B588504j84990l43848m50887m64852m12999l77850l82327l46086k09647
$$ 2588504 2403514 2059666 1608779 1143927 730928 353078 -29249 -375335 -584982
19366e84982n8043J142o845q067K2175P4244J35671J61322J13521N7667Q2833
$$ -584982 -643025 -641883 -648728 -656795 -634620 -560376 -424705 -263383 -149862 -92195 -9362
19355i362J73792K62208L25686L56227L13844J98224R2679Q3247J92635L43827
$$ -9362 164430 426638 752324 1108551 1422395 1620619 1713298 1796545 1989180 2333007
19345B333007L74770J94516j36088m93451p44688q08681p15244n34593l19299
$$ 2333007 2707777 2902293 2766205 2272754 1528066 719385 4141 -530452 -849751
19336h49751j46909j02721j84140l05033l75283l46326k34630j03089J85Q1039
$$ -849751 -996660 -1099381 -1283521 -1588554 -1963837 -2310163 -2544793 -2647882 -2647697 -2566658
19326b566658J64108K45350L17603L93935M58737M53573L52361K13011J12450
$$ -2566658 -2402550 -2157200 -1839597 -1445662 -986925 -533352 -180991 32020 144470
19317A44470O4749M9727O0503Q2512P8422M9533N4585J15419J82655K10027K17554
$$ 144470 209219 258946 319449 401961 480383 529916 584501 699920 882575 1092602 1310156
19306A310156K36167K16872P0071j78189l62145l69736k30880k4149J70821L10179
$$ 1310156 1546323 1763195 1833266 1655077 1292932 923196 692316 668167 838988 1149167
19296A149167M12632M70318M09580J97231q7206l20648m29166m29073l87493l08666
$$ 1149167 1561799 2032117 2441697 2638928 2551722 2231074 1801908 1372835 985342 676676
19286F76676j37721J21355L71152N08944N16059M24137K64245O3910j42384l20179
$$ 676676 538955 660310 1031462 1540406 2056465 2480602 2744847 2808757 2666373 2346194
19276B346194m59906n63958o17897n89978m60950k74748j14870j4308K5965K430
$$ 2346194 1886288 1322330 704433 114455 -346495 -621243 -736113 -750421 -724456 -722026
19266g22026m8634n1556K7911J41164K46634L43941M04319L94287L19440K06521
$$ -722026 -770660 -822216 -794305 -653141 -406507 -62566 341753 736040 1055480 1262001
19256A262001P8555l6686q9971o9743m1085q0331k09885l65639m47926m14921
$$ 1262001 1340556 1303870 1213899 1144156 1103071 1022740 812855 447216 -710 -415631
19246d15631l02078j95378j51228j48150j18115j7877J14142K15302K97740L77590
$$ -415631 -717709 -913087 -1064315 -1212465 -1330580 -1348457 -1234315 -1019013 -721273 -343683
19236c43683M19778M01134L09929J53454j7367j64338l00932l99624l77695k03428
$$ -343683 76095 477229 787158 940612 923245 758907 457975 58351 -319344 -522772
19226e22772O2909K96069L91850L44348K36385J46329O5594o3400k44203m25507
$$ -522772 -459863 -163794 228056 572404 808789 955118 1020712 957312 713109 287602
19216B87602n64460o17598n16691k36589J40416M70254O48226O56464N65895M78356
$$ 287602 -276858 -894456 -1411147 -1647736 -1507320 -1037066 -388840 267624 833519 1311875
19206A311875L97906K41178j2133k67952m23937m64413m10564k68871p7872P8666
$$ 1311875 1709781 1950959 1938826 1670874 1246937 782524 371960 103089 25217 103883
19196A03883J35165J02849N2749M3055P2055R3943P4036K9575J146j1312l0962
$$ 103883 239048 341897 394646 437701 509756 603699 677735 707310 708456 697144 666182
19185F66182m0895j9785j7518j05975k78099m40661m85598l50235p2295K02892
$$ 666182 625287 605502 587984 482009 203910 -236751 -722349 -1072584 -1144879 -941987
19175i41987L43149L17942J73868J975r6068p6172L586M4905K7680J0365M2111
$$ -941987 -598838 -280896 -107028 -105053 -201121 -277293 -273707 -228802 -201122 -190757 -148646
19164a48646J19967K00627K36653K20978K03656K37936L10349L45319K96324J94649
$$ -148646 -28679 171948 408601 629579 833235 1071171 1381520 1726839 2023163 2217812
19154B217812J00186L8904j629k4286j5911J8951L5186k5038j40325k24729k20558
$$ 2217812 2317998 2356902 2355273 2330987 2315076 2334027 2369213 2344175 2203850 1979121 1758563
19143A758563j24419J3687J38241K28947K64189K22415R6577j02499k97889l55151
$$ 1758563 1634144 1647831 1786072 2015019 2279208 2501623 2598200 2495701 2197812 1842661
19133A842661k21160k0559N2424q5347l46222n33599n03858l21113j63386j28029
$$ 1842661 1621501 1600942 1653366 1568019 1221797 688198 184340 -136773 -300159 -428188
19123d28188j77570k20123k10226j44141m3577L3668M8859M1919M8889M6972J2055
$$ -428188 -605758 -825881 -1036107 -1180248 -1223825 -1190157 -1141298 -1099379 -1050490 -1003518 -991463
19112i91463p2980j81935k10052j12078K5472J23460J95061K55453K50812J65222
$$ -991463 -1064443 -1246378 -1456430 -1568508 -1543036 -1419576 -1224515 -969062 -718250 -553028
19102e53028Q8281R9218J70027K41287K89904L00206K51002J44712J5210j10316
$$ -553028 -464747 -365529 -195502 45785 335689 635895 886897 1031609 1046819 936503
19092I36503k23234k93750k82350j67887L1230K30144L45528L96735M63937N49854
$$ 936503 713269 419519 137169 -30718 512 230656 576184 972919 1436856 1986710
19082A986710N55159L86537O0837l04520n66313o25945m67425j56493J98445M72609
$$ 1986710 2541869 2928406 2989243 2684723 2118410 1492465 1025040 868547 1066992 1539601
19072A539601N44757L78585O2546k39549l87173l33625j37852O5432J41826O9509
$$ 1539601 2084358 2462943 2525489 2285940 1898767 1565142 1427290 1492722 1634548 1704057
19062A704057l6775n0533M1012J65195K59539K78198J81246o853j66313k12021
$$ 1704057 1667282 1616749 1657761 1822956 2082495 2360693 2541939 2535086 2368773 2156752
19052B156752j97862k23114l04905l93955m56430m57080l69131k42040j41403
$$ 2156752 1958890 1735776 1430871 1036916 580486 123406 -245725 -487765 -629168
19043f29168o4054K4000J32527K45286L12178K76543J50565J1873p4444j19830
$$ -629168 -693222 -669222 -536695 -291409 20769 297312 447877 459750 385306 265476
19033B65476j62902j96636k08267k11505k11193j78033j02220k6813K3030O7095
$$ 265476 102574 -94062 -302329 -513834 -725027 -903060 -1005280 -1032093 -1009063 -941968
19023i41968J01512R2082K1389q8066j91601k65438k95174k55027j67300j06550
$$ -941968 -840456 -748374 -726985 -815051 -1006652 -1272090 -1567264 -1822291 -1989591 -2096141
19013b096141j00471r6848m3029L7105O7709J9541o3285j12676o9820P1104K18339
$$ -2096141 -2196612 -2293460 -2336489 -2299384 -2231675 -2212134 -2275419 -2388095 -2457915 -2386811 -2168472
19002b168472K34524Q9743q1499j15608J6076K15810L97299N23128N63566N19293
$$ -2168472 -1933948 -1844205 -1925704 -2041312 -2025236 -1809426 -1412127 -888999 -325433 193860
18992A93860M31554L38650K39660J16016j1215r4759j15034n9011P8651K49704
$$ 193860 625414 964064 1203724 1319740 1308525 1213766 1098732 1039721 1118372 1368076
18982A368076L84045M29939L54884J68870m4286j72685j89979j37906o2418k6927
$$ 1368076 1752121 2182060 2536944 2705814 2661528 2488843 2298864 2160958 2098540 2071613
18972B071613p7365j81855k65630k91292k66694k01500r5515L3834J41762J85874
$$ 2071613 1994248 1812393 1546763 1255471 988777 787277 691762 725596 867358 1053232
18962A053232J67899J19607O5820K6396J0167j6985o8941p1619K5918J80981L33002
$$ 1053232 1221131 1340738 1406558 1432954 1443121 1426136 1357195 1285576 1311494 1492475 1825477
18951A825477M14586L60724J98835L1415p6660j56032k64192m01916n29108o10143
$$ 1825477 2240063 2600787 2799622 2831037 2754377 2598345 2334153 1932237 1403129 792986
18941G92986o27439n81442m84191l46335j79933n149J63748L04267L47144K37795
$$ 792986 165547 -415895 -900086 -1246421 -1426354 -1431503 -1267755 -963488 -616344 -378549
18931c78549M6977q4357j18550j12916p8697j1095M8904P4158P7857O1168K1394
$$ -378549 -331572 -415929 -534479 -647395 -726092 -737187 -688283 -614125 -536268 -475100 -453706
18920d53706j3258l3860m5520k5887K6714Q2376J32564J92159K76788L83810M64968
$$ -453706 -466964 -500824 -546344 -572231 -545517 -463141 -330577 -138418 138370 522180 987148
18909I87148M34839K47296k3824k43418l28912k95750k38138k26884k52961k76565
$$ 987148 1421987 1669283 1645459 1402041 1073129 777379 539241 312357 59396 -217169
18899b17169k49754j41354o556N0044J9604k6510n1733m8515j9340J6356L8037
$$ -217169 -466923 -608277 -614833 -564789 -545185 -571695 -623428 -671943 -691283 -674927 -636890
18888f36890M6883O3578J01753J67775K50588L15428L24713K59670J53619Q6004
$$ -636890 -590007 -526429 -424676 -256901 -6313 309115 633828 893498 1047117 1133121
18878A133121R7116J64940K59448L42002L60531K95242J81051O4417m5901j58662
$$ 1133121 1230237 1395177 1654625 1996627 2357158 2652400 2833451 2897868 2851967 2693305
18868B693305k41946k62331k51710k74244l50648m47522m99942m50849l04247
$$ 2693305 2451359 2189028 1937318 1663074 1312426 864904 364962 -85887 -390134
18859c90134j24876R519N6744K2073l0751l7340P658Q6121J77590K87678M17039
$$ -390134 -515010 -505491 -448747 -426674 -457425 -494765 -487107 -400986 -223396 64282 481321
18848D81321M96975M59873L29006J56878l7563k34439l84127m29476l59733k14163
$$ 481321 978296 1438169 1767175 1924053 1886490 1652051 1267924 838448 478715 264552
18838B64552l6279J42311K78311L27017K76898J21006j20565l38937m21822l58697
$$ 264552 228273 370584 648895 975912 1252810 1373816 1253251 914314 492492 133795
18828A33795k42730k01341k84793m03492m18643k82304m7622J86415L38871M10220
$$ 133795 -108935 -310276 -595069 -998561 -1417204 -1699508 -1747130 -1560715 -1221844 -811624
18818h11624M45489M46422M04247L45859K79470J83268O6292l0585j05400j99245
$$ -811624 -366135 80287 484534 830393 1109863 1293131 1359423 1328838 1223438 1024193
18808A024193l23317m23499m36870l71847k70581j58632p1105l6807k9242j201
$$ 1024193 700876 277377 -159493 -531340 -801921 -960553 -1031658 -1068465 -1097707 -1098908
18798a098908M2132O5609O5045M7140J6765q991k7466m8481m6441J7188Q9301
$$ -1098908 -1056776 -991167 -926122 -878982 -862217 -871208 -898674 -947155 -993596 -976408 -887107
18787h87107N0316j30069l50943m83851m69135l30087j17649Q7197J72584J14714
$$ -887107 -836791 -966860 -1317803 -1801654 -2270789 -2600876 -2718525 -2631328 -2458744 -2344030
18777b344030P69q5962j30300j49489j64669j79444j58874q7816o113M2956O4852
$$ -2344030 -2343261 -2429223 -2559523 -2709012 -2873681 -3053125 -3211999 -3299815 -3305928 -3262972 -3198120
18766c198120P3123N6356K3179j0861n8424j02184p8040L1772J78356K92289L17265
$$ -3198120 -3124997 -3068641 -3045462 -3056323 -3114747 -3216931 -3294971 -3263199 -3084843 -2792554 -2475289
18755b475289K55027J83577J72512K13334K68305K97524K42232Q3497j14409k75084
$$ -2475289 -2220262 -2036685 -1864173 -1650839 -1382534 -1085010 -842778 -759281 -873690 -1148774
18745a148774l80067m36536m35744l78469l04756k55125k18766j46587j1012J70433
$$ -1148774 -1528841 -1965377 -2401121 -2779590 -3084346 -3339471 -3558237 -3704824 -3715836 -3545403
18735c545403L79071N88472P16209O78618M95229K77954J20537N2310P2458J62964
$$ -3545403 -3166332 -2577860 -1861651 -1183033 -687804 -409850 -289313 -237003 -164545 -1581
18725a581K83716L92099M53652M42380L47438J94577M5500n4877r3068q9257r4017
$$ -1581 282135 674234 1127886 1570266 1917704 2112281 2157781 2102904 2009836 1920579 1826562
18714A826562j32016j73158j90895j98604k29177l02917l74692l43530j72425
$$ 1826562 1694546 1521388 1330493 1131889 902712 599795 225103 -118427 -290852
18705b90852M1209J82638K32909K15936J52553Q6032O3859Q1707R6836R0083N7766
$$ -290852 -249643 -67005 165904 381840 534393 620425 684284 765991 862827 952910 1010676
18694A010676o515p7944j14774r7773o6055r6547k02452l19772l86796l98276
$$ 1010676 1004161 926217 811443 713670 647615 551068 348616 28844 -357952 -756228
18684g56228l67559k72904j11378L9772R1592L0764r9652k53503l67634l80301
$$ -756228 -1123787 -1396691 -1508069 -1468297 -1376705 -1345941 -1445593 -1699096 -2066730 -2447031
18674b447031k83891r1440J56727L58478M16027L22912J68094N0250R529L5286
$$ -2447031 -2730922 -2822362 -2665635 -2307157 -1891130 -1568218 -1400124 -1349874 -1340345 -1305059
18664a305059P9179J19707K10682L66847M98854N21442M15600J87866j00189l22639
$$ -1305059 -1225880 -1106173 -895491 -528644 -29790 491652 907252 1095118 994929 672290
18654F72290m01293l77801l28974k72175k27522k46007l17511l77439l57763k25816
$$ 672290 270997 -106804 -435778 -707953 -935475 -1181482 -1498993 -1876432 -2234195 -2460011
18644b460011j8736K02234L71560M39071M16878L58969L06469K63360K21025K16343
$$ -2460011 -2478747 -2276513 -1904953 -1465882 -1049004 -690035 -383566 -120206 100819 317162
18634C17162L06561M52539N12383M06510K03965J5152q0261n7385L2627J19257
$$ 317162 623723 1076262 1588645 1995155 2199120 2214272 2134011 2076626 2109253 2228510
18624B228510J71616J80097J46573J12652J11129J32083J45243J29426Q2243J3811
$$ 2228510 2400126 2580223 2726796 2839448 2950577 3082660 3227903 3357329 3439572 3453383
18614C453383o2294j27914j64958j84371k17459k83128l79100m83516n48886n27970
$$ 3453383 3391089 3263175 3098217 2913846 2696387 2413259 2034159 1550643 1001757 473787
18604D73787m12775k42045p9468P188m5997k28674m25081n35310n58499n31444
$$ 473787 61012 -181033 -260501 -253313 -299310 -527984 -953065 -1488375 -2046874 -2578318
18594b578318m57247l39282k15787j02634M5039K48823M28725M95485M44439L28993
$$ -2578318 -3035565 -3374847 -3590634 -3693268 -3648229 -3399406 -2970681 -2475196 -2030757 -1701764
18584a701764K09250J14993M2498k4234q9615j40039j34624l1345J50805L24892
$$ -1701764 -1492514 -1377521 -1335023 -1359257 -1448872 -1588911 -1723535 -1754880 -1604075 -1279183
18574a279183M14178M17170L69797K79867J29216n4442j71952j66902r2293l0790
$$ -1279183 -865005 -447835 -78038 201829 331045 276603 104651 -62251 -154544 -185334
18564a85334j3049q840L5727J54752L20797M48789M76946M10349K76243Q1979
$$ -185334 -198383 -207223 -171496 -16744 304053 752842 1229788 1640137 1916380 1998359
18554A998359j39644l18776m04258l80834k70447j05518R2460K73119L49663K86426
$$ 1998359 1858715 1539939 1135681 754847 484400 378882 471342 744461 1094124 1380550
18544A380550J23969n2435j61797j89775j58326p1849L3334N8645m9795k04598
$$ 1380550 1504519 1452084 1290287 1100512 942186 870337 903671 962316 912521 707923
18534G07923k39533r8230P3709J21393N7317l3307j00293j37274j79276k60855
$$ 707923 468390 370160 443869 565262 622579 589272 488979 351705 172429 -88426
18524h8426l62826m17260l73032k46452p9289R1811K07981K29171J86947J37696
$$ -88426 -451252 -868512 -1241544 -1487996 -1567285 -1475474 -1267493 -1038322 -851375 -713679
18514g13679J12376J15565J27620R7414L05j08249j77550k05543j91662j19330
$$ -713679 -601303 -485738 -358118 -260704 -260399 -368648 -546198 -751741 -943403 -1062733
18504a062733M715J20161J69627J69020J61641J44016R2701Q743q2117j25576
$$ -1062733 -1058018 -937857 -768230 -599210 -437569 -293553 -200852 -192109 -274226 -399802
18494c99802p4673N8828J91008K19911J29598o713j05799j15940l5738N8733R2684
$$ -399802 -474475 -415647 -224639 -4728 124870 118157 12358 -103582 -139320 -80587 12097
18483A2097P3264K7812l8822j29240k08008k00942r3573L6521R4480N7712M04
$$ 12097 85361 113173 74351 -54889 -262897 -463839 -557412 -520891 -426411 -368699 -368295
18472c68295j0734J7576N8037J00464J68297K85592L78526L21076J20080p3211
$$ -368295 -379029 -361453 -303416 -202952 -34655 250937 629463 950539 1070619 997408
18462I97408j25701m2579N5366P4524N530j18259k27479k56841j82303J1608K93687
$$ 997408 871707 829128 884494 959018 964548 846289 618810 361969 179666 191274 484961
18451D84961N35831N97323M33668J34307j35922k70838k75405j95891p1730L0800
$$ 484961 1020792 1618115 2051783 2186090 2050168 1779330 1503925 1308034 1236304 1267104
18441A267104N0116N157n6498j16211j59143j57835r0000L4018J78716L00315
$$ 1267104 1317220 1322377 1265879 1149668 990525 832690 742690 776708 955424 1255739
18431A255739L52306L19818K35267J45625R2849Q9022J05073J32555J76934J92701
$$ 1255739 1608045 1927863 2163130 2308755 2401604 2490626 2595699 2728254 2905188 3097889
18421C097889J22148j7727j58233k63594l14971k84829k08482k01385l07471m25980
$$ 3097889 3220037 3202310 3044077 2780483 2465512 2180683 1972201 1770816 1463345 1037365
18411A037365m62903m42248m41683m63622m16008k56549o7413O0057J11315J03406
$$ 1037365 574462 132214 -309469 -773091 -1189099 -1445648 -1513061 -1453004 -1341689 -1238283
18401a238283N6213J8067N2962J66574K94726L68318L37091J95159O640j40698
$$ -1238283 -1182070 -1164003 -1111041 -944467 -649741 -281423 55668 250827 257467 116769
18391A16769k01097k00373k02615k36055k42757j25736J31217M07067N41175M89125
$$ 116769 -84328 -284701 -487316 -723371 -966128 -1091864 -960647 -553580 -12405 476720
18381D76720L16067R0842j34967k70176k29303l6279J98249L50265L62120K81888
$$ 476720 792787 883629 748662 478486 249183 212904 411153 761418 1123538 1405426
18371A405426J75716O0513o1204j73997k56386k78105k04167m4966J15382J62095
$$ 1405426 1581142 1641655 1580451 1406454 1150068 871963 667796 622830 738212 900307
18361I00307M2588j20658j24514N5960K44307K69620J41503m510q8913j24389
$$ 900307 942895 822237 697723 753683 997990 1267610 1409113 1404603 1315690 1191301
18351A191301j50684j93654k29940k15694j57027q5513l8345o9721j65335k27695
$$ 1191301 1040617 846963 617023 401329 244302 158789 120444 50723 -114612 -342307
18341c42307j95630r2637K7704J33628K14926K70139K96830K80636K22876J72777
$$ -342307 -537937 -630574 -602870 -469242 -254316 15823 312653 593289 816165 988942
18331I88942J82012K60243L85384N20784N91353N16572L16429R3663q6518k35253
$$ 988942 1170954 1431197 1816581 2337365 2928718 3445290 3761719 3855382 3768864 3533611
18321C533611l61733m29522m29380m27071n09945o71375p80226p25841n19166
$$ 3533611 3171878 2742356 2312976 1885905 1375960 704585 -75641 -801482 -1320648
18312a320648k70297r3096Q358J12536K46989L58286L89008L35435K37313J34528
$$ -1320648 -1590945 -1684041 -1675683 -1563147 -1316158 -957872 -568864 -233429 3884 138412
18302A38412P7236J14072K06104K39163J43986m4316k05618k29673j31602k5047
$$ 138412 215648 329720 535824 774987 918973 874657 669039 439366 307764 282717
18292B82717K9482N0622M9469K9056R568k876J1909R9103K55582M22921N46309
$$ 282717 312199 362821 412290 441346 450914 448038 459947 559050 814632 1237553 1783862
18281A783862N98550N74744M99436M31156L99646L43297J82281o6010l06833m64776
$$ 1783862 2382412 2957156 3456592 3887748 4287394 4630691 4812972 4746962 4440129 3975353
18271C975353n44310o18835p11709p49516o75641n41073m38285l56659j79584
$$ 3975353 3431043 2812208 2100499 1350983 675342 134269 -304016 -660675 -840259
18262h40259J57219N45779P84629P67655N68054L61692K67644K71828L07130L11570
$$ -840259 -683040 -137261 647368 1415023 1983077 2344769 2612413 2884241 3191371 3502941
18252C502941K18910N253k79128n40214o82648o54578m88137k84048j39616q8173
$$ 3502941 3721851 3727104 3447976 2907762 2225114 1570536 1082399 798351 658735 570562
18242E70562j01027j21929j12343o8956k366N8378N7712l3527j52058j68735m3928
$$ 570562 469535 347606 235263 166307 163941 222319 280031 246504 94446 -74289 -118217
18231a18217Q9476Q9025m8976k23937l34111l61739l53958l27414k50498j00695
$$ -118217 -28741 60284 11308 -212629 -546740 -908479 -1262437 -1589851 -1840349 -1941044
18221a941044Q2406K25233K85074K59240J76682R2231L8022K046j3310J8673R9381
$$ -1941044 -1858638 -1633405 -1348331 -1089091 -912409 -820178 -782156 -780110 -793420 -774747 -675366
18210f75366J96203K65165K59653J65434L4177o1920j28396k31024l40935l33111
$$ -675366 -479163 -213998 45655 211089 245266 183346 54950 -176074 -517009 -850120
18200h50120j41434J68314M37526N28262M39394K97950K09125J72534J47389J15753
$$ -850120 -991554 -823240 -385714 142548 581942 879892 1089017 1261551 1408940 1524693
18190A524693P1628K2757J3205Q9166K34624L63964L86724K80606J01668r5088
$$ 1524693 1596321 1619078 1632283 1721449 1956073 2320037 2706761 2987367 3089035 2993947
18180B993947k87812m31534m65422l80528k40575j10790k8392j5788o3614j43223
$$ 2993947 2706135 2274601 1809179 1428651 1188076 1077286 1048894 1033106 969492 826269
18170H26269k07479j92557r2050K1470R2751J30412J44812J24674O6176j6914
$$ 826269 618790 426233 334183 355653 448404 578816 723628 848302 914478 897564
18160H97564r0776j12932o4872J9014Q4597J14641Q9758j9048j72112k90669l27507
$$ 897564 806788 693856 628984 647998 732595 847236 936994 917946 745834 455165 127658
18149A27658k82811j97976j25036r0110p4441m8150l7982j17918k80007m00048
$$ 127658 -155153 -353129 -478165 -568275 -642716 -690866 -728848 -846766 -1126773 -1526821
18139a526821m16488m04388m09480l89262l22655k31437j13335N0961K42740M35563
$$ -1526821 -1943309 -2347697 -2757177 -3146439 -3469094 -3700531 -3813866 -3762905 -3520165 -3084602
18129c084602O17741P57244P96663O88079M61535K37230J16111R0187Q3026L4068
$$ -3084602 -2466861 -1709617 -912954 -224875 236660 473890 590001 680188 763214 797282
18119G97282m7736r9659r5427o2756l6050j6375L1135J07096J33503M6433r7568
$$ 797282 749546 649887 554460 491704 455654 439279 470414 577510 711013 757446 659878
18108F59878j86692j64059n4504N0674N3760k8733p0505p189R3343J51435J55830
$$ 659878 473186 309127 254623 305297 359057 330324 259819 252630 345973 497408 653238
18097F53238J14727N4604M1472J02913J69849J61981P9492n1000k28177m21960
$$ 653238 767965 822569 864041 966954 1136803 1298784 1378276 1327276 1099099 677139
18087F77139n36252m91390l24974j54221o7544o4848r0685j11315j17163r9692
$$ 677139 140887 -350503 -675477 -829698 -897242 -962090 -1052775 -1164090 -1281253 -1380945
18077a380945q5440j24840k16540k89378k73486j56062J1493J61005K66213L28904
$$ -1380945 -1466385 -1591225 -1807765 -2097143 -2370629 -2526691 -2515198 -2354193 -2087980 -1759076
18067a759076L52844L33917K60620J52389N7117J641k2908l2262m1082l7965K9833
$$ -1759076 -1406232 -1072315 -811695 -659306 -602189 -600548 -623456 -655718 -696800 -734765 -704932
18056g04932J64435K77139L13094L26014L65391L88453K95715K4393l38919o15850
$$ -704932 -540497 -263358 49736 375750 741141 1129594 1425309 1449702 1110783 494933
18046D94933o85266n29644k29958M8798J61383J13577K0975j4034L4083R8153
$$ 494933 -190333 -719977 -949935 -901137 -739754 -626177 -605202 -619236 -585153 -487000
18036d87000R6272L0221m0084q9414j47325k36348l35411m06544m43909m51201
$$ -487000 -390728 -360507 -400591 -490005 -637330 -873678 -1209089 -1615633 -2059542 -2510743
18026b510743m12823l30973k32593j30647k7828P9154J84277K43009K41431K39195
$$ -2510743 -2923566 -3254539 -3487132 -3617779 -3645607 -3566453 -3382176 -3139167 -2897736 -2658541
18016b658541K89620L72395M47750N21796O26893P36662P35166N37180K04329
$$ -2658541 -2368921 -1996526 -1548776 -1026980 -400087 336575 1071741 1608921 1813250
18007A813250j19800l25359l78034l29095k68476k28264j77972j17815r8874j38429
$$ 1813250 1693450 1368091 990057 660962 392486 164222 -13750 -131565 -230439 -368868
17997c68868j89694k34181l08171m06376m65371m44417l63404k53444j16812J3112
$$ -368868 -558562 -792743 -1100914 -1507290 -1972661 -2417078 -2780482 -3033926 -3150738 -3137626
17987c137626O0926Q105q6732j50309j48323r9188k4266O7193J59792K45319L18976
$$ -3137626 -3076700 -3068595 -3155327 -3305636 -3453959 -3553147 -3577413 -3510220 -3350428 -3105109 -2786133
17976b786133L45052K75061J22336l3574j23459j42681j11876j8005J46083L07846
$$ -2786133 -2441081 -2166020 -2043684 -2077258 -2200717 -2343398 -2455274 -2473279 -2327196 -2019350
17966b019350L69164L28373K57302K01308J46188O7955j1783m5096O174J44207
$$ -2019350 -1650186 -1321813 -1064511 -863203 -717015 -649060 -660843 -705939 -699765 -555558
17956e55558L19052M40037M42893L74717L28908L04631K46714J54660N0947p2308
$$ -555558 -236506 203531 646424 1021141 1350049 1654680 1901394 2056054 2107001 2034693
17946B034693k12484l30379m06442m61700m97470m78754l98872k98475k18633
$$ 2034693 1822209 1491830 1085388 623688 126218 -352536 -751408 -1049883 -1268516
17937a268516j44498k2880J43387K75371L15092K90586K70097K72975K57579K14940
$$ -1268516 -1413014 -1435894 -1292507 -1017136 -702044 -411458 -141361 131614 389193 604133
17927F04133J74617J01957n0311k19034k99705k57355j18258O8756K27719K82420
$$ 604133 778750 880707 830396 611362 311657 54302 -63956 4800 232519 514939
17917E14939K11036O1672p3110j29802j14573n0629M9818J42438J69249J32734
$$ 514939 725975 787647 714537 584735 470162 419533 469351 611789 781038 913772
17907I13772P1432o073q0572j01688o8707o3422j60015l61224o02820p76772q08151
$$ 913772 985204 979131 898559 796871 728164 664742 504727 143503 -459317 -1236089 -2044240
17896b044240p05974n21659k79191M871K63366M23167M59158M19410L95895M20284
$$ -2044240 -2750214 -3271873 -3551064 -3546193 -3282827 -2859660 -2400502 -1981092 -1585197 -1164913
17886a164913M63625M84281M33514L20025K11571J56507J73499K25929K26805
$$ -1164913 -701288 -217007 216507 536532 748103 904610 1078109 1304038 1530843
17877A530843J50384N4919m2635j64327k35424j91086j22144j22989j83817k49514
$$ 1530843 1681227 1736146 1693511 1529184 1293760 1102674 980530 857541 673724 424210
17867D24210k75987k87860l43053m07963l84886k64008j22768k8164j9287r1306
$$ 424210 148223 -139637 -482690 -890653 -1275539 -1539547 -1662315 -1690479 -1709766 -1801072
17857a801072j66027j64596j10153p5910o0876l2582k239K594k3740n4954l6151
$$ -1801072 -1967099 -2131695 -2241848 -2317758 -2378634 -2411216 -2413455 -2410861 -2434601 -2489555 -2525706
17846b525706Q0000K66988M07068M01802K80473J58154J24533J74945K44329K87821
$$ -2525706 -2445706 -2178718 -1771650 -1369848 -1089375 -931221 -806688 -631743 -387414 -99593
17836i9593K94187K71880K50983K36797J86784R7849K7431k9419j20684k12210
$$ -99593 194594 466474 717457 954254 1141038 1238887 1266318 1236899 1116215 904005
17826I04005k24995j79605k02592l42605m94683n46816m98331m26547l87665l73248
$$ 904005 679010 499405 296813 -45792 -540475 -1087291 -1585622 -2012169 -2399834 -2773082
17816b773082l41846k40883m9063J80943L62750M29942L50633J55966n5239j64912
$$ -2773082 -3114928 -3355811 -3404874 -3223931 -2861181 -2431239 -2080606 -1924640 -1979879 -2144791
17806b144791j04297Q4848K70832L73230M00635L55204K63738K18319K80068L92655
$$ -2144791 -2249088 -2164240 -1893408 -1520178 -1119543 -764339 -500601 -282282 -2214 390441
17796C90441M46478L91977K71746J55936N9849l0729j07869j54836j77467k10591
$$ 390441 836919 1228896 1500642 1656578 1716427 1685698 1577829 1422993 1245526 1034935
17786A034935k56015k58145j87069r6954n8932q0484j51366k64051l60376l68650
$$ 1034935 778920 520775 333706 236752 177820 97336 -54030 -318081 -678457 -1047107
17776a047107k74724j11175O7605J89135K21492K15286K36929K67398K45993J98735
$$ -1047107 -1321831 -1433006 -1365401 -1176266 -954774 -739488 -502559 -235161 10832 209567
17766B09567K05522K66033L13845L16937K58774J21851l3126j07421r8525p3485
$$ 209567 415089 681122 994967 1311904 1570678 1692529 1659403 1551982 1453457 1379972
17756A379972p4004j17054k00716k83553l51002m38986n46499o18662n92674m35694
$$ 1379972 1305968 1188914 988198 704645 353643 -85343 -631842 -1250504 -1843178 -2278872
17746b278872j87852O1501K60211L97970M61576M23718K94763J40073o29j33403
$$ -2278872 -2466724 -2405223 -2145012 -1747042 -1285466 -861748 -566985 -426912 -427541 -560944
17736e60944k57977l38804l40017k74684j76300o2999L3160N9622J5515m0488
$$ -560944 -818921 -1157725 -1497742 -1772426 -1948726 -2011725 -1978565 -1918943 -1903428 -1943916
17726a943916n0868J7315J39188K57644L40752L75192L45092K40224Q5267o2433
$$ -1943916 -1994784 -1977469 -1838281 -1580637 -1239885 -864693 -519601 -279377 -194110 -256543
17716b56543j45585j30260j8509J54686L17468L67400K46044J4703j60645j56153
$$ -256543 -402128 -532388 -550897 -396211 -78743 288657 534701 549404 388759 232606
17706B32606j0983J44344K35799K69427K62679K23237J76615J65665J70052R0089
$$ 232606 221623 365967 601766 871193 1133872 1357109 1533724 1699389 1869441 1959530
17696A959530j06693l24134m64062n18227n19461n05657n18323n40625n27859
$$ 1959530 1852837 1528703 1064641 546414 26953 -478704 -997027 -1537652 -2065511
17687b065511n12076n39130n45099m19924j63012J21399L38833M59431N11833
$$ -2065511 -2577587 -3116717 -3661816 -4081740 -4244752 -4123353 -3784520 -3325089 -2813256
17678b813256N21263M96104M64197M30565L55269K03645K377j49557j75713j15610
$$ -2813256 -2291993 -1795889 -1331692 -901127 -545858 -342213 -339836 -489393 -665106 -780716
17668g80716m4931L7153J33152J57754N7451j00396k12251k58081k86214l00141
$$ -780716 -825647 -788494 -655342 -497588 -440137 -540533 -752784 -1010865 -1297079 -1597220
17658a597220k82610k40237j70761p7228Q361O6075J13611J59739J76117J51552
$$ -1597220 -1879830 -2120067 -2290828 -2368056 -2359695 -2293620 -2180009 -2020270 -1844153 -1692601
17648a692601J34802J81412K68560L11208K46485Q1479j39506l65111n37059o12702
$$ -1692601 -1557799 -1376387 -1107827 -796619 -550134 -468655 -608161 -973272 -1510331 -2123033
17638b123033n77512m44639k57546p5798O9394K08687L56666M50901M59957M29759
$$ -2123033 -2700545 -3145184 -3402730 -3478528 -3409134 -3200447 -2843781 -2392880 -1932923 -1503164
17628a503164L88687L02015J38476n0696j70473j82096j28203o6913j1159R0311
$$ -1503164 -1114477 -812462 -673986 -724682 -895155 -1077251 -1205454 -1272367 -1283526 -1193215
17618a193215K86566N08867N88897M24224R7558j83599k49306j12867N4604J24766
$$ -1193215 -906649 -397782 191115 615339 712897 529298 279992 167125 221729 346495
17608C46495R9880K8890l9245o5211o6131p6475o2077L1216J75220K86185L33908
$$ 346495 446375 475265 436020 370809 304678 228203 166126 197342 372562 658747 992655
17597I92655L41194L22251K79923K25811J59277P2229l2752j38588k16525k59529
$$ 992655 1333849 1656100 1936023 2161834 2321111 2393340 2360588 2222000 2005475 1745946
17587A745946k64915k31710j95076j96142k34241k53652k00424j01189j6837O4768
$$ 1745946 1481031 1249321 1054245 858103 623862 370210 169786 68597 51760 116528
17577A16528J90731L35854M21816M24671M01022L74997L08818K01701Q6847k4713
$$ 116528 307259 643113 1064929 1489600 1890622 2265619 2574437 2776138 2862985 2838272
17567B838272j38775k16160j83125n2928O7134Q4466j2568j52788k43485k70930
$$ 2838272 2699497 2483337 2300212 2247284 2314418 2398884 2386316 2233528 1990043 1719113
17557A719113k96373l48133l91777l93235l76653l86408m11515l99610l23174
$$ 1719113 1422740 1074607 682830 289595 -87058 -473466 -884981 -1284591 -1607765
17548a607765j98153p6212P310P0990J16000R6588J6030l4680J3505J19423K02185
$$ -1607765 -1805918 -1882130 -1874820 -1803830 -1687830 -1591242 -1575212 -1609892 -1596387 -1476964 -1274779
17537a274779K40416K62654K76749K56766J94003J15381M5527j2211o4621j24252
$$ -1274779 -1034363 -771709 -494960 -238194 -44191 71190 116717 104506 39885 -84367
17527h4367j86860k50375l17612l51994k98174j45646L5441J38545J02255n0667
$$ -84367 -271227 -521602 -839214 -1191208 -1489382 -1635028 -1599587 -1461042 -1358787 -1409454
17517a409454k32519l63143m24011m13812l23642j72071m536J20072J45587O4071
$$ -1409454 -1641973 -2005116 -2429127 -2842939 -3166581 -3338652 -3343188 -3223116 -3077529 -3013458
17507c013458n4258j07131n2427O6701J77073K31307K48831K76024L18250L27503
$$ -3013458 -3067716 -3174847 -3227274 -3160573 -2983500 -2752193 -2503362 -2227338 -1909088 -1581585
17497a581585K52496J30337O2481P2923Q0529l846j85277l79096m84677m30208
$$ -1581585 -1329089 -1198752 -1136271 -1063348 -982819 -986665 -1171942 -1551038 -2035715 -2465923
17487b465923k06232J07556L87780N32198N12395L86970K40026J29247L5365r7970
$$ -2465923 -2672155 -2564599 -2176819 -1644621 -1132226 -745256 -505230 -375983 -340618 -438588
17477d38588k32469k79898k15708n5754J43253K65917K48526J66743J24746J10008
$$ -438588 -671057 -950955 -1166663 -1222417 -1079164 -813247 -564721 -397978 -273232 -163224
17467a63224M2157r0034k14092k45174j59003l3195L6018M7574M1653J3122m4803
$$ -163224 -121067 -211101 -425193 -670367 -829370 -862565 -826547 -778973 -737320 -724198 -769001
17456g69001p9242l7609M9253J17257J36413J17200J11049J57323K03686J59624
$$ -769001 -848243 -885852 -836599 -719342 -582929 -465729 -354680 -197357 6329 165953
17446A65953L3019p2409p7308J4898J29183J79420J54551J19565J06483O8723
$$ 165953 198972 126563 49255 64153 193336 372756 527307 646872 753355 822078
17436H22078l2526j77652l25545m35224m69738m22336l00105j28445K533j1951
$$ 822078 789552 611900 286355 -148869 -618607 -1040943 -1341048 -1469493 -1466960 -1478911
17426a478911j57001k82151k58299r4315P4497J18341M8387l1452n6373l2143
$$ -1478911 -1635912 -1918063 -2176362 -2270677 -2196180 -2077839 -2029452 -2060904 -2117277 -2149420
17416b149420K601J2953L786j0580m6946r1264q5117k821J40900L16874M81223
$$ -2149420 -2146819 -2133866 -2130080 -2140660 -2187606 -2278870 -2363987 -2366808 -2225908 -1909034 -1427811
17405a427811N95117O48533O23023M58782J51518j61521l08504k72596j56001
$$ -1427811 -832694 -184161 438862 897644 1049162 887641 579137 306541 150540
17396A50540j4381J43014K76554L51820L73808L23406J69658l1174j87891k77542
$$ 150540 136159 279173 555727 907547 1281355 1604761 1774419 1743245 1555354 1277812
17386A277812l14035l27222l37591l16828k54912j91334j80536k41737k97733
$$ 1277812 963777 636555 298964 -17864 -272776 -464110 -644646 -886383 -1184116
17377a184116k49512j06017M7017J63070K62471L51814L86479L44377K55928J75302
$$ -1184116 -1433628 -1539645 -1492628 -1329558 -1067087 -715273 -328794 15583 271511 446813
17367D46813J54372J82458J81313R7851k3340j09345j66933k30012k62156k27069
$$ 446813 601185 783643 964956 1062807 1039467 930122 763189 533177 271021 43952
17357D3952j86470j83558j54038o2385M805m0315j55145k19128j68317n1310N9923
$$ 43952 -142518 -326076 -480114 -542499 -537694 -578009 -733154 -952282 -1120599 -1171909 -1111986
17346a111986J52069K15499K31106J99316J29332L5456n3190j07681j29735j40741
$$ -1111986 -959917 -744418 -513312 -313996 -184664 -149208 -202398 -310079 -439814 -580555
17336e80555j77901k62591l67790m43369m29675k96469q5141J09740K32123L18123
$$ -580555 -758456 -1021047 -1388837 -1832206 -2261881 -2558350 -2643491 -2533751 -2301628 -1983505
17326a983505M13642M77916M54446L92939L83072M03218L44812J86380L9487J1426
$$ -1983505 -1569863 -1091947 -637501 -244562 138510 541728 886540 1072920 1112407 1123833
17316A123833R4599K09043K94793L37076L37755L09817L00705L57600M50499M77833
$$ 1123833 1218432 1427475 1722268 2059344 2397099 2706916 3007621 3365221 3815720 4293553
17306D293553L72507J76110j0347j37277k30206l13318l76880m17443m49123m74725
$$ 4293553 4666060 4842170 4831823 4694546 4464340 4151022 3774142 3356699 2907576 2432851
17296B432851m51405l36680j37385R2309K82879L93802M13310L47396K03404J6345
$$ 2432851 1981446 1644766 1507381 1599690 1882569 2276371 2689681 3037077 3240481 3256826
17286C256826j38067k17430k59872l11586l59104l66977l24395k68103k57522
$$ 3256826 3118759 2901329 2641457 2329871 1970767 1603790 1279395 1011292 753770
17277G53770l10924l96753m52553m20156k97967j30265M6325K26037L91551N03500
$$ 753770 442846 46093 -406460 -826616 -1124583 -1254848 -1208523 -982486 -590935 -87435
17267h7435N36576M78124L56476K31793J29680L4611o6741j52394k02382k09202
$$ -87435 449141 927265 1283741 1515534 1645214 1679825 1613084 1460690 1258308 1049106
17257A049106j38335M751J10875O5593j21784l29192m27228l83688k99256k97621
$$ 1049106 910771 915522 1026397 1091990 970206 641014 213786 -169902 -469158 -766779
17247g66779l73724m24187l78807k57314j40206o7343q296Q2248K28463L97814
$$ -766779 -1140503 -1564690 -1943497 -2200811 -2341017 -2408360 -2416656 -2334408 -2105945 -1708131
17237a708131N14976N28833M61438L55687K40987J83882K32193L14465L22087
$$ -1708131 -1193155 -664322 -202884 152803 393790 577672 809865 1124330 1446417
17228A446417K61183K02539J25921l0084k07369k89621k61199j99742k05735l26762
$$ 1446417 1707600 1910139 2036060 2005976 1798607 1508986 1247787 1048045 842310 515548
17218E15548n09780o33444n95041l94837j28330J31021L52950M65683M18378K70183
$$ 515548 5768 -627676 -1222717 -1617554 -1745884 -1614863 -1261913 -796230 -377852 -107669
17208a07669J25629J3271j02621k24918l02303k84621j83680n7704O3962J80550
$$ -107669 17960 31231 -71390 -296308 -598611 -883232 -1066912 -1124616 -1060654 -880104
17198h80104K57021K44416J36858p907j05854j39138j53033j62731j46628j10710
$$ -880104 -623083 -378667 -241809 -249716 -355570 -494708 -647741 -810472 -957100 -1067810
17188a067810q1120l8594N6877J84343K54736K18973J40283R7818Q8780O3724
$$ -1067810 -1148930 -1187524 -1130647 -946304 -691568 -472595 -332312 -234494 -145714 -81990
17178h1990L4188M6730Q8538J10111Q6829L6079K882J5003P6878J86241L04456
$$ -81990 -47802 -1072 87466 197577 284406 320485 323367 338370 415248 601489 905945
17167I05945L58760K73656L9113k32516m00678m36645m12580l86335l29594k06981
$$ 905945 1264705 1538361 1577474 1344958 944280 507635 95055 -291280 -620874 -827855
17157h27855p5502j6487k1609j9423m020k7846q6449j44326j85242j87142j20613
$$ -827855 -903357 -919844 -941453 -960876 -964896 -992742 -1079191 -1223517 -1408759 -1595901 -1716514
17146a716514K5310J93965K78863K10560J7714j77710k78147l02882l12825l30040
$$ -1716514 -1691204 -1497239 -1218376 -1007816 -990102 -1167812 -1445959 -1748841 -2061666 -2391706
17136b391706l35334k96323k08772j20724q1524o0976j9857J9790K2864j4189
$$ -2391706 -2727040 -3023363 -3232135 -3352859 -3434383 -3495359 -3515216 -3495426 -3472562 -3486751
17126c486751l4362q778O619k2556p6408j16588r2146J6324J74695L07615L34976
$$ -3486751 -3521113 -3529891 -3523272 -3545828 -3622236 -3738824 -3830970 -3814646 -3639951 -3332336 -2997360
17115b997360K53519J33121M5286N6713J73411L18116M01212L74547K56657J04451
$$ -2997360 -2743841 -2610720 -2565434 -2508721 -2335310 -2017194 -1615982 -1241435 -984778 -880327
17105h80327k4578p4917l0002N4833J09524J32974J94706L09770L85491L43510
$$ -880327 -904905 -979822 -1009824 -954991 -845467 -712493 -517787 -208017 177474 520984
17095E20984K00856K8378j13820j96321k07828j53809o3153J550l9939k00568
$$ 520984 721840 750218 636398 440077 232249 78440 15287 16837 -23102 -223670
17085b23670l53855l47055j69791N9642K11471K17877R8062p8599k35669l31339
$$ -223670 -577525 -924580 -1094371 -1034729 -823258 -605381 -507319 -585918 -821587 -1152926
17075a152926l70337l40174k32010p1962J30794L63351N36886N79207N28046M34468
$$ -1152926 -1523263 -1863437 -2095447 -2167409 -2036615 -1673264 -1136378 -557171 -29125 405343
17065D05343L01585J36481j3627r9048j05059o3169j2603L2469M2394o467q8750
$$ 405343 706928 843409 829782 730734 625675 562506 549903 582372 624766 618299 529549
17054E29549j71940k45214k92933k96528k40417r7989J29787L66332M93884M58424
$$ 529549 357609 112395 -180538 -477066 -717483 -815472 -685685 -319353 174531 632955
17044F32955L30397K18566J67104J56424J41705J00463L9101m0111j21963j62180
$$ 632955 963352 1181918 1349022 1505446 1647151 1747614 1786715 1746604 1624641 1462461
17034A462461j47641j46148k19214l29114l98458l65065k00942K0493J55436J38851
$$ 1462461 1314820 1168672 949458 620344 221886 -143179 -344121 -323628 -168192 -29341
$$ [...]
##END NTUPLES=NMR SPECTRUM
##END=
