##TITLE=C13
SL61-Dau(rechrom)
 15.09.2022
##JCAMPDX= 6.0         $$ Bruker NMR JCAMP-DX V2.0
##DATA TYPE= NMR SPECTRUM
##DATA CLASS= NTUPLES
##ORIGIN= UXNMR, Bruker Analytische Messtechnik GmbH
##OWNER= root
$$ TOPSPIN		Version 1.3
$$ 2023-08-07 10:15:02.500 +0400  Irina@DPX200
$$ Compression mode = diff/dup
##.OBSERVE FREQUENCY= 50.32789651
##.OBSERVE NUCLEUS= ^13C
##.ACQUISITION MODE= SIMULTANEOUS
##.ACQUISITION SCHEME= undefined
##.AVERAGES= 200
##.DIGITISER RES= 17
##SPECTROMETER/DATA SYSTEM= spect
##.PULSE SEQUENCE= ineptnd
##.SOLVENT NAME= CDCl3
##.SHIFT REFERENCE= INTERNAL, CDCl3, 1, 222.6533
##AUDIT TRAIL= $$ (NUMBER, WHEN, WHO, WHERE, WHAT)
$$ ##TITLE= Audit trail, TOPSPIN		Version 1.3
$$ ##JCAMPDX= 5.01
$$ ##ORIGIN= Bruker BioSpin GmbH
$$ ##OWNER= Irina
$$ $$ F:/spectra/data/iren/nmr/c13 she/2/pdata/1/auditp.txt
$$ ##AUDIT TRAIL=  $$ (NUMBER, WHEN, WHO, WHERE, VERSION, WHAT)
(   1,<2023-08-07 10:02:40.062 +0400>,<Irina>,<DPX200>,<TOPSPIN 1.3>,
      <acquisition in progress>)
(   2,<2023-08-07 10:14:10.625 +0400>,<Irina>,<DPX200>,<TOPSPIN 1.3>,
      <Start of raw data processing
       efp BC_mod = 2 LB = 3 FT_mod = 6 PKNL = 1 PHC0 = 71.56116 PHC1 = -1.101521 SI = 32K 
       data hash MD5: 32K
       E5 22 34 74 B6 5E 3C B5 E7 44 85 09 58 5E C5 AE>)
(   3,<2023-08-07 10:14:13.828 +0400>,<Irina>,<DPX200>,<TOPSPIN 1.3>,
      <apk 
       data hash MD5: 32K
       41 B4 20 C7 1E 85 4B 05 BE 0D 79 21 C3 E7 9C 94>)
$$ ##END=
$$ 
$$ $$ hash MD5
$$ $$ FD 86 ED 70 DF E5 0A EF A3 DE F3 57 EB 63 BE B7
##$RELAX= 
##$RELAX= 
##$RELAX= 
##$RELAX= 
##$RELAX= 
##$RELAX= 
##$RELAX= 
##$RELAX= 
##$RELAX= 
$$ Bruker specific parameters
$$ --------------------------
##$DU= <F:/spectra>
##$EXPNO= 2
##$NAME= <c13 she>
##$PROCNO= 1
##$TYPE= <nmr>
##$USER= <iren>
##$AMP= (0..31)
100 100 100 100 100 100 100 100 100 100 100 100 100 100 100 100 100 100 
100 100 100 100 100 100 100 100 100 100 100 100 100 100 
##$ANAVPT= -1
##$AQSEQ= 0
##$AQ_mod= 1
##$AUNM= <au_zg>
##$AUTOPOS= <>
##$BF1= 50.322709
##$BF2= 200.13
##$BF3= 50.322709
##$BF4= 500.13
##$BF5= 500.13
##$BF6= 500.13
##$BF7= 500.13
##$BF8= 500.13
##$BYTORDA= 1
##$CFDGTYP= 0
##$CFRGTYP= 5
##$CHEMSTR= <none>
##$CNST= (0..63)
1 1 128 1 1 1 1 1 1 1 1 1 1 1 1 1 1 1 1 1 1 1 1 1 1 1 1 1 1 1 1 1 1 1 
1 1 1 1 1 1 1 1 1 1 1 1 1 1 1 1 1 1 1 1 1 1 1 1 1 1 1 1 1 1 
##$CPDPRG= <waltz16>
##$CPDPRG1= <>
##$CPDPRG2= <waltz16>
##$CPDPRG3= <>
##$CPDPRG4= <mlev>
##$CPDPRG5= <mlev>
##$CPDPRG6= <mlev>
##$CPDPRG7= <mlev>
##$CPDPRG8= <mlev>
##$CPDPRGB= <>
##$CPDPRGT= <>
##$D= (0..63)
0 2 0.00345 0 0.001953125 0 0 0 0 0 0 0.03 2e-005 3e-006 0 0 0 0 0 0 0 
0 0 0 0 0 0 0 0 0 0 0 0 0 0 0 0 0 0 0 0 0 0 0 0 0 0 0 0 0 0 0 0 0 0 0 
0 0 0 0 0 0 0 0 
##$DATE= 1691388848
##$DBL= (0..7)
120 120 120 120 120 120 120 120 
##$DBP= (0..7)
150 150 150 150 150 150 150 150 
##$DBP07= 0
##$DBPNAM0= <>
##$DBPNAM1= <>
##$DBPNAM2= <>
##$DBPNAM3= <>
##$DBPNAM4= <>
##$DBPNAM5= <>
##$DBPNAM6= <>
##$DBPNAM7= <>
##$DBPOAL= (0..7)
$$ [...]
##$SW= 239.972172959595
##$SWIBOX= (0..15)
0 1 3 0 0 0 0 0 0 0 0 0 0 0 0 0 
##$SW_h= 12077.2946859903
##$TD= 32768
##$TD0= 1
##$TE= 300
##$TE2= 300
##$TE3= 300
##$TEG= 300
##$TL= (0..7)
120 120 120 120 120 120 120 120 
##$TP= (0..7)
150 150 150 150 150 150 150 150 
##$TP07= 0
##$TPNAME0= <>
##$TPNAME1= <>
##$TPNAME2= <>
##$TPNAME3= <>
##$TPNAME4= <>
##$TPNAME5= <>
##$TPNAME6= <>
##$TPNAME7= <>
##$TPOAL= (0..7)
0.5 0.5 0.5 0.5 0.5 0.5 0.5 0.5 
##$TPOFFS= (0..7)
0 0 0 0 0 0 0 0 
##$TUNHIN= 0
##$TUNHOUT= 0
##$TUNXOUT= 0
##$USERA1= <user>
##$USERA2= <user>
##$USERA3= <user>
##$USERA4= <user>
##$USERA5= <user>
##$V9= 5
##$VALIST= <valist>
##$VCLIST= <CCCCCCCCCCCCCCC>
##$VD= 0
##$VDLIST= <DDDDDDDDDDDDDDD>
##$VPLIST= <PPPPPPPPPPPPPPP>
##$VTLIST= <TTTTTTTTTTTTTTT>
##$WBST= 1024
##$WBSW= 4
##$XGAIN= (0..3)
0 0 0 0 
##$XL= 0
##$YL= 0
##$YMAX_a= 141815
##$YMIN_a= -132925
##$ZGOPTNS= <>
##$ZL1= 120
##$ZL2= 120
##$ZL3= 120
##$ZL4= 120
##$ABSF1= 0
##$ABSF2= 0
##$ABSG= 0
##$ABSL= 0
##$ALPHA= 0
##$AQORDER= 0
##$ASSFAC= 0
##$ASSFACI= 0
##$ASSFACX= 0
##$ASSWID= 0
##$AUNMP= <proc_1d>
##$AXLEFT= 0
##$AXRIGHT= 0
##$AXTYPE= 0
##$AXUNIT= <>
##$AZFE= 0.1
##$AZFW= 0.5
##$BCFW= 0
##$BC_mod= 2
##$BYTORDP= 0
##$COROFFS= 0
##$CY= -3
##$DATMOD= 1
##$DC= 0
##$DFILT= <>
##$DTYPP= 0
##$F1P= 0
##$F2P= 0
##$FCOR= 0.5
##$FTSIZE= 32768
##$FT_mod= 6
##$GAMMA= 0
##$GB= 0
##$INTBC= 1
##$INTSCL= 1.329259e-009
##$ISEN= 128
##$LB= 3
##$LEV0= 0
##$LPBIN= 0
##$MAXI= 10000
##$MC2= 0
##$MEAN= 0
##$ME_mod= 0
##$MI= 0.9312502
##$NCOEF= 0
##$NC_proc= -6
##$NLEV= 6
##$NOISF1= 120.0001
##$NOISF2= 80.00006
##$NSP= 0
##$NTH_PI= 0
##$NZP= 0
##$OFFSET= 222.6533
##$PC= 1.4
##$PHC0= -8.990822
##$PHC1= 17.95633
##$PH_mod= 1
##$PKNL= yes
##$PPARMOD= 0
##$PPDIAG= 0
##$PPIPTYP= 0
##$PPMPNUM= 100
##$PPRESOL= 1
##$PSCAL= 0
##$PSIGN= 0
##$REVERSE= no
##$SF= 50.3227306370915
##$SI= 32768
##$SIGF1= 140
##$SIGF2= 120
##$SINO= 35.31775
##$SIOLD= 32768
##$SREGLST= <13C.CDCl3>
##$SSB= 0
##$STSI= 32768
##$STSR= 0
##$SW_p= 12077.2946859903
##$SYMM= 0
##$S_DEV= 0
##$TDeff= 32768
##$TDoff= 0
##$TI= <>
##$TILT= no
##$TM1= 0
##$TM2= 0
##$TOPLEV= 0
##$USERP1= <user>
##$USERP2= <user>
##$USERP3= <user>
##$USERP4= <user>
##$USERP5= <user>
##$WDW= 1
##$XDIM= 32768
##$YMAX_p= 457994701
##$YMIN_p= -438203473
$$ End of Bruker specific parameters
$$ ---------------------------------
##NTUPLES= NMR SPECTRUM
##VAR_NAME=  FREQUENCY,     SPECTRUM/REAL,   SPECTRUM/IMAG
##SYMBOL=    X,             R,               I
##VAR_TYPE=  INDEPENDENT,   DEPENDENT,       DEPENDENT
##VAR_FORM=  AFFN,          ASDF,            ASDF
##VAR_DIM=   32768,         32768,           32768
##UNITS=     HZ,            ARBITRARY UNITS, ARBITRARY UNITS
##FACTOR=    0.368581032318806, 1,           1
##FIRST=     12077.2946859903, -628609,      446988
##LAST=      0,             -659572,         -665469
##MIN=       0,             -438203473,      0
##MAX=       12077.2946859903, 457994701,    0
$$ Real data points
##PAGE= N=1
##DATA TABLE= (X++(R..R)), XYDATA
$$ [...]
##PAGE= N=2
##DATA TABLE= (X++(I..I)), XYDATA
22173g577387m55241p43532k50585P21572J847955K730373L001447K719165K247129
22164D240896J797586J504060J444498J347705P84754k68889j293237j766889
22156G790484j693220j426130j163116r95715r50006p44373j02218Q22092J720431
22147C258229K502307L020169K968779K285626J260523K24654n35967q33343q36049
22138A3314928r28529j299244j902000k514909k663068j994433o89928O40815
22130A963632J320610J065319K28979n02354q44604j066801j319004j511995j570012
22121b236230j355146r11681n78911l74640K9608M73338M00267l42322j385641
22112f281358k217059k520988k148506j163976r7195N64745Q46993J020656J323036
$$ y = [-7577387, -8032628, -8776160, -9026745, -8305173, -6457218, -3726845, -725398, 1993767, 4240896, 6038482, 7542542, 8987040, 10334745, 11119499, 10850610, 9557373, 7790484, 6097264, 4671134, 3508018, 2512303, 1562297, 817924, 715706, 1537798, 3258229, 5760536, 8780705, 11749484, 14035110, 15295633, 15520287, 14984320, 14150977, 13314928, 12386399, 11087155, 9185155, 6670246, 4007178, 2012745, 1322817, 1963632, 3284242, 4349561, 4578540, 4076186, 3231582, 2164781, 845777, -666218, -2236230, -3591376, -4503057, -5081968, -5456608, -5427000, -4953662, -4553395, -4895717, -6281358, -8498417, -11019405, -13167911, -14331887, -14429082, -13864337, -13017344, -11996688, -10673652]
22103a0673652J834865K532102L473520M465006M758624M022687K991351K427745
22095A5832248K144950J502237L00738j101478k189653k646070k351010j322764
22087A0169198J33140J466721K407602L143118L756895M113308M191181M077472
22079C3458635L773034L239980K568765J818932Q62754k42428j173114j746273
22071D2560285j990070k129526k418186k843198l246514l464509l457971l501923
22063A9508388l743420l686065k770647j302104j12976M13854M74656M54055N47384
22054I783125N57403J76758n94743j486333k249409k731117k877456k673681k010203
22045d105656q22794N96307J746325K328641K176096J129445n07026j857669k237262
$$ y = [-10673652, -8838787, -6306685, -2833165, 1631841, 6390465, 10413152, 13404503, 15832248, 17977198, 19479435, 19780173, 18678695, 16489042, 13842972, 11491962, 10169198, 10302338, 11769059, 14176661, 17319779, 21076674, 25189982, 29381163, 33458635, 37231669, 40471649, 43040414, 44859346, 45722100, 45479672, 44306558, 42560285, 40570215, 38440689, 36022503, 33179305, 29932791, 26468282, 23010311, 19508388, 15764968, 12078903, 9308256, 8006152, 7893176, 8307030, 8781686, 9235741, 9783125, 10340528, 10517286, 9922543, 8436210, 6186801, 3455684, 578228, -2095453, -4105656, -4928450, -4332143, -2585818, -257177, 1918919, 3048364, 2541338, 683669, -1553593]
22036a553593j750932j099266q35698r52846j195433j422934j424732p90600M96355
22027a0529679J829387K768363L409069L761729L708567L379649K688690J406822
22019A2422597o3667j126691j782790k252907k415866k102790j448328p21665
22011E07893j77012J10439L92035Q36161J298799J640799J795066J747470J494759
22002I646409Q75371j63920j255920k072091k652897l119848l483227l652964
21994e879087l483292k824964j745901p66766k27510Q9336K33239R5069m1626
21985a4551502N2742J83492Q8283k46425o38202q45982o48820P0583J199209K233566
21975a3103056K494517J781270P34103K12472L62601O51375O78147O11574N93822
$$ y = [-1553593, -3304525, -4403791, -5239489, -6192335, -7387768, -8810702, -10235434, -11026034, -10529679, -8700292, -5931929, -2522860, 1238869, 4947436, 8327085, 11015775, 12422597, 12358930, 11232239, 9449449, 7196542, 4780676, 2677886, 1229558, 507893, 330881, 441320, 833355, 1669516, 2968315, 4609114, 6404180, 8151650, 9646409, 10521780, 10357860, 9101940, 7029849, 4376952, 1257104, -2226123, -5879087, -9362379, -12187343, -13933244, -14700010, -14927520, -14838184, -14604945, -14509876, -14551502, -14498760, -14315268, -14226985, -14473410, -15111612, -15957594, -16606414, -16535831, -15336622, -13103056, -10608539, -8827269, -8093166, -7880694, -7518093, -6866718, -6188571, -5576997, -4983175]
21966d983175L25941m37116j399731j882229j595381j041292q20763r79009j161204
21957a3973959r86536m04594K28579P07782J185064J660453J934695K024624K107905
21948e515987K120722K026846K120569K410040K382649J735343P52884q9330n27647
21939G416089m76178J3492P78308J695395K493069K599381J895282J007172K92263
21930A7714273n06666j502258k309019k575488k488896k425731k504511k580804
21922H20900k412296j904710j145235l83436J9963l914j41517j56299j49481j94582
21912e650607j13388Q3143J04400j38349m09317m50273j06168N29975Q59063L24033
21902d967488q13477j663688j719680j404426j251829j167809q76689l28340M20787
$$ y = [-4983175, -4657234, -5094350, -6494081, -8376310, -9971691, -11012983, -11833746, -12812755, -13973959, -14960495, -15365089, -15136510, -14428728, -13243664, -11583211, -9648516, -7623892, -5515987, -3395265, -1368419, 752150, 3162190, 5544839, 7280182, 8033066, 7943736, 7416089, 6939911, 6953403, 7731711, 9427106, 11920175, 14519556, 16414838, 17422010, 17714273, 17207607, 15705349, 13396330, 10820842, 8331946, 5906215, 3401704, 820900, -1591396, -3496106, -4641341, -5024777, -5004814, -5008728, -5150245, -5306544, -5456025, -5650607, -5763995, -5680852, -5576452, -5714801, -6124118, -6574391, -6680559, -6150584, -5291521, -4967488, -5780965, -7444653, -9164333, -10568759, -11820588, -12988397, -13865086, -14193426, -13772639]
21893a3772639J175934J644411J666148J386419J080321R17450R31285Q17951
21885d152720P5628j261818k435628k666544j717021p4311J303009J797090J579795
21876g552520J278217J273263J448758J542087J223105L78943o54359j552529
21868b615035k209441k431067j981972r11462L78279J232175J138232R0402j315849
21859h625738k285850k353704j557649m51307K99119M73172L95161M29234O07981
21850a3069581Q29285J134916J504644J612662J262861Q63466R35433J462388
21842c463926K063385K421602K475085K295663J907431J318791P07152L56512
21834A0081695K40331L7015m13261r85084j564566k168936k724249k916261k479710
$$ y = [-13772639, -12596705, -10952294, -9286146, -7899727, -6819406, -5901956, -4970671, -4152720, -4077092, -5338910, -7774538, -10441082, -12158103, -12232414, -10929405, -9132315, -7552520, -6274303, -5001040, -3552282, -2010195, -787090, -408147, -1062506, -2615035, -4824476, -7255543, -9237515, -10148977, -9770698, -8538523, -7400291, -7309889, -8625738, -10911588, -13265292, -14822941, -15274248, -14975129, -14501957, -14106796, -13677562, -13069581, -12240296, -11105380, -9600736, -7988074, -6725213, -5861747, -4926314, -3463926, -1400541, 1021061, 3496146, 5791809, 7699240, 9018031, 9725183, 10081695, 10322026, 10359041, 9945780, 8960696, 7396130, 5227194, 2502945, -413316, -2893026]
21825b893026j621184j025397j107285j584245j892288j706367j248123r73451
21817a4051366j099769j531889k027836k402016k458272j904729p57323M42957
21809b5790243J195036J393986J156392P18955L70760K53334L10247M49682O41624
21800a9300227Q45903J043048J312990J710179K146385K417284K343949K012590
21792e467899J649301J191850N33791j54080o19412q30778j077982j555509j983929
21783h314647j935071j481033j029038n42248K40510R90005J085722O67172M77574
21774i841054Q05120J503790K321077K705345K138187Q55329l58981r46927q36791
21765a654905k41544N52456J252016J598182J320726M14105n19737q51809o38010
$$ y = [-2893026, -4514210, -5539607, -6646892, -8231137, -10123425, -11829792, -13077915, -14051366, -15151135, -16683024, -18710860, -21112876, -23571148, -25475877, -26233200, -25790243, -24595207, -23201221, -22044829, -21325874, -20955114, -20701780, -20391533, -19941851, -19300227, -18454324, -17411276, -16098286, -14388107, -12241722, -9824438, -7480489, -5467899, -3818598, -2626748, -2092957, -2247037, -2866449, -3697227, -4775209, -6330718, -8314647, -10249718, -11730751, -12759789, -13302037, -13061527, -12071522, -10985800, -10318628, -9841054, -9035934, -7532144, -5211067, -2505722, -367535, 487794, 128813, -818114, -1654905, -1896449, -1343993, -91977, 1506205, 2826931, 3241036, 2721299, 1869490, 1231480]
21756A231480k79334k8331J57774M52261P20333O20233M0081p44904j256528j122445
21746b09380l03928Q22279J691723J952173J664280J035815J51490q20728j546157
21737D437567j917817k087962k243688k401096k193145j327947p3775J098327
21729f709536J848240J997723J687244J455769J737858K323666K614306K216386
21721I171656J209938J12143n83326p74469o39931m17451k06152q3205j35485
21712G653718j30237K56676Q69580J185413P52959k85642j205738j499237j309371
21703F288121j197576j514130k030035k300709k134683j568131p37776p0184R481
21694e255622l90228p98240r47377q85416o18279n3010P05578J156894R23743
$$ y = [1231480, 952146, 923815, 1081589, 1533850, 2254183, 2874416, 2914497, 2169593, 913065, -209380, -513308, 308971, 2000694, 3952867, 5617147, 6652962, 6804452, 5983724, 4437567, 2519750, 431788, -1811900, -4212996, -6406141, -7734088, -7807863, -6709536, -4861296, -2863573, -1176329, 279440, 2017298, 4340964, 6955270, 9171656, 10381594, 10493737, 9910411, 9135942, 8496011, 8078560, 7872408, 7789203, 7653718, 7523481, 7780157, 8649737, 9835150, 10588109, 10302467, 9096729, 7597492, 6288121, 5090545, 3576415, 1546380, -754329, -2889012, -4457143, -5194919, -5265103, -5255622, -5645850, -6444090, -7391467, -8276883, -8895162, -8948172, -8242594, -7085700, -6161957]
21685f161957L14322n7981P6390O23939J304374J738897J558653O57084o61074
21676f07353j877488k610358k681480k021022q72884L01719J105409J268799P97605
21667g197053J32739j23950K01950P19776R18930O76644K39694k44104q21054
21658e496428j378618j701090j809741j812559j619454r98326J37186J485163
21650a3193867K446033K427838J417937K67724r4502M34732J204839J499408J035536
21641b554322J13277p06074j060643q98605l87810J62981L69306J85649l3829
21632d810070o6729J06906M42230Q12974J131262J345955J286370Q41301L77934
21623A468133L66590P34547J118536J215948R70664O74809N87401N72872L55456
$$ y = [-6161957, -5847635, -5905616, -5829226, -5205287, -3900913, -2162016, -603363, 53721, -607353, -2484841, -5095199, -7776679, -9797701, -10670585, -10368866, -9263457, -7994658, -7197053, -7064314, -7188264, -6986314, -6266538, -5347608, -4670964, -4431270, -4675374, -5496428, -6875046, -8576136, -10385877, -12198436, -13817890, -14816216, -14679030, -13193867, -10747834, -8319996, -6902059, -6634335, -6728837, -6294105, -5089266, -3589858, -2554322, -2441045, -3147119, -4207762, -5106367, -5494177, -5331196, -4961890, -4776241, -4810070, -4876799, -4769893, -4327663, -3514689, -2383427, -1037472, 248898, 1090199, 1468133, 1834723, 2569270, 3687806, 4903754, 5874418, 6549227, 7136628, 7709500, 8064956]
21614H064956q3777n34789r65487j580491k417291l291997l873094l871904l309908
21605a1863782k374140j319297m06386K43557N89212P72021J123009J741968K387887
21596i105951K747337K569458J751841N95299l49553r05217j332905j728833j863607
21587g622131j650983j251995p38327k04086J23365L12846O29792R63223R42578
21578h495718M32367l98210j188744j484579j038933j24316N49584N36307l5125
21569a1247367p75555j365100j635994j496320j041903n31901j54066J11262M68517
21560a7668427J103857J878714K436105K711014K950363L170458L073714K513937
21552B169735J714859J035171P27023Q71884J325760J689267J451481M76009p15268
$$ y = [8064956, 7981179, 7446390, 6480903, 4900412, 2483121, -808876, -4681970, -8553874, -11863782, -14237922, -15557219, -15963605, -15720048, -15130836, -14358815, -13235806, -11493838, -9105951, -6358614, -3789156, -2037315, -1442016, -1791569, -2696786, -4029691, -5758524, -7622131, -9273114, -10525109, -11263436, -11467522, -11344157, -11031311, -10401519, -9438296, -8495718, -8063351, -8461561, -9650305, -11134884, -12173817, -12298133, -11748549, -11212242, -11247367, -12022922, -13388022, -15024016, -16520336, -17562239, -18094140, -18248206, -18136944, -17668427, -16564570, -14685856, -12249751, -9538737, -6588374, -3417916, -344202, 2169735, 3884594, 4919765, 5646788, 6518672, 7844432, 9533699, 10985180, 11461189, 10745921]
21543A0745921j442139j417867r61711p21185r26152j304540j657902j949424
21535C65001k097262k097130k130815k286592k342301j999421j080238L60102
21527a3308656J825275K714381K795946K229624J547942J373197J752574K081082
21519C011365J797540Q76044k68758j186248j733486j992090j932534j422055
21511b850222m85700N11491J104883J161382Q37483M13895P9524j03354r9015
21502E70367P0128L05136N19929O58247O65749O51916Q17269J280526J932905
21493G472172K358067K318467K051968J813634J688437J673525J565196J101583
21485B2043049K63588p50584j615102j970673j737443j322379j132620j126009
$$ y = [10745921, 9303782, 7885915, 6924204, 6203019, 5276867, 3972327, 2314425, 365001, -1732261, -3829391, -5960206, -8246798, -10589099, -12588520, -13668758, -13308656, -11483381, -8769000, -5973054, -3743430, -2195488, -822291, 930283, 3011365, 4808905, 5684949, 5416191, 4229943, 2496457, 504367, -1428167, -2850222, -3335922, -2824431, -1719548, -558166, 279317, 693212, 772736, 669382, 570367, 640495, 945631, 1465560, 2123807, 2789556, 3441472, 4258741, 5539267, 7472172, 9830239, 12148706, 14200674, 16014308, 17702745, 19376270, 20941466, 22043049, 22306637, 21556053, 19940951, 17970278, 16232835, 14910456, 13777836, 12651827]
21477A2651827j109070r95477q82068r70978j215702j174657n38537L71764J012045
21468G149147J123755P14871l3387q19347j290370j151931l40268O62586R81108
21459F996164K87106p19297j165965q98902l17559M8511r3546m18333m85691n03751
21449B728737q93858j491189j805742j764753j578554j308240q14166Q987J004709
21440e914069J850650K195905J974535J574623J342103J168315P27889j04331
21432D815620j159879k060380k478700k354771j856021j120359j58404Q23345
21424e549549J276475P44218n54208j665272j765541r62661m1521M62154O91437
21415g364468R30169J300031J712113J813206J463536J004580Q44249J054345
$$ y = [12651827, 11542757, 10547280, 9665212, 8694234, 7478532, 6303875, 5765338, 6137102, 7149147, 8272902, 8987773, 8954386, 8135039, 6844669, 5692738, 5352470, 6015056, 6996164, 7283270, 6563973, 5398008, 4499106, 4181547, 4230058, 4136512, 3718179, 3232488, 2728737, 1834879, 343690, -1462052, -3226805, -4805359, -6113599, -6927765, -6918778, -5914069, -4063419, -1867514, 107021, 1681644, 3023747, 4192062, 4919951, 4815620, 3655741, 1595361, -883339, -3238110, -5094131, -6214490, -6372894, -5549549, -4273074, -3528856, -4083064, -5748336, -7513877, -8476538, -8518059, -8055905, -7364468, -6434299, -5134268, -3422155, -1608949, -145413, 859167, 1703416, 2757761]
21407B757761J267035J214416J107124J066885Q47078L49718k44000q08916j332684
21398F224417j701627j707844j377657r70560n43871R8053Q15785J023248K77768
21389B137712j146326k484813l110414k770094j685853m52498N05763J191774
21381g814749J583545J534352J160464O43942q93n79325p50464n70374m24533
21372e218035m43206m85916m37459l89529n64347p74149m60171M83694J525989
21363f763129K195888K311281J694806L72581j112113k065339k182185j531769
21355g079979l37490J004609J911488J825771P39082n77668j227948r94576m61367
21346e198078l67869p17687r06883o56013j30478L83795N78597L57690k8415k70853
$$ y = [2757761, 4024796, 5239212, 6346336, 7413221, 8260299, 8610017, 8366017, 7557101, 6224417, 4522790, 2814946, 1437289, 466729, -77142, 20911, 836696, 1859944, 2137712, 991386, -1493427, -4603841, -7373935, -9059788, -9512286, -9006523, -7814749, -6231204, -4696852, -3536388, -2892446, -2893339, -3472664, -4223128, -4793502, -5218035, -5661241, -6147157, -6584616, -6974145, -7538492, -8312641, -8772812, -8289118, -6763129, -4567241, -2255960, -561154, -188573, -1300686, -3366025, -5548210, -7079979, -7417469, -6412860, -4501372, -2675601, -1936519, -2514187, -3742135, -4736711, -5198078, -5565947, -6283634, -7190517, -7846530, -7977008, -7593213, -7014616, -6656926, -6685341, -6956194]
21336f956194k99660j53033K19786Q41707J435179J586908J164733L87754l69863
21327b142683r05316j283589j610770j785188j669370j190760l65397N33388J127512
21318i292173J287723J226281J191108J230182J273873J418113J785653K058996
21310B179756J760961Q99139j13128r34988j381427j253267n29570L04089O45545
21301A577110M12929j40751r71972k106706l140264l502144l098699k181697j052091
21292a4204285j39358J00978l20588q15483q54203l04401O34110J502713J952545
21283a2447972K066429J942435J422050N04274m48747j118350j413204j254598
21275a0747683p27924k82772k55242m43969n37707m43570q2890N21591R98265
$$ y = [-6956194, -7255854, -7408887, -7189101, -6347394, -4912215, -3325307, -2160574, -1772820, -2142683, -3047999, -4331588, -5942358, -7727546, -9396916, -10587676, -10953073, -10419685, -9292173, -8004450, -6778169, -5587061, -4356879, -3083006, -1664893, 120760, 2179756, 3940717, 4839856, 4726728, 3791740, 2410313, 1157046, 627476, 931565, 1577110, 1990039, 1849288, 877316, -1229390, -4369654, -7871798, -10970497, -13152194, -14204285, -14343643, -14242665, -14563253, -15378736, -16232939, -16537340, -15903230, -14400517, -12447972, -10381543, -8439108, -7017058, -6512784, -6961531, -8079881, -9493085, -10747683, -11475607, -11758379, -12013621, -12457590, -12995297, -13438867, -13521757, -13000166, -12001901]
21266a2001901R42057M20870q7637k36229j36354l0102M7701J02577J22653J71193
21256a0685172K97396N56055R26456J212215J253954R61002K99485n54895j344080
21247g077584j948388k410160k807333l036685l011951k846302k528462j859482
21239b7526347o84060R79226K825026M248440M653811L995753K803554J621771
21231g082826P01640o976o66960j224480j530024j532489j239583o70784J46328
21222a3106154J048393J780313K222095K325447K102204J792786J664571J670248
21214A499903J448665Q52002L21237K97159O12074Q04280O67078L10395q0127
21205F732666l54652m59609m28054l95220n90368j020056j421665j650664j796541
$$ y = [-12001901, -11059844, -10638974, -10726611, -10962840, -11099194, -11129296, -11081595, -10979018, -10856365, -10685172, -10387776, -9831721, -8905265, -7693050, -6439096, -5478094, -5178609, -5733504, -7077584, -9025972, -11436132, -14243465, -17280150, -20292101, -23138403, -25666865, -27526347, -28210407, -27231181, -24406155, -20157715, -15503904, -11508151, -8704597, -7082826, -6381186, -6388162, -7055122, -8279602, -9809626, -11342115, -12581698, -13252482, -13106154, -12057761, -10277448, -8055353, -5729906, -3627702, -1834916, -170345, 1499903, 2948568, 3800570, 4121807, 4418966, 5031040, 5835320, 6502398, 6812793, 6732666, 6378014, 5918405, 5490351, 5095131, 4504763, 3484707, 2063042, 412378, -1384163]
21196a384163j816030j304836R3123J993996L501529M147909L977643L021265
21188A2230436J363478n54587k155555l075826l231367k897762k549775k482540
21180c353498k635567k561790j781413m40787Q20050J502777J484016J000136
21172e966076M84480K59325L38931N99648R87509J300480J226406O79160j48291
21163b38428r11958j377821j563044j505960j052390j33309P90174J018462M83520
21154d490754j89551o47182r52159q28521J287J062675J592394J398438R16336
21145b137037N86294M64681K66844l81719j435169k269658k371736j912979j406167
21136a0596646j225680j439927j706596j560543r89656m71641k50937n3721M32192
$$ y = [-1384163, -3200193, -4505029, -4411906, -2417910, 1083619, 5231528, 9209171, 12230436, 13593914, 13039327, 10883772, 7807946, 4576579, 1678817, -870958, -3353498, -5989065, -8550855, -10332268, -10773055, -9953005, -8450228, -6966212, -5966076, -5481596, -5222271, -4883340, -4283692, -3296183, -1995703, -769297, -90137, -238428, -1150386, -2528207, -4091251, -5597211, -6649601, -6782910, -5992736, -4974274, -4490754, -4680305, -5327487, -6279646, -7108167, -7106880, -6044205, -4451811, -3053373, -2137037, -1550743, -1086062, -819218, -1200937, -2636106, -4905764, -7277500, -9190479, -10596646, -11822326, -13262253, -14968849, -16529392, -17519048, -17990689, -18241626, -18295347, -17863155]
21127a7863155J163188J633065J353366L96296o58787j070169m73169P57171J929785
21118a2832409K710478L120470L140226K687369J883636J143087Q29556Q34630
21110C517043P44064L77982r8722n50883r48772j007198l06944R93764K112776
21101D833110K339110J526583Q8734j361994k371047k897097l104756k983530
21093c930887k477014j658563o52763L68328J191293J559485J300515O65437J83160
21084c451009R9991L00039M99709L10977m76969j442391j868305j504465q08934
21075h341357n55632j043471j710979j756431j100580l11068O0051j62928m46927
21066a5369322n2142R23997J694119J768234J365510R87548Q95519J035390J093354
$$ y = [-17863155, -16699967, -15066902, -13713536, -13317240, -13976027, -15046196, -15519365, -14762194, -12832409, -10121931, -7001461, -3861235, -1173866, 709770, 1852857, 2682413, 3517043, 4261107, 4639089, 4540367, 3989484, 3040712, 2033514, 1726570, 2720334, 4833110, 7172220, 8698803, 8787537, 7425543, 5054496, 2157399, -947357, -3930887, -6407901, -8066464, -8719227, -8350899, -7159606, -5600121, -4299606, -3634169, -3451009, -3351018, -3050979, -2551270, -2240293, -2717262, -4159653, -6027958, -7532423, -8341357, -8896989, -9940460, -11651439, -13407870, -14508450, -14819518, -14759467, -14922395, -15369322, -15421464, -14497467, -12803348, -11035114, -9669604, -8682056, -7786537, -6751147, -5657793]
21057e657793P24758k0646o99100r66277p72440j51256O88446J313234J373073
21048d168001P37192m45245j676716k312346k025208j061233M9625P82383R46105
21039i173444Q98832J052234J468183J888126J931475J372931K48354j083569
21031a396878k029895k169660j619608p89365k4653K97436k1713n74093p07267
21022i035696k58915L97897Q97432J306189J792105K163087K051483J365311N14190
21013A193083J15572K61373M97659N51972L61735j21706o72448r54429r43163
21004B89648q36263p64008q37294j096576j288946j200879j016163r04900p53909
20995h409290m37625K1402L95869N60115O48562P06202O30925L00734k63131p75813
$$ y = [-5657793, -4933035, -4953681, -5652781, -6619058, -7391498, -7542754, -6854308, -5541074, -4168001, -3430809, -3876054, -5552770, -7865116, -9890324, -10951557, -10901932, -10119549, -9173444, -8274612, -7222378, -5754195, -3866069, -1934594, -561663, -313309, -1396878, -3426773, -5596433, -7216041, -8005406, -8030059, -7732623, -7754336, -8328429, -9035696, -9294611, -8896714, -7999282, -6693093, -4900988, -2737901, -686418, 678893, 1193083, 1308655, 1570028, 2067687, 2619659, 2981394, 2859688, 2187240, 1232811, 289648, -546615, -1310623, -2147917, -3244493, -4533439, -5734318, -6750481, -7655381, -8409290, -8846915, -8825513, -8429644, -7869529, -7220967, -6514765, -5883840, -5583106, -5846237, -6622050]
20985f622050r10929o50456k30506J47476L46498L17009P6450l42476p02088o39540
20975i210612j03790M55103M60807j54564r89772j600236j653462j030615Q441
20966a3818700R56624J428409J542704J687895J850131J801293J607195J407097
20958a537352J076450M15142m44734j013529q54723P3492J274391J914965J445440
20949B349542O4928j431440k381995k714115k599282k180989j658016j253521
20941a1804888r69296o49281k81395L4839K22874K13416j5400l13945m38726k78204
20931a4280006O9336L64516N03360N54162M89001L42739L74468P03438J097362
20922i781624J300923J417160J587567J558077J155412O90168M44148K27022k42453
$$ y = [-6622050, -7532979, -8183435, -8413941, -8266465, -7919967, -7602958, -7526508, -7868984, -8571072, -9210612, -9314402, -8859299, -8398492, -8553056, -9542828, -11143064, -12796526, -13827141, -13818700, -12862076, -11433667, -9890963, -8203068, -6352937, -4551644, -2944449, -1537352, -460902, -45760, -490494, -1504023, -2358746, -2285254, -1010863, 904102, 2349542, 2414470, 983030, -1398965, -4113080, -6712362, -8893351, -10551367, -11804888, -12774184, -13423465, -13704860, -13670021, -13447147, -13233731, -13249131, -13563076, -14001802, -14280006, -14210670, -13846154, -13342794, -12788632, -12299631, -11956892, -11582424, -10878986, -9781624, -8480701, -7063541, -5475974, -3917897, -2762485, -2072317, -1628169, -1401147, -1643600]
20913a643600q52898j111701m94450J043335K817948M009978M231620L570789
20905A1571021K432141J277005K89347p29804j836959k745697l212217l135139
20897C909698k553170j734562j044984n54533p6549L45766M38110J54430p0286
20888a186080L12288J277645K065360J984891J204705M38186J34006J30406N3247
20879F414654j86582n57527j092129j664953j970935j960374j905477j851316
20871d774639j440673n05619N15431R29223M42733n01762j097861r37227l31016
20862g701410J66667L36386K39176M4188m7195m5667j73357n64812j095763j473904
20852a0315691j642702j858400k136374k187394j908366j458261j098236r36483
$$ y = [-1643600, -2496498, -3608199, -4102649, -3059314, -241366, 3768612, 8000232, 11571021, 14003162, 15280167, 15569514, 14839710, 13002751, 10257054, 7044837, 3909698, 1356528, -378034, -1423018, -1977551, -2054100, -1708334, -1270224, -1115794, -1186080, -873792, 403853, 2469213, 4454104, 5658809, 6096995, 6231001, 6361407, 6414654, 6228072, 5670545, 4578416, 2913463, 942528, -1017846, -2923323, -4774639, -6215312, -6720931, -6205500, -5276277, -4833544, -5335306, -6433167, -7370394, -7701410, -7534743, -7198357, -6959181, -6914993, -6962188, -7007855, -7181212, -7746024, -8841787, -10315691, -11958393, -13816793, -15953167, -18140561, -20048927, -21507188, -22605424, -23541907]
20844b3541907p40999k87437M71232J512853K687082L606568L872311L564920
20836h855377L106095K563330J725685P68454K33690L60089Q32740J256471J476941
20827C468118J268150N51149j53459l99816l24874j40263J7332j22246p39877
20818C424214j577128k043338j973261j907314k235574k549625k234775j247762
20810a2344563o6219Q25420J215820J119032R00306J060969J611232K096562K161738
20801a419703J793114J114261K52742o77485j441973j717284j512688j154927
20793d763943p75253k72295M36140J489791K759574L546112L300847K171705O31722
20784H524400q23532j937840k720667k979070k454296j364952k80562M22355P58169
$$ y = [-23541907, -24282906, -24570343, -24099111, -22586258, -19899176, -16292608, -12420297, -8855377, -5749282, -3185952, -1460267, -691813, -458123, -98034, 734706, 1991177, 3468118, 4736268, 5287417, 5133958, 4734142, 4409268, 4269005, 4286337, 4164091, 3424214, 1847086, -196252, -2169513, -4076827, -6312401, -8862026, -11096801, -12344563, -12410782, -11585362, -10369542, -9250510, -8350204, -7289235, -5678003, -3581441, -1419703, 373411, 1487672, 1740414, 1062929, -379044, -2096328, -3609016, -4763943, -5539196, -5811491, -5375351, -3885560, -1125986, 2420126, 5720973, 7892678, 8524400, 7700868, 5763028, 3042361, 63291, -2391005, -3755957, -4036519, -3614164, -2855995]
20775b855995J006281J403602J831783J952932J570262Q99575L78721K05660L91047
20766F783868Q10846J133367J073384N12203m97459j661025k532258k769590k295218
20757E58118j306575l18332J81342J83267q7176m99143r76488j548168k185865
20748e999020k604421k473229j658939m01010P12982J292463J474822J561113
20740h095239J695810J843983J860335J561066Q14943k31295j179123j622842
20732c352362j287607k21541J132378K246736K698658K307785J255554O0304o76235
20723D163670p91145o11944o02523j014799j554959j708848j505642j385536j406035
20714f417761j179351o47718k70551m05565r71222j448273j276588m33942N82525
$$ y = [-2855995, -1849714, -446112, 1385671, 3338603, 4908865, 5808440, 6187161, 6392821, 6783868, 7594714, 8728081, 9801465, 10313668, 9816209, 8155184, 5622926, 2853336, 558118, -748457, -1066789, -885447, -702180, -789356, -1288499, -2264987, -3813155, -5999020, -8603441, -11076670, -12735609, -13136619, -12423637, -11131174, -9656352, -8095239, -6399429, -4555446, -2695111, -1134045, -319102, -550397, -1729520, -3352362, -4639969, -4861510, -3729132, -1482396, 1216262, 3524047, 4779601, 4839905, 4163670, 3372525, 2760581, 2158058, 1143259, -411700, -2120548, -3626190, -5011726, -6417761, -7597112, -8244830, -8515381, -8920946, -9892168, -11340441, -12617029, -13050971, -12468446]
20705a2468446J204741J143637N44152j09963m98119o22339m26981J64434R48650
20696a0120234J718359K394589K722483K665939K605244K489097J824108N11672
20688F811257j008189k074155k386679k298123k161392j877788j306778o80378
20680f982225l94247o21673j215517j890724k343036k311692j771951j095130
20672a8626195p84768q69520q27102k30281P53178J565871J881062J933203K107414
20663a3097138K317067K238938J860053J254133M98889q2768r9934M24233R22186
20654c764341R21160L77699o03584j630336k073529j759598j062710k43566O79300
20645i159505J513611J888886J705773J304133J097853J077656Q98794M49996
$$ y = [-12468446, -11263705, -10120068, -9575916, -9685879, -10183998, -10806337, -11233318, -11068884, -10120234, -8401875, -6007286, -3284803, -618864, 1986380, 4475477, 6299585, 6811257, 5803068, 3728913, 1342234, -955889, -3117281, -4995069, -6301847, -6982225, -7376472, -7998145, -9213662, -11104386, -13447422, -15759114, -17531065, -18626195, -19410963, -20280483, -21107585, -21337866, -20584688, -19018817, -17137755, -15204552, -13097138, -10780071, -8541133, -6681080, -5426947, -4928058, -5010826, -5110760, -4686527, -3764341, -2843181, -2465482, -3069066, -4699402, -6772931, -8532529, -9595239, -9838805, -9159505, -7645894, -5757008, -4051235, -2747102, -1649249, -571593, 327201, 777197]
20637G77197o1074m16621n81103o45704o73994p46899q08263n88840n3059M91944
20627c306416P23427N43704J64630j26076k45929k92500l35899l08415j10491
20618c293965K32187N00627M74145J97451j35626l41357n07805j039379j808023
20609e721745k115873j654873p72476P0328N74637N33152j4463p33410j262407
20600a1097130j409456j091813l06893O32630J100216P87363j2199q74584j463462
20591a3735328j493468r80276j03971J106962K325286K723513J909262N15143
20583g732877m49460m42931L28484J107520J291479J007000O75802L96595J52437
20574c665951J08509J28504k18807r00148j472896j707677j732736j601490j055277
$$ y = [777197, 716123, 299502, -281601, -927305, -1601299, -2348198, -3156461, -3745301, -3798360, -3306416, -2582989, -2039285, -1874655, -2000731, -2246660, -2539160, -2875059, -3183474, -3293965, -3061778, -2561151, -2087006, -1889555, -2025181, -2366538, -2874343, -3913722, -5721745, -7837618, -9492491, -10264967, -10194639, -9620002, -9086850, -9101313, -9834723, -11097130, -12506586, -13598399, -13905292, -13272662, -12172446, -11385083, -11397282, -12271866, -13735328, -15228796, -16209072, -16313043, -15206081, -12880795, -10157282, -8248020, -7732877, -8182337, -8625268, -8296784, -7189264, -5897785, -4890785, -4214983, -3818388, -3665951, -3557442, -3428938, -3647745, -4547893, -6020789, -7728466, -9461202, -11062692, -12117969]
20565a2117969p7294P45979Q60490K22564q47514j803895k129990j774330j137528
20556a8059487n01918J72817Q86271J371961J323039P67743n9417r75240j704543
20547a6778774j941967j618433r47782l69867k77585n52640p78795p60497m37748
20538b4464088J22504N70853O75815O98107J031382J723443K433167K594776J860173
20529a2753868O35771k61357n32719m92003n29818p70614j018449j087941r35857
20520a7746855n98144k04898J53679N69326J073626J436383J499930J333963R59713
20511a1523277L71819l18291r63105j365046j364866r69597k85169M41781Q50006
20502a5125745P11772K16444k85326q72646j739642k443658k196019p29678J425685
$$ y = [-12117969, -12195263, -11449284, -10588794, -10366230, -11213744, -13017639, -15147629, -16921959, -18059487, -18561405, -18388588, -17502317, -16130356, -14807317, -14039574, -14098991, -15074231, -16778774, -18720741, -20339174, -21286956, -21656823, -21934408, -22487048, -23265843, -24026340, -24464088, -24341584, -23770731, -23094916, -22396809, -21365427, -19641984, -17208817, -14614041, -12753868, -12118097, -12379454, -12912173, -13404176, -13933994, -14704608, -15723057, -16810998, -17746855, -18344999, -18549897, -18396218, -17826892, -16753266, -15316883, -13816953, -12482990, -11523277, -11151458, -11469749, -12432854, -13797900, -15162766, -16132363, -16417532, -15975751, -15125745, -14413973, -14197529, -14482855, -15355501, -17095143, -19538801, -21734820, -22464498, -21038813]
20493b1038813L322206M274076M370917L988965L191310K063470R82999L39671
20485A494801Q0056k12977q45374j754006k531558k763262k496372k261144k284195
20476a3574031k198850j764344j125366m72734R8732M93555M16048m06988j683779
20467b0217757k656661k767264k140567j294157n37650J32955O53254P87837O56717
20458b7383293P38179J102212J207042N29937p56839j894741k394749k432005
20450c1284257k256412j775358p94835O19315K018947K967813L425630L505052
20442b3574105L234323K713963K143438J588113R56938J90778m51965o44199m06444
20433a4249160K3567L21862L17834L47164Q67881J765248K367436K181183J399259
$$ y = [-21038813, -17716607, -13442531, -9071614, -5082649, -1891339, 172131, 1155130, 1494801, 1574857, 1361880, 516506, -1237500, -3769058, -6532320, -9028692, -11289836, -13574031, -15772881, -17537225, -18662591, -19135325, -19036593, -18543038, -18126990, -18533978, -20217757, -22874418, -25641682, -27782249, -29076406, -29614056, -29481101, -28827847, -28040010, -27383293, -26645114, -25542902, -24335860, -23805923, -24562762, -26457503, -28852252, -31284257, -33540669, -35316027, -36110862, -35491547, -33472600, -30504787, -27079157, -23574105, -20339782, -17625819, -15482381, -13894268, -12937330, -12746552, -13198517, -13842716, -14249160, -14225593, -13903731, -13585897, -13238733, -12370852, -10605604, -8238168, -6056985, -4657726]
20424d657726M98047k56228q32346j277770j639947j851445j613862p47506L44348
20415a2034435J080043J231613Q40706K94287R2828K95809N25501L41168l36443
20406g668923j294294k441280l629693m379830m123785k710351p27260Q14008
20398b6161408J246733P73117J05433k67537k17300K69859J004440J449970J203928
20389b0592765M79628k46194p16237q12321n40103j43865P9535M7718p9798j27713
20379b2652115L0355L67280O70822P51965N14062P3387j85949k087N07395R52649
20369a8972236R09460K54812n81986j021822r23840m48978K31827P97289P77749
20360a8977725J27619n59522p87537n14039J4976M41944O11520M60641j341m44018
$$ y = [-4657726, -4159679, -4415907, -5248253, -6526023, -8165970, -10017415, -11631277, -12378783, -12034435, -10954392, -9722779, -8882073, -8587786, -8494958, -8199149, -7673648, -7332480, -7668923, -8963217, -11404497, -15034190, -19414020, -23537805, -26248156, -26975416, -26161408, -24914675, -24141558, -24036125, -24303662, -24520962, -24251103, -23246663, -21796693, -20592765, -20113137, -20359331, -21075568, -21887889, -22427992, -22571857, -22492322, -22444604, -22524402, -22652115, -22621760, -22254480, -21583658, -20831693, -20317631, -20244244, -20430193, -20432280, -19924885, -18972236, -18062776, -17807964, -18389950, -19411772, -20335612, -20784590, -20552763, -19755474, -18977725, -18850106, -19409628, -20197165, -20711204, -20696228, -20254284, -19642764, -19182123, -19183464, -19627482]
20350a9627482n12978k68401k3637J19488M01414R84735J424116J061664m8812
20341a6489893j149410j674375j545153r45495k46271J87180K01475j7729k37067
20332b1916738m27281n73678p06896p71311n26466M5111N90260O79342K75028
20323b3332629l10185r14261j441992j603596j325479r51622p05779n36873l61257
20314c1483673n6422M53486Q84540O59147m32024j880783l054930l789411m166008
20305d2866078m090108l487400k606346j671702o72348L86528J321492J852445
20297e1833517J901144J715766J593273J591835J527460J266436P57346P4400
20289d1405857n51584j014578j370303j790802k364871k910936l145694k928839
$$ y = [-19627482, -20140460, -20408861, -20432498, -20313010, -19911596, -18926861, -17502745, -16441081, -16489893, -17639303, -19313678, -20858831, -21804326, -22050597, -21863417, -21661942, -21679671, -21916738, -22344019, -22917697, -23624593, -24395904, -24922370, -24877259, -24286999, -23607657, -23332629, -23642814, -24557075, -25999067, -27602663, -28928142, -29879764, -30585543, -31122416, -31483673, -31540095, -31086609, -30202069, -29542922, -29974946, -31855729, -34910659, -38700070, -42866078, -46956186, -50443586, -53049932, -54721634, -55393982, -55007454, -53685962, -51833517, -49932373, -48216607, -46623334, -45031499, -43504039, -42237603, -41480257, -41405857, -41957441, -42972019, -44342322, -46133124, -48497995, -51408931, -54554625, -57483464]
20281e7483464k250280j120728K61541J506671K325726K597824K290158J572535
20273e0300017Q73247O06307Q44500J299853J670373J821049J702888J312496
20265d0169304O16592k55685r20926j294347j573888j586136j152743o10102l38788
20256d7285327l27176k30249J32706L49034l0239q24432j437680j431826r95797
20247e2080986p65041r57465j167936r59902k17229Q56303J729523J885459J405583
20238e0271691P62559J81733l58795q54436j229428j268979p75033j7843L95162
20229e3436751M01810M50361P44427J236588J646846J491344O31374p12432k236488
20220d9782921l453152m004731l979060l610787k997980k230898j600975j371575
$$ y = [-57483464, -59733744, -60854472, -60592931, -59086260, -56760534, -54162710, -51872552, -50300017, -49426770, -48820463, -47975963, -46676110, -45005737, -43184688, -41481800, -40169304, -39552712, -39808397, -40729323, -42023670, -43597558, -45183694, -46336437, -46946539, -47285327, -47612503, -47842752, -47710046, -47361012, -47391251, -48215683, -49653363, -51085189, -52080986, -52846027, -53803492, -54971428, -55931330, -56148559, -55292256, -53562733, -51677274, -50271691, -49509132, -49327399, -49686194, -50540630, -51770058, -53039037, -53814070, -53831913, -53436751, -53034941, -52584580, -51840153, -50603565, -48956719, -47465375, -46834001, -47546433, -49782921, -53236073, -57240804, -61219864, -64830651, -67828631, -70059529, -71660504, -73032079]
20212g3032079j500642j729267j698064j249459o90376m88371q16153j444498
20204h2648909j964684k102293j902639j562228j181748p73362l79258j9248L61752
20195i2172617N55899K90917j96492n15549p72488j274053j909674k293389k244269
20186a00531715j855024j314841j003772j196887j582156j716419j465308q80245
20178a11546367j51412K73685j2492q32363j621756k006869j843450j241434o76103
20169a19658561n16482o76787q12284o69387l50381j09176p6510l57993j094093
20160a24321654k253124l466915m271539m406045m000974l475939l027917k592749
20152a51816856k201052k092496k557555l603099m881680o000975o861606p529202
$$ y = [-73032079, -74532721, -76261988, -77960052, -79209511, -79899887, -80388258, -81204411, -82648909, -84613593, -86715886, -88618525, -90180753, -91362501, -92135863, -92515121, -92534369, -92172617, -91616718, -91325801, -91522293, -92037842, -92810330, -94084383, -95994057, -98287446, -100531715, -102386739, -103701580, -104705352, -105902239, -107484395, -109200814, -110666122, -111546367, -111697779, -111424094, -111436586, -112268949, -113890705, -115897574, -117741024, -118982458, -119658561, -120175043, -120851830, -121664114, -122333501, -122683882, -122793058, -122869568, -123227561, -124321654, -126574778, -130041693, -134313232, -138719277, -142720251, -146196190, -149224107, -151816856, -154017908, -156110404, -158667959, -162271058, -167152738, -173153713, -180015319, -187544521]
20144a87544521p900674p893154p862395q312977r149055r702201r630295r336061
20136b57331333r283938r297528q779614p518016n762845l297003O76269O816114
20128b93777894J5784818K7976624M1692667N2512010N6148592N1528410M0422395
20121g712378K5674452J0705909j365536r367201j3996056j6428827j7423700
20114b9913337j7258853j5950619j3361010r049716k380181O714814J7483413
20107f3715489K8853861L9231508M6331789M8237009M4145809L4519937K1482748
20100A99087172Q256683k366467r155117j2507190j3664914j3814777j3776917
20093A42058473j4015889j4460580j4749572j4644741j4029510j2939412j1514851
$$ y = [-187544521, -195445195, -203338349, -211200744, -219513721, -228662776, -238364977, -247995272, -257331333, -266615271, -275912799, -284692413, -292210429, -297973274, -301270277, -300594008, -293777894, -277993076, -250016452, -208323785, -155811775, -99663183, -48134773, -7712378, 17962074, 28667983, 27302447, 17935246, 3939190, -12489637, -29913337, -47172190, -63122809, -76483819, -85533535, -87913716, -81198902, -63715489, -34861628, 4369880, 50701669, 98938678, 143084487, 177604424, 199087172, 207343855, 204977388, 195822271, 183315081, 169650167, 155835390, 142058473, 128042584, 113582004, 98832432, 84187691, 70158181, 57218769, 45703918]
20086D5703918r679712p355783m907807k947798j976403k176752l207534m509963
20078H942166n954368p508697q728450r240028r002970p835266n350952j656636
20070d6335201K399770N924270Q334686R380388R544651R521771R380812Q715081
20062A6866228P126601M727100K079369k13702j511245j381834J55768K873153
20054C0721438O554303J1034314J5921520K0438282K3584677K4533964K3350670
20047A56139168K0662755J6534777J1118105N542249P80789l157461o177030p334185
20039A94109167n839322k053525K760237P220088J0609228J2805314J3577298
20032B33188485J2747173J0745737Q036894M621921O55354l125325n853546p107864
$$ y = [45703918, 36024206, 28668423, 23760616, 20812818, 18836415, 16659663, 13452129, 8942166, 2987798, -4520899, -13249349, -22489377, -31492347, -39327613, -44678565, -46335201, -43935431, -38011161, -29676475, -20296087, -10751436, -1229665, 8151147, 16866228, 23992829, 28719929, 30799298, 30585596, 29074351, 27692517, 27848285, 30721438, 37275741, 48310055, 64231575, 84669857, 108254534, 132788498, 156139168, 176801923, 193336700, 204454805, 209997054, 210777843, 207620382, 201443352, 194109167, 188269845, 186216320, 188976557, 196196645, 206805873, 219611187, 233188485, 245935658, 256681395, 264718289, 269340210, 269995564, 266870239, 261016693, 253908829]
20024B53908829p002210n790853l690736j283206M92047J078541O22929m38608
20016B37896733j608364k311341k425100k516141l156668m344524n547052o355062
20008B09632481o833896p098705o980404o425106n696824n079516m644452m175699
20000A62697879l569701l094859k988071l135957l328021l515802l679775l672696
19992A35712997l353952k806247k222583j779411j594399j585129j485385j148080
19984A19737811p05494l82848k02835J22701P80867J374770J419050Q88072L159
19975A23035253q99935j372827j228254o40117J27764P64618R21203L97614n65153
19966A20540166j365705j610343j330583p87957k80795K5634J83068L72656N53782
$$ y = [253908829, 246906619, 241115766, 237425030, 236141824, 236633871, 237712412, 238335341, 237896733, 236288369, 233977028, 231551928, 229035787, 225879119, 221534595, 215987543, 209632481, 202798585, 195699880, 188719476, 182294370, 176597546, 171518030, 166873578, 162697879, 159128178, 156033319, 153045248, 149909291, 146581270, 143065468, 139385693, 135712997, 132359045, 129552798, 127330215, 125550804, 123956405, 122371276, 120885891, 119737811, 119032317, 118649469, 118446634, 118569335, 119350202, 120724972, 122144022, 123032094, 123035253, 122135318, 120762491, 119534237, 118894120, 119021884, 119786502, 120707705, 121105319, 120540166, 119174461, 117564118, 116233535, 115445578, 115164783, 115190417, 115373485, 115746141, 116299923]
19957A16299923M39512j18697j054950k057074k636507k533299j819623q03706
19949A05715579o643J27512k77508o85561q07908p84160p78279o80430l82238
19940A01440364m3878k7851o84348j888191k944723l092536k009027k34531J038010
19931I1553289J177088O59688J52583j93670m51760o89763r36910r61469n18575
19922H9790501L41575J349208K174772K635786K661727K278593J678807J043840
19914A03954809M30397p9207m17768q03984j492487k249038k481117k064051j684000
19905I3113554j987269k651784k769008k073570j071601j92423N91958J275776
19897H4235633J533736J175773L58925o88342j759683k599533l005681k835683
$$ y = [116299923, 116739435, 116620738, 115565788, 113508714, 110872207, 108338908, 106519285, 105715579, 105708936, 105836448, 105558940, 104873379, 104065471, 103281311, 102503032, 101822602, 101440364, 101396486, 101368635, 100684287, 98796096, 95851373, 92758837, 90749810, 90515279, 91553289, 92730377, 93390065, 93542648, 93348978, 92897218, 92207455, 91270545, 90309076, 89790501, 90132076, 91481284, 93656056, 96291842, 98953569, 101232162, 102910969, 103954809, 104385206, 104305999, 103888231, 103084247, 101591760, 99342722, 96861605, 94797554, 93113554, 91126285, 88474501, 85705493, 83631923, 82560322, 82367899, 82959857, 84235633, 85769369, 86945142, 87304067, 86615725, 84856042, 82256509, 79250828, 76415145]
19889G6415145k062577r90916j77731O5754j44572m74491n78201l92031j08862
19880G1551518K93204R21750J521425J971335K535985L107914L099653K290993
19872H7293777J155879K23800n07020j190107j694886j999188k502512l423959
19864G7355784m134729l909918k914727j706415o51148n4066R412j47084k47391
19855F3599718j49813M22978J508707K496709K662102J962940R89377L22889J21849
19846G3937456J05890l8192l02415n14534n19409k81505j25008n03237j254866
19837G0504180j775214j832783j436314n69703M61025J021647P35573q2476q16577
19828F6209358j137239j065106p55034l29774P6315L24518L56803L06132M08100
$$ y = [76415145, 74352568, 73361652, 73183921, 73249675, 73105103, 72630612, 72052411, 71660380, 71551518, 71844722, 72766472, 74287897, 76259232, 78795217, 81903131, 85002784, 87293777, 88449656, 88673456, 88166436, 86976329, 85281443, 83282255, 80779743, 77355784, 73221055, 69311137, 66396410, 64689995, 64038847, 63984781, 63994193, 63847109, 63599718, 63449905, 63872883, 65381590, 67878299, 70540401, 72503341, 73492718, 73815607, 73937456, 74043346, 74005154, 73702739, 73188205, 72668796, 72387291, 72262283, 71759046, 70504180, 68728966, 66896183, 65459869, 64890166, 65351191, 66372838, 67108411, 67025935, 66209358, 65072119, 64007013, 63251979, 62922205, 62998520, 63323038, 63679841, 63985973, 64394073]
19819F4394073N44034K95127l84038j053407j406501j538989j600980j640631
19811E7608688j713753j758116j583427j144297o01961j75551q4972m30905r38801
19802D9176905j173042r76705m33025K23574P37451J146131J527823J627454J005443
19793E2862009m66896k103250k910671k755565k272701j809832j364416j101741
19785C8076937j168933j364818j527350j816757k268206k699216l022675l252448
19777B0956534l405954l412887l126891k536394j722072p20918M59308J952166
19769H442892L871252O104752Q489766J0824242J2614450J3128632J1951393R274662
19761H4702041N641307J731780j679331l851515m500767m133178l540108l071428
$$ y = [64394073, 64938107, 65233234, 64849196, 63795789, 62389288, 60850299, 59249319, 57608688, 55894935, 54136819, 52553392, 51409095, 50807134, 50631583, 50546611, 50115706, 49176905, 48003863, 47027158, 46594133, 46817707, 47555158, 48701289, 50229112, 51856566, 52862009, 52395113, 50291863, 47381192, 44625627, 42352926, 40543094, 39178678, 38076937, 36908004, 35543186, 34015836, 32199079, 29930873, 27231657, 24208982, 20956534, 17550580, 14137693, 11010802, 8474408, 6752336, 6031418, 6490726, 8442892, 12314144, 18418896, 26908662, 37732904, 50347354, 63475986, 75427379, 84702041, 90343348, 92075128, 90395797, 86544282, 82043515, 77910337, 74370229, 71298801]
19753G1298801k536086j361860J080286M929196R742761J5030320K0376092K5044527
19745A43604037K7963401K8152112K5387684K0434094J4417196Q256340K607682
19738B70822546k008255n240408o998798p445351o856888n468140l493168j138766
19730B32172772J436704M195603P099790R683560J1128047J1202180J0575048
19723B87493704R830970Q890409P545394N955072M495081L509827L207907L496994
19715C34425358M069385M718741N280943N497644N380817N300824N590024O339289
19707C76603025P424698Q568948R429124R761236R476924Q664359P427814N352071
19699D42708199J101185o683825j7657506k9380435l8875114m4535027m6523855
$$ y = [71298801, 68762715, 67400855, 68481141, 73410337, 83153098, 98183418, 118559510, 143604037, 171567438, 199719550, 225107234, 245541328, 259958524, 268214864, 270822546, 268814291, 263573883, 256575085, 249129734, 242272846, 236804706, 233311538, 232172772, 233609476, 237805079, 244904869, 254588429, 265716476, 276918656, 287493704, 297324674, 306215083, 313760477, 319715549, 324210630, 327720457, 330928364, 334425358, 338494743, 343213484, 348494427, 353992071, 359372888, 364673712, 370263736, 376603025, 384027723, 392596671, 402025795, 411787031, 421263955, 429928314, 437356128, 442708199, 443809384, 437125559, 419468053, 390087618, 351212504, 306677477, 260153622]
19692B60153622m5443149m0849741l1864107j9361734o365874L982299J0390706
19685A30642022J3525478J4578220J4204953J2794664J0716605P767835K836508
19678B07066285n591748j8353257l4142698m8709482n7067374n7099398m9586079
19671f3483751l6478102k0966378o770399L964862J1070742J5224795J7346213
19664h0092018J8204203J8014375J6659612J4190615J1036093P854922N324704
19657A1192506M095270M562418O468477R049104J1478736J2935379J2969184J1737808
19649H4488882R538215O659507L524752N88992j962890m066734n486336o348267
19641H6936121p090828p532216p001236n344516l285838j649663p06207m93084
$$ y = [260153622, 214710473, 173860732, 141996625, 122634891, 116269017, 120251316, 130642022, 144167500, 158745720, 172950673, 185745337, 196461942, 204229777, 207066285, 201474537, 183121280, 148978582, 100269100, 43201726, -13897672, -63483751, -99961853, -120928231, -127698630, -123733768, -112663026, -97438231, -80092018, -61887815, -43873440, -27213828, -13023213, -1987120, 5867802, 11192506, 15287776, 19850194, 26318671, 35367775, 46846511, 59781890, 72751074, 84488882, 94027097, 100686604, 104211356, 104800348, 102837458, 98770724, 93284388, 86936121, 79845293, 72313077, 65311841, 59967325, 56681487, 55031824, 54325617, 53832533]
19633E3832533j018107k285858m364679p159869j0535850j4544239j8768049k1727481
19625b6571599k1725825j8916707j5408917j2717387j0475420p542352l487476
19618a16845683P28890L295867L067732L30650l582987o909239q472396q914776
19610a37301942j0098075j2681165j5084810j5005599j1418505n472802K68522
19603b06794376L960273N620202O273825O693205O851242O292240M803610K608737
19595a63691042J86099j773547k410142j269682J007419L150059M413340M991825
19587a55395671N493671O258946O994918P105557O381737N075858L592976K331823
19579a12160185J663523J691541K022622K110911J755619J266429J207283J742044
$$ y = [53832533, 52814426, 50528568, 46163889, 39004020, 28468170, 13923931, -4844118, -26571599, -48297424, -67214131, -82623048, -95340435, -105815855, -113358207, -116845683, -116116793, -112820926, -109753194, -109422544, -113005531, -119914770, -128387166, -137301942, -147400017, -160081182, -175165992, -190171591, -201590096, -207062898, -206794376, -202834103, -197213901, -190940076, -184246871, -177395629, -171103389, -166299779, -163691042, -163504943, -165278490, -167688632, -168958314, -167950895, -164800836, -160387496, -155395671, -149902000, -143643054, -136648136, -129542579, -123160842, -118084984, -114492008, -112160185, -110496662, -108805121, -106782499, -104671588, -102915969, -101649540, -100442257, -98700213]
19571i8700213K432633K970247L694461M892529O131056O830526O801808O049407
19563e8897546M692533L051522J602690N87549k82761j336854k439515l224611
19555e6246993l609553l727077l413768k461994j111818J23390Q90169J283621
19547f8274023J591898J857567J955760J809991J486669J170127R45828Q03487
19539e6652696P97846R44080J113787J174404J129809J090718J064585Q69468
19531d8467999M87870K14504K53797N11057R06662J446577J874098J803035J140088
19522c9830311J58320o65047j036590j028277q00996l31206L77168J131370J777652
19513d0247917K261403K523908K409346J791438P26303m51918j330249j713325
$$ y = [-98700213, -96267580, -93297333, -89602872, -84710343, -78579287, -71748761, -64946953, -58897546, -54205013, -51153491, -49550801, -48963252, -49246013, -50582867, -53022382, -56246993, -59856546, -63583623, -66997391, -69459385, -70571203, -70447813, -69557644, -68274023, -66682125, -64824558, -62868798, -61058807, -59572138, -58402011, -57456183, -56652696, -55854850, -54910770, -53796983, -52622579, -51492770, -50402052, -49337467, -48467999, -47980129, -47765625, -47511828, -47000771, -46094109, -44647532, -42773434, -40970399, -39830311, -39671991, -40337038, -41373628, -42401905, -43202901, -43534107, -43156939, -42025569, -40247917, -37986514, -35462606, -33053260, -31261822, -30535519, -30987437, -32317686, -34031011]
19505c4031011j595546j204555q09999l11023N12294J517096K300272K609872
19497c1012600K497395K203214J982236J912600J773891J222010K90960m73463
19489a9603757n63024N8660R24309J414120J320934R91837Q01630O65341K99312
19480a3690638m36744j345542j760708j156449O3203J038808J350992J094928
19472a4842150O73670M76788N42805N72731K67930k65965p20243r88089j026549
19463a5309072p89731n04699n04894p95363j136831j313114j274338j104727p42881
19454b3475650m0142R74863K026624K624649K494710J926392J470577J479973
19446a0518004J903706K372661K526503K311291K004192J773123J340968M99260
$$ y = [-34031011, -35626557, -36831112, -37641111, -37952134, -37439840, -35922744, -33622472, -31012600, -28515205, -26311991, -24329755, -22417155, -20643264, -19421254, -19130294, -19603757, -20166781, -20108121, -19183812, -17769692, -16448758, -15456921, -14655291, -13989950, -13690638, -14127382, -15472924, -17233632, -18390081, -18326878, -17288070, -15937078, -14842150, -14168480, -13691692, -13148887, -12576156, -12308226, -12574191, -13294434, -14282523, -15309072, -16098803, -16603502, -17108396, -17903759, -19040590, -20353704, -21628042, -22732769, -23475650, -23515792, -22540929, -20514305, -17889656, -15394946, -13468554, -11997977, -10518004, -8614298, -6241637, -3715134, -1403843, 600349, 2373472, 3714440, 4213700]
19438D213700m00627q42207o29373J19750R61938J352302J185528O46765j9499
19429F588277m47203m75595l60103l39408k87786q9603J34357M03160Q21258J336743
19419G284097J858906K280196K355939J827567O80142p25431j720987j834387
19411A2006042j332122p39947j58958M99597J134791J551288J772879K027147
19403A6760717K198970J822799P79036l46340p93256o01759m96565q79020j544858
19394A6899724k042234k001857j515093j063764j025365j459241k053623k236172
19386C502375j736976q34567J06000Q88048J419946J765041K114655K657503L230365
19377A3112390L275504K601062J763954J410796J751289K524212L105448K915406
$$ y = [4213700, 3813073, 2970866, 2341493, 2461243, 3423181, 4775483, 5961011, 6607776, 6588277, 6141074, 5665479, 5305376, 4965968, 4678182, 4588579, 4722936, 5126096, 5947354, 7284097, 9143003, 11423199, 13779138, 15606705, 16286847, 15561416, 13840429, 12006042, 10673920, 9933973, 9775015, 10274612, 11409403, 12960691, 14733570, 16760717, 18959687, 20782486, 21561522, 21215182, 20421926, 19820167, 19323602, 18444582, 16899724, 14857490, 12855633, 11340540, 10276776, 9251411, 7792170, 5738547, 3502375, 1765399, 930832, 1036832, 1924880, 3344826, 5109867, 7224522, 9882025, 13112390, 16387894, 18988956, 20752910, 22163706, 23914995, 26439207, 29544655, 32460061]
19369C2460061K097645J512714J730407K528158L222924L249664K517135J227617
19361E0546325k94585j517089j923291j621644j162519q63189p81815p80518n21497
19352D1080178J65557J109079K023699K741627L223049L459388L482685L458419
19344F0743681L607639L936181M367895M856467N087714M722402L841409K746877
19336I3910265J523024n7564k212738m683210o791320q145140q952254r569123
19328E5021940r884732r112173o549261k458368K086485O087680Q940900J0223386
19320E4355857R825566P963427M862938P60084m166662r821100j5737595k0918619
19312B7123896k4284501k5375887k4467808k1921582j7916357j2733245o907255
$$ y = [32460061, 34557706, 36070420, 37800827, 40328985, 43551909, 46801573, 49318708, 50546325, 50251740, 48734651, 46811360, 45189716, 44027197, 43164008, 42382193, 41601675, 41080178, 41245735, 42354814, 44378513, 47120140, 50343189, 53802577, 57285262, 60743681, 64351320, 68287501, 72655396, 77511863, 82599577, 87321979, 91163388, 93910265, 95433289, 95375725, 93162987, 88479777, 81688457, 73543317, 64591063, 55021940, 45137208, 36025035, 29475774, 27017406, 29103891, 35191571, 44132471, 54355857, 64181423, 72144850, 77007788, 77767872, 73601210, 63780110, 48042515, 27123896, 2839395, -22536492, -47004300, -68925882, -86842239, -99575484, -106482739]
19305a06482739j260638L401992O645664Q392739Q888956Q488416P286102N153593
19297e9485915K113947j416312m867322p904743j0384647j2176997j3073423j2797093
19289a19992505j1122720q275816n039678j967193P86115K990308M532031N492644
19281a32596814N776817N354237M615020L999661L692923L645908L583861L136673
19273i8791714K114795P91624j99168l57829L43746J548716K714387L320962L307965
19264h5206516L120941L102651L086894K658021J729615O39805k71975q49942
19256g1990506r05864k89054P16579J436941J396611O70646k46100p27682l62146
19247g0300575O94330J784496K307761K197066J916676J868648J980796J921150
$$ y = [-106482739, -107743377, -104341385, -97695721, -89302982, -80414026, -71925610, -64639508, -59485915, -57371968, -58788280, -63655602, -71560345, -81944992, -94121989, -107195412, -119992505, -131115225, -139391041, -144430719, -146397912, -145611797, -142621489, -138089458, -132596814, -126819997, -121465760, -116850740, -112851079, -109158156, -105512248, -101928387, -98791714, -96676919, -95885295, -96084463, -96442292, -96098546, -94549830, -91835443, -88514481, -85206516, -82085575, -78982924, -75896030, -73238009, -71508394, -70868589, -71140564, -71990506, -72896370, -73185424, -72468845, -71031904, -69635293, -68964647, -69210747, -69938429, -70300575, -69606245, -67821749, -65513988, -63316922, -61400246, -59531598, -57550802, -55629652]
19239e5629652J462587O42977k81148r26903j070804q09208m74950m71487r47386
19230e8505974j482517j491378r21822j98802L61394Q17829J404386K171222K863209
19221e4982453L062574K556556J822355J575567J825763K063218K059729J945208
19213c8071483J876405J791522J457474Q05006J8916n57144o31513k67360J38947
19204c3439230L61632M99316P17307J128012J603343J908052J970162J975142
19196b3276264K201104K514407K514224J997871J018702j64250j235960j897780
19188a6327946j969207j610436j165439p35836k32368K43975M73709N27948N68025
19179b0227575M66447J65028p60L17311J075122J830419K000751J353731L12602
$$ y = [-55629652, -54167065, -53524088, -53805236, -54732139, -55802943, -56612151, -57087101, -57558588, -58505974, -59988491, -61479869, -62401691, -62600493, -62239099, -61421270, -60016884, -57845662, -54982453, -51919879, -49363323, -47540968, -45965401, -44139638, -42076420, -40016691, -38071483, -36195078, -34403556, -32946082, -32141076, -32122160, -32679304, -33310817, -33578177, -33439230, -33077598, -32578282, -31860975, -30732963, -29129620, -27221568, -25251406, -23276264, -21075160, -18560753, -16046529, -14048658, -13029956, -13194206, -14430166, -16327946, -18297153, -19907589, -21073028, -21808864, -22041232, -21797257, -21323548, -20795600, -20227575, -19761128, -19596100, -19596860, -19279549, -18204427, -16374008, -14373257, -13019526, -12706924]
19170a2706924m74557o83644m57533k96922n59483r37873q65225m40255k55973
19161a7678389l75996k72728K75341Q66645J134941J087692R75405J030375J155595
19152a1801119J131602R82051Q61521Q21728P42001M27652r9027n47801p52291
19143h233683q84882j162635j524358j639027j162674k56656M46331O92064P57168
19134a2968352R58915J335807J658093J676877J350766P72301K575q00366j532374
19125g545758k237117k797367k847007k134101q71797K75115O15464P8043o73767
19116a8138292q36391l23409J61217L0098p68121j919240k977317l511063l113932
19107c1396450j760865j01785J006289J237209J034218R39262R73343R28917P34187
$$ y = [-12706924, -13181481, -13865125, -14322658, -14619580, -15179063, -16116936, -16982161, -17422416, -17678389, -18054385, -18327113, -18051772, -17185127, -16050186, -14962494, -13987089, -12956714, -11801119, -10669517, -9687466, -8825945, -8004217, -7262216, -6834564, -6933591, -7481392, -8233683, -9118565, -10281200, -11805558, -13444585, -14607259, -14863915, -14417584, -13725520, -12968352, -12009437, -10673630, -9015537, -7338660, -5987894, -5215593, -5213018, -6013384, -7545758, -9782875, -12580242, -15427249, -17561350, -18433147, -18158032, -17542568, -17464525, -18138292, -18974683, -19298092, -19136875, -19106777, -19874898, -21794138, -24771455, -28282518, -31396450, -33157315, -33259100, -32252811, -31015602, -29981384, -29042122, -28068779, -27139862, -26405675]
19098b6405675O47046J059959J868720K422519K127436R02553q32560k375240
19090b0585242l059929k758840k006203j449824j315036j345942j057213k29918
19082c3808147Q73685J881478K629775K961750K689249J938766J070457J96455
19074a9566532o24185j081998j020108n67801M0720N90017R98582J172896Q65115
19065a9193294o1832j245713k078771k193978j655985q91670k92965L1617J62092
19056b7420499J10964p7428O5596J021468K533376L878533M610170M691879M278205
19047f307736L513379K520188J578498J083033J155778J296882R71435K95874
19039F107331m78576j464211k653971l567827l739855l246993k560330k074809
$$ y = [-26405675, -25758629, -24698670, -22829950, -20407431, -18279995, -17377442, -18210002, -20585242, -23645171, -26404011, -28410214, -29860038, -31175074, -32521016, -33578229, -33808147, -32934462, -31052984, -28423209, -25461459, -22772210, -20833444, -19762987, -19566532, -20190717, -21272715, -22292823, -22860624, -22819904, -22229887, -21231305, -20058409, -19193294, -19255126, -20500839, -22579610, -24773588, -26429573, -27321243, -27614208, -27582591, -27420499, -27309535, -27386963, -27321367, -26299899, -23766523, -19887990, -15277820, -10585941, -6307736, -2794357, -274169, 1304329, 2387362, 3543140, 4840022, 5811457, 6107331, 5628755, 4164544, 1510573, -2057254, -5797109, -9044102, -11604432, -13679241]
19031a3679241j881767j874743j932720j942685j867298j851494j934024j916388
19023b8880360j678958j252885n92641M01244J634601K698872L190097L146418
19015b1333612K846092K449115K008210J453244N89886n81404j688083k279671
19007a6536223j987314q49387M88977J500577K255870K969950L590577L799747
18999d767226L290768K167582J046391O35430J104290J835946J957168J157910
18991H428259j13111j128733j492319j336279j081438r17105o86916k94559R9049
18982A476848K80734J63623k18404q03642j511744k111771k228596j805550j132892
18973g891394l13810N62729J291108J748255J857355J622751J084479L40152k84793
$$ y = [-13679241, -15561008, -17435751, -19368471, -21311156, -23178454, -25029948, -26963972, -28880360, -30559318, -31812203, -32404844, -32003600, -30368999, -27670127, -24480030, -21333612, -18487520, -16038405, -14030195, -12576951, -11987065, -12568469, -14256552, -16536223, -18523537, -19372924, -18883947, -17383370, -15127500, -12157550, -8566973, -4767226, -1476458, 691124, 1737515, 2372945, 3477235, 5313181, 7270349, 8428259, 8315148, 7186415, 5694096, 4357817, 3276379, 2359274, 1672358, 1377799, 1476848, 1757582, 1921205, 1702801, 899159, -612585, -2724356, -4952952, -6758502, -7891394, -8205204, -7642475, -6351367, -4603112, -2745757, -1123006, -38527, 301625, 16832]
18964A6832n35839m65344k53897j31246k58644o43954j222481j912045k552777
18955g959395k934421k971764k648024j922697q98402K59414J392349K176966
18947a5505974K270524J741467J002088N45401O64713J052159J020394L21092
18939f888136o65423j422159j507668p14036M45536J029854P15177k6352m71019
18930i504226k95054J15643L04309K26687k6841m39267j044277j708304k116158
18921a4487488k073043j559777n74245P91053K261709L468500M178540M391930
18913c602821M128088L240179J700121K1268j050224j195152o58022J80628J048122
18904C812187J585431J423772O60993j75972q21659j292457j322675q19305l23955
$$ y = [16832, -519007, -984351, -1238248, -1369494, -1628138, -2272092, -3494573, -5406618, -7959395, -10893816, -13865580, -16513604, -18436301, -19334703, -19075289, -17682940, -15505974, -13235450, -11493983, -10491895, -9946494, -9281781, -8229622, -7209228, -6888136, -7553559, -8975718, -10483386, -11197422, -10751886, -9722032, -9006855, -9033207, -9504226, -9799280, -9683637, -9379328, -9152641, -9179482, -9618749, -10663026, -12371330, -14487488, -16560531, -18120308, -18694553, -17903500, -15641791, -12173291, -7994751, -3602821, 525267, 3765446, 5465567, 5486835, 4436611, 3241459, 2583437, 2764065, 3812187, 5397618, 6821390, 7482383, 7306411, 6484752, 5192295, 3869620, 3050315, 2726360]
18895B726360l63846p88366j026572p87672k55787K07775N29759Q36353J039043
18886B117047R67067N78042q6338q88379j654349k229939k402229k091146j389927
18877g080151l37783Q79147J816387K168823J925612J172519J06130p51620r16176
18868a017112n77322l07982l65068o95057j226707j910885k536873k678954k128460
18859a3444420j167146k98664K68241O20480Q62965J157563J611640K026070K169501
18850f193770K146984K132984K243408K470124K554005K310699J798862J169738
18842A0633034N24534k10132j037972j731399k219861k694653l145135l104834
18834b986418k189327o60079Q20199J830758K386920K536376K129462J170059
$$ y = [2726360, 2362514, 1574148, 547576, -240096, -495883, -288108, 241651, 1078004, 2117047, 3084114, 3662156, 3575818, 2687439, 1033090, -1196849, -3599078, -5690224, -7080151, -7417934, -6538787, -4722400, -2553577, -627965, 544554, 650684, -100936, -1017112, -1594434, -1902416, -2267484, -2962541, -4189248, -6100133, -8637006, -11315960, -13444420, -14611566, -14910230, -14641989, -14021509, -13158544, -12000981, -10389341, -8363271, -6193770, -4046786, -1913802, 329606, 2799730, 5353735, 7664434, 9463296, 10633034, 11157568, 10947436, 9909464, 8178065, 5958204, 3263551, 118416, -2986418, -5175745, -5835824, -5015625, -3184867, -797947, 1738429, 3867891, 5037950]
18826E037950Q24r43704j394046j231287o46446l15152o65953j320667j647052
18817c125533j358741n40080N21923J449396J895777J717113R22499m92910k278493
18808a289049l750724m333854l922457k732105j231676P6673J057643J789868
18800a4335681K157766J921526J145816K40370n17108j121128j523411j502583
18792a3534433r98898k42775O11089J585263K481000K788555K210990J009057
18784d090152k68777j244564j798394j943751j741762j207438l98085M31092R43550
18775a1318281R28119L47895m42534q34218o21877l5956N10383N97347K76956
18766a0592166J232K8118L56439Q46994J181671J076236O58565L21251J66268
$$ y = [5037950, 5038774, 4095070, 2701024, 1469737, 823291, 508139, -157814, -1478481, -3125533, -4484274, -5024354, -4502431, -3053035, -1157258, 559855, 1482354, 989444, -1289049, -5039773, -9373627, -13296084, -16028189, -17259865, -17183192, -16125549, -14335681, -12177915, -10256389, -9110573, -8870203, -9387311, -10508439, -12031850, -13534433, -14533331, -14776106, -14165017, -12579754, -10098754, -7310199, -5099209, -4090152, -4358929, -5603493, -7401887, -9345638, -11087400, -12294838, -12692923, -12261831, -11318281, -10390162, -10042267, -10484801, -11319019, -11940896, -11976852, -11466469, -10869122, -10592166, -10590934, -10562816, -10206377, -9359383, -8177712, -7101476, -6442911, -6121660, -5955392]
18757e955392j13043p16348j285010j222289l77810O90466J259504J078482M57187
18748f184253j07921m38992p25097r97915j210689j633250k408543l122726l350057
18739b0179443l039441k126151o26877R53839J873374J709170P65472j21332l35424
18730b1126813J93531J137746J848520J695769P19795m07635j155673j424074
18722a8518834j169989l82098O63984J529012J929069J854855J467892R24258
18714a1701851L44495l2618P8088O03259R70112P57234J51986l89604o00734n91990
18704a0411623n51239m78928l54390j92514R4945N12489P29022M27584k75834
18695a0500488j057806j546584j447474r09874m11184k75801l78515m08415l20158
$$ y = [-5955392, -6068435, -6784783, -8069793, -9292082, -9669892, -8979426, -7719922, -6641440, -6184253, -6292174, -6731166, -7456263, -8454178, -9664867, -11298117, -13706660, -16829386, -20179443, -23218884, -25345035, -25971912, -25018073, -23144699, -21435529, -20670057, -20791389, -21126813, -20933282, -19795536, -17947016, -16251247, -15531452, -15939087, -17094760, -18518834, -19688823, -20070921, -19406937, -17877925, -15948856, -14094001, -12626109, -11701851, -11357356, -11389974, -11311886, -10708627, -9738515, -8981281, -8829295, -9218899, -9819633, -10411623, -10962862, -11441790, -11796180, -11988694, -11893749, -11381260, -10652238, -10224654, -10500488, -11558294, -13104878, -14552352, -15462226, -15873410, -16149211, -16527726, -16936141, -17256299]
18686a7256299k06254Q6808N90930R66094J049141Q95903N14766n5437m49956
18677a3864304l4195J435580L258053M218607L703883K085189K19109j063571
18669d1649j494520j533441j754813k206678k422539k043042j147778Q244R80116
18660a1656100J270440R50213N32357K63081J46893M24479J155266J598407J034618
18651d280346j79960j132575j324792r43820n03607l63668n40878q13106j088598
18642a1171350j284665j143780o24755J4491N00602P44809R96072J558220K226484
18633h183872K429931J914283J032461K24077n15056j343025j952922j824365
18625h218488j002142O4637J036401J671925J788390J416676Q52750M27965K15477
$$ y = [-17256299, -17462553, -17375745, -16784815, -15818721, -14769580, -13873677, -13358911, -13414348, -13864304, -13898499, -12462919, -9204866, -4986259, -1282376, 802813, 1021922, -41649, -1536169, -3069610, -4824423, -7031101, -9453640, -11496682, -12644460, -12636216, -11656100, -10385660, -9435447, -8903090, -8640009, -8493116, -8068637, -6913371, -5314964, -4280346, -4460306, -5592881, -6917673, -7861493, -8365100, -8728768, -9269646, -10082752, -11171350, -12456015, -13599795, -14224550, -14210059, -13709457, -12964648, -11968576, -10410356, -8183872, -5753941, -3839658, -2807197, -2583120, -3098176, -4441201, -6394123, -8218488, -9220630, -9155993, -8119592, -6447667, -4659277, -3242601, -2389851, -1961886, -1746409]
18616a746409J51461K74391M85158M33259l0176n50656o48998l04229N221j27745
18606b058723m84027m92763N6729Q53045J507047J793076J478097N48966n44882
18597B656565j244855j284969p45364J94600J303692K184494K532294K450975
18589H047432K242897J891943J020579l86344j706039k298451k031875j236410
18581E543732l57905K91261O54823P52378N62436J65615k03540k84621O8060O21427
18571G813666P92693K86951n51973j026462q45451l67237K1738K84178M97820
18562F905923O28793O75417P32097Q63717J071156J230665J064206L89111o10497
18553A2950588j696593k673355l116806k732200j687927m69767M79800R32610
$$ y = [-1746409, -1594948, -1320557, -835399, -402140, -432316, -982972, -1631970, -1936199, -1930978, -2058723, -2542750, -3035513, -2978784, -2125739, -618692, 1174384, 2652481, 3201447, 2656565, 1411710, 126741, -618623, -424023, 879669, 3064163, 5596457, 8047432, 10290329, 12182272, 13202851, 12816507, 11110468, 8812017, 6780142, 5543732, 5185827, 5477088, 6131911, 6884289, 7446725, 7612340, 7408800, 7124179, 7192239, 7813666, 8606359, 8893310, 8341337, 7314875, 6469424, 6102187, 6123925, 6408103, 6905923, 7534716, 8210133, 8942230, 9805947, 10877103, 12107768, 13171974, 13561085, 12950588, 11253995, 8580640, 5463834, 2731634, 1043707, 573940, 1053740, 1986350]
18545A986350P53715J59016l52983p04197j176852j863485k549073k973112l075438
18536i796059k756155j715671j05956J236872J553703P75492l87475r06089l68113
18527a2469451Q33423K113269K969303L245631L076854K465572J438393L07923
18519C980917m28520n13255k69094j20677k29756n91874j099428j741083k524410
18510c537180l249714l628835l471198k737452j592959l15107R17970J851838
18502a5762637K163712J799075P86824p29847k081736k475741j780259n00991
18494a8581600O99233J359782J368450Q55841J86620j58959m4660K32567L73742
18485a3708984L64122K40734j22941p67337j462518j892186j895561j551262j051408
$$ y = [1986350, 2740065, 2899081, 2546098, 1841901, 665049, -1198436, -3747509, -6720621, -9796059, -12552214, -14267885, -14373841, -13136969, -11583266, -10807774, -11195249, -12101338, -12469451, -11636028, -9522759, -6553456, -3307825, -230971, 2234601, 3672994, 3980917, 3552397, 3039142, 2770048, 2649371, 2419615, 1827741, 728313, -1012770, -3537180, -6786894, -10415729, -13886927, -16624379, -18217338, -18532445, -17614475, -15762637, -13598925, -11799850, -11013026, -11742873, -13824609, -16300350, -18080609, -18581600, -17882367, -16522585, -15154135, -14298294, -14111674, -14270633, -14315293, -14082726, -13708984, -13344862, -13104128, -13227069, -13994406, -15456924, -17349110, -19244671, -20795933, -21847341]
18476b1847341n22085P6003Q72175J790550K489239K743493K697290K462032J977512
18467g261132J291829N00825k44572o69613o33242k78844J03313J61874l23741
18458g353303j192154j980289k355774k240509j629393p33783j9242J19300l74869
18449a7760016j255313k091969k502438k462056k073280j330238m31096K37037
18441b9669369M97329M21398J92207M6124L27980J122942J861763K096202K244845
18432b0858579K881996L788002M227149L826205K752747J344308r0972j370540
18424c499684k363427k958753l236635l331434l115445k396967j268385o7844
18416b2238574R06208J676978K369702K895558L047286K693238K005669J483991
$$ y = [-21847341, -22369426, -22293423, -21421248, -19630698, -17141459, -14397966, -11700676, -9238644, -7261132, -5969303, -5468478, -5713050, -6382663, -7015905, -7294749, -7191436, -7029562, -7353303, -8545457, -10525746, -12881520, -15122029, -16751422, -17485205, -17504447, -17385147, -17760016, -19015329, -21107298, -23609736, -26071792, -28145072, -29475310, -29906406, -29669369, -29172040, -28750642, -28558435, -28512311, -28184331, -27061389, -25199626, -23103424, -20858579, -17976583, -14188581, -9961432, -6135227, -3382480, -2038172, -2129144, -3499684, -5863111, -8821864, -12058499, -15389933, -18505378, -20902345, -22170730, -22238574, -21332366, -19655388, -17285686, -14390128, -11342842, -8649604, -6643935, -5159944]
18408e159944J526627K121680K831818L091945K716689J803187M89834q90978
18400H530858j881309k180170j852946j314292r83532j022349j337560j646773
18392c688073j780057j771600j625820j269118p25755p5148O68519J498452K347689
18383f420911K928215K893563K255862J449922R60724Q95474R80014Q06543P8851
18374F828257j025487j870840j957821j511071j230946j352376j440116j048258
18366d608658k27955N56728R77720J064148R99468R04342P31303M61638J81095
18357A039829n8727k00009j53401J62715P05324J160444J062953K93788p81181
18348C231735j715606k229168k168703j508663m12689O98022J369436J562949
$$ y = [-5159944, -3633317, -1511637, 1320181, 4412126, 7128815, 8932002, 9421836, 8530858, 6649549, 4469379, 2616433, 1302141, 318609, -703740, -2041300, -3688073, -5468130, -7239730, -8865550, -10134668, -10860423, -10935571, -10267052, -8768600, -6420911, -3492696, -599133, 1656729, 3106651, 4067375, 4962849, 5942863, 6749406, 6828257, 5802770, 3931930, 1974109, 463038, -767908, -2120284, -3560400, -4608658, -4836613, -4279885, -3302165, -2238017, -1238549, -334207, 397096, 858734, 1039829, 981102, 781093, 627692, 790407, 1495731, 2656175, 3719128, 4012916, 3231735, 1516129, -713039, -2881742, -4390405, -4803094, -4105072, -2735636, -1172687]
18340a172687J720760K117781K316703J765689P46529J53092L12443M66999j23011
18331H304298j214726k178057k678502k681422k266995j680106j201923p82423
18323f379856k17185L99539P81842R56188J205858J722557K428471K834824K516188
18314F248426J696227Q53201J83479k56364m93578o72037r50875j554481k516015
18305B537983l404540l711222l398381k806495k105287j276710m55771J54598
18297a4465825N57600R43858J480711K117527K727230L295775L788548M057408
18289D502832L938775L221357J959029P00983j38099n31552m92405j83320k9324
18280A2948276m16713j313001k304505k931813k948060k560589k279830k437570
$$ y = [-1172687, 548073, 2665854, 4982557, 6748246, 7494775, 7647867, 7960310, 8427309, 8304298, 7089572, 4911515, 2233013, -448409, -2715404, -4395510, -5597433, -6379856, -6597041, -6197502, -5415660, -4459472, -3253614, -1531057, 897414, 3732238, 6248426, 7944653, 8797854, 8981333, 8724969, 8231391, 7559354, 6608479, 5053998, 2537983, -866557, -4577779, -7976160, -10782655, -12887942, -14164652, -14620423, -14465825, -13908225, -12964367, -11483656, -9366129, -6638899, -3343124, 445424, 4502832, 8441607, 11662964, 13621993, 14322976, 14184877, 13653325, 13160920, 12977600, 12948276, 12531563, 11218562, 8914057, 5982244, 3034184, 473595, -1806235, -4243805]
18272d243805k994396l499641l491374k939074k132267j395839r12684n93057
18264b2202137k11459K09856N14096P96620J222078J538249J238650K74825p00907
18255a7320129r53299l67421M61461R05575Q29593L41952k44274m34381r2566
18246a6873489M36225O82991L11128o43249j669150k042407j285444K13728J521968
18237a9347699K236768K506258K469747K281300K139725K065005J927179J572064
18229b149653R37252J94053k66272k63738n352K78766M63026N16323M26667J64537
18219B95609k03906o19007j015704j283203j338022j116623o77370k03364K03190
18210e958400M01855J62298m47429r73346r98801n19772L9817K69246Q9315j67797
$$ y = [-4243805, -7238201, -10737842, -14229216, -17168290, -19300557, -20696396, -21609080, -22202137, -22413596, -22203740, -21689644, -20893024, -19670946, -18132697, -16894047, -16619222, -17320129, -18273428, -18640849, -18179388, -17273813, -16444220, -16102268, -16346542, -16780923, -16873489, -16437264, -15754273, -15443145, -16086394, -17755544, -19797951, -21083395, -20869667, -19347699, -17110931, -14604673, -12134926, -9853626, -7713901, -5648896, -3721717, -2149653, -1212401, -1018348, -1284620, -1548358, -1553710, -1274944, -811918, -295595, 131072, 295609, 91703, -527304, -1543008, -2826211, -4164233, -5280856, -5958226, -6161590, -5958400, -5556545, -5394247, -5841676, -6815022, -7813823, -8333595, -8293778, -8024532, -7935217, -8103014]
18200h103014j9311M86700Q56293Q02369N14032K90255J89557J81361K69899N14474
18190d017385R60247J405344J531026J383340J228769J011147N04164k09268q13163
18181B984221j076617r89125q18715r87729j502961j797986j506467p89689L396
18172f481672M92146M69096J68468p4938j83489j71220j4236K00427K56439q8958
18162e427937p92240j288324j042996q6672J109231K031781K459204K483058K169965
18153A615070J343650R1219r89671j418828j351524j266761j373527j540947j571325
18144f462644j330904o67430M59538J765671K761874L136270L023626K699513
18136E385514K078341R88117j51451o79472o20579o05038r64792j301769j190397
$$ y = [-8103014, -8122325, -7635625, -6779332, -5976963, -5462931, -5172676, -4983119, -4801758, -4531859, -4017385, -3057138, -1651794, -120768, 1262572, 2491341, 3502488, 4006652, 3797384, 2984221, 1907604, 918479, 99764, -887965, -2390926, -4188912, -5695379, -6485068, -6481672, -5989526, -5520430, -5351962, -5426900, -5610389, -5781609, -5795845, -5595418, -5338979, -5427937, -6220177, -7508501, -8551497, -8638169, -7528938, -5497157, -3037953, -554895, 1615070, 2958720, 3049939, 2060268, 641440, -710084, -1976845, -3350372, -4891319, -6462644, -7793548, -8460978, -8001440, -6235769, -3473895, -337625, 2686001, 5385514, 7463855, 8451972, 8300521, 7621049, 7000470, 6395432, 5430640, 4128871, 2938474]
18127B938474r07282r67665j417587j738304j351828l19429Q70212K086230L415566
18118B608387M598523N181367M821903L415555J195944j296506l406741m610614
18110A2507818m660595l696298k220791p96245K22763P64318J073953J372005
18102D566928J450254J128634P28475N87370M56291J2845m92582p06929p73279
18093F958007j191820k060399k833847k986506k615584k213737k003697j758174
18085a0705757j158821k94263L61867M26262l1934m68357m14967P2197O98016
18076a1515757J237037J526362J562524J516973J414154J197031R37975O57917
18068a465784L46415K34939O36331J482115K282240K515050K103167J399765O60575
$$ y = [2938474, 2031192, 1063527, -354060, -2092364, -3444192, -3763621, -2893409, -807179, 2608387, 7206910, 12388277, 17210180, 20625735, 21821679, 20525173, 17118432, 12507818, 7847223, 4150925, 1930134, 1133889, 1356652, 2120970, 3194923, 4566928, 6017182, 7145816, 7874291, 8461661, 8917952, 8930797, 8438215, 7731286, 6958007, 5766187, 3705788, 871941, -2114565, -4730149, -6943886, -8947583, -10705757, -11864578, -12158841, -11796974, -11370712, -11402646, -11871003, -12285970, -12213773, -11515757, -10278720, -8752358, -7189834, -5672861, -4258707, -3061676, -2123701, -1465784, -1119369, -884430, -248099, 1234016, 3516256, 6031306, 8134473, 9534238, 10194813]
18059A0194813q6013o54853p22520l61170r3267l56137j220290k416907l399214
18050H84442l607943k854303j469367q9094Q10676J314381J774668K187196K284702
18041A235358J923429J138422J41749o89179j098122j044747m05791P99441K008240
18032D008800K451683J894148Q58277q5266q70334j491248j675235j333262q53423
18023B904140q27065j436276k174311k412036j995206j143984p1375J088615K085995
18014c981503K646982K765664K617338K172022J322384K26746r55258k166629
18006D647746k999850k926368k033815r33006r9942L90965P18749J105219J513677
17997f16625J534417J012399L74456R4734L18314Q82735J414513J633822J669617
$$ y = [10194813, 10108800, 9453947, 8731427, 8370257, 8276990, 7920853, 6700563, 4283656, 884442, -2723501, -5577804, -7047171, -7136265, -6325589, -5011208, -3236540, -1049344, 1235358, 3158787, 4297209, 4438958, 3749779, 2651657, 1606910, 1201119, 2000560, 4008800, 6460483, 8354631, 9212908, 9127642, 8257308, 6766060, 5090825, 3757563, 2904140, 2077075, 640799, -1533512, -3945548, -5940754, -7084738, -7156113, -6067498, -3981503, -1334521, 1431143, 4048481, 6220503, 7542887, 7769633, 6814375, 4647746, 1647896, -1278472, -3312287, -4245293, -4345235, -3954270, -3235521, -2130302, -616625, 917792, 1930191, 2304647, 2399381, 2717695, 3600430, 5014943, 6648765, 8318382]
17988H318382J757293J711681J037566m62843k548207m721922o253634o450744
17980g612428n163401l022224j015545J13326K16648k73803p73672q85452n47080
17971a8963631J47007J045574J735529J911227J765278J609436J505348J313383
17963g930849J033576R13359J097414J569505K078048K187335J906459J577716
17955D432563J245271P59855J89267k32140l65814k46476j49402m12869q78130
17946D342125r42114m37865R0545K44437K31773L23362N90949R80544J175662
17937F599418Q38753J21641o28215j275405j821600k275416k529035k336598j640325
17928d946782r15787p09784r72677j182446q85326p8640O35750O41255M3679n57449
$$ y = [8318382, 10075675, 11787356, 12824922, 12362079, 9813872, 5091950, -1161684, -7612428, -12775829, -15798053, -16813598, -16700272, -16483624, -16757427, -17531099, -18416551, -18963631, -18816624, -17771050, -16035521, -14124294, -12359016, -10749580, -9244232, -7930849, -6897273, -5983914, -4886500, -3316995, -1238947, 948388, 2854847, 4432563, 5677834, 6437689, 6626956, 6394816, 6029002, 5782526, 5633124, 5220255, 4342125, 3400011, 2962146, 3052691, 3297128, 3528901, 3852263, 4443212, 5423756, 6599418, 7438171, 7559812, 6931597, 5656192, 3834592, 1559176, -969859, -3306457, -4946782, -5862569, -6572353, -7545030, -8727476, -9612802, -9691442, -9055692, -8414437, -8370758, -8928207]
17918h928207o94662l76242J02722N75289R22396J007212R70950J056855J188205
17909d175482J151832Q62913M32858J08929K7603K25691O74959J280779J964999
17900B555081K584090K924910K728117J843552O80315M5232L21776J204160K040607
17891A6927840K266081J645279L83199q91032j522328j368812p41793j38539k01335
17882A6358560j148800k291425k811948k639898k194334j847974j687124j420585
17874C16472p23625L56428J376707J928477J944410J501836P49281M8842k81997
17865G216831m30228o97170r13634p17859o3491O83142R46002M61053l14802p20456
17855E449388n72193j43599Q3298m09530j699538l078584l621683k996569j615234
$$ y = [-8928207, -9622869, -9999111, -9896389, -9321100, -8398704, -7391492, -6420542, -5363687, -4175482, -3023650, -2160737, -1727879, -1618950, -1591347, -1365656, -690697, 590082, 2555081, 5139171, 8064081, 10792198, 12635750, 13316065, 13361297, 13683073, 14887233, 16927840, 19193921, 20839200, 21222399, 20331367, 18809039, 17440227, 16698434, 16559895, 16358560, 15209760, 12918335, 10106387, 7466489, 5272155, 3424181, 1737057, 316472, -407153, -50725, 1325982, 3254459, 5198869, 6700705, 7449986, 7498828, 7216831, 6786603, 6089433, 5175799, 4457940, 4394449, 5077591, 6023593, 6484646, 6169844, 5449388, 4877195, 4733596, 4816894, 4407364, 2707826, -370758, -3992441, -6989010, -8604244]
17846h604244j17658J192391K296415L021104L114327K729995K420471K500742
17838H553543K638749K435322J906597J104565K2847j002278j535112j602260
17830A2521973j577093j830600k495044l290650l647086l098586j684022m7605
17822e148713J066763J457556J466027J410329J124280L13846p68028j507598
17814e85538j576345j082593l93456J83749N57847P37275Q44102J000249R54755
17805F40045K71225q17397j406695j000527o4981O53496R39299R64173Q47952
17796A026590O53394N21317O40429R51293J146989J051771P40627L00399j95518
17787F837291n20447n31798m33781o12984j159924j679886j742220j240018l83152
$$ y = [-8604244, -8721902, -7529511, -5233096, -2211992, 902335, 3632330, 6052801, 8553543, 11192292, 13627614, 15534211, 16638776, 16661623, 15659345, 14124233, 12521973, 10944880, 9114280, 6619236, 3328586, -318500, -3417086, -5101108, -5148713, -4081950, -2624394, -1158367, 251962, 1376242, 1690088, 922060, -585538, -2161883, -3244476, -3637932, -3454183, -2896336, -2159061, -1314959, -314710, 640045, 911270, 93873, -1312822, -2313349, -2378330, -1724834, -785535, 178638, 1026590, 1679984, 2201301, 2841730, 3793023, 4940012, 5991783, 6732410, 7032809, 6837291, 6316844, 5785046, 5351265, 4738281, 3578357, 1898471, 156251, -1083767, -1466919]
17778a466919M41748Q22565M35154n61849j445695j780055j753211j552714j268610
17769h129586j110738j197336j398862j339508o87907L70525J147315J065071
17761a1281026J67795r59637j604024j373477n12767K97007O17967N59055M12047
17752a3677060K02979q7820j23080M14545J321246K039038K089545J420248N07876
17743e892483p5359j85840M5015N36200J067790J315477J168709P97288N46774
17734f76429N45793N81745O16528P63859R35104R36711O17932K3632m37232l29744
17724C577899R3594J40549k48693n25353l63966J30985P09461J246576J712620
17715F473672K003026J843809J068219m8543j030873j453379r78546K77068J592064
$$ y = [-1466919, -1025171, -202606, 232548, -329301, -1774996, -3555051, -5308262, -6860976, -8129586, -9240324, -10437660, -11836522, -13176030, -13863937, -13493412, -12346097, -11281026, -11113231, -12072868, -13676892, -15050369, -15563136, -15266129, -14648162, -14089107, -13677060, -13474081, -13561901, -13684981, -13270436, -11949190, -9910152, -7820607, -6400359, -5892483, -5967842, -6153682, -6108667, -5572467, -4504677, -3189200, -2020491, -1223203, -676429, -130636, 451109, 1067637, 1831496, 2766600, 3703311, 4321243, 4344875, 3907643, 3577899, 3671493, 3812042, 3563349, 3037996, 2674030, 2805015, 3514476, 4761052, 6473672, 8476698, 10320507, 11388726, 11340183, 10309310, 8855931, 7877385, 8154453, 9746517]
17706I746517K049716J314009n5714j380060k411278l108225l544223l812517
17698a201775l809192l471168k901932k218528j503975p97548L374J009647J946854
17689a2944243K210050J612748P41535K09705J09096J64539k8649n85886j208193
17680i719298j689894j935575j756800j164638l46420O55618J627254K039150
17672a2290603J723819R89309K17723j96815r9991K96813P25141R15686O89789
17663g029129J64504l95822p66054q28083o32399k95625J64430N67015N19380
17654h531783o76m80890m77755j31557P221l30378o30913l21321L54563P86730
17644i756759Q55089Q96967J011028R05042K75455q27857j835293k120997j731855
$$ y = [9746517, 11796233, 13110242, 13054528, 11674468, 9263190, 6154965, 2610742, -1201775, -5010967, -8482135, -11384067, -13602595, -15106570, -15904118, -15900744, -14891097, -12944243, -10734193, -9121445, -8379910, -8170205, -8061109, -7896570, -7925219, -8511105, -9719298, -11409192, -13344767, -15101567, -16266205, -16612625, -15957007, -14329753, -12290603, -10566784, -9577475, -9359752, -9556567, -9656558, -9359745, -8634604, -7718918, -7029129, -6864625, -7260447, -8026501, -8854584, -9486983, -9782608, -9618178, -9051163, -8531783, -8532459, -9013349, -9491104, -9622661, -9615440, -9945818, -10576731, -10898052, -10543489, -9756759, -8901670, -8004703, -6993675, -6088633, -5813178, -6641035, -8476328, -10597325, -12329180]
17635a2329180j262508r52040m85611L39354J348651K245941K742596K535280
17627e817517J549146J79691q20606r35454l31536L92600P84693Q57019P90403
17618c351561O24146L62008J48896J68412M57136R75132J605450K140176K466879
17609E596674K439725J818033P13358m00331j169116j482544j285130o22384J00702
17600E708987L58969K5888n41865r04097r01160o37578k29641K44662O82000R45643
17590D751808Q85857M72580j92584r49583j562795j829505j838676j925119k208411
17581d396428k363881k115852j589680q95752m0634P54928J250966J413768J293447
17572f689118R84637O15238K80202j17512p00798j280211j549086j408580j016900
$$ y = [-12329180, -13591688, -14543728, -15029339, -14689985, -13341334, -11095393, -8352797, -5817517, -4268371, -4088680, -4909286, -5844740, -6176276, -5783676, -4998983, -4141964, -3351561, -2727415, -2365407, -2216511, -2048099, -1590963, -615831, 989619, 3129795, 5596674, 8036399, 9854432, 10567790, 10167459, 8998343, 7515799, 6230669, 5608285, 5708987, 6067956, 6093844, 5551979, 4647882, 3746722, 3109144, 2879503, 3124165, 3806165, 4751808, 5637665, 6110245, 5917661, 4968078, 3405283, 1575778, -262898, -2188017, -4396428, -6760309, -8876161, -10465841, -11361593, -11402227, -10647299, -9396333, -7982565, -6689118, -5704481, -5089243, -4809041, -4926553, -5627351, -6907562, -8456648, -9865228, -10882128]
17563a0882128n87539r7901O15979J414408J878891J776796J202056M25883l58126
17554d611681j041205j397059j336541j199079j453427j967579k093520j562159
17546a6662250o09617M52025J399722K135547K667321L033661L302328L515482
17538g65781L608653L379399K711571J808511R50964K18094n61433j527759k379513
17529G442706k702494k523166k030965j298450n65357k99371p81251j756665k534070
17520g049083k471676j555592m28359M28027J165413K082851L038944L537557
17512a251918L391949K910067K425615J983148J394864N02993o12068j632436
17504I112214k269635k493165k392294k073360j642988j147829o13479j68246
$$ y = [-10882128, -11469667, -11567568, -10951589, -9537181, -7658290, -5881494, -4679438, -4253555, -4611681, -5652886, -7049945, -8386486, -9585565, -11038992, -13006571, -15100091, -16662250, -17271867, -16819842, -15420120, -13284573, -10617252, -7583591, -4281263, -765781, 2842872, 6222271, 8933842, 10742353, 11693317, 11911411, 11349978, 9822219, 7442706, 4740212, 2217046, 186081, -1112369, -1677726, -1977097, -2758348, -4515013, -7049083, -9520759, -11076351, -11504710, -11076683, -9911270, -7828419, -4789475, -1251918, 2140031, 5050098, 7475713, 9458861, 10853725, 11356718, 10744650, 9112214, 6842579, 4349414, 1957120, -116240, -1759228, -2907057, -3520536, -3688782]
17496c688782J43860O29583J458282K213069K391055J872444Q01697m46818j305127
17487D069263j502673j162011n42535j17670k29350o60883r23545p44895k21305
17478b035604L17571O26046P01370O93828O89849N39710J27829m30498r49117
17469B80984j332235j440598j131135o41699l50279j61944L56073J333887K310526
17460g76420K544646J850965Q56303J29656l22726n97231o31761n24664n32681
17451A996087p75443j058782j051914o96319k18530L11362Q98887J220288R81275
17442A606911M11178N572m3998J12094K50797J31967k74602n99459n52247k24078
17432H24135K11844N99439Q37665J029163J347503J737900J798666J090726k17246
$$ y = [-3688782, -3544922, -2915339, -1457057, 756012, 3147067, 5019511, 5821208, 5374390, 4069263, 2566590, 1404579, 862044, 744374, 515024, -145859, -1069404, -1814299, -2035604, -1718033, -1091987, -390617, 303211, 993060, 1532770, 1660599, 1230101, 280984, -1051251, -2491849, -3622984, -4264683, -4614962, -4776906, -4420833, -3086946, -776420, 1768226, 3619191, 4475494, 4605150, 4282424, 3685193, 3053432, 2528768, 1996087, 1220644, 161862, -890052, -1586371, -1804901, -1493539, -594652, 625636, 1606911, 2018089, 2023661, 1979663, 2091757, 2342554, 2474521, 2199919, 1600460, 1048213, 824135, 1035979, 1635418, 2473083, 3502246, 4849749, 6587649, 8386315, 9477041, 9259795]
17423I259795j331002j694187j428153r44814o45592q18810j421390k140806k546734
17414c711693k319366j495070l83869N42887Q97510O43835q695r12201j929321
17405h675983k596832k324384j052713M98435J528688J905798J942415J902897
17397f871679J791010J379805O85916P4259k76192l63568L265R43459K075671
17388e58054K790460K847371K422990J969880K019042K593272K893038K075529
17380A9053528L17053j430646k413179k564975k176172j598982j266594j286597
17372F633436j165128m88799N50006J458684J768032J362219O33426j0760m17018
17363A0324098m18594J31538J038979J852062K095759J503050L82584n67624q78291
$$ y = [9259795, 7928793, 6234606, 4806453, 3861639, 3216047, 2397237, 975847, -1164959, -3711693, -6031059, -7526129, -7909998, -7367111, -6469601, -5825766, -5834461, -6746662, -8675983, -11272815, -13597199, -14649912, -14151477, -12622789, -10716991, -8774576, -6871679, -5080669, -3700864, -3014948, -2940689, -3216881, -3580449, -3577184, -2633725, -558054, 2232406, 5079777, 7502767, 9472647, 11491689, 14084961, 16977999, 19053528, 19370581, 17939935, 15526756, 12961781, 10785609, 9186627, 7920033, 6633436, 5468308, 4979509, 5529515, 6988199, 8756231, 10118450, 10751876, 10741116, 10324098, 9905504, 10037042, 11076021, 12928083, 15023842, 16526892, 16909476, 16341852, 15463561]
17354A5463561n51966o6408M9558j92824n29160q52458j248570j797709k215106
17345H058918k062050j489176j175254j275501j279837q51617j15656O68088J291685
17336A769600J473482R86873N3860o60208q20687p58165o79962l92147O0346L80197
17326A413189M75327M34105L37547K89344M27352Q18031J240948J434148J455357
17317H325348J376859J124494P75038M97407K45813k14575r69589j774206k323418
17308G063171k494011k406569k236565j992361j552772q22880J66172J175210
17300c100605J713305J452918O80867K609k11323Q9529P13567J225483J244224
17291C810574Q43365L57569l484j47882L3934N86765J328227J921205K078566
$$ y = [15463561, 14911595, 14845187, 14894745, 14701921, 14172761, 13320303, 12071733, 10274024, 8058918, 5996868, 4507692, 3332438, 2056937, 777100, -74517, -190173, 477915, 1769600, 3243082, 4229955, 4283815, 3623607, 2802920, 2044755, 1364793, 972646, 1032992, 1413189, 1888516, 2322621, 2660168, 2949512, 3376864, 4194895, 5435843, 6869991, 8325348, 9702207, 10826701, 11601739, 12099146, 12344959, 12130384, 11160795, 9386589, 7063171, 4569160, 2162591, -73974, -2066335, -3619107, -4441987, -4275815, -3100605, -1387300, 65618, 746485, 749094, 537771, 627300, 1340867, 2566350, 3810574, 4653939, 5011508, 5008024, 4860142, 4894076, 5480841, 6809068, 8730273, 10808839]
17282A0808839J736575J080801M08224q4700m16484p17290j191597j907938k598228
17273G118202k925374k749203k211559j654963j168708m63359N94518J668230
17265a792216K248083K050458J348890Q41101Q66352J092779R41031K19447p46262
17256G069663j659582k319253k463804k153904j872527j972921k206294j989123
17248i567745j196806k89029K39456K17608k01048n56948m14317P1098L99774
17239a1297957L98255K24528Q0604L2383K430M860L00223J138140K277953L055670
17229c782911L080821K531573J847943J468184J591249K001619K286817K242134
17221A3267429J813691J005698k8807j077668j943050k353831k077379j319723
$$ y = [10808839, 12545414, 13626215, 14034439, 13949739, 13533255, 12815965, 11624368, 9716430, 7118202, 4192828, 1443625, -767934, -2422897, -3591605, -4054964, -3460446, -1792216, 455867, 2506325, 3855215, 4696316, 5562668, 6655447, 7596478, 7815925, 7069663, 5410081, 3090828, 627024, -1526880, -3399407, -5372328, -7578622, -9567745, -10764551, -11053580, -10814124, -10596516, -10797564, -11354512, -11768829, -11697731, -11297957, -10899702, -10675174, -10594570, -10562187, -10559757, -10554897, -10254674, -9116534, -6838581, -3782911, -702090, 1829483, 3677426, 5145610, 6736859, 8738478, 11025295, 13267429, 15081120, 16086818, 16058011, 14980343, 13037293, 10683462, 8606083, 7286360]
$$ [...]
##END NTUPLES=NMR SPECTRUM
##END=
