##TITLE= 10.03.10
200.13MHz,DMSO
SerBB-383
##JCAMPDX= 5.0         $$ Bruker NMR JCAMP-DX V1.0
##DATA TYPE= NMR FID
##DATA CLASS= NTUPLES
##ORIGIN= UXNMR, Bruker Analytische Messtechnik GmbH
##OWNER= root
$$ XWIN-NMR		Version 2.1
$$ Thu Jul 29 05:24:15 2010 PDT (UT-7h)  anp
##.OBSERVE FREQUENCY= 200.13128668345
##.OBSERVE NUCLEUS= ^1H
##.DELAY= (6, 6)
##.ACQUISITION MODE= SIMULTANEOUS
##.AVERAGES= 32
##.DIGITISER RES= 18
##SPECTROMETER/DATA SYSTEM= spect
$$ Bruker specific parameters
$$ --------------------------
##$AQSEQ= 0
##$AQ_mod= 1
##$AUNM= <au_zg>
##$BF1= 200.13
##$BF2= 200.13
##$BF3= 200.13
##$BF4= 500.13
##$BF5= 500.13
##$BF6= 500.13
##$BF7= 500.13
##$BF8= 500.13
##$BYTORDA= 1
##$CFDGTYP= 0
##$CFRGTYP= 5
##$CNST= (0..31)
1 1 145 1 1 1 1 1 1 1 1 1 1 1 1 1 1 1 1 1 1 1 1 1 1 1 1 1 1 1 1 1 
##$CPDPRG= <>
##$CPDPRG1= <>
##$CPDPRG2= <>
##$CPDPRG3= <>
##$CPDPRG4= <mlev>
##$CPDPRG5= <mlev>
##$CPDPRG6= <mlev>
##$CPDPRG7= <mlev>
##$CPDPRG8= <mlev>
##$CPDPRGB= <>
##$CPDPRGT= <>
##$D= (0..31)
0 2 0 0 0 0 0 0 0 0 0 0.03 0 0 0 0 0 0 0 0 0 0 0 0 0 0 0 0 0 0 0 0 
##$DATE= 1280406193
##$DBL= (0..7)
120 120 120 120 120 120 120 120 
##$DBP= (0..7)
150 150 150 150 150 150 150 150 
##$DBP07= 0
##$DBPNAM0= <>
##$DBPNAM1= <>
##$DBPNAM2= <>
##$DBPNAM3= <>
##$DBPNAM4= <>
##$DBPNAM5= <>
##$DBPNAM6= <>
##$DBPNAM7= <>
##$DBPOAL= (0..7)
0.5 0.5 0.5 0.5 0.5 0.5 0.5 0.5 
##$DBPOFFS= (0..7)
0 0 0 0 0 0 0 0 
##$DE= 6
##$DECBNUC= <off>
##$DECIM= 32
##$DECNUC= <off>
##$DECSTAT= 4
##$DIGMOD= 1
##$DIGTYP= 9
##$DL= (0..7)
0 120 120 120 120 120 120 120 
##$DP= (0..7)
150 150 150 150 150 150 150 150 
##$DP07= 0
##$DPNAME0= <>
##$DPNAME1= <>
##$DPNAME2= <>
##$DPNAME3= <>
##$DPNAME4= <>
##$DPNAME5= <>
##$DPNAME6= <>
##$DPNAME7= <>
##$DPOAL= (0..7)
0.5 0.5 0.5 0.5 0.5 0.5 0.5 0.5 
##$DPOFFS= (0..7)
0 0 0 0 0 0 0 0 
##$DQDMODE= 0
##$DR= 18
##$DS= 0
##$DSLIST= <SSSSSSSSSSSSSSS>
##$DSPFIRM= 0
##$DSPFVS= 10
##$DTYPA= 0
##$EXP= <>
##$F1LIST= <111111111111111>
##$F2LIST= <222222222222222>
##$F3LIST= <333333333333333>
##$FCUCHAN= (0..9)
0 1 0 0 0 0 0 0 0 0 
##$FL1= 90
##$FL2= 90
##$FL3= 90
##$FL4= 90
##$FOV= 20
##$FQ1LIST= <freqlist>
##$FQ2LIST= <freqlist>
##$FQ3LIST= <freqlist>
##$FQ4LIST= <freqlist>
##$FQ5LIST= <freqlist>
##$FQ6LIST= <freqlist>
##$FQ7LIST= <freqlist>
##$FQ8LIST= <freqlist>
##$FS= (0..7)
83 83 83 83 83 83 83 83 
##$FTLPGN= 0
##$FW= 93750
##$GP031= 0
##$GPNAM0= <sine.100>
##$GPNAM1= <sine.100>
##$GPNAM10= <sine.100>
##$GPNAM11= <sine.100>
##$GPNAM12= <sine.100>
##$GPNAM13= <sine.100>
##$GPNAM14= <sine.100>
##$GPNAM15= <sine.100>
##$GPNAM16= <sine.100>
##$GPNAM17= <sine.100>
##$GPNAM18= <sine.100>
##$GPNAM19= <sine.100>
##$GPNAM2= <sine.100>
##$GPNAM20= <sine.100>
##$GPNAM21= <sine.100>
##$GPNAM22= <sine.100>
##$GPNAM23= <sine.100>
##$GPNAM24= <sine.100>
##$GPNAM25= <sine.100>
##$GPNAM26= <sine.100>
##$GPNAM27= <sine.100>
##$GPNAM28= <sine.100>
##$GPNAM29= <sine.100>
##$GPNAM3= <sine.100>
##$GPNAM30= <sine.100>
##$GPNAM31= <sine.100>
##$GPNAM4= <sine.100>
$$ [...]
0.5 0.5 0.5 0.5 0.5 0.5 0.5 0.5 0.5 0.5 0.5 0.5 0.5 0.5 0.5 0.5 
##$SPOFFS= (0..15)
0 0 0 0 0 0 0 0 0 0 0 0 0 0 0 0 
##$SW= 19.0423779955203
##$SWIBOX= (0..15)
0 0 3 0 0 0 0 0 0 0 0 0 0 0 0 0 
##$SW_h= 3810.9756097561
##$TD= 8192
##$TE= 300
##$TL= (0..7)
0 120 120 120 120 120 120 120 
##$TP= (0..7)
150 150 150 150 150 150 150 150 
##$TP07= 0
##$TPNAME0= <>
##$TPNAME1= <>
##$TPNAME2= <>
##$TPNAME3= <>
##$TPNAME4= <>
##$TPNAME5= <>
##$TPNAME6= <>
##$TPNAME7= <>
##$TPOAL= (0..7)
0.5 0.5 0.5 0.5 0.5 0.5 0.5 0.5 
##$TPOFFS= (0..7)
0 0 0 0 0 0 0 0 
##$TUNHIN= 0
##$TUNHOUT= 0
##$TUNXOUT= 0
##$USERA1= <user>
##$USERA2= <user>
##$USERA3= <user>
##$USERA4= <user>
##$USERA5= <user>
##$V9= 5
##$VCLIST= <CCCCCCCCCCCCCCC>
##$VD= 0
##$VDLIST= <DDDDDDDDDDDDDDD>
##$VPLIST= <PPPPPPPPPPPPPPP>
##$VTLIST= <TTTTTTTTTTTTTTT>
##$WBST= 1024
##$WBSW= 8
##$XGAIN= (0..3)
0 0 0 0 
##$XL= 0
##$YL= 0
##$YMAX_a= 0
##$YMIN_a= 0
##$ZL1= 120
##$ZL2= 120
##$ZL3= 120
##$ZL4= 120
##$ABSF1= 15.95049
##$ABSF2= -3.09201
##$ABSG= 0
##$ABSL= 0
##$ALPHA= 0
##$AQORDER= 0
##$ASSFAC= 0
##$ASSFACI= 0
##$ASSFACX= 0
##$ASSWID= 0
##$AUNMP= <proc_1d>
##$AZFE= 0.1
##$AZFW= 0.1
##$BCFW= 1
##$BC_mod= 2
##$BYTORDP= 1
##$COROFFS= 0
##$DATMOD= 1
##$DC= 2
##$DFILT= <>
##$DTYPP= 0
##$FCOR= 1
##$FTSIZE= 16384
##$FT_mod= 6
##$GAMMA= 1
##$GB= 0
##$INTBC= 1
##$INTSCL= 3.876899e-10
##$ISEN= 128
##$LB= 0
##$LEV0= 0
##$LPBIN= 0
##$MAXI= 10000
##$MC2= 0
##$MEAN= 0
##$ME_mod= 0
##$MI= 0.3374128
##$NCOEF= 0
##$NC_proc= -5
##$NLEV= 6
##$NOISF1= 3.799351
##$NOISF2= 2.8
##$NSP= 1
##$NTH_PI= 0
##$NZP= 0
##$OFFSET= 15.95049
##$PC= 1
##$PHC0= -69.36354
##$PHC1= 6.4
##$PH_mod= 1
##$PKNL= yes
##$PPARMOD= 0
##$PSCAL= 0
##$PSIGN= 0
##$REVERSE= no
##$SF= 200.13
##$SI= 16384
##$SIGF1= 3
##$SIGF2= 2
##$SINO= 400
##$SIOLD= 16384
##$SREGLST= <1H.CDCl3>
##$SSB= 0
##$STSI= 0
##$STSR= 0
##$SW_p= 3810.97560975609
##$SYMM= 0
##$S_DEV= 0
##$TDeff= 0
##$TDoff= 0
##$TI= <>
##$TILT= no
##$TM1= 0
##$TM2= 0
##$TOPLEV= 0
##$USERP1= <user>
##$USERP2= <user>
##$USERP3= <user>
##$USERP4= <user>
##$USERP5= <user>
##$WDW= 0
##$XDIM= 8192
##$YMAX_p= 486130272
##$YMIN_p= -1782015
$$ End of Bruker specific parameters
$$ ---------------------------------
##NTUPLES=NMR FID
##VAR_NAME=  TIME,          FID/REAL,        FID/IMAG,        PAGE NUMBER
##SYMBOL=    X,             R,               I,               N
##VAR_TYPE=  INDEPENDENT,   DEPENDENT,       DEPENDENT,       PAGE
##VAR_FORM=  AFFN,          ASDF,            ASDF,            AFFN
##VAR_DIM=   4096,          4096,            4096,            2
##UNITS=     SECONDS,       ARBITRARY UNITS, ARBITRARY UNITS,
##FIRST=     0,             0,               0,               1
##LAST=      1.074528,      3598,            -1129,           2
##MIN=       0,             -294797,         -2107025,        1
##MAX=       1.074528,      1255244,         291770,          2
##FACTOR=    0.0002624,     1,               1,               1
$$ Real data points
##PAGE= N=1
##DATA TABLE=(X++(R..R)), XYDATA
0@%S2l2O4o4O4o4R6j28J29j61J97k29K88l52M07m71N44o14P03q12R27j054J196
$$ 0 0 0 0 0 0 0 0 0 0 0 0 0 -32 32 -32 32 -32 64 -64 65 -96 101 -128 160 -192 215 -256 288 -326 377 -435 492 -562 634
34F34j355J524j707J920k154K402k676K974l301L659m049M478m940N450o013O627
$$ 634 -721 803 -904 1016 -1138 1264 -1412 1562 -1739 1920 -2129 2349 -2591 2859 -3154 3473
50C473p302Q043q860R776j0801J1951j3254J4746j6469J8489k0905K3841k7506
$$ 3473 -3829 4214 -4646 5130 -5671 6280 -6974 7772 -8697 9792 -11113 12728 -14778
63a4778L2240l8617M7731o1942Q7453j47805N61549P00124j07228J96517j28260
$$ -14778 17462 -21155 26576 -35366 52087 -95718 465831 1165955 1058727 1255244 1126984
74A126984k73514l62449l0271J35953J11296k10803k91755j27062J73836J78899
$$ 1126984 853470 491021 460750 596703 707999 497196 205441 78379 252215 431114
84D31114Q0553Q7085K70618K51256j2991l25247l12438o7311J35165M1184j39568
$$ 431114 511667 598752 869370 1120626 1107635 782388 469950 402639 537804 578988 439420
95D39420j71186n454N2355o7694j48641N4800L30845L49929N1458k25259k30270
$$ 439420 268234 262780 315135 247441 98800 153600 484445 834374 885832 660573 430303
106D30303m4309M3208n0093j18677J0025J58394P2875j93937k83867n1721K34687
$$ 430303 385994 429202 379109 260432 270457 428851 501726 307789 23922 -27799 206888
117B06888K56973N4209r7248n7519K6001m4387j85875j41588J20440K94476J43253
$$ 206888 463861 518070 420822 363303 389304 344917 159042 17454 137894 432370 575623
128E75623j51975k47369p9147Q2152N7243n1856l4381R8678J14403q6074k74881
$$ 575623 423648 176279 97132 179284 236527 184671 150290 248968 363371 277297 2416
139B416j73957J29818K95215J69187l2432p0254J2921O211j28240j92397m3838
$$ 2416 -171541 -41723 253492 422679 390247 319993 332914 339125 210885 18488 -25350
150b5350J64377J59798q2242k64387j62567P3576J67033Q9220L9260J22102J78809
$$ -25350 139027 298825 216583 -47804 -210371 -136795 30238 119458 158718 280820 459629
161D59629M2618j98649k66931q0669J33505J17952p6263j77076p4884M1064Q536
$$ 459629 502247 303598 36667 -44002 89503 207455 131192 -45884 -120768 -79704 -71168
172g1168o9141J2449K17432K95533J20042j48707k24231p5988N8588Q540r9937
$$ -71168 -140309 -127860 89572 385105 505147 356440 132209 56221 114809 123349 23412
183B3412o8056N3527N4261j00694j96511o0736J90098K90019J45051m8846q2126
$$ 23412 -44644 8883 63144 -37550 -234061 -294797 -104699 185320 330371 281525 199399
194A99399j332n924j19688j50583m130J50702R7589j02842k14505j05160R4093
$$ 199399 198067 192143 72455 -78128 -82258 68444 166033 63191 -151314 -256474 -162381
205a62381J57413P2400J9413Q3624J14811j4435j92962j97173j342J61551J16772
$$ -162381 -4968 67432 86845 170469 285280 270845 77883 -119290 -120632 40919 157691
216A57691n3912j33139n8760K5713l438o0655J3060J72965K04383K4119j74732
$$ 157691 103779 -29360 -88120 -62407 -65845 -126500 -113440 59525 263908 288027 113295
227A13295j82721k3140Q9583N0898k8994j1574N9783L5799j04905j76982l7623
$$ 113295 -69426 -92566 -2983 47915 18921 7347 67130 102929 -1976 -178958 -216581
238b16581J60831K03908N6126r1120q7359q057j52o2978o0840N8517J61364Q1818
$$ -216581 -55750 148158 204284 113164 25805 17748 17596 -45382 -106222 -47705 113659 195477
250A95477j13270j92745p2785Q8367J11965L3411m235M1891N4266m3043j51771
$$ 195477 82207 -110538 -183323 -94956 17009 50420 46185 88076 142342 99299 -52472
261e2472j16510N5414J73157J00287o2751j14243m1776J5985j4516m1385K6226
$$ -52472 -168982 -113568 59589 159876 97125 -17118 -58894 -42909 -57425 -98810 -72584
272g2584J36694J32159j9244j63439j34520J6329J02561M8614k2964l983M2383
$$ -72584 64110 196269 177025 13586 -120934 -104605 -2044 46570 23606 19623 62006
283F2006J421j01796j22785k491J48534J55158J8812r8130p7514j7L853m3485
$$ 62006 63427 -38369 -161154 -163645 -15111 140047 158859 60729 -16785 -16802 -12949 -56434
295e6434k4574P4681J24474L2350j13318j52205m1100Q7710R7405K1350j1127
$$ -56434 -81008 -6327 118147 150497 37179 -115026 -156126 -68416 28989 50339 39212
306C9212K4071K3675o0260j24999n8987Q5181J53000P0674n8985r3927l8135J2876
$$ 39212 63283 86958 26698 -98301 -157288 -72107 80893 151567 92582 -1345 -39480 -26604
318b6604j1351l0706K7845J02858P0481o3787j48035q9465M5634J11301O9545
$$ -26604 -37955 -68661 -40816 62042 132523 68736 -79299 -168764 -123130 -11829 57716
329E7716J2611J0322L1416j4803j00118j01950J0621J13152Q2909l7015j09421
$$ 57716 70327 80649 112065 97262 -2856 -104806 -94185 18967 101876 64861 -44560
340d4560p5213j595K3152J2675L9886J08268J24598K3904j06564j24466k7951
$$ -44560 -119773 -121368 -98216 -85541 -45655 62613 187211 211115 104551 -19915 -47866
351d7866N3019L6240k8475m6085j9818j2455n2206p1054J1827J34805J70996
$$ -47866 5153 41393 12918 -33167 -52985 -65440 -117646 -188700 -176873 -42068 128928
362A28928P7634l8864o7932k7782j1450l9300m6922r999L2152L965q4482j18104
$$ 128928 206562 167698 99766 71984 60534 21234 -25688 -35687 -3535 430 -84052 -202156
374b02156l6565Q9177J38075R2214M3918L6685K3272l2705r5411q6882o853N6617
$$ -202156 -238721 -149544 -11469 80745 124663 161348 184620 151915 56504 -30378 -37231 19386
386A9386K4700o9100j06559n1577J9498M4714M1326P2087J11672R2640k768r4275
$$ 19386 44086 -25014 -131573 -183150 -163652 -118938 -77612 -5525 106147 198787 196019 101744
398A01744r9738k3062M0485K1272l5744m5351k0341j7411m4055l7623M0573J21537
$$ 101744 2006 -21056 19429 40701 4957 -40394 -60735 -78146 -122201 -159824 -119251 2286
410B286J20372L6948n1387o9392k8793l534j4399j4674K5301M5299k910p4522
$$ 2286 122658 159606 108219 38827 10034 6500 -7899 -22573 2728 48027 45117 -29405
422b9405q8965j4969O8522Q5867M3830k216j4618j4525l8782n9650k2515N6549
$$ -29405 -118370 -133339 -64817 21050 64880 62664 48046 33521 -5261 -64911 -87426 -30877
434c0877R2626M4583l4092o4994l7222K680R920N282J1412L1763J2146n0465q9534
$$ -30877 61749 106332 72240 7246 -29976 -27296 -17376 -12094 -682 31081 43227 -7238 -96772
447i6772m7929M2276Q9281P4200L1390O208n55j9708m9366m9896o118M3627K5888
$$ -96772 -144701 -102425 -13144 61056 92446 98654 98099 78391 29025 -20871 -26989 16638 42526
460D2526m2571q7012o0372l991L8403N3926O5420Q0206O9888J2217n5350p5720
$$ 42526 -45 -87057 -147429 -151420 -113017 -59091 6329 86535 156423 168640 113290 37570
472C7570l3677J7365J1490k7773n1073m4908l2227k5520o903M2490R9147J15422
$$ 37570 3893 21258 32748 4975 -46098 -91006 -123233 -148753 -155656 -113166 -14019 101403
484A01403O4147j4012m7363l4039j6861k0802k7919j6995p471k7878n6105o0659
$$ 101403 165550 151538 104175 70136 53275 32473 4554 -12441 -19912 -47790 -103895 -164554
496a64554r290O1700J04617Q3766L9238J0676n039l0233n2071m0253k016K1850
$$ -164554 -173844 -112144 -7527 76239 115477 126153 121114 90881 38810 -1443 -3459 18391
508A8391J330m3078o9565m2691P046M3303N1976N7071N7975L5594j5751n6709
$$ 18391 19721 -23357 -92922 -135613 -128567 -85264 -33288 23783 81758 117352 101601 44892
520D4892n0531j0230K5843K3398o865l1240k9179k5526j9106n227L3236O6301
$$ 44892 -5639 -15869 9974 33372 26507 -4733 -33912 -59438 -78544 -83771 -50535 15766
532A5766N8433J0710l9847m9756k5567O064J6006J9551J8957J2350j2645m3063
$$ 15766 74199 84909 45062 -4694 -30261 -24197 -8191 11360 30317 42667 30022 -13041
544a3041m3414o771L8263M7562K5026r865k8220k9427k4513j4934J3000M2575
$$ -13041 -56455 -63226 -24963 22599 47625 37760 9540 -19887 -44400 -59334 -46334 -3759
556c759N3749K5142k0294m1160k7644m749J2062J3653J0387M167j3495l4954m5513
$$ -3759 49990 75132 54838 13678 -13966 -18715 -6653 7000 17387 21554 8059 -26895 -72408
569g2408j9058K8314N7855N1148K2409l371j8345k2836k5064j0891R027K1858
$$ -72408 -91466 -63152 -5297 45851 68260 64889 46544 23708 -1356 -12247 -3220 18638
581A8638J0398k2125m8352l8946n554K2083M1176M2568L7874J7767j0458l3543
$$ 18638 29036 6911 -41441 -80387 -85941 -63858 -22682 19886 57760 75527 65069 31526
593C1526l4690j0337J6689K1492p41k0731l2566k8064j7479K418L0499M9484M6572
$$ 31526 -3164 -13501 3188 24680 23939 3208 -29358 -57422 -74901 -72483 -41984 7500 54072
606E4072K1211j7840l5457k5490m817R333J1708P027k914k0137l6755k9546j943
$$ 54072 75283 57443 21986 -3504 -8321 1012 12720 19747 16833 -3304 -40059 -69605 -71548
619g1548L0231M7202M0693J0585j1438k2437k0228j6616k92J8132K2440J686k3250
$$ -71548 -41317 5885 46578 57163 45725 23288 3060 -13556 -13848 4284 26724 28410 5160
632E160l5326k6596k715K3809L3592K8542J8457P13j9793k8315j8819O066K0431
$$ 5160 -30166 -56762 -59477 -35668 -2076 26466 44923 45636 25843 -2472 -21291 -15225 5206
645E206J8201L147j7299k6163k4648j0413J1454K5087L5328K4807J425k2693k5058
$$ 5206 23407 26554 9255 -16908 -41556 -51969 -40515 -15428 19900 44707 46132 23439 -1619
658a619j3244J534J5972J5797M683r936k2166k6066j6798M764K8642L4120K3725
$$ -1619 -14863 -13329 2643 18440 23123 13187 -8979 -35045 -51843 -47079 -18437 15683 39408
671C9408J501j1248k0276j5393m668P963J3087J1240l988k2976k8341j7131K532
$$ 39408 40909 29661 9385 -6008 -10676 -2713 10374 21614 17626 -5350 -33691 -50822 -48290
684d8290K2590K9116K7546J2595o667j9600j9515q591M502J7474J0625m283j9978
$$ -48290 -25700 3416 30962 43557 36890 17290 -2225 -10816 -6314 11160 21785 17502 -2476
697b476k3669j9740m136J6337K9737K8882J5803k339j7014k1173j1655M615J2635
$$ -2476 -26145 -45885 -50021 -33684 -3947 24935 40738 38399 21385 212 -11443 -6828 5807
710E807R811M246j2187k2709k0985p516R958K5598K6497J6874l258j7593j7920
$$ 5807 15618 19864 7677 -15032 -36017 -43533 -33575 -7977 18520 35394 32136 14543 -3377
723c377j2184J276J3031J6289P085o405j5552k0008r415M945J7371K0041J1625
$$ -3377 -15561 -14285 -1254 15035 22120 15715 163 -19845 -29260 -24315 -6944 13097 24722
736B4722l345j4172j9327j5704K000J5718J9512J5328L03q693j4925j0595L02P805
$$ 24722 21377 7205 -12122 -27826 -25826 -10108 9404 24732 25035 16342 1417 -9178 -8876 -1071
750a071J1280P488n048j8246k0470j2731L9J4735K4188K2559J1556l343r899j1439
$$ -1071 10209 17697 12649 -5597 -26067 -38798 -38759 -24024 164 22723 34279 30936 21037 9598
764I598m510K932L792K246q672j8660k2186j5643j281J4946K6508K7137K0913
$$ 9598 5088 8020 11812 14058 5386 -13274 -35460 -51103 -52384 -37438 -10930 16207 37120
777C7120M210m789j1219p791j326j031Tj0559j8419k4171j6581l252J2001K5936
$$ 37120 41330 36541 25322 17531 16205 15174 14143 3584 -14835 -39006 -55587 -58839 -46838 -20902
791b0902L0308K3383J1084j840r368j0427n111q2j484q237j8506k1215j9213q765
$$ -20902 9406 32789 43873 42033 32665 22238 17127 17045 15561 7324 -11182 -32397 -51610 -60375
805f0375J1027K3463K8945K3181J3112j753q610j0211l916O66k434k880j3205
$$ -60375 -49348 -25885 3060 26241 39353 37600 28990 18779 14863 15529 13095 10215 -2990
818b990j7641j9246q293O113J6386K4029K0742J0382q50q371j0039o373J301M680
$$ -2990 -20631 -39877 -48170 -42057 -25671 -1642 19100 29482 28632 20261 10222 3849 5150 9830
832I830R39o321j1110j1886q858q00J1000J6604J3871N796j661j0700r975n398
$$ 9830 10769 4448 -6662 -18548 -27406 -28206 -17206 -602 13269 19065 17404 6704 -3271 -8669
846h669J201P958P378L296m665q802p044j067M198P999P973K224m679j1006j0511
$$ -8669 -7468 490 7868 11164 6499 -2303 -9347 -10414 -6216 1783 9756 11980 7301 -3705 -14216
861a4216n833Q84R670J2625R793J621j398m338m783Q52L926J283r67p227j2471
$$ -14216 -20049 -19165 -9495 3130 12923 14544 13146 8808 4025 4877 8803 10086 9119 1892 -10579
876a0579j2026q123K622J1894J3818J2592Q670J431l368l207l938J982M57j953
$$ -10579 -22605 -30728 -28106 -16212 -2394 10198 18868 20299 16931 13724 9786 11768 12225 10272
890A0272r853j2611j4014p171J020J1021J4643J5218J0268M380l191n351l139L66
$$ 10272 419 -12192 -26206 -33377 -32357 -21336 -6693 8525 18793 23173 19982 14631 11492 11858
904A1858Lk671q170r874j4201o097k65P636J3347J3714J0866J820j430m067m61k540
$$ 11858 11861 9190 1020 -8854 -23055 -29152 -29417 -21781 -8434 5280 16146 17966 16536 12469 12008 9468
920I468j132j447l382q922r230q578r58O365J1531J1069O336K350j574l268l513
$$ 9468 8336 6889 3507 -5415 -14645 -23223 -24181 -17816 -6285 4784 11120 13470 11896 8628 5115
935E115j637J282m85N65o035p734m691J63K081O147P225O501K585j222o162n084
$$ 5115 3478 4760 4275 4840 -1195 -8929 -13620 -13457 -11376 -5229 1996 8497 11082 9860 3698 -1386
951a386j70K155J460Q01k669k668j031k971n97K147O622O022J006l751m645l720
$$ -1386 -1556 599 2059 2860 191 -2477 -3508 -6479 -7076 -4929 1693 7715 8721 4970 325 -3395
967c395j632M99K174K428L147n5m365k286p2L311M235R94P38k218l586j987l682
$$ -3395 -5027 -4528 -2354 74 3221 3166 -1199 -3485 -3557 -246 3989 4983 5721 3503 -83 -2070 -5752
984e752k109K368N509L764p54k694k590J439K082M97J706J78L86k993l143n515
$$ -5752 -7861 -5493 16 3780 3026 332 -2258 -819 1263 1760 3466 3644 4030 1037 -2106 -7621
1000g621K070L745K043K00L60K54L97j133j734J164L113J791j244m279m110k85L220
$$ -7621 -5551 -1806 237 437 797 1051 1448 315 -1419 -255 2858 4649 3405 -874 -4984 -5269 -2049
1017b049R10R82K19K655n34j878j932k45L454K640j377k718j321R0K41l215J15K270
$$ -2049 -1139 -157 62 2717 2183 305 -1627 -1872 1582 4222 2845 127 -1194 -1104 -863 -4078 -3963 -1693
1035a693L577K156m353j467J211K952k00k165n19J253j08p58k605q28K109K399
$$ -1693 1884 4040 -313 -1780 -569 2383 2183 18 -501 752 644 -114 -2719 -3547 -1438 961
1051I61j463j812J667K724J976k715j633j302L181J265k639p50k061K235J191k933
$$ 961 -502 -2314 -647 2077 4053 1338 -295 -1597 1584 2849 210 -540 -2601 -366 825 -2108
1067b108k55k67L542J987j163k310P67N75J042j701j063N81J179n39q64l318J000
$$ -2108 -2363 -2630 912 2899 1736 -574 193 768 1810 109 -954 -373 806 267 -597 -3915 -2915
1084b915L823j03M66L12p30J407j989j277p57J640J234P15k214j679R53L188k272
$$ -2915 908 805 1271 1583 853 2260 271 -1006 -1763 -123 1111 1826 -388 -2067 -1114 2074 -198
1101a98j881L84L499J697l304m58k233R20N08J50K30J83K779J803k796j704p56K448
$$ -198 -2079 -1695 1804 3501 197 -261 -2494 -1574 -1066 -916 -686 -503 2276 4079 1283 -421 -1177 1271
1119A271QQ4o34n61l35l184j600j626L477N787J908j022l208J013J250m08m03m46
$$ 1271 1279 1363 729 168 -167 -3351 -4951 -6577 -3100 2687 4595 3573 365 1378 2628 2220 1817 1371
1137A371J105p95k876n882k768L732L332L756M87J769O42M65j368k058K220K673
$$ 1371 2476 1681 -1195 -7077 -9845 -6113 -2781 975 1462 3231 3873 4338 2970 912 3132 5805
1153E805n77j624q446k621K19M88J860J708L439K423J139j795j550K672M160J611
$$ 5805 5228 3604 -4842 -7463 -7244 -6756 -4896 -3188 251 2674 3813 2018 468 3140 7300 8911
1169H911k178k834m099l785l026k567Q41K986L873K580k145j272L274L510K048
$$ 8911 6733 3899 -200 -3985 -7011 -9578 -8737 -5751 -1878 702 -1443 -2715 559 4069 6117
1184F117K356K78L50k584o441o170l290J312L288k71l12J91L025Q4J273K633N524
$$ 6117 8473 8751 9101 6517 76 -6094 -9384 -8072 -4784 -5055 -5367 -5176 -2151 -2067 -794 1839 7363
1201G363M828R69l613o373m197l610j249j448j58K10K148j291r93J901M309P027
$$ 7363 12191 13160 9547 3174 -1023 -4633 -5882 -7330 -7488 -7278 -5130 -6421 -7414 -5513 -1204 5823
1217E823N325K409j244m055l268o063k247k102J086j86j478m091k101K333M359
$$ 5823 11148 13557 12313 8258 4990 -1073 -3320 -5422 -4336 -4522 -6000 -10091 -12192 -9859 -5500
1232e500N857P501L145K528j780n482n098k251J153J728k368l301n228k316p31N1
$$ -5500 357 7858 11003 13531 11751 6269 1171 -1080 73 1801 -567 -3868 -9096 -11412 -12143 -12092
1248a2092N424Q218P314K673j617m962r21K64j593K029p92j508l914n718n405r06
$$ -12092 -6668 1550 8864 11537 9920 4958 4037 4301 2708 4737 3945 2437 -1477 -7195 -12600 -13506
1264a3506L179N720N400K854J377j265r34Q99J003M819J528q46m853p595p570k696
$$ -13506 -10327 -4607 793 3647 5024 3759 2825 3724 4727 9546 11074 10228 5375 -2220 -9790 -12486
1280a2486J733J750K165M157J848l14l42K705L369O132L832J341m742o413o169
$$ -12486 -10753 -9003 -6838 -2681 -833 -1147 -1489 1216 4585 10717 14549 15890 11148 4735 -1434
1295a434o654k671j788L208L130m99Pk16K360O905O410O329J317J049n055q033
$$ -1434 -8088 -10759 -12547 -9339 -6209 -6708 -6701 -6917 -4557 2348 8758 15087 16404 17453 12398 4365
1311D365q809m387j392K069m38J92j003Q32n23N381P497P031O749Q93m672o143
$$ 4365 -4444 -8831 -10223 -8154 -8592 -8400 -9403 -8571 -9094 -3713 3784 10815 17564 18457 13785 7642
1327G642o735n010j429l50p93l95j840k664j274M826O328P592P722L015l606m861
$$ 7642 907 -4103 -5532 -5882 -6675 -7070 -8910 -11574 -12848 -8022 -1694 5898 13620 16635 13029 8168
1343H168n498l541k346J374J42o28l104l738l648J483M445P433P565L993ql623
$$ 8168 2670 -871 -3217 -1843 -1701 -2329 -5433 -9171 -12819 -11336 -6891 542 8107 12100 12092 8469
1359H469n417k758k20O59J635q95k506l783n771j274L491M842M772M312K083k275
$$ 8469 3052 294 74 733 2368 1473 -1033 -4816 -10587 -11861 -8370 -3528 1244 5556 7639 5364
1375E364l317k734M63L530J305J116k038m766n551l441P21K763N364M373J263j246
$$ 5364 2047 -687 -224 3306 4611 5727 3689 -1077 -6628 -10069 -9348 -6585 -1221 3152 4415 3169
1391C169l590n53j51L158L299K223j079l738l961n378j444P13M101K701L583j379
$$ 3169 -421 -974 -1125 2033 5332 7555 6476 2738 -1223 -6601 -8045 -7332 -3231 -530 3053 1674
1407A674k699j712O5L317M647K605O74l710m652n379k036J27M839K550K023k99k059
$$ 1674 -1025 -2737 -2672 645 5292 7897 8571 4861 209 -5170 -7206 -7079 -2240 310 2333 2034 -25
1424b5k873j787K622O100L592J173l033m359m846m928J730K426M817L018j296j695
$$ -25 -2898 -4685 -2063 4037 7629 8802 5769 1410 -3436 -8364 -6634 -4208 609 3627 2331 636
1440F36l618k050L517M028L720K247k123l647n218o099J408K737L042L501m59r96
$$ 636 -2982 -5032 -1515 2513 6233 8480 6357 2710 -2508 -8607 -7199 -4462 -1420 2081 1622 626
1456F26m033p94K405L650N269K102l40l947o976m849j596K941K484K851j22j175
$$ 626 -3407 -4201 -1796 1854 7123 9225 8885 4938 -2038 -6887 -8483 -5542 -3058 -207 -329 -1504
1472a504n27k149J820M783O025K252K93k284o189m940m547o13K891M07N1n13j303
$$ -1504 -2031 -4180 -2360 2423 8448 10700 10993 8709 2520 -2420 -6967 -7580 -4689 -4282 -4231 -4744 -6047
1489f047j127M335L115O639N399L238k110o142o189n230k244j870J773J09N28l425
$$ -6047 -7174 -2839 276 6915 12314 15552 13442 7300 1111 -4119 -6363 -8233 -6460 -6351 -5823 -9248
1505i248m07J351M850R409O061N202j445l472n617n873m471k734P3j696J7m239
$$ -9248 -9655 -8304 -3454 5955 12016 17218 15773 12301 6684 811 -3660 -6394 -6321 -8017 -8000 -12239
1521a2239j637J660N676P008Q769M802L817p24o737n331m337o91k419j631m071
$$ -12239 -13876 -12216 -6540 468 9237 14039 17856 17132 10395 5064 727 36 -2383 -4014 -8085
1536h085m257m181j475O898N769R234N832N319p41k534l840l585O3Qk404n558m410
$$ -8085 -12342 -16523 -17998 -11100 -5331 3903 9735 15054 14313 11779 7939 4354 4417 4425 2021 -3537 -7947
1553g947n605k655l42M703P307Q097L679R85j525m07J003K54L88N59j499m969p331
$$ -7947 -13552 -16207 -16549 -11846 -4539 3558 7237 8222 6697 6290 7293 7547 7935 8494 6995 2026 -5305
1570e305q791j576J497M590M618L070K502J797J162J495J341N276M176q10m795
$$ -5305 -14096 -15672 -14175 -9585 -4967 -1897 605 2402 3564 5059 6400 11676 15852 15042 10247
1585A0247o729q113m732k841j680J205K226K601J924j74L579P191O666O844J867
$$ 10247 3518 -4595 -9327 -12168 -13848 -12643 -10417 -7816 -5892 -6066 -2487 4704 11370 18214 20081
1600B0081j207n165o525p659r153l756Q89j123m73o65M1M610Q226P842R218O674
$$ 20081 18874 13709 7184 -475 -9628 -13384 -12495 -13618 -14091 -14756 -14715 -10105 -1879 5963 15181 21855
1616B1855K636k619o399j0909o113m404l272m002m136m31o1J818M740P588J1369
$$ 21855 24491 21872 15473 4564 -1549 -5953 -9225 -13227 -17363 -17794 -17855 -16037 -11297 -3709 7660
1631G660J0915O203j729n039o438m419n303o164l407n186m79n672k726L696P645
$$ 7660 18575 24778 23049 18010 11572 7153 1850 -4314 -7721 -12907 -13386 -19058 -21784 -18088 -10443
1646a0443J1179R489M553K899R93k195m552p368k185q28l159q036o139l431P45L934
$$ -10443 736 10225 14778 17677 18670 16475 11923 4555 2370 1542 -1617 -9653 -15792 -19223 -18478 -14544
1662a4544O176N612P965M939L272j354l043r18K665m09m686n872o001m443k386
$$ -14544 -8368 -2756 5209 10148 13420 12066 9023 8105 10770 10361 5675 -197 -6198 -10641 -13027
1677a3027k370M86O619P014L683m69m25K840O335O80q11o53l24k334p531r641m662
$$ -13027 -15397 -14911 -8292 -1278 2405 1936 1511 4351 10686 11366 10555 9902 9578 7244 -287 -9928 -14590
1694a4590Q01N125R15j206K227M008M140J796K502L981P141J026m656p863p654
$$ -14590 -13789 -8664 -7749 -8955 -6728 -2720 1420 3216 5718 9699 16840 17866 13210 5347 -2307
1709b307k179j576m545k386J376K207K042o13J664O898R878O413r32j773l201k970
$$ -2307 -4486 -6062 -10607 -12993 -11617 -9410 -7368 -7981 -6317 581 10459 16872 15940 14167 10966 7996
1725G996n111p620m098J66R21j266m001j696N938P982M199N736K351M821j236m418
$$ 7996 2885 -4735 -8833 -8667 -7746 -9012 -13013 -14709 -8771 -789 3410 9146 11497 16318 15082 10664
1741A0664q807l939q14L138n151o684j533J734K696J935P65Q351R103K346j943
$$ 10664 1857 -2082 -2896 242 -4909 -11593 -13126 -11392 -8696 -6761 -5996 2355 11458 13804 11861
1756A1861n500q37J418j180o968l539k60J511l785l000q38N764R206K947j154j121
$$ 11861 6361 5524 6942 5762 -1206 -4745 -5005 -3494 -7279 -10279 -11117 -5353 3853 6800 5646 4525
1772D525P07K861k525n086j186J789K144l263q514k212K835M767P89O05J911N083
$$ 4525 5232 8093 5568 482 -704 1085 3229 -34 -8548 -10760 -7925 -3158 -2369 -1764 147 5230
1788E230K638l865l244r73N043J104k994o998r43K626m11k176j888M814O034K661
$$ 5230 7868 4003 759 -214 4829 5933 2939 -4059 -5002 -2376 -2787 -4963 -6851 -2037 3997 6658
1804F658m894l690K009M982N86l158j877k00J391l110o070j535M909O648J735m582
$$ 6658 1764 -1926 83 5065 5651 2493 616 416 1807 -1303 -7373 -8908 -3999 2649 4384 -198
1820a98m22L024K643k240l412k3M835J523m244o867m262N955L963j088k165J257
$$ -198 -620 2404 5047 2807 -605 -628 4207 5730 1486 -5381 -9643 -3688 275 -813 -2978 -1721
1836a721O209K659o318k905P21O339K134m791o531j265L152K24l717k759N524O621
$$ -1721 4488 7147 829 -2076 -1355 4984 7118 2327 -4204 -5469 -2317 -2093 -5810 -8569 -3045 3576
1852C576J436n308j956N620M703R0m876k685P24Q77l909o987j727M248O313k37l342
$$ 3576 5012 -296 -2252 3368 8071 8161 3285 600 1324 2201 -1708 -8695 -10422 -6174 139 -98 -3440
1869c440j88O235M025j278k727l79N316P51n952q179q86J929K446m377k975L750
$$ -3440 -3628 2607 6632 5354 2627 2248 7564 8315 2363 -5816 -6702 -4773 -2327 -6704 -9679 -5929
1885e929N818L059k473j753N382P642j07m471o151j65O15k258p252m419M392N602
$$ -5929 -111 2948 475 -1278 4104 11746 11639 7168 1017 852 1467 -791 -8043 -12462 -8070 -2468
1901b468n55l679j368Q369O652L212l270m84L940J110o421r510m090L072K210n064
$$ -2468 -3023 -6702 -8070 299 6951 10163 6893 6409 10349 11459 5038 -4472 -8562 -5490 -3280 -8344
1917h344m334n90Q587M132J066j061O504Q245J983n678o881k005K842k279q544
$$ -8344 -12678 -13268 -4681 -549 517 -544 5960 14205 16188 10510 3629 1624 4466 2187 -6357
1932f357o764J199L958R16l369N63Q181J0496L637m462o65K798L374m420q769o031
$$ -6357 -13121 -11922 -7964 -7048 -10417 -9854 -1673 8823 12460 7998 7333 10131 13505 9085 316 -5715
1948e715J251J191m822q109J564M852R486M29j909L894Q905L539k290o845r49J841
$$ -5715 -4464 -3273 -8095 -16204 -14640 -9788 -302 127 -1782 2112 11017 14556 12266 5421 4472 6313
1964F313p06o745q660j713J771L097l522k214O280Q367N654k543j688M288O236
$$ 6313 5607 -1138 -9798 -11511 -9740 -6643 -10165 -12379 -6099 2268 7922 5379 3691 7979 14215
1979A4215J24p259o438j731J437m212q834l295M387O053K234k261K278O452Q456
$$ 14215 14339 7080 642 -1089 348 -3864 -12698 -15993 -11606 -5553 -3319 -5580 -3302 3150 11606
1994A1606P19l416j987M593N69o125j0995n096J866J314l535m025R97Q749O259
$$ 11606 12325 8909 6922 11515 12084 5959 -5036 -10132 -8266 -6952 -10487 -14512 -13515 -4766 1493
2009A493J544k200O541P802L301o019q380n95P13l836r127o891J298N830J477l127
$$ 1493 3037 837 7378 15180 18481 12462 4082 3487 4200 364 -8763 -15654 -14356 -8526 -7049 -10176
2025a0176O73R556Q506K870n36k644L123L632m953j0053o431L76K054n427n097
$$ -10176 -9503 53 8559 11429 10893 8249 11372 15004 10051 -2 -6433 -6057 -4003 -9430 -14527
2040a4527n95P679O939J232o80L648Q781L389l000p660o12Q65K18r207q912M02M441
$$ -14527 -15122 -7443 -504 728 48 3696 12477 15866 12866 5206 4594 5459 5677 -3530 -12442 -12040 -7599
2057g599R82k583j004M684R965L837j480j928M413L121o54q963o220J667J892l406
$$ -7599 -6617 -9200 -10204 -5520 4445 8282 6802 4874 9287 12408 11754 2791 -3429 -1762 130 -3276
2073c276q114j826L696P002M34j938K624P095P455k496n290j146K770J544n174
$$ -3276 -11390 -13216 -9520 -2518 -2084 -4022 -1398 5697 13152 10656 5366 4220 6990 8534 3360
2088C360q821k433K805J495m727m702M036P619O060k171j832L869N288K778n940
$$ 3360 -5461 -7894 -5089 -3594 -8321 -13023 -8987 -1368 4692 2521 689 4558 9846 12624 6684
2103F684o135r0L641l726p759m979K157O224J097k721N92N898P265N53k730l030
$$ 6684 549 459 4100 374 -7385 -12364 -10207 -3983 -2886 -5607 -5015 883 8148 8701 5971 2941
2119B941M565K716l513j0020l915L616P43k947l625o83P606N548n41l405K791O257
$$ 2941 7506 10222 6709 -3311 -7226 -3610 -2867 -5814 -9439 -10122 -2516 3032 2491 -914 1877 8134
2135H134M311n560n141j212K470k61n449o475N29N294J919k467j001L266O468K993
$$ 8134 12445 6885 1744 532 3002 2741 -2708 -9183 -8654 -3360 -1441 -3908 -4909 -1643 4825 7818
2151G818m020k068J720M247j110p460m057L54L663j009n219j182N071N378J083
$$ 7818 3798 1730 3450 7697 6587 -873 -4930 -4576 -913 -1922 -7141 -8323 -3252 2126 3209
2166C209m278n80O324L979j551p514l12K597M67k807n301N1M092K892j857m351
$$ 3209 -1069 -1649 4675 8654 7103 -411 -723 1874 2341 -466 -5767 -5716 -1624 1268 -589 -4940
2182d940K453M492L935l142l773R06M725k68n172m059J663L753J182n156j456J016
$$ -4940 -2487 2005 5940 2798 -975 -69 4656 4388 -784 -4843 -3180 573 1755 -3401 -4857 -3841
2198c841O210M90m582m25K608M722o54n134k284J614K922k72n033j276K558L897
$$ -3841 2369 2859 -1723 -2148 460 5182 4528 -606 -2890 -1276 1646 1374 -3659 -4935 -2377 1520
2214A520K25m153k38N121K363r06n628M05J931L179m298m434J173L288K165l597
$$ 1520 1745 -2408 -2646 2475 4838 3932 -1696 -1291 640 3819 -479 -4913 -3740 -452 1713 -1884
2230a884l230J610M956L017l201k523L753J616o7n190l051J403L604J420m786l511
$$ -1884 -5114 -3504 1452 4469 1268 -1255 2498 4114 4047 -1143 -4194 -2791 813 2233 -2553 -6064
2246f064L539L617o15j776n1M901K709j309n154k113K807K282j142n473n75J752
$$ -6064 -2525 1092 477 -1299 -1350 3551 6260 4951 -203 -2316 491 2773 1631 -3842 -4417 -2665
2262b665K233k182j886J801M259L398j519j383K78K463M55m465k864n19L191l5n030
$$ -2665 -432 -2614 -4500 -2699 1560 4958 3439 2056 2334 4797 5252 787 -2077 -2596 595 560 -4470
2279d470l116J393N829J167J12j981L797N046j518k104k234N6J740m070m576k653
$$ -4470 -7586 -6193 -364 803 915 -1066 2731 7777 6259 4155 1921 1977 3717 -353 -4929 -7582
2295g582J676K478k05j850Q44N606M669n05q40k58K339K097m331m841j805N32q17
$$ -7582 -5906 -3428 -3633 -5483 -4639 967 5636 5131 4291 4033 6372 8469 4138 -703 -2508 -1976 -2793
2312b793m226k306N18N357M357K20M35K043M014J095k270l184m03K050l973n768
$$ -2793 -7019 -9325 -8807 -3450 907 1127 1562 3605 7619 8714 6444 3260 2857 4907 934 -4834
2328d834l130k99L368J725j719p4N674L004J733j663o34L366J372k323m445l689
$$ -4834 -7964 -8263 -4895 -3170 -4889 -4963 711 3715 5448 3785 3151 6517 7889 5566 1121 -2568
2344b568m92n9j253l526n64N361K532M00j241J607M147K553r23k505p22J502j085
$$ -2568 -3060 -3119 -4372 -7898 -8462 -3101 -569 -169 -1410 197 4344 6897 5974 3469 2747 4249 3164
2361C164n454k884L28K098r9r80j690J172L605J708k09L55L466K327L1l460j206
$$ 3164 -2290 -5174 -4846 -2748 -2847 -3827 -5517 -4345 -740 968 759 1114 4580 6907 6938 3478 2272
2378B272k73m20j930m111j260j46J407l52j668J558M651N004M46L0p82K434k75k692
$$ 2272 1999 1579 -351 -4462 -5722 -5868 -4461 -4813 -6481 -4923 -272 4732 5178 5208 4426 6860 6585 3893
2396C893l352k307O9j084l660k891J375L079L796J203P82K535M076J266k333j516
$$ 3893 541 -1766 -1697 -2781 -6441 -9332 -7957 -4878 -1082 121 903 3438 7514 8780 6447 4931
2412D931p34n6k456n288m012l93R60L03R25j40O675K409L073n6p18J250L35j753
$$ 4931 4197 4141 1685 -3603 -7615 -8008 -7048 -6745 -5820 -5960 715 3124 6197 6141 5423 6673 7008 5255
2430E255k956l992j186j210l401l14J346J995L709J442Q17K915J658J419j660j879
$$ 5255 2299 -1693 -2879 -4089 -7490 -7804 -6458 -4463 -754 688 1505 4420 6078 7497 5837 3958
2446C958j688J144l928l089j693o78K189o4P74R76Q63L005N40m04L0J488J766o94
$$ 3958 2270 3414 -514 -3603 -5296 -5974 -3785 -3849 -3075 -2099 -1236 1769 2309 1905 1935 3423 5189 4495
2464D495k404k869L96l29j878j269M4J662J755j524p56J614J937K159M91o00j212
$$ 4495 2091 -778 -382 -711 -2589 -3858 -3814 -2152 -397 -1921 -2677 -1063 874 3033 3524 2924 1712
2481A712L06L95j998j096p58Q72K78k306r34N82K72J969N17J37J994J577k18k3j499
$$ 1712 2018 2413 415 -681 -1439 -567 -289 -2595 -3529 -2947 -2675 -706 -189 -52 1942 3519 3301 3278 1779
2500A779l29r8m28j594j615p92k75k06j601J813K104L689J383j488k4O14N67j234
$$ 1779 1450 1352 924 -670 -2285 -3077 -3352 -3558 -5159 -3346 -1242 2447 3830 2342 2318 2932 3499 2265
2518B265r62j024j197n05j309k865J88J820K432J644M08JK163K51K82j874L63j830
$$ 2265 1303 279 -918 -1423 -2732 -5597 -5409 -3589 -1157 487 895 896 3059 3310 3592 1718 2081 251
2536B51J152k614k165j421J56K817m31M97Q01K625J488o88j207RQ81j121m58j17
$$ 251 1403 -1211 -3376 -4797 -4641 -1824 -2255 -1758 -957 1668 3156 2468 1261 1270 2151 1030 572 455
2554D55j823j26j53j182m5J639J616J007p13K40J011o09J487j633k78K65r1k129
$$ 455 -1368 -1494 -1647 -2829 -2874 -1235 381 1388 675 915 1926 1317 2804 1171 893 1158 1067 -1062
2572a062j428O41O04J487p33N80J56L66P94q59O73r34J712j656l30k223J768k249
$$ -1062 -2490 -1849 -1245 242 -491 89 245 611 1405 546 1219 285 1997 341 11 -2212 -444 -2693
2590b693K944q29N46K83Q29O3j260K8Q36J85q89j5n99j77K39nn97R81R0K88Q46j009
$$ -2693 251 -578 -32 251 1080 1143 -117 -89 747 932 43 28 -571 -748 -509 -514 -1111 -130 -40 248 1094 85
2612H5J54M57O42J43r46m78O21j053j941M19k85R02J582Q58k09j32l36J293n78K76
$$ 85 239 696 1338 1481 535 57 678 -375 -2316 -1897 -2182 -1280 302 1160 951 819 483 1776 1198 1474
2632A474q7o89J19j538o71l31N81J100j332J288l71N49r7N10K20l4J014q60j96p74
$$ 1474 1387 698 817 -721 -1392 -1723 -1142 -42 -1374 -86 -457 92 -5 505 725 691 1705 845 649 -125
2652a25o52K68l4j335J016J410L91l98O14j439m27J440j29P98J31j38j605m46N77
$$ -125 -777 -509 -543 -1878 -862 548 939 541 1155 -284 -711 729 600 1398 1529 1391 -214 -660 -83
2671h3j333J282K6N39j185j12r45M97J295R1Q81J497j254N32j647J036l82R27j566
$$ -83 -1416 -134 -108 431 -754 -866 -1811 -1314 -19 72 953 2450 1196 1728 81 1117 735 1662 96
2690I6L74r86l69j043R06j051J682J395o42J310l62J710m28m75N40j459q32j308
$$ 96 470 -516 -885 -1928 -1022 -2073 -391 1004 362 1672 1310 3020 2592 2117 2657 1198 366 -942
2708i42j305k95k96R12J4J098n5K188O51J337l13k86n71Q6k274j279l58p08j741
$$ -942 -2247 -2542 -2838 -1926 -1912 -814 -869 1319 1970 3307 2994 2708 2137 2223 -51 -1330 -1688 -2396 -4137
2727d137K98Q89J148Q51J765J488R84o88k86J304k154o43K1k294j541O38r4J025
$$ -4137 -3839 -2950 -1802 -951 814 2302 3286 2598 2312 3616 1462 819 840 -1454 -2995 -2357 -2451 -1426
2745a426K5M98J189J424N18p15O74l6m62j75k143O03p53m37j443J152L89K6J168
$$ -1426 -1401 -903 286 1710 2228 1513 2187 2151 1689 1514 -629 -26 -779 -1216 -2659 -1507 -1118 -1092 76
2764G6N78J132n16o23L55O03m92p06L2j038K78o35R47r65K490r65J051q77j057
$$ 76 654 1786 1270 647 1002 1605 1113 407 439 -599 -321 -956 -9 -974 1516 551 1602 725 -332
2783c32j88n44J020k42M24K99J017j043J12O53K61o53P31k166p19j218J294k50j318
$$ -332 -520 -1064 -44 -286 138 437 1454 411 523 1176 1437 784 1515 -651 -1370 -2588 -1294 -1544 -2862
2802b862K278m18J115J235k71P33n7K41o61q22l12r57k33j317M95k65k27K494k53
$$ -2862 -584 -1002 113 1348 1077 1810 1753 1994 1333 511 199 -758 -991 -2308 -1813 -2078 -2305 189 -64
2821f4K754q66N13L21k315K044j060j299m94p60J30o53q50Q36N61K216l31M91J238
$$ -64 2690 1824 2337 2658 343 2387 1327 28 -466 -1226 -1096 -1749 -2599 -1763 -1202 1014 683 1174 2412
2840B412r91J492j018q16j167q14J82r58p51N88l68J249k37J989J133r91P86M98
$$ 2412 1421 2913 1895 1079 -88 -902 -720 -1678 -2429 -1841 -2209 -960 -1197 792 1925 934 1720 2218
2858B218p54q40j208J069j947k97O75k11P01N43k15M06j3O7M8j81J68q12k95N56
$$ 2218 1464 624 -584 485 -1462 -1759 -1084 -1295 -594 -51 -266 140 127 194 242 61 229 -583 -878 -322
2878c22n56Q81j251J888o83k75J448j43M4o00j76K9L7m12k36m03M69M32n07J012
$$ -322 -878 3 -1248 640 -43 -318 1130 987 1031 431 255 284 321 -91 -327 -730 -261 171 -336 676
2898F76j54o78J60L43j83j012J190j581K373j789k61J656k144J809K53k97K322
$$ 676 522 -156 4 347 164 -848 342 -1239 1134 -655 -916 740 -1404 405 658 361 2683
2915B683j087k0j476N72j042q05J74M06j70O20m73O36L25J92M04p3m23O42m32J3r54
$$ 2683 1596 1576 100 672 -370 -1175 -1001 -595 -765 -145 -618 18 343 535 939 866 443 1085 653 666 -288
2936b88m75J714k368J278k82O67N61q58k40J25n13R36J325j468K56j145m7J21M66
$$ -288 -763 951 -1417 -139 -421 246 807 -51 -291 -166 -679 257 1582 114 370 -775 -822 -701 -235
2955b35J651j146n47m91R65o22R3M73l4P50k07j234P92k70o31P83m54r7o12J569
$$ -235 1416 270 -277 -768 197 -425 -332 141 107 857 650 -584 208 -62 -693 90 -364 -461 -1073 496
2975D96K19n88Q39m2R2o69j091K10R10p66J92l3R87r81N40j118R50O59l05q02J235
$$ 496 715 127 966 924 1016 347 -744 -534 376 -390 -198 -231 756 -225 315 -803 147 806 501 -301 934
2996I34q57M12KmJ066j740m4J30l08n33O91J218Q94k528J620r73n82mJ050K75n78
$$ 934 77 489 491 487 1553 -187 -231 -101 -409 -942 -251 967 1861 -667 953 -20 -602 -606 444 719 141
3017A41l92O30l9M67j105n88N99M66J9j334R77O31j138J504n21m63L40j067L67o26
$$ 141 -251 379 340 807 -298 -886 -287 179 198 -1136 -159 472 -666 838 317 -146 194 -873 -506 -1132
3037a132J048o45J75R92L91j94Q85r75K3K89j161n10k80J619j2n16Q61m18M08j119
$$ -1132 -84 -729 -554 438 829 635 1520 545 568 857 -304 -814 -1094 525 513 -3 858 440 848 -271
3057b71Q16N06j283l69M81N28j327m27J11M9N10P52k37J173l23q2q1k6q77J047
$$ -271 545 1051 -232 -601 -120 408 -919 -1346 -1235 -1186 -676 76 -161 1012 689 607 526 500 -377 670
3077F70p02m09p57P06L95n19L13M19l42L25L67R2l1M36J006j425l10k68p63j090
$$ 670 -32 -441 -1198 -492 -97 -616 -303 116 -226 99 466 558 527 963 1969 544 234 -34 -797 -1887
3097a887N27J335J65o83R14M0J36r56J130l13K9k66J16l69j461N0M47O97N80o32
$$ -1887 -1360 -25 140 -543 371 411 547 -409 721 408 437 171 287 -82 -1543 -1493 -1046 -349 231 -401
3117d01J902j380n2N60p30J371k70k97k59om13j116K57L31J79j000M35O0J186P51
$$ -401 1501 121 69 629 -101 1270 1000 703 444 438 25 -1091 -834 -503 -324 -1324 -889 -829 357 1108
3137A108o65J041l81m29K96k86j56n27M57n16p52k4o79O31j237J058l59J378R69
$$ 1108 443 1484 1103 674 970 684 528 1 458 -58 -810 -834 -1513 -882 -2119 -1061 -1420 -42 927
3156I27l6r48P98J277j564M66o36k89p82O78j190m41K10p8K49J608R4J49N61J41
$$ 927 891 -57 741 2018 454 920 284 -5 -787 -109 -1299 -1740 -1530 -1608 -1359 249 343 492 1053 1194
3176A194j20Q3l72o50M20j251J234p46j911J79M06L53J1J015J058n94J409r72q2K95
$$ 1194 1074 1157 785 135 555 -696 538 -208 -2119 -1940 -1534 -1181 -1170 -155 903 309 1718 746 664 959
3196I59M55j388n6l74k17p45K19j408J295L19j98R24N25J14J330m40N52p05o79r45
$$ 959 1414 26 -30 -404 -621 -1366 -1147 -2555 -1260 -941 -1139 -215 310 424 1754 1314 1866 1161 482 -463
3216d63O40j342N3o2m01N92p3l15J445J82k12N99P82J021j500m67J26k322R08j363
$$ -463 177 -1165 -1112 -1174 -1575 -983 -1056 -1371 74 256 44 643 1425 2446 946 479 605 -1717 -809 -2172
3236b172K64P69m6J21K27O63M48K2J33K140j450O24o75k1j159l02l5j222pj01n75
$$ -2172 -1908 -1139 -1185 -1064 -837 -174 274 296 429 2569 1119 1743 1068 1047 -112 -414 -449 -1671 -1678 -1779 -2354
3257b354l96J407O54R45J282q92J329n89n80L87j582n34J105K08k378Q20j943J917
$$ -2354 -2750 -1343 -689 256 1538 646 1975 1386 806 1193 -389 -923 182 390 -1988 -1168 -3111 -1194
3275a194J330m86p4J214O93l46N92q49k10k19K51J72o60j198r07R43K05j431J865
$$ -1194 136 -350 -424 790 1483 1137 1729 880 670 451 702 874 214 -984 -1891 -948 -743 -2174 -309
3294c09k46J143O12o3j187P75J99P67q86o57N11j107j410j34O55Q09k19j12R97r6
$$ -309 -555 588 1200 1137 -50 725 924 1691 805 148 659 -448 -1858 -1992 -1337 -528 -747 -859 138 42
3314D2o5L95J123n47n16O66j73j44j068k76k79K79m85L08p98J338K88N23P39p10
$$ 42 -23 372 1495 948 432 1098 925 781 -287 -563 -842 -563 -1048 -740 -1538 -200 88 611 1350 640
3334F40j175L11Q16l57n56l47K30J3o53k26R50j00P86j82m46K152n61j38m78k013
$$ 640 -535 -224 592 235 -321 -668 -438 -425 -1078 -1304 -354 -454 332 150 -296 1856 1295 1157 679 -1334
3354a334K664j443l83j24M85j245J032J84j77k10J355q26K67K71P96M2o98r80L23
$$ -1334 1330 -113 -496 -620 -135 -1380 -348 -164 -341 -551 804 -22 245 516 1312 1354 656 -324 -1
3373al28L41p5J004j425p04M04J298o52M11N40K53K01n83N0r71m29L80K08j428
$$ -1 -329 12 -63 941 -484 -1188 -784 514 -138 273 813 1066 1267 684 734 -237 -666 -286 -78 -1506
3393a506K65O41O78J07j64J25Q46n84J158k39n84r60pN29m96p73J202j979J31N76
$$ -1506 -1241 -600 78 185 21 146 992 408 1566 1327 743 -217 -224 305 -191 -964 238 -1741 -1610 -1034
3413a034J927q41l69J433m34M9m05J56j032N51p20o46k99O85K6L99L78J61L09J166
$$ -1034 893 52 -317 1116 682 731 326 482 -550 1 -719 -1365 -1664 -979 -953 -554 -176 -15 294 1460
3433A460o81P71m22M07k345L41L0q71m76K70j14Q06k76J225j59r1Q78L49J163j59
$$ 1460 779 1550 1128 1535 -810 -469 -439 -1310 -1786 -1516 -1630 -824 -1100 125 -34 -125 753 1102 2265 2106
3453B106j275o39m32j41j203m31L15l50Q47L39J76K066N84l71L19P27j100j313
$$ 2106 831 192 -240 -381 -1584 -2015 -1700 -2050 -1203 -864 -688 1378 1962 1591 1910 2637 1537 224
3471B24k66N73n71n11j558R96o37J078o05J055L83J487m47j9O78r65q1n37j46j321
$$ 224 -42 531 -40 -551 -2109 -1113 -1750 -672 -1277 -222 161 1648 1201 1182 1860 895 814 277 131 -1190
3491a190R07p90N03l45q57J529n07J581r77R61K42m02K69K52P69j058l70r9l08j27
$$ -1190 -283 -1073 -570 -915 -1772 -243 -750 831 -146 815 1057 655 924 1176 1945 887 517 418 110 -17
3511a7o82j004J07n03O98M62M38J848o5N57O80j475J075n27o20j553J11j387P7j638
$$ -17 -699 -1703 -1596 -2099 -1401 -939 -501 1347 1282 1839 2519 1044 2119 1592 972 -581 -470 -1857 -1780 -3418
3531c418K50O60J239n62J928J705O14R36q92N3m35m57j138j868n18l02n55m87P49
$$ -3418 -3168 -2508 -1269 -1831 97 1802 2416 3352 2460 2513 2078 1621 483 -1385 -1903 -2205 -2760 -3247 -2498
3550b498q59K548J020P52O27J485O22L12p07k942J191j823j216j975j53P96m70P45
$$ -2498 -3357 -809 211 963 1590 3075 3697 4009 3302 360 1551 -272 -1488 -3463 -3616 -2820 -3290 -2545
3568b545J914J391Q84J195J329m83r60j154j18j794n36k254O16j508J026Q3O39N36
$$ -2545 -631 760 1644 2839 4168 3685 2725 1571 1453 -341 -877 -3131 -2515 -4023 -2997 -2914 -2275 -1739
3586a739K137J212j58J678p01m47K07j114r19q85j130j213K40j22J999l94J3J725
$$ -1739 398 1610 1452 3130 2429 1982 2189 1075 156 -729 -1859 -3072 -2832 -2954 -955 -1349 -1336 389
3604C89L1m60R64K97R75p27m57j228P69j637l28J11J50l63O62n63m30J072j39J046
$$ 389 420 -40 924 1221 2196 1469 1012 -216 553 -1084 -1412 -1301 -1151 -1514 -852 -1415 -1845 -773 -912 134
3624A34Q73J01l67J374j292J557l71r30k326m0n82l41j555J588q53J624K173j469
$$ 134 1007 1108 741 2115 823 2380 2009 1079 -1247 -1287 -1869 -2210 -3765 -2177 -3030 -1406 767 -702
3642g02K355J7J852p64k38p48l97j334n8j627r47l94m25J114K192o95J066J848
$$ -702 1653 1670 3522 2758 2520 1772 1375 41 -17 -1644 -2591 -2985 -3410 -2296 -104 -799 267 2115
3660B115M22r96P05K226k476L07k287j049j168j00r74P62j10J586J063J446M58J517
$$ 2115 2537 1541 2246 4472 1996 2303 16 -1033 -2201 -2301 -3275 -2513 -2623 -1037 26 1472 1930 3447
3678C447J33p90p64r36k12j397q16j626p71R78J488M29j119J497L84K189O07M38
$$ 3447 3580 2790 2026 1090 878 -519 -1335 -2961 -3732 -2754 -1266 -837 -1956 -459 -75 2114 2721 3159
3696C159j288n14k47m11k014K48j141j91J926m31p46J501M19J016m31Q14O03j092
$$ 3159 1871 1357 1110 699 -1315 -1067 -2208 -2399 -473 -904 -1650 -149 270 1286 855 1669 2272 1180
3714A180j25j943q60P34N46L66j526O11R70P29k01j345Q97j08J368o34j41m74K36
$$ 1180 1055 -888 -1748 -1014 -468 -102 -1628 -1017 -47 682 481 -864 33 -75 1293 659 518 44 280
3733B80k81p56R06r01K261j454n19R23j915J347L50p7j12J99J057l5p04p10j73K80
$$ 280 -1 -757 149 -752 1509 55 -464 459 -1456 -109 241 164 52 251 1308 1273 569 -141 -314 -34
3753c4k71O05n20M43R71m15p52O75m17J125j288o92M93J492j516N62j07j95m45M62
$$ -34 -305 300 -220 223 1194 779 27 702 285 1410 122 -570 -77 1415 -101 461 354 159 -286 176
3773A76L54j504Q81k46N03k46M43n14N47q62L60K51N99q74N60j528J418r46M92K13
$$ 176 530 -974 -93 -339 164 -82 361 -153 394 -468 -108 143 742 -132 428 -1100 318 -628 -136 77
3793G7k99L18J104n01l89p7j25j3L15O07k396O57j051L20j47L53J666k61K89j64
$$ 77 -222 96 1200 699 310 233 108 95 410 1017 -1379 -722 -1773 -1453 -1600 -1247 419 158 447 283
3813B83r37m46K845j343J273m65m73j555N80j069l54q18K152R61p87J76P91n5Q24
$$ 283 -654 -1100 1745 402 1675 1210 737 -818 -238 -1307 -1661 -2479 -327 634 -153 23 814 759 1583
3832A583j211n2K084k001L51q87o88j198J229j072q6m2J261P84N24P82J537M82o78
$$ 1583 372 320 2404 403 754 -133 -821 -2019 -790 -1862 -1948 -1990 -729 55 579 1361 2898 3380 2702
3851B702l76j843q13j173m87j588n54K307K24n33J690k68K173Q03J119j64r38p95
$$ 2702 2326 483 -330 -1503 -1990 -3578 -4132 -1825 -1601 -2134 -444 -712 1461 2264 3383 3219 2281 1486
3869A486o11j642j342q50M63J60L49R40p33J991J396J5J038l1R21j510k412M3k094
$$ 1486 875 -767 -2109 -2959 -2496 -2336 -1987 -1047 -1780 211 1607 1622 2660 2629 3550 2040 -372 -329 -2423
3888b423Q77r86o01N90j9J149O34N53J985M16J112p51k40j081q59q84J105j916
$$ -2423 -1546 -2532 -3133 -2543 -2562 -1413 -779 -226 1759 2175 3287 2536 2296 1215 356 -528 577 -1339
3906a339K16J30P88o09o05j65J482J156P69p68N5K0m67n74J82q79J92J447k19q47
$$ -1339 -1123 -993 -205 -814 -1419 -1584 -102 1054 1823 1055 1110 1130 663 89 271 -608 -416 1031 812 -35
3926c5j139r83K226j262j312K538j926K384n88K15P90J51K209j329j560J482k473
$$ -35 -1174 -2157 69 -1193 -2505 33 -1893 491 -97 118 908 1059 3268 1939 379 1861 -612
3943f12j87k174k13k36K566j655J097Q44J866J213j64P75L93n05r6j627j571k267
$$ -612 -799 -2973 -3186 -3422 -856 -2511 -1414 -570 1296 2509 2345 3120 3513 3008 2912 1285 -286 -2553
3961b553m83k64n04J40Q17J498J288J395J174P71K017o22j268l300K61j307j817
$$ -2553 -3036 -3300 -3804 -3664 -2847 -1349 -61 1334 2508 3279 5296 4674 3406 106 367 -940 -2757
3978b757k05j21r68N63L981j140J34K353J978l18J808j592j926k284O00j336k456
$$ -2757 -2962 -3083 -4051 -3488 493 -647 -513 1840 3818 3500 5308 3716 1790 -494 106 -1230 -3686
3995c686J85J632k63l46O3J884J967k2J740p65J72Q29j735j730j782R41j85pk12
$$ -3686 -3501 -1869 -2132 -2478 -2415 -531 1436 1414 3154 2389 2561 3390 1655 -75 -1857 -916 -1101 -1108 -1320
4014a320J94K33M02M82K38Q91J15J93j237j51j55J727j944n77Q2L87O33j133o19
$$ -1320 -1126 -893 -491 -9 229 1120 1235 1428 191 40 -115 1612 -332 -909 -827 -440 193 -940 -1559
4033a559q16J742J690p25p79J36m34J858k07k71N43kK34j53j103q60K81J27o41j19
$$ -1559 -2375 -633 1057 332 -447 -311 -745 1113 906 635 1178 1176 1410 1257 154 -706 -425 -298 -939 -1058
4053a058l69Q44l68J550m61l2J367J379k43j271r22K91j151j403q89m5Q36Q93p7K97
$$ -1058 -1427 -583 -951 599 138 106 1473 2852 2609 1338 416 707 -444 -1847 -2736 -2781 -1945 -1052 -1129 -832
4073h32J657K3R97O28j053J299O03j608j693j063k266J059M44o50K98R2K509L15
$$ -832 825 848 1845 2473 1420 2719 3322 1714 21 -1042 -3308 -2249 -1805 -2455 -2157 -2065 444 759
4091G59p28J686P3J808
$$ 759 31 1717 1790 3598
4095C598          $$ checkpoint
$$ Imaginary data points
##PAGE= N=2
##DATA TABLE=(X++(I..I)), XYDATA
0@%S0L2o4O4o4R6j28J60j94K26k88L52m16N12o08P04q32R64j121J302j495J703
$$ 0 0 0 0 0 0 0 0 0 0 0 32 -32 32 -32 64 -64 96 -98 128 -160 192 -224 288 -320 384 -448 516 -605 697 -798 905
31I05j936K210k511K838l198L593m028M509n034N607o241O930p677Q496r389J0367
$$ 905 -1031 1179 -1332 1506 -1692 1901 -2127 2382 -2652 2955 -3286 3644 -4033 4463 -4926 5441
47E441j1437J2608j3895J5306j6860J8580k0492K2632k5040K7766l0893L4503
$$ 5441 -5996 6612 -7283 8023 -8837 9743 -10749 11883 -13157 14609 -16284 18219
59A8219l8738M3797m9949N7634o7551Q0911j00000J29734j83029L08602j168860
$$ 18219 -20519 23278 -26671 30963 -36588 44323 -55677 74057 -108972 199630 -969230
70i69230j137795R03565K15003J60035k07814R7729O3022J10777j49566n2149
$$ -969230 -2107025 -1203460 -988457 -828422 -1036236 -938507 -875485 -764708 -914274 -966423
80i66423K3171J33947j60983l34147k66811J63887L48782K90039P4794R2801J45890
$$ -966423 -943252 -809305 -970288 -1304435 -1571246 -1407359 -1058577 -768538 -693744 -600943 -455053
91d55053J25309j02473j92328n5049K11882J87626q6923l25083k18802K8179J35889
$$ -455053 -329744 -432217 -624545 -679594 -467712 -280086 -367009 -692092 -910894 -882715 -746826
102g46826N0348M7235J84326K89515J28101j61722k66759n1851K06433K00816
$$ -746826 -696478 -649243 -464917 -175402 -47301 -209023 -475782 -527633 -321200 -120384
112a20384l0908j52938n1604M3117m4429j57781o7456J91973L18887J40534j59063
$$ -120384 -151292 -304230 -355834 -312717 -357146 -514927 -582383 -390410 -71523 69011 -90052
123i0052k38818n5998J13612O2145m3951J8841J70233J51868p8620k50824j42046
$$ -90052 -328870 -384868 -271256 -209111 -253062 -234221 -63988 87880 9260 -241564 -383610
134c83610J27511K46936R0167j16525j26460q794m668j27668j38360P6727K96814
$$ -383610 -256099 -9163 81004 -35521 -161981 -170775 -175443 -303111 -441471 -364744 -67930
145f7930K54785o270j86607j12990O9627J04881j6974p9666J8315Q5521n4140
$$ -67930 186855 180585 -6022 -119012 -49385 55496 38522 -41144 -22829 62692 8552
156H552k57372k42337J9817K60070K42017N9894l4105K9779Q3902j9744j43119
$$ 8552 -248820 -491157 -471340 -211270 30747 90641 56536 86315 170217 150473 7354
167G354q5865J10945J69280l1850k60096k55445m5379J16215R9266L5633Q9698
$$ 7354 -78511 32434 201714 169864 -90232 -345677 -391056 -274841 -175575 -139942 -50244
178e0244J94020J47994o9476k14809j01244J28072J72946l449j68016j50283
$$ -50244 143776 291770 222294 7485 -93759 34313 207259 203810 35794 -114489
188a14489m3455k1096q8480o2318J20940K80128K01726m9436j82226p8390P8214
$$ -114489 -157944 -179040 -267520 -329838 -208898 71230 272956 223520 41294 -37096 41118
199D1118Q2817k6329o4348J0464M4556o9825k07107j64000O8746K42688J77136
$$ 41118 123935 97606 33258 43722 88278 18453 -188654 -352654 -283908 -41220 135916
210A35916m301p4506j899L9113l4378j01903k3639J24640J42253l4619k14509
$$ 135916 131615 57109 55210 94323 59945 -41958 -65597 59043 201296 166677 -47832
221d7832j82332R097J26779P7293K662L9289J05614M5603j09995j73479m1213
$$ -47832 -230164 -221067 -94288 -16995 -14333 24956 130570 176173 66178 -107301 -148514
232a48514J44566J64590N262j26490r5456K148J519o5449m0069J01281J87966
$$ -148514 -3948 160642 165904 39414 -56042 -53894 -52375 -117824 -157893 -56612 131354
243A31354Q5329j09165j80237o0287Q9308R4157J832k6696L6933M6727o6295j66300
$$ 131354 216683 107518 -72719 -133006 -43698 50459 52291 25595 62528 109255 42960 -123340
255a23340r6974Q7011J89845J05186n0720r9929k7549J9736k6539n9898K3845
$$ -123340 -220314 -133303 56542 161728 111008 11079 -16470 3266 -23273 -83171 -59326
266e9326J38066J08273n6380j80581j25070K8887J09694O1484k420K1613O1894
$$ -59326 78740 187013 130633 -49948 -175018 -146131 -36437 25047 22627 44240 106134
277A06134L745j16347j32150P477J52433J31768j3529j12033p8931n763J357l8963
$$ 106134 109879 -6468 -138618 -131141 21292 153060 139531 27498 -51433 -57196 -55839 -94802
289i4802q133R9597J43744L3162j27119j47328k4998R0219Q0004Q539j1890K1334
$$ -94802 -102935 -3338 140406 173568 46449 -100879 -125877 -35658 44346 52885 40995 62329
301F2329J6565o8461j29641n2235J03907J57175N7283p3187r2917k6084P887j7831
$$ 62329 78894 10433 -119208 -171443 -67536 89639 146922 73735 -19182 -45266 -37379 -55210
313e5210k3318M3911J15608P6991o1178j44095p4675N4395R6032L3156j7792m321
$$ -55210 -78528 -34617 80991 157982 96804 -47291 -121966 -67571 28461 61617 43825 39504
325C9504J2651l8059j07192q6546L7967J44329J17672p138p7473l8309J9827N927
$$ 39504 52155 14096 -93096 -179642 -141675 2654 120326 113188 35715 -2594 17233 23160
337B3160k6095l8O4237O2931m0230j44462j31823j0697R2345Q8415L2774K4804
$$ 23160 -2935 -2973 61264 124195 83965 -60497 -192320 -203017 -110672 -22257 10517 35321
349C5321N7413L2449m4524q3663j6471P7566Q5985j5238j17968j21819m8813L75
$$ 35321 92734 125183 80659 -3004 -19475 58091 144076 128838 10870 -110949 -159762 -159387
361a59387l567J5214Q9283J37787P8036l3238q3680k9575N4091O5050j114n9503
$$ -159387 -162954 -147740 -58457 79330 157366 124128 40448 10873 64964 130014 128900 69397
373F9397n9140m5745p4328j04661m5561Q1672J53896J15055J5776l3369r640K2421
$$ 69397 10257 -35488 -109816 -214477 -260038 -178366 -24470 90585 106361 72992 63352 85773
385H5773J1815k0907j1586K4118N116q4866j47187r9742J9288R8936Q8860M6804
$$ 85773 97588 76681 65095 89213 94329 9463 -137724 -237466 -218178 -119242 -30382 16422
397A6422L5086L9077J6593l7941n4998K69O9377N1052m2439j08512r2013l1040
$$ 16422 51508 90585 107178 69237 14239 14508 83885 134937 92498 -16014 -108027 -139067
409a39067P756J4736L5659P5412Q8997L2540n7897q1513j6809N5988N5820L707
$$ -139067 -131311 -116575 -80916 -5504 83493 116033 58136 -23377 -40186 15802 71622 75329
421G5329k8226k3137k2523m5589n7083j0088O5207R9063M6671m3152p3325l5423
$$ 75329 47103 23966 1443 -44146 -101229 -111317 -46110 52953 99624 56472 -16853 -52276
433e2276M819M908P735L2849N7821L2754l2862p1198m2206L2820O7441L4123j9532
$$ -52276 -47457 -42549 -34814 -1965 55856 88610 55748 -15450 -57656 -24836 42605 76728 57196
446E7196l3170l0267m5938o1884l4937L6604R5578Q4187J7795l4312k7361J2142
$$ 57196 24026 -6241 -52179 -114063 -149000 -112396 -16818 67369 85164 50852 23491 35633
458C5633K1595N345k878J2336m163n9161j06359q6531q802O6043Q4713N5063L1285
$$ 35633 57228 62573 59695 72031 67868 8707 -97652 -184183 -192985 -126942 -42229 12834 44119
471D4119K7774K0545q798k6252j054L5110K6997l6181r6098j00174n6738j204K7421
$$ 44119 71893 92438 83640 57388 56334 91444 118441 82260 -13838 -114012 -170750 -171954 -144533
484a44533M6276O5618Q1337M9719p574l6350p449L2579L6032l149m8957o8371
$$ -144533 -98257 -32639 48698 98417 90843 54493 47044 79623 115655 112506 63549 -4822
496d822o3603n5946m4509o019N9981R6678P5065J4137j9635j0023J2222J5709
$$ -4822 -68425 -124371 -168880 -174899 -114918 -18240 56825 70962 51327 41304 53526 69235
508F9235O992j001p720k4791o0426q1905n4234J8388O4736O3171L2658J3347M363
$$ 69235 76227 75226 67506 42715 -17711 -99616 -153850 -135462 -70726 -7555 25103 38450 42813
521D2813o403j6410j2790R922L5449K6892k1586o2650n7912k1527J0312K6266
$$ 42813 36410 20000 7210 17132 52581 79473 57887 -4763 -62675 -84202 -73890 -47624
533d7624L2844L7605K7682m228l9439m4543p586L1772M6632J9508j2071k1671
$$ -47624 -14780 22825 50507 46279 6840 -37703 -45289 -13517 33115 52623 40552 18881
545A8881k5200k3209j4556J0373L8237M4953J1160l3880n1546l5940j041J8096
$$ 18881 -6319 -29528 -44084 -33711 4526 49479 60639 26759 -24787 -60727 -61768 -43672
557d3672K4509L0609K9090R219k2304l7105j4697J9671L9935K5173q167l4765
$$ -43672 -19163 11446 40536 49755 27451 -9654 -24351 -4680 35255 60428 52261 17496
569A7496l7872l5641k5405k746L2791N3187M0845N502k3685k3217j181J9244J8753
$$ 17496 -20376 -56017 -81422 -84168 -51377 1810 42655 48157 24472 1255 74 19318 38071
582C8071J2287J389j7189m0595n1613l6787M157M0742M7144K9505N829o788r754
$$ 38071 50358 51747 34558 -6037 -57650 -94437 -90280 -49538 -2394 27111 32940 26152 16398
595A6398o312j178J2539K5157J4714j6814m7357m9339k7286M509K4510L4241K9806
$$ 16398 10086 8908 21447 46604 61318 44504 -2853 -52192 -79478 -74969 -50459 -16218 13588
608A3588J8990J892j6843k0484k552K0553K8205R750j4654l1722l5978k7823r165
$$ 13588 32578 34470 17627 -2857 -5409 15144 43349 53099 38445 6723 -29255 -57078 -66243
621f6243J0408L1870L9929K1650n722k3770j7909R58J5689J8245J4026P9j7599
$$ -66243 -55835 -23965 15964 37614 31892 8122 -9787 -8829 6860 25105 39131 39210 21611
634B1611l2696l2735j9827J0589L4675L3919J4045k873j4015j6544q457M067K0018
$$ 21611 -11085 -43820 -63647 -53058 -18383 15536 29581 26708 12693 -3851 -12308 -8241 11777
647A1777K2107J0480j4766l2756l5257j6534Q341K2745K5876K2062O642j1815
$$ 11777 33884 44364 29598 -3158 -38415 -54949 -46608 -23863 2013 24075 30717 18902
659A8902k0881j2537L606K0080K4860P756j2984k9166k8729j8362m086J7781K8588
$$ 18902 -1979 -14516 -10910 9170 34030 41786 28802 -364 -29093 -47455 -51541 -33760 -5172
672e172K6325R071r124j9563j1444K224J7400J7919R661n946k1198l0794k6004
$$ -5172 21153 30224 21100 1537 -9907 -7683 9717 27636 37297 31351 10153 -20641 -46645
685d6645p485J6113K7547K5278J0080o901j3359r242K081R547J6746J3824m361
$$ -46645 -54130 -38017 -10470 14808 24888 17987 4628 -4614 -2533 7014 23760 37584 33223
698C3223k1416l0101k3134o820R673K3445K2527J1690j07q714j3211m931Q729J7604
$$ 33223 11807 -18294 -41428 -48248 -38575 -15130 7397 19087 18980 10266 -2945 -7876 853 18457
712A8457J3443J25j4960k4815k1571j0708N565J9818K0613J4930j8j4059j5193
$$ 18457 31900 32025 17065 -7750 -29321 -40029 -34464 -14646 5967 20897 20879 6820 -8373
725h373n864M520J4650J5737O054o510j6828j8866r833J484J6195K0673J0326
$$ -8373 -14237 -9717 4933 20670 26724 20214 3386 -15480 -25313 -23829 -7634 13039 23365
738B3365k220j3357j9186j4602j662J1598J6385J5281K409o506j2516r900K710
$$ 23365 21145 7788 -11398 -26000 -27662 -16064 321 15602 18011 11505 -1011 -10911 -8201
751h201J4239J6630P954m955j9295k4739j8803n600P016J9138K0169J0992n28n673
$$ -8201 6038 22668 30622 25667 6372 -18367 -37170 -42770 -35754 -16616 3553 14545 14017 8344
765H344k897K506R754J4787Q691r347k1929k8410k4346j2765L470K0219K2282
$$ 8344 5447 7953 17707 32494 41185 31838 9909 -18501 -42847 -55612 -52142 -31923 -9641
778i641J4490J0209R78j121M195J0100R626N610p528k0689l0364k6536j6435m74
$$ -9641 4849 15058 16036 14915 19110 29210 38836 44446 36918 16229 -14135 -40671 -57106 -57580
792e7580J6028K1147J7966J1451M948L697M941O765Q546N446n575j8797k5761
$$ -57580 -41552 -20405 -2439 9012 13960 17657 22598 29363 37909 43355 37780 18983 -6778
805f778k6034j9008l220J2172J8939J8294J2781M972K420K306N164O989N476k273
$$ -6778 -32812 -51820 -55040 -42868 -23929 -5635 7146 12118 14538 16844 22008 28997 34473 32200
819C2200j0725k0051k4492j5140l286O229J6270J6343J0709J653j321j926J044
$$ 32200 21475 1424 -23068 -38208 -41494 -35265 -18995 -2652 8057 9710 8389 6463 7507
832G507N988O977K526m743j3738j5050j2153k775N411J4672J0667P341j967p584
$$ 7507 13495 20472 22998 18255 4517 -10533 -22686 -25461 -20050 -5378 5289 12630 10663 3079
846C079q564k447K276Q658Q924K25n223r121o552k515N154J1161J0454K936n270
$$ 3079 -5485 -7932 -5656 3002 11926 12151 6928 -2193 -8745 -11260 -6106 5055 15509 18445 13175
861A3175j3862j1742p440Q23N535J0193Q041K95j696l572R14O809P668P235P79p266
$$ 13175 -687 -12429 -19869 -19046 -13511 -3318 4723 5018 3322 -250 664 7473 15141 22376 23155 15889
877A5889j4199j5882j1649m495O578J0144R636O338P20R48L170O039P281L681J389
$$ 15889 1690 -14192 -25841 -30336 -23758 -13614 -3978 2360 3080 4028 7198 13237 20518 24199 25588
892B5588p263j4655j6611j3075m918L309Q282J0297O991M576M337K713L832N258
$$ 25588 18325 3670 -12941 -26016 -30934 -27625 -19343 -9046 -2055 2521 6858 9571 13403 18661
906A8661M205J013n577j1969j5076j0978n721N96M115R472R632O485J479M92J485
$$ 18661 22866 23879 18302 6333 -8743 -19721 -25442 -24846 -20731 -11259 -1627 4858 6337 6829 8314
921H314N719L357J681m670q650q415r884p447n33N237Q318Q725K023Q82j573J524
$$ 8314 14033 17390 19071 14401 5751 -2664 -12548 -19995 -20528 -15291 -6973 1752 3775 4657 3084 4608
937D608K361K015R03N50l334p678r529m254J059N646O666K912J614l39j407j813
$$ 4608 6969 8984 9887 10437 7103 -575 -10104 -14358 -13299 -7653 -987 1925 3539 3200 1793 -20
953b0Q8J673N123J379l224o569n516j425J786M037L756K173K867j708m223m006
$$ -20 68 1741 6864 8243 5019 -1550 -7066 -8491 -6705 -2668 1088 3261 6128 4420 197 -3809
969c809j719L590L395R60j039l009m30j279p26K818M780L997J455m448n052k209
$$ -3809 -5528 -1938 1457 2417 1378 -1631 -2061 -3340 -4066 -1248 3532 7529 8984 4536 -516 -2725
985b725N92O86n71P55R21J172k016k520M12L565L963K029j500l551n65p62j870
$$ -2725 -2133 -1447 -2018 -1263 -342 830 -1186 -3706 -3294 271 4234 6263 4763 1212 647 -115 -1985
1002a985l168K016K321L019j557k569p43J921J342N75P40o28K630q75l212l334
$$ -1985 -5153 -3137 -816 2203 646 -1923 -2666 -745 597 1172 1912 1284 3914 3039 -173 -3507
1018c507M05K516M84o07L7m70K185j99j059r18L070K342r85j763m111P68J238O29
$$ -3507 -3102 -586 -102 -709 -672 -1142 1043 844 -215 -1133 1937 4279 3294 1531 -2580 -1812 -574 55
1036E5j669o57K628K409j164k073k443K199L646j163q01J54r93M54j128r24r41K453
$$ 55 -1614 -2271 357 2766 1602 -471 -2914 -715 2931 1768 967 1121 128 582 -546 -1470 -2411 42
1054D2j68K01j757K26J533K431j321j801r53K606J459k955k293J989K064k00k415
$$ 42 -126 75 -1682 -1456 77 2508 1187 -614 -1567 1039 2498 -457 -2750 -761 1303 1103 -1312
1071a312l343J966K838R76N28j988J323J426j765k243l35K244J769j550k463j394
$$ -1312 -4655 -2689 149 1125 1653 -335 988 2414 649 -1594 -1929 315 2084 534 -1929 -3323
1087c323J493L074O9j055P44J926j790j854k522P01L704K002j611k717N70o31J061
$$ -3323 -1830 1244 1313 258 1002 2928 1138 -716 -3238 -2537 1167 3169 1558 -1159 -589 -1220 -159
1104a59J179j219J633J530n5l373k331j564L090K754l11j317l04K229j009k274
$$ -159 1020 -199 1434 2964 2909 -464 -2795 -4359 -1269 1485 1174 -143 -447 1782 773 -1501
1120a501K027J903J990j071l684l981J414K99p55j624K765K496K560n13l723j14
$$ -1501 526 2429 4419 3348 -336 -4317 -2903 -2604 -3359 -4983 -2218 278 2838 2325 -1398 -1512
1136a512N297K718j415p69k480j017l465j614k722R29L643K626j138O6o05L232
$$ -1512 3785 6503 5088 4319 1839 822 -2643 -4257 -6979 -6050 -2407 219 -919 -853 -1458 1774
1152A774K267P12L71J644O29l331n644n854M0J424K160Q49m9J402J242j240J163
$$ 1774 4041 4753 5124 6768 7397 4066 -1578 -7432 -7392 -5968 -3808 -2959 -3008 -1606 -364 -1604 -441
1169d41K938N821K733j938l965m434k323k857n26k040R87K654K88k255j849K040
$$ -441 2497 8318 11051 9113 5148 714 -1609 -4466 -4992 -7032 -6045 -3391 -3103 -5358 -7207 -5167
1185e167N450O820K675R27j029k730n278m393j164j433L097m54l200l742M24J476
$$ -5167 283 7103 9778 10705 9676 6946 1668 -2725 -3889 -5322 -2225 -2679 -5879 -9621 -9197 -7721
1201g721L403O026O460M024J314k486n584m121k332J632K62l972l366k547k494
$$ -7721 -4318 1708 8168 12192 13506 11020 5436 1315 -1017 615 877 -3095 -6461 -9008 -11502
1216a1502n8J367O705P036O941O73k590j526j354p38j764K15l101k582l747n419
$$ -11502 -11560 -10193 -3488 3548 10489 11162 8572 7046 5692 4954 3190 3405 304 -2278 -6025 -11444
1232a1444k777J026O343N699L952M559j317P30p5j868M07J902k93k780o715n653
$$ -11444 -14221 -13195 -6852 -1153 2799 7358 6041 6771 6696 4828 5235 7137 6844 4064 -2651 -8304
1248h304m561K52K859L023O119L099J002N25j997Q69K960L592J88p70m848m613
$$ -8304 -12865 -12613 -9754 -6731 -612 2487 3489 4014 2017 2886 5846 9438 9626 8856 4008 -605
1264f05n715n476K137J689L887J219L31j273O92J899L191N183M853J956k784m246
$$ -605 -6320 -11796 -9659 -7970 -4083 -2864 -2533 -3806 -3114 -1215 1976 7159 12012 13968 11184 6938
1280F938o498p294j631Q46K879q41ql786m08K037M600P035P970M501R03n212o966
$$ 6938 440 -6854 -8485 -7639 -4760 -5601 -5609 -9395 -9803 -7766 -3166 3869 11839 16340 17243 12031 5065
1297E065m221l441o09r09j225k352k553n077O3M702J0081R859M508Q49M56l973
$$ 5065 844 -2597 -3206 -4115 -5340 -7692 -10245 -15322 -15259 -10557 -476 9383 13891 14740 15196 11223
1313A1223n714j514n497K057k233j830p539l313k107J571Q685O784P922M685J289
$$ 11223 5509 3995 -1502 555 -1678 -3508 -11047 -14360 -16467 -14896 -6211 573 8495 13180 14469
1328A4469k847m806k000j625k70j509k208n768o499j004q63M139O420P195P080
$$ 14469 11622 6816 4816 3191 2921 1412 -796 -6564 -13063 -14067 -14930 -10791 -4371 2824 9904
1343I904Q42j508k967p31j47k19L57k696m241n512n105j800J670O499N917M805
$$ 9904 10746 9238 6271 5540 5393 5174 5531 2835 -1406 -6918 -12023 -13823 -12153 -5654 263 5068
1359E068J711k421j488N25JQ39L689n78k967m857p083m228J771M047L893M265p9n12
$$ 5068 6779 4358 2870 3395 3396 4235 7924 7346 4379 -478 -7561 -11789 -10018 -5971 -2078 2187 2108 1596
1377A596j384k610J852L673L581M399k007n495n657n717P00O77M239L519M91l005
$$ 1596 212 -2398 -546 3127 6708 11107 9100 3605 -2052 -7769 -7069 -6392 -2153 1366 1857 -1148
1393a148k597j96n60N087O229K252M86l529m781n482k444J151M292K483Nr4m155
$$ -1148 -3745 -3941 -4501 586 6815 9067 9553 6024 1243 -4239 -6683 -5532 -1240 1243 1248 1154 -3001
1410c001l325J262L830M143M778J702j916n103n130j911N51K110L718j304l5l953
$$ -3001 -6326 -5064 -1234 2909 7687 9389 7473 2370 -2760 -4671 -4120 -2010 1708 404 369 -3584
1426c584j418J90J980M567M574J720K5m022n607k806q89K010L409R70m36k138k699
$$ -3584 -5002 -4812 -2832 1735 6309 8029 8054 4032 -1575 -4381 -5270 -3260 149 1119 683 -1455 -4154
1443d154K62o87L764N674L628o73j678o292l224j246L29K985J843K86k909l177
$$ -4154 -3892 -4579 -815 4859 8487 7814 6136 -156 -3380 -4626 -4297 -1312 531 817 -2092 -5269
1459e269r88J285L945M966M849Q90p99n601n688r72l39J182J775q07j769k928k229
$$ -5269 -6257 -4972 -1027 3939 8788 9678 8879 3278 -2410 -3382 -3721 -2539 -764 -1571 -3340 -6268 -8497
1476h497J32M148P517O317J274j15m482l881k307j386J615r45q32k386m927k963
$$ -8497 -8365 -4217 3300 9617 10891 10776 6294 2413 106 -1280 335 -610 -1442 -3828 -8755 -11718
1492a1718L95N058P409O338L966K117l374m165k377k298K4P77k615n748n937l780
$$ -11718 -11323 -6265 1144 7482 11448 13565 10191 6026 3649 1351 1375 2152 -463 -6211 -12148 -15928
1508a5928N46L333O755Q171P468K001J392l915l419n53M59j012n063m521o026m135
$$ -15928 -15382 -12049 -5294 2877 10345 12346 13738 9823 6404 5851 6310 5298 235 -4286 -10312 -14447
1524a4447l426J589O176P990O798N342K772j827r40j26j657m47j641n477n218o942
$$ -14447 -17873 -16284 -10108 -2118 4680 10022 12794 10967 10027 9901 8244 7797 6156 679 -4539 -11481
1540a1481o705r43N579N848O615L737L350L061j606O31N95K635l7m425m467p306
$$ -11481 -18186 -19129 -13550 -7702 -1087 2650 6000 9061 7455 8086 8681 11316 11279 6854 2387 -4919
1556d919p537k555J049K853L936O244J849L89l56R32N843M037K872P8m873n257
$$ -4919 -12456 -15011 -13962 -11109 -7173 -929 920 1309 953 1885 7728 11765 14637 14715 9842 4585
1572D585o894n870l060J206K093Q19O27j759M05L794M046N469O592L622L277m795
$$ 4585 -2309 -8179 -11239 -10033 -7940 -7121 -6494 -8253 -7848 -4054 -8 5461 12053 15675 18952 14157
1588A4157p564o039l983q46k066j395n044r65k412K982K859P741J1387P630L319
$$ 14157 6593 554 -3429 -4275 -6341 -7736 -12780 -13745 -16157 -13175 -10316 -2575 8812 16442 19761
1603A9761j636m955j789l285n496m268n839k523o418m244k238L987J0397J0177
$$ 19761 18125 13170 11381 8096 2600 -1668 -7507 -10030 -16448 -20692 -22930 -18943 -8546 1631
1617A631Q175N773L147J835k917m581l480m798k384p009q880q233j902K218N359
$$ 1631 9806 15579 18726 20561 17644 13063 9583 4785 2401 -4608 -13488 -21721 -23623 -21405 -16046
1632a6046P662P848R706P452K770k142k975P41j548m209q198p091o981m418l453
$$ -16046 -8384 -536 9170 16622 19392 17250 14275 15016 13468 9259 1061 -6030 -13011 -17429 -20882
1647b0882j578O182J0136R318L467K494J614K577K309k620j498k331l799p188r128
$$ -20882 -22460 -16278 -6142 3176 6643 9137 10751 13328 15637 13017 11519 9188 5389 -1799 -10927
1662a0927p269j641M991N012L409L369L257M394J892R36J472N382K217k546r515
$$ -10927 -18196 -19837 -14846 -9834 -6425 -3056 201 4595 6487 7423 8895 14277 16494 13948 4433
1677D433q156l440k337j743j237J036M444K598o84m62M177Q138O412L209l295j789
$$ 4433 -3723 -7163 -9500 -11243 -12480 -11444 -7000 -4402 -5086 -5548 -1371 6767 13179 16388 13093 11304
1693A1304k340m204p886l474j295J286p4m314l073J281O672O178M164L052N698
$$ 11304 8964 4760 -3126 -6600 -7895 -6609 -6683 -10997 -14070 -12789 -6117 61 4225 7277 12975
1708A2975L193m62o582o315n97j301k135p222n094L33P01K529l52O644Q604P255
$$ 12975 16168 15706 9124 2809 2212 911 -1224 -8446 -13540 -13207 -12506 -9977 -10329 -3685 4919 12174
1724A2174K779m033j328R04j144l627n251n998J54k250n791m241K189Q597Q748
$$ 12174 14953 10920 9592 10496 9352 5725 474 -5524 -5370 -7620 -13411 -17652 -15463 -6866 1882
1739A882L066R41K235M126N84n069l769j147K587m893o567p637j677N612K161K470
$$ 1882 4948 5889 8124 12250 12834 7765 3996 2849 5436 543 -6024 -13661 -15338 -9726 -7565 -5095
1755e095L052O375N110l53l984m23J421L630j858q270l215k181O70l449l416L523
$$ -5095 -2043 4332 9442 9089 5105 4682 6103 9733 7875 -395 -3610 -5791 -5121 -8570 -11986 -8463
1771h463P558N005J94l573o19M754L805k058k555j944J69q05o978o464K008O540
$$ -8463 -905 4100 4294 721 102 4856 8661 6603 4048 2104 2273 1468 -5510 -11974 -9966 -3426
1787c426L817o81l522K379N359N00k971r33K303N201j555q620l857J207K401J536
$$ -3426 391 -290 -3812 -1433 3926 4426 1455 522 2825 8026 6471 -2149 -6006 -4799 -2398 -862
1803h62k687j081L730M520r71m867j8O127L239k127m495k936J901J283l630l669
$$ -862 -3549 -4630 -900 3620 2649 -2218 -2236 3891 7130 5003 508 -2428 -527 756 -2874 -6543
1819f543J091N911K987l456l968J435N653K463j413l888R25L651j812o311n227
$$ -6543 -5452 459 3446 -10 -3978 -2543 3110 5573 4160 272 1197 4848 3036 -3275 -8502
1834h502K003O336K181k635l795L017M801J180k880q18M477L320l277o581n162
$$ -8502 -6499 -163 2018 -617 -4412 -1395 3406 4586 1706 888 5365 8685 5408 -1173 -6335
1849f335L016K407J287o552n2M901M187j589l875J025O081O704k693p517k684K505
$$ -6335 -3319 -912 375 -6177 -6229 -1328 2859 1270 -2605 -1580 4501 11205 8512 995 -1689 816
1865H16J668m792o858J910N151L090n044m090M413P309L236m7l631J651N189k409
$$ 816 2484 -2308 -9166 -7256 -2105 985 -4059 -8149 -3736 3573 6809 6762 3131 4782 9971 7562
1881G562q383m939Q62N882k409n562m387L331P098J226k066J072P568O620j181
$$ 7562 -821 -5760 -4898 984 -1425 -6987 -11374 -8043 -945 281 -1785 -713 6855 13475 12294
1896A2294p996k823Q47K202l838q364l542M535J510l951k132K242J1540P266j056
$$ 12294 4298 1475 2322 4524 686 -7678 -11220 -6685 -5175 -9126 -11258 -9016 2524 9790 8734
1911H734j977p0M070K104q119o563k255J800m18q198n982L693P192N509j56N42P047
$$ 8734 6757 6687 10757 12861 4742 -1821 -4076 -2276 -2694 -10892 -16874 -13181 -5989 -480 -636 -94 6953
1928F953P006N8n352k987l07K902m731j0278n629R20L904k349k244J795J0050
$$ 6953 13959 14017 8665 5678 5371 8273 3542 -6736 -12365 -11445 -7541 -9890 -12134 -10339 -289
1943b89P782J31k866J191O961J485m550q568l757J066j215o364p133K139Q520L572
$$ -289 7493 7624 4758 5949 12910 14395 9845 1277 -2480 -1414 -2629 -8993 -16126 -13987 -5467 -1895
1959a895q91k283O051Q774M432m602k714J320L032m457r504p375O27K909j385l525
$$ -1895 -2786 -5069 982 9756 14188 9586 6872 8192 11224 6767 -2737 -10112 -9485 -6576 -7961 -11486
1975a1486j87N865P448L204k856J205P999M601k082q114m707K301j577n234p889
$$ -11486 -11673 -5808 1640 4844 1988 3193 11192 15793 13711 5597 890 3191 1614 -3620 -11509
1990a1509k812M753L631k040k740N352J0536O396K65l978R04N782k588q768o814
$$ -11509 -14321 -9568 -5937 -7977 -10717 -5365 5171 11567 11832 7854 8758 14540 11952 3184 -3630
2005c630k406J397k952n834m211M295R333M019L28J01P849P632o62l891p248J338
$$ -3630 -6036 -4639 -7591 -13425 -17636 -13341 -4008 11 339 440 8289 15921 15259 11368 4120 5458
2021E458J375o403j0321m712K428M272j059m189L825Q387R945J480l307J481M811
$$ 5458 6833 430 -9891 -14603 -12175 -7903 -8962 -13151 -9326 -939 9006 10486 7179 8660 13471
2036A3471J698p620p717m215J420l7o866p206L770O686N682k190J046N026R169
$$ 13471 15169 7549 -168 -4383 -2963 -3000 -9866 -17072 -13302 -6616 -934 -3124 -2078 2948 12117
2051A2117K661m700o285K191K687l131j0030p089J120M796k277m456J244P493P961
$$ 12117 14778 10078 3793 5984 8671 5540 -4490 -11579 -10459 -5663 -7940 -12396 -11152 -3659 4302
2066D302M47k233J77O743M287k863q346k591K031K51o783p762l4L617O081k013
$$ 4302 4749 2516 2693 9436 13723 10860 2514 -77 1954 2205 -4578 -12340 -12374 -8757 -2676 -4689
2082d689j120L887P388M740j284m283K311L441m81p428q200j200L477k89n925m342
$$ -4689 -5809 -1922 5466 10206 8922 4639 6950 10391 9910 2482 -5718 -6918 -3441 -3730 -9655 -13997
2098a3997N715P239L342k707m04P476N698n90o571l977K141J513l617r232l782
$$ -13997 -8282 -1043 2299 -408 -812 6664 12362 11772 5201 1224 3365 4878 1261 -7971 -11753
2113a1753M007L600m54m080J212Q969O072q41l123J412L931J704n815p828l226
$$ -11753 -7746 -4146 -4600 -8680 -7468 1501 7573 6732 3609 5021 8952 10656 4841 -2987 -6213
2128f213M980P38n868l868K69Q672K883k461r84M472P030J570n433l737q20K048
$$ -6213 -1233 -495 -6363 -10231 -9962 -1290 1593 -868 -1852 2620 9650 11220 5787 2050 1230 3278
2144C278j084o410m157J811N402n60n105J30N463O442N28l176n51K657M787m377
$$ 3278 2194 -4216 -8373 -6562 -1160 -1720 -6825 -6695 -1232 5210 5738 2562 2011 4668 9455 5078
2160E078o232l684L737K806l228n410M12N634L637k743l406L133N844J801m441
$$ 5078 -1154 -4838 -1101 1705 -1523 -6933 -6521 -887 2750 7 -3399 -266 5578 7379 2938
2175B938l533j58N743j380n577k318RM889L63l649k915M100N318J451m266j131
$$ 2938 -595 -753 4990 3610 -1967 -4285 -4276 613 976 -2673 -5588 -1488 3830 5281 1015 -116
2191a16J373L255q21o085j381J750L653j284l703j711L360M123j48m803J889K952
$$ -116 1257 4512 3691 -2394 -3775 -2025 1628 344 -3359 -5070 -1710 2413 2265 -2538 -649 2303
2207B303L810l006n028p32L983J610k971m410M99L289K109k125j459J265N868p6l034
$$ 2303 6113 3107 -1921 -2653 1330 2940 -31 -4441 -3942 -653 1456 -669 -2128 -863 5005 4929 1895
2224A895m305J844L673J55m879k461J773L399m93l959j798M180M556o00k325k005
$$ 1895 -2410 -566 3107 3262 -1617 -4078 -2305 1094 601 -3358 -5156 -976 3580 2980 655 -1350
2240a350L534L531l055l645l141M636K378l812l861j728M791L863l178p67K043
$$ -1350 2184 5715 2660 -985 -4126 510 2888 -924 -4785 -6513 -1722 2141 -1037 -1804 239
2255B39L677K379l314l785Q60L064l16m546l681J596J642M91j697j656K602N047
$$ 239 3916 6295 2981 -804 56 3120 2804 -1742 -5423 -3827 -2185 -1694 -3391 -5047 -2445 2602
2271B602K042l090j028L146K286M43m904l871J107J382j723m169l434M005L954
$$ 2602 4644 1554 526 3672 5958 6401 1497 -2374 -1267 115 -1608 -5777 -9211 -5206 -1252
2286a252J710k463J09O380L445k149k711o39K561L72n046n227j732Q76K284j711
$$ -1252 458 -2005 -1896 4484 7929 5780 3069 2430 4991 5363 317 -4910 -6642 -5766 -3482 -5193
2302e193j333K492N300K740l03q69K780J603K804n726m028k485O80j134m911q06
$$ -5193 -6526 -4034 1266 4006 3703 2834 5614 7217 10021 4295 267 -2218 -1538 -2672 -7583 -8389
2318h389J917M580J282j232P85L442N916J23k278j767J252j404m228n330k590J799
$$ -8389 -6472 -1892 -610 -1842 -1057 2385 8301 8424 6146 4379 5631 4227 -1 -5331 -7921 -6122
2334f122J697M24j141J16M630M169J234j580K294J051J479l627n026o08J51J39m421
$$ -6122 -4425 -4001 -5142 -5026 -396 3773 5007 3427 5721 6772 8251 4624 -402 -1010 -859 -720 -5141
2351e141j913J478J406K023p07J30L650M773J824k264k641Q46K069k830l638j869
$$ -5141 -7054 -5576 -4170 -2147 -2854 -2724 926 5699 7523 5259 2618 3464 5533 2703 -935 -2804
2367b804K94N70k36l929r34K315L369J549M99R20K667L630k094k373j981K960j580
$$ -2804 -2510 -1940 -2176 -6105 -7039 -4724 -1355 194 693 1613 4280 7910 5816 3443 1462 4422 2842
2384B842l175m125q34Q25m74j778O90K407M065K767J062j089K925N62J581k513
$$ 2842 -333 -4458 -5292 -4467 -4941 -6719 -6029 -3622 443 3210 4272 3183 6108 6670 8251 5738
2400E738n307j038j908j986k295j747N52M133K162K35J283K607M712P27j037j653
$$ 5738 431 -607 -2515 -4501 -6796 -8543 -7991 -3858 -1696 -1461 -178 2429 7141 7868 6831 5178
2416E178j29N6m074n327l721K75R43K14K72L101L096L547mP11J439L115l50k613
$$ 5178 5049 5105 1031 -4296 -8017 -7742 -6799 -6585 -6313 -3212 -116 3431 3427 4138 5577 8692 8342 5729
2434E729m378l133k87k528k306o37K21L264K928m29P37L372K218J941j348j262
$$ 5729 1351 -1782 -2069 -4597 -6903 -7540 -7319 -4055 -1127 -1556 -819 2553 4771 6712 5364 4102
2450D102j63o00j861o168m98J540J640j536j395J285K111K324O90M2J210J585m1p99
$$ 4102 3939 3339 1478 -4690 -5188 -3648 -2008 -3544 -4939 -3654 -1543 781 1471 1513 2723 4308 4267 3468
2468C468k953m46M20J37k762j011j6P97J568j840p02K541K254J976n17o21q27J620
$$ 3468 515 69 489 626 -2136 -3147 -3163 -2366 -798 -2638 -3340 -799 1455 3431 2914 2293 1466 3086
2486C086j25r30j158o21q17J94l689j396N24K748K134j58j26J773J500P40j016
$$ 3086 2961 2031 873 252 -565 -371 -4060 -5456 -4932 -2184 -50 -208 -334 1439 2939 3679 2663
2503B663L15k52K58p80l796k68j999o70P79P5O67K136L222j606k47J366J992m0m12
$$ 2663 2978 2726 2984 2204 -1592 -1860 -3859 -4529 -3750 -3675 -3008 -872 2350 744 497 1863 3855 3815 3403
2522C403p87k741j553p35j186j883J725K593J490M11m82N61K285J109m7l229J522
$$ 3403 2616 -125 -1678 -2413 -3599 -5482 -3757 -1164 326 737 255 816 3101 4210 4163 934 2456
2539B456o6k492q39j933O6K40J201q24P53j1J621l44K427j178K326l2j978j559
$$ 2456 2390 -102 -941 -2874 -2808 -2568 -1367 -2191 -1438 -1449 172 -172 2255 1077 3403 3371 1393 -166
2557a66l04r62j35l72n39R36J104m02m1P79J338P23J083j135j670M08q48r65m19
$$ -166 -470 -1432 -1567 -1939 -2478 -1542 -438 -840 -881 -102 1236 1959 3042 1907 237 645 -203 -1168 -1587
2576a587j086P59J539N24j831K35K249J50m26m69O99J147l03k052k21o40M13P15
$$ -1587 -2673 -1914 -375 149 -1682 -1447 802 952 526 57 756 1903 1600 -452 -673 -1313 -900 -185
2594a85j46l99O89N9P22J21j62M36J240l99k47k131q75N12p7j68n07K248p85Q53
$$ -185 -331 -730 -41 18 740 861 699 1135 2375 1976 1729 -402 -1277 -765 -842 -1010 -1517 731 -54 799
2614G99p87K38M81Q26N54p99r13n28n38O4M71K80j473J469p72P9p00J423O83k45
$$ 799 12 250 731 1557 2111 1312 399 -129 -667 -603 -132 148 -1325 144 -628 -549 -1249 174 857 612
2634F12J493j715J474j582q29m19j106P60j17J738j243n1Q86j50J10J471m83J01
$$ 612 2105 390 1864 282 -547 -966 -2072 -1312 -1429 309 -934 -985 -99 -249 -139 1332 849 950
2652I50J85j161O52n09O79q38p10O85j44l00q26O79l36Q24J55m12o4J807j048M07
$$ 950 1135 -26 626 117 796 -42 -752 -67 -211 -511 -1337 -658 -994 -170 -15 -427 -491 1316 268 675
2672F75k94n39R53l49l22o7q69n81N68k6k68N08k81K72J411n35j33J410k62J097
$$ 675 381 -158 795 446 124 57 -812 -1393 -825 -851 -1119 -611 -892 -620 791 256 123 1533 1271 2368
2692B368r48m21j230p76j466k38O56o06P93J227J33R07J807P4J11jl07m75r70j503
$$ 2368 1420 999 -231 -1007 -2473 -2711 -2055 -2661 -1868 -641 -508 399 2206 2280 2391 2390 2083 1608 638 -865
2712h65j591L95k07J25q24O73K480J000J86J805q53K183k104k89k040K72k807m10
$$ -865 -2456 -2061 -2268 -2143 -2967 -2294 186 1186 1372 3177 2324 4507 2403 2114 74 346 -2461 -2871
2730b871o62J26J151K51L093q41O79J035J345n71k84p86n68j119j620l50j166P37
$$ -2871 -3533 -3407 -2256 -2005 1088 247 926 1961 3306 2735 2451 1665 1097 -22 -1642 -1992 -3158 -2421
2748b421r00J493R6J053P69O51N26J230q73k72L14j474J74j862Q57k141Q88J555
$$ -2421 -3321 -1828 -1732 -679 90 741 1267 2497 1624 1352 1666 192 366 -1496 -639 -2780 -1892 -337
2766c37j059K161r43J84J006p01Q13n47p55P09j284N85n22J184R15j976L4O29k95
$$ -337 -1396 765 -178 6 1012 311 1124 577 -178 531 -753 -168 -690 494 1409 -567 -533 96 -199
2785a99m78q77R08m22m03O38J000j67L56J216q03j10O56M58j385j373k26K12r99
$$ -199 -677 -1554 -646 -1068 -1471 -833 167 0 356 1572 769 659 1315 1773 388 -985 -1211 -999 -1998
2804a998M17l72R12n4J74J592J332m51J232p82P01j049j476k439l07J358j744O66
$$ -1998 -1581 -1953 -1041 -1095 -921 671 2003 1552 2784 2002 2703 1654 178 -2261 -2568 -1210 -2954 -2288
2822b288R50L01L66K583J60m27Q58M1r86o84j7k901l02O92J21L6l90J099P49Q68
$$ -2288 -1338 -1037 -671 1912 2072 1645 2503 2544 1558 874 857 -2044 -2346 -1654 -1533 -1497 -1887 -788 -39 829
2842H29Q14J55J69L07r5j385j956Q71j315m19p47L89K066j45J84N57O03L06k92k3
$$ 829 1643 1798 1967 2274 2179 794 -1162 -291 -1606 -2025 -2772 -2383 -317 -462 -278 279 882 1188 896 873
2862H73P44r43l78r97R0j169K32J54L90K88J448j144Q01J277j493L53o61Q04j076
$$ 873 1617 674 296 -701 -611 -1780 -1548 -1394 -1004 -716 732 -412 389 1666 173 526 -135 669 -407
2881d07j59P54j486m3M47J179j41n04N91l0J44q0l48p2j008J966l65j346J642j073
$$ -407 -566 188 -1298 -1341 -894 285 144 -360 231 201 345 265 -83 -155 -1163 803 438 -908 734 -339
2901c39J255KM24n31o53m37O09q85P03K51p31n95N44m06N98M36k1L94j45N82n84
$$ -339 916 918 1342 811 158 -279 330 -555 148 399 -332 -927 -383 -789 -191 245 224 618 473 1055 471
2922D71p50J95R1O01j129J066q13o43J078o68N1j1J344o0p60m94J087m47J11j87
$$ 471 -279 -84 7 608 -521 545 -268 -911 167 -501 -450 -461 883 823 63 -431 656 209 320 133
2942A33q6n57k98J055J1R96j381O41r47O33N13k7Q77k413J083P5o87k89M28l85J424
$$ 133 47 -510 -808 247 258 1254 -127 514 -433 200 713 686 1563 -850 233 308 -379 -668 -240 -625 799
2963G99j854J10J024l74K32J16j050l7L75P38N7m18K47Q55j426J006O01l32q57J16
$$ 799 -1055 -945 79 -295 -63 53 -997 -1034 -659 79 136 -282 -35 820 -606 400 1001 669 -188 -72
2983g2K21R32j337j7q58J977j016O81K07l40J05j236J99P31P11k124J920J034j275
$$ -72 149 1081 -256 -273 -1131 846 -170 511 718 378 483 -753 -554 177 888 -1236 684 1718 443
3002D43j503J991l76r79K45l38K06R54j220o63J063L35K11p06J4M41o86j21K95o89
$$ 443 -1060 931 555 -424 -179 -517 -311 643 -577 -1240 -177 158 369 -337 -323 118 -568 -689 -394 -1083
3022a083P71J192p02p76Q79n45R93L32q77J42n1q68N39k82m82J245k43J37q9j110
$$ -1083 -312 880 178 -598 281 -264 729 1061 184 326 275 -593 -54 -336 -818 427 184 321 232 -878
3042h78J261j134R81m43L66J44p89k91j38P33j310J686R7o45j24P13l61N49l69J233
$$ -878 383 -751 230 -213 153 297 -492 -783 -921 -188 -1498 188 285 -360 -484 229 -132 417 48 1281
3062A281n70p23O0j084p71J109M42m85L78K17J018J66m44N28o2j654O78J46nq17
$$ 1281 711 -12 48 -1036 -1807 -698 -256 -741 -363 -146 872 1038 594 1122 1060 -594 84 230 225 -592
3082e92j72K47N06o3L22l14L48k7J099p32mK147k014k37j219N98n88q55J58L81Q8
$$ -592 -764 -517 -11 -74 248 -66 282 255 1354 622 618 2765 751 514 -705 -107 -695 -1550 -1392 -1011 -923
3103i23j63j88J892q35L06Q08j4p6K28L0q59n90k63Q70j655O61N75k33J314n87R28
$$ -923 -1086 -1274 618 -217 89 897 883 807 1035 1065 206 -384 -647 223 -1432 -771 -196 -429 885 298 1226
3124A226j057P39K17N62j126j38N76j082J63n07M58l48n22o69J359o11P99M72M11
$$ 1226 169 908 1125 1687 561 423 999 -83 80 -427 31 -317 -839 -1508 -149 -760 39 511 922
3143I22n44R13j07j467R59m52k43m98O7L41j515R21j155Q99o07J456L66J42Q53q77
$$ 922 378 1291 1184 -283 676 224 -19 -517 -450 -109 -1624 -703 -1858 -959 -1566 -110 256 398 1251 374
3163C74L60n59J373p59o92k5j76j133J75k242J482L92rJ831l43O6K289j333K89k67
$$ 374 734 175 1548 789 97 72 -104 -1237 -1062 -3304 -1822 -1430 -1439 392 49 115 2404 1071 1360 1093
3183A093M69o04q79j002M25n30J13k23q05J717N28J270l16n2K72j079J968p44n18
$$ 1093 1562 958 79 -923 -498 -1028 -915 -1138 -1943 -226 302 1572 1256 1204 1476 397 2365 1621 1103
3202A103j636Q36r59p18K01j37K14J0l24N63N72J568L08Q23n67k9l54p69M91k377
$$ 1103 -533 303 -656 -1374 -1173 -1310 -1096 -1086 -1410 -847 -275 1293 1601 2424 1857 1828 1474 705 1196 -1181
3222a181J218k004N95O00j65k13O83K50J22K029K6J80m94n09o80M2n02l71N8j557
$$ -1181 37 -1967 -1372 -772 -937 -1150 -467 -217 -95 1934 1960 2140 1646 1137 457 499 -3 -374 -316 -1873
3242a873R17j424J518j190J827L14N84N89P43j53J9k75p80j154J43j639J914k363
$$ -1873 -956 -2380 -862 -2052 -225 89 673 1262 2005 1852 1871 1596 816 -338 -195 -1834 80 -2283
3260b283R65l88K92O00J584p87J424L31J6n13k81N77k207P57j139R79j599m1L49
$$ -2283 -1318 -1706 -1414 -814 770 -17 1407 1738 1754 1241 960 1537 -670 87 -1052 -73 -1672 -1713 -1364
3279a364J057k55J139m49N46j222K694J1o30j023j43J84j198j36j544K286q55L49
$$ -1364 -307 -562 577 128 674 -548 2146 2157 1527 504 361 545 -653 -789 -2333 -47 -902 -553
3297e53m97O88J177q88K32K61R36o07r43O73p37K40q10M37j099N66J41M8q86J736
$$ -553 -1050 -362 815 -73 159 420 1356 749 -194 479 -258 -18 -828 -391 -1490 -924 -783 -735 -1621 115
3317A15P91m6n74N84j69J27J02l33r11l00p5o49R18o61n61J717p29J06R72r1k67
$$ 115 906 860 286 870 701 828 930 597 -314 -614 -689 -1338 -420 -1081 -1642 75 -654 -548 424 333 66
3338F6J722j087o9p6j82n39R8j18m78j015N23J9P82k64M84J102M84k66j395J127
$$ 66 1788 701 632 556 374 -165 -67 -185 -663 -1678 -1155 -1136 -354 -618 -134 968 1452 1186 -209 918
3358I18k11K85r29J58j007J9n0M67K34L62M1m53M13P85j200Q88m25J036j307N39
$$ 918 707 992 63 221 -786 -767 -817 -350 -116 246 287 -166 247 1032 -168 720 295 1331 24 563
3378E63j210J26P24j849J596N94j266L80J282n68P01K08n98P3R1m00j665Q80j345
$$ 563 -647 -521 203 -1646 -50 544 -722 -342 940 372 1073 1281 683 756 847 447 -1218 -338 -1683
3397a683J355m59q37J697Q47j32p48J185j035P39o58l24K63J51j359J45J31m15Q14
$$ -1683 -328 -787 -1624 73 920 788 40 1225 190 929 271 -53 210 361 -998 -853 -722 -1137 -323
3416c23o10N06O16o7P26L9L46o79p57O36o68n77L20j169r8j41J751J203o50n55J010
$$ -323 -933 -427 189 122 848 887 1233 554 -203 433 -235 -812 -492 -1661 -1759 -1900 -149 1054 404 -151 859
3437H59j48P13n03j44O52j639K47j680J96m00pR97k55M30o56J988N25N85k48K63
$$ 859 711 1424 921 777 1429 -210 37 -1643 -1447 -1847 -1854 -857 -1112 -682 -1338 650 1175 1760 1512 1775
3457A775q99o88r3q43p97m36q84J464L10L03j68N19J421k26J650j295P79l76m88
$$ 1775 876 188 95 -748 -1545 -1981 -2865 -1401 -1091 -788 -956 -437 984 758 2408 1113 1892 1516 1028
3476A028o94j400k26R40k25j850L87K78J443l2K328J44q88L91ok18r85k05k24q34
$$ 1028 334 -1066 -1292 -352 -577 -2427 -2040 -1762 -319 -351 1977 2121 1233 1624 1618 1400 415 210 -14 -848
3496h48N57j853J597j070Q12k48N71k63P48L77J342j33n38k8j014R84r58J39q43
$$ -848 -291 -2144 -547 -1617 -805 -1053 -482 -745 3 380 1722 1589 1051 1023 9 993 35 174 -669
3515f69p63p37Q21p71m59J708L36k69J281J007J652j395K80j168L75M69j308j847
$$ -669 -1432 -2169 -1348 -2119 -2578 -870 -534 -803 478 1485 3137 1742 2022 854 1229 1698 390 -1457
3533a457O7j241n70M18J729k64K280N59p05J721J59M72p44l00j092j713j548Q5j328
$$ -1457 -1390 -2631 -3201 -2783 -1054 -1318 962 1521 816 2537 2696 3168 2424 2124 1032 -681 -2229 -2144 -3472
3552c472l46N92P09J704J031J058J152n89L494k834J41j53k557j43l258N65j125
$$ -3472 -3818 -3226 -2517 -813 218 1276 2428 1839 5333 2499 2640 2487 -70 -213 -3471 -2906 -4031
3569d031L63J637p35J874j03K818J009Q74J231j830o26j065j076n06k247m4k73J441
$$ -4031 -3668 -2031 -2766 -892 -995 1823 2832 3706 4937 3107 2481 1416 340 -166 -2413 -2457 -2730 -1289
3587a289j329n6J452J236M17J531O32M2j068o79M98j789O58j329m16j277J529j07
$$ -1289 -2618 -2674 -1222 14 431 1962 2594 2636 1568 889 1387 -402 256 -1073 -1489 -2766 -1237 -1344
3605a344m02J563Q5r50J679N11L63k63Q8k11P67o40j059m47P0j197M8o13K39M51
$$ -1344 -1746 -183 -98 -1048 631 1142 1505 1242 1330 1119 1886 1246 187 -260 -190 -1387 -1339 -1952 -1713 -1262
3625a262L12N86Q95k77O28O63p2K02M60k51j001m30j517R50j475r84O94k34O59j48
$$ -1262 -950 -364 531 254 882 1545 1473 1675 2135 1884 883 453 -1064 -114 -1589 -2573 -1879 -2113 -1454 -1602
3645a602K764L32N07O28Q59p05q31o03k34k094q21j062K49J87k73R9J673J921J4M36
$$ -1602 1162 1494 2001 2629 3488 2783 1952 1349 1115 -979 -1800 -2862 -2613 -2426 -2699 -2600 -927 994 1008 1444
3665A444J933n76j008J225k675M66k710j337k01pP59J26O97J600O74J296J889r56
$$ 1444 3377 2801 1793 3018 343 809 -1901 -3238 -3439 -3446 -2687 -2561 -1864 -264 410 1706 3595 2639
3683B639j203K082j691j881j101M29j319L54p98M52J139M49P57J799LQ69k108j9J281
$$ 2639 1436 3518 1827 -54 -1155 -726 -2045 -1691 -2489 -2037 -898 -449 308 2107 2110 2979 871 852 2133
3702B133j152j041Q1k67p57j47J80m59l49R77J425M41j22P43q39j83o2k004R37R22
$$ 2133 981 -60 21 -246 -1003 -1150 -970 -1429 -1778 -801 624 1065 943 1686 847 664 602 -1402 -465 457
3722D57N82k200R35n52J34O72m57K63l63P42p86P1M76LL47Q75j032m51J132k004
$$ 457 1039 -1161 -226 -778 -644 28 -429 -166 -529 213 -573 -502 -26 -23 324 1199 167 -284 848 -1156
3742a156M18k76m18J092l31J133j120p59J150J13O36J76j523J774j093O65j031
$$ -1156 -738 -1014 -1432 -340 -671 462 -658 -1417 -267 -154 482 658 -865 909 -184 481 -550
3759e50P83j115Q01K78p38Q99J33m39o76J117j356J085J546k355L96m50m30J428
$$ -550 233 -882 -81 197 -541 358 491 52 -624 493 -863 222 1768 -587 -191 -641 -1071 357
3777C57j234k82J560j854K484p61n50K21k70J354r32J144j077q46k01P30N20J881
$$ 357 -877 -1159 401 -1453 1031 270 -280 -59 -329 1025 93 1237 160 -686 -887 -157 363 2244
3795B244k357m17J231q67J575q07J36j163qJ390K58j383l10o43P21K67j099J401
$$ 2244 -113 -530 701 -166 1409 602 738 -425 -433 957 1215 -168 -478 -1121 -400 -133 -1232 169
3813A69j133n47J171l68J195J06N25P9r00M47l39r68N80q18k7m12R91o00j68L81
$$ 169 -964 -1511 -340 -708 487 593 1118 1197 297 744 405 -563 17 -801 -828 -1240 -249 -849 -1017 -636
3833f36P75j09J228L7J56N88k93j471j294j151l97J595j06k245Q33K007R14J098
$$ -636 139 30 1258 1295 1451 2039 1746 275 -1019 -2170 -2567 -972 -1078 -3323 -2490 -483 431 1529
3851A529K18J807m2j939K39j806o9j322L68q24j332J60J557p78J114J126K923N86
$$ 1529 1747 3554 3512 1573 1812 6 -63 -1385 -1017 -1841 -3173 -3013 -1456 -2234 -1120 6 2929 3515
3869C515j33m39j674O77o79j554j73k187K89j219K33R04L44J965J338R28L63O58
$$ 3515 3382 2943 1269 1946 1267 -287 -460 -2647 -2358 -3577 -3344 -2440 -2096 -131 1207 2135 2498 3156
3887C156O36j424j023k339p09K62j165m38m53J018J116N77J869p4J070R12j189
$$ 3156 3792 2368 1345 -994 -1703 -1441 -2606 -3044 -3497 -2479 -1363 -786 1083 1009 2079 2991 1802
3904A802r88N18r04q5l55p60N68o98m48k69p7O32J886K35q60j019K514o97j12o33
$$ 1802 814 1332 428 343 -12 -772 -204 -902 -1350 -1619 -1696 -1064 822 1057 197 -822 1692 995 883 250
3924B50R5j26P27q88l61mo82J033n31m55n15L76o05J520J87L17J47L938m20j543
$$ 250 345 219 946 58 -303 -307 -989 44 -487 -942 -1457 -1081 -1686 -166 21 338 485 4423 4003 2460
3944B460o98k084Q50j794n25j715J493J47j170M70J349J920J627J172J211j186
$$ 2460 1762 -322 528 -1266 -1791 -3506 -2013 -1866 -3036 -2566 -1217 703 2330 3502 4713 3527
3960C527J43q01j831k057j185p64J35r09j760K137J126K249J454P04K185P51j203
$$ 3527 3670 2869 1038 -1019 -2204 -2968 -2833 -3742 -5502 -3365 -2239 10 1464 2168 4353 5104 3901
3977C901o87n03k703j370m7j480j925M45K008p14J329K017K727J146R07j354j738
$$ 3901 3214 2711 8 -1362 -1409 -2889 -4814 -4369 -2361 -3075 -1746 271 2998 4144 5051 3697 1959
3994A959M5N3k413j005j775l13J388l56O32N61O88K441N46K08q27m54K29r52j079
$$ 1959 2004 2057 -356 -1361 -3136 -3449 -2061 -2417 -1785 -1224 -536 1905 2451 2659 1832 1378 1607 655 -424
4013d24j161J232j076q25J120N9K84J024R03q16r20K822j219j267K10L74l1J193
$$ -424 -1585 -353 -1429 -2254 -1134 -1075 -791 233 1136 320 -600 2222 1003 -264 -54 320 289 1482
4031A482n26j387K14Q15k30j592jJ43J378m52o87n64M10J337N93n39O24K58L26l99
$$ 1482 956 -431 -217 598 368 -1224 -1225 -1082 296 -156 -843 -1407 -997 340 933 394 1018 1276 1602 1203
4051A203r37q06J211m14p59o01j581Q95l60K40K276J365P59j62J021j200k689J105
$$ 1203 266 -540 671 257 -502 -1103 -2684 -1789 -2149 -1909 367 1732 2491 2329 3350 2150 -539 566
4069E66r18j600K61k60J003j369L15J59J391K207Q2O11j428P29P1j943j9o47j78
$$ 566 -352 -1952 -1691 -1951 -948 -2317 -2002 -1843 -452 1755 1837 2448 1020 1749 1820 -123 -142 -789 -967
4088i67l19m88j258K83J369J190r39
$$ -967 -1286 -1774 -3032 -2749 -1380 -190 -1129
4095a129          $$ checkpoint
##END NTUPLES=NMR FID
##END=
