##TITLE= 10.03.10
200.13MHz,DMSO
SerBB-383
##JCAMPDX= 5.0         $$ Bruker NMR JCAMP-DX V1.0
##DATA TYPE= NMR FID
##DATA CLASS= NTUPLES
##ORIGIN= UXNMR, Bruker Analytische Messtechnik GmbH
##OWNER= root
$$ XWIN-NMR		Version 2.1
$$ Thu Jul 29 05:18:26 2010 PDT (UT-7h)  anp
##.OBSERVE FREQUENCY= 200.13128668345
##.OBSERVE NUCLEUS= ^1H
##.DELAY= (6, 6)
##.ACQUISITION MODE= SIMULTANEOUS
##.AVERAGES= 32
##.DIGITISER RES= 18
##SPECTROMETER/DATA SYSTEM= spect
$$ Bruker specific parameters
$$ --------------------------
##$AQSEQ= 0
##$AQ_mod= 1
##$AUNM= <au_zg>
##$BF1= 200.13
##$BF2= 200.13
##$BF3= 200.13
##$BF4= 500.13
##$BF5= 500.13
##$BF6= 500.13
##$BF7= 500.13
##$BF8= 500.13
##$BYTORDA= 1
##$CFDGTYP= 0
##$CFRGTYP= 5
##$CNST= (0..31)
1 1 145 1 1 1 1 1 1 1 1 1 1 1 1 1 1 1 1 1 1 1 1 1 1 1 1 1 1 1 1 1 
##$CPDPRG= <>
##$CPDPRG1= <>
##$CPDPRG2= <>
##$CPDPRG3= <>
##$CPDPRG4= <mlev>
##$CPDPRG5= <mlev>
##$CPDPRG6= <mlev>
##$CPDPRG7= <mlev>
##$CPDPRG8= <mlev>
##$CPDPRGB= <>
##$CPDPRGT= <>
##$D= (0..31)
0 2 0 0 0 0 0 0 0 0 0 0.03 0 0 0 0 0 0 0 0 0 0 0 0 0 0 0 0 0 0 0 0 
##$DATE= 1280405771
##$DBL= (0..7)
120 120 120 120 120 120 120 120 
##$DBP= (0..7)
150 150 150 150 150 150 150 150 
##$DBP07= 0
##$DBPNAM0= <>
##$DBPNAM1= <>
##$DBPNAM2= <>
##$DBPNAM3= <>
##$DBPNAM4= <>
##$DBPNAM5= <>
##$DBPNAM6= <>
##$DBPNAM7= <>
##$DBPOAL= (0..7)
0.5 0.5 0.5 0.5 0.5 0.5 0.5 0.5 
##$DBPOFFS= (0..7)
0 0 0 0 0 0 0 0 
##$DE= 6
##$DECBNUC= <off>
##$DECIM= 32
##$DECNUC= <off>
##$DECSTAT= 4
##$DIGMOD= 1
##$DIGTYP= 9
##$DL= (0..7)
0 120 120 120 120 120 120 120 
##$DP= (0..7)
150 150 150 150 150 150 150 150 
##$DP07= 0
##$DPNAME0= <>
##$DPNAME1= <>
##$DPNAME2= <>
##$DPNAME3= <>
##$DPNAME4= <>
##$DPNAME5= <>
##$DPNAME6= <>
##$DPNAME7= <>
##$DPOAL= (0..7)
0.5 0.5 0.5 0.5 0.5 0.5 0.5 0.5 
##$DPOFFS= (0..7)
0 0 0 0 0 0 0 0 
##$DQDMODE= 0
##$DR= 18
##$DS= 0
##$DSLIST= <SSSSSSSSSSSSSSS>
##$DSPFIRM= 0
##$DSPFVS= 10
##$DTYPA= 0
##$EXP= <>
##$F1LIST= <111111111111111>
##$F2LIST= <222222222222222>
##$F3LIST= <333333333333333>
##$FCUCHAN= (0..9)
0 1 0 0 0 0 0 0 0 0 
##$FL1= 90
##$FL2= 90
##$FL3= 90
##$FL4= 90
##$FOV= 20
##$FQ1LIST= <freqlist>
##$FQ2LIST= <freqlist>
##$FQ3LIST= <freqlist>
##$FQ4LIST= <freqlist>
##$FQ5LIST= <freqlist>
##$FQ6LIST= <freqlist>
##$FQ7LIST= <freqlist>
##$FQ8LIST= <freqlist>
##$FS= (0..7)
83 83 83 83 83 83 83 83 
##$FTLPGN= 0
##$FW= 93750
##$GP031= 0
##$GPNAM0= <sine.100>
##$GPNAM1= <sine.100>
##$GPNAM10= <sine.100>
##$GPNAM11= <sine.100>
##$GPNAM12= <sine.100>
##$GPNAM13= <sine.100>
##$GPNAM14= <sine.100>
##$GPNAM15= <sine.100>
##$GPNAM16= <sine.100>
##$GPNAM17= <sine.100>
##$GPNAM18= <sine.100>
##$GPNAM19= <sine.100>
##$GPNAM2= <sine.100>
##$GPNAM20= <sine.100>
##$GPNAM21= <sine.100>
##$GPNAM22= <sine.100>
##$GPNAM23= <sine.100>
##$GPNAM24= <sine.100>
##$GPNAM25= <sine.100>
##$GPNAM26= <sine.100>
##$GPNAM27= <sine.100>
##$GPNAM28= <sine.100>
##$GPNAM29= <sine.100>
##$GPNAM3= <sine.100>
##$GPNAM30= <sine.100>
##$GPNAM31= <sine.100>
##$GPNAM4= <sine.100>
$$ [...]
0.5 0.5 0.5 0.5 0.5 0.5 0.5 0.5 0.5 0.5 0.5 0.5 0.5 0.5 0.5 0.5 
##$SPOFFS= (0..15)
0 0 0 0 0 0 0 0 0 0 0 0 0 0 0 0 
##$SW= 19.0423779955203
##$SWIBOX= (0..15)
0 0 3 0 0 0 0 0 0 0 0 0 0 0 0 0 
##$SW_h= 3810.9756097561
##$TD= 8192
##$TE= 300
##$TL= (0..7)
0 120 120 120 120 120 120 120 
##$TP= (0..7)
150 150 150 150 150 150 150 150 
##$TP07= 0
##$TPNAME0= <>
##$TPNAME1= <>
##$TPNAME2= <>
##$TPNAME3= <>
##$TPNAME4= <>
##$TPNAME5= <>
##$TPNAME6= <>
##$TPNAME7= <>
##$TPOAL= (0..7)
0.5 0.5 0.5 0.5 0.5 0.5 0.5 0.5 
##$TPOFFS= (0..7)
0 0 0 0 0 0 0 0 
##$TUNHIN= 0
##$TUNHOUT= 0
##$TUNXOUT= 0
##$USERA1= <user>
##$USERA2= <user>
##$USERA3= <user>
##$USERA4= <user>
##$USERA5= <user>
##$V9= 5
##$VCLIST= <CCCCCCCCCCCCCCC>
##$VD= 0
##$VDLIST= <DDDDDDDDDDDDDDD>
##$VPLIST= <PPPPPPPPPPPPPPP>
##$VTLIST= <TTTTTTTTTTTTTTT>
##$WBST= 1024
##$WBSW= 8
##$XGAIN= (0..3)
0 0 0 0 
##$XL= 0
##$YL= 0
##$YMAX_a= 0
##$YMIN_a= 0
##$ZL1= 120
##$ZL2= 120
##$ZL3= 120
##$ZL4= 120
##$ABSF1= 15.95049
##$ABSF2= -3.09201
##$ABSG= 0
##$ABSL= 0
##$ALPHA= 0
##$AQORDER= 0
##$ASSFAC= 0
##$ASSFACI= 0
##$ASSFACX= 0
##$ASSWID= 0
##$AUNMP= <proc_1d>
##$AZFE= 0.1
##$AZFW= 0.1
##$BCFW= 1
##$BC_mod= 2
##$BYTORDP= 1
##$COROFFS= 0
##$DATMOD= 1
##$DC= 2
##$DFILT= <>
##$DTYPP= 0
##$FCOR= 1
##$FTSIZE= 16384
##$FT_mod= 6
##$GAMMA= 1
##$GB= 0
##$INTBC= 1
##$INTSCL= 3.876899e-10
##$ISEN= 128
##$LB= 0
##$LEV0= 0
##$LPBIN= 0
##$MAXI= 10000
##$MC2= 0
##$MEAN= 0
##$ME_mod= 0
##$MI= 0.3374128
##$NCOEF= 0
##$NC_proc= -5
##$NLEV= 6
##$NOISF1= 3.799351
##$NOISF2= 2.8
##$NSP= 1
##$NTH_PI= 0
##$NZP= 0
##$OFFSET= 15.95049
##$PC= 1
##$PHC0= -65.87114
##$PHC1= 0
##$PH_mod= 1
##$PKNL= yes
##$PPARMOD= 0
##$PSCAL= 0
##$PSIGN= 0
##$REVERSE= no
##$SF= 200.13
##$SI= 16384
##$SIGF1= 3
##$SIGF2= 2
##$SINO= 400
##$SIOLD= 16384
##$SREGLST= <1H.CDCl3>
##$SSB= 0
##$STSI= 0
##$STSR= 0
##$SW_p= 3810.97560975609
##$SYMM= 0
##$S_DEV= 0
##$TDeff= 0
##$TDoff= 0
##$TI= <>
##$TILT= no
##$TM1= 0
##$TM2= 0
##$TOPLEV= 0
##$USERP1= <user>
##$USERP2= <user>
##$USERP3= <user>
##$USERP4= <user>
##$USERP5= <user>
##$WDW= 0
##$XDIM= 8192
##$YMAX_p= 485933609
##$YMIN_p= -1949833
$$ End of Bruker specific parameters
$$ ---------------------------------
##NTUPLES=NMR FID
##VAR_NAME=  TIME,          FID/REAL,        FID/IMAG,        PAGE NUMBER
##SYMBOL=    X,             R,               I,               N
##VAR_TYPE=  INDEPENDENT,   DEPENDENT,       DEPENDENT,       PAGE
##VAR_FORM=  AFFN,          ASDF,            ASDF,            AFFN
##VAR_DIM=   4096,          4096,            4096,            2
##UNITS=     SECONDS,       ARBITRARY UNITS, ARBITRARY UNITS,
##FIRST=     0,             0,               0,               1
##LAST=      1.074528,      -4103,           4466,            2
##MIN=       0,             -286134,         -2104363,        1
##MAX=       1.074528,      1257411,         282311,          2
##FACTOR=    0.0002624,     1,               1,               1
$$ Real data points
##PAGE= N=1
##DATA TABLE=(X++(R..R)), XYDATA
0 0 0 0 0 0 0 0 0 0 0 0 0 0 -32 32 -32 32 -32 64 -64 66 -96 106 -129 160 -192 219 -253 289 -334 381 -442 500 -566 642
34 642 -725 813 -915 1023 -1145 1274 -1425 1579 -1754 1941 -2149 2371 -2618 2887 -3181 3503
50 3503 -3862 4255 -4691 5178 -5728 6335 -7040 7841 -8778 9882 -11209 12845 -14906
63 -14906 17615 -21342 26810 -35669 52523 -96489 468509 1172783 1061271 1257411 1126884
74 1126884 852026 488089 457757 591169 703440 491675 199086 70287 244164 419023
84 419023 499018 584397 857623 1111152 1098441 773500 461348 395854 528854 567160 424689
95 424689 258759 255442 306378 231812 80493 134800 466526 816191 869053 647565 423571
106 423571 381747 420883 363292 245214 259656 422399 493991 296919 12965 -40898 192769
117 192769 445393 496422 405580 357222 387286 339177 147796 3450 127154 420506 563675
128 563675 413196 174257 98077 177867 225022 169000 139901 243988 360769 272763 -2035
139 -2035 -175059 -48628 238503 404923 375815 316293 335177 339520 209131 14034 -29111
150 -29111 134963 293871 212503 -45846 -205136 -135584 22904 104705 144546 270647 451933
161 451933 495407 302173 40412 -41439 89059 203861 127375 -41795 -112725 -74578 -72434
172 -72434 -141955 -130548 80292 372891 490520 349463 132971 58580 113401 120467 23164
183 23164 -43279 8706 61929 -32588 -222826 -286134 -104048 177155 320673 274264 195426
194 195426 190091 185035 71489 -73932 -80196 61345 161868 63390 -141404 -245190 -156204
205 -156204 -3514 70693 89945 163613 270197 258979 76099 -113991 -120468 33789 149139
216 149139 103184 -26840 -87453 -63369 -60722 -111298 -100573 57897 249793 277992 110917
227 110917 -68808 -95300 -8582 51771 27914 7945 55538 89515 -9 -161300 -202554
238 -202554 -51645 145229 205013 113521 17919 2879 10074 -37267 -91254 -41824 101164
249 101164 182086 81651 -105347 -181188 -96827 25555 68364 57180 76426 118991 86338
260 86338 -47407 -158222 -109956 56661 159361 102314 -20665 -73112 -55250 -48492 -76551
271 -76551 -54892 62893 183521 169687 12204 -126374 -114669 -4083 59898 38446 17997
282 17997 42626 46299 -37474 -146259 -151727 -12759 142431 163426 60686 -29861 -35326 -18263
294 -18263 -42312 -63721 -2518 107104 139518 35307 -113034 -158222 -68412 38418 65151
305 65151 43747 49867 69236 20397 -89038 -146376 -67554 78945 152983 96817 -6158
316 -6158 -50269 -34566 -32228 -55370 -34087 54801 120784 64939 -75398 -161662 -119709 -7633
328 -7633 69432 79326 78255 98247 86264 -2965 -98762 -92525 11946 94868 62956 -44432
340 -44432 -121394 -121868 -90806 -69375 -33783 63077 179148 201381 101562 -21180 -52545 -3792
352 -3792 34873 13826 -35208 -57445 -68522 -112091 -172251 -161879 -36469 127256 203321 164131
364 164131 96123 63520 53177 19434 -26722 -37126 -8737 -4044 -79266 -188743 -225119 -140790
376 -140790 -8585 80317 122767 153708 175017 144123 54834 -30666 -41180 11498 38697 -21177
388 -21177 -122216 -173645 -153772 -111368 -73191 -5007 99345 186029 186509 99551 2701 -19955
400 -19955 13901 35547 5398 -36593 -52949 -70134 -111384 -149083 -116025 -4497 111251
411 111251 148350 103058 40561 11264 5615 -9859 -23212 436 46026 47420 -20436 -104456
423 -104456 -123728 -63761 14580 55136 56731 47846 36479 -2001 -59735 -85074 -35012 52853
435 52853 97121 70983 13670 -20874 -22685 -16396 -15953 -4002 28734 42871 -2355 -87284 -134552
448 -134552 -101780 -21988 45538 77866 91965 96923 81748 32822 -18212 -24758 15259 40620
460 40620 5335 -73135 -130530 -139642 -112997 -69940 -12820 67936 140834 159315 112262 43080
472 43080 11908 22512 33375 9781 -34051 -70852 -103059 -136655 -152832 -121777 -31673 75044
484 75044 140053 137763 102881 76263 57922 34852 6640 -5275 -8546 -28918 -85265 -147757
496 -147757 -165721 -116855 -28971 46986 90841 113153 117696 93289 42266 1914 997 21664
508 21664 26916 -10421 -72393 -116124 -117510 -90640 -51412 180 64052 105692 98546 48790 1848
521 1848 -10537 9146 29461 26523 5322 -17228 -42339 -69830 -84704 -58965 709 58644
533 58644 73452 45528 4766 -19422 -23452 -14815 1460 25320 44436 38583 -1364 -45607 -57353
546 -57353 -30837 12426 34943 34632 17255 -6404 -34053 -57880 -55519 -18152 34345 65154 55391
559 55391 22620 -2431 -10979 -8369 -774 12819 24645 18420 -13217 -61678 -86863 -70433 -22532
572 -22532 23606 51031 59816 54400 33028 6912 -11128 -5628 18429 33288 18107 -24854 -63653
585 -63653 -79048 -71063 -43702 -3620 41184 68976 67346 37652 4056 -9767 3892 22796
597 22796 26224 12656 -11076 -39472 -66790 -77538 -58909 -11987 37526 65286 58902 31500
609 31500 6807 -2804 -1537 6834 19884 25338 10496 -23726 -60576 -72226 -53065 -13589 26674
622 26674 48476 48265 32762 10491 -10071 -16678 486 23196 31410 16205 -14545 -45130 -57176
635 -57176 -46073 -20304 10242 35493 47339 34327 4712 -15459 -16845 196 17924 26712 17961
648 17961 -2258 -28038 -46173 -47732 -30922 2947 33078 42712 29537 9690 -7532 -11978 -4894
661 -4894 9623 22330 21999 3845 -21239 -44819 -50811 -33642 -2584 23306 37301 33782 19868
674 19868 377 -9783 -7527 4946 21862 24705 8460 -18977 -42227 -49822 -37796 -14453 14969
687 14969 34966 37883 25433 5258 -9018 -8242 6744 19425 22921 9890 -10530 -34591 -49622
700 -49622 -43637 -20495 9764 31955 38229 26377 6123 -6723 -8070 1117 13891 22846 18287
713 18287 -2201 -24436 -41101 -40056 -23568 4506 25993 29371 21599 4642 -11233 -15644 -7151
726 -7151 8695 20544 22449 10602 -8327 -24218 -27030 -16102 2696 17941 22896 15263 -3497
739 -3497 -21266 -28595 -20885 -2312 14572 23817 20855 9738 -970 -8094 -4805 5637 16853
752 16853 17485 6809 -11399 -30637 -40987 -35959 -16867 6544 22885 28382 26212 15932 8008
765 8008 6990 13347 18226 15430 2363 -17638 -39775 -52897 -48859 -31610 -4835 18719 34099
778 34099 34988 27793 21536 17501 19124 20773 15847 3153 -18664 -40320 -54284 -55245 -40744 -15511
792 -15511 11973 30465 36787 32419 24890 20510 21129 22091 19131 7189 -11745 -33923 -51794 -54254
806 -54254 -42049 -20076 5067 23953 30794 28938 20869 16339 17049 18207 18775 12461 -3630 -22721
820 -22721 -38065 -43419 -36683 -18774 2371 18138 24390 20325 12721 6992 5434 8990 13862 11967
834 11967 5477 -7256 -20906 -26423 -23297 -10612 1525 13673 17069 10697 1757 -5795 -7407 -4295
848 -4295 3327 9290 10545 5225 -3247 -8593 -9157 -3441 4858 12489 12056 5589 -5329 -16022 -20430
863 -20430 -17453 -6962 3205 11272 12931 9763 6004 4921 6325 10643 13053 11239 1271 -12159
877 -12159 -23992 -29024 -25090 -16475 -3801 10415 14467 15802 13136 11063 12223 15231 15479 11835 2214
892 2214 -12280 -23956 -29729 -29159 -20551 -6890 5890 14492 16128 13986 12342 13429 14379 15596 12352
907 12352 3871 -7988 -18601 -26559 -26874 -20228 -7561 2651 8960 12177 11666 11435 10693 9804 10643 11476
923 11476 5466 -3587 -14938 -20261 -18890 -14296 -5928 1404 8042 10988 9047 6284 4201 3933 7112
938 7112 6337 3702 -710 -7353 -11028 -14193 -12402 -6104 1600 6534 9457 6215 824 -21 573 1679
954 1679 2264 3391 3025 -416 -4474 -8435 -7170 -2350 4321 6568 6380 3773 -438 -3810 -5078 -5047 -1689
971 -1689 2761 4532 2033 -2281 -2490 -2453 -470 2424 4175 6120 5997 -17 -4911 -6681 -5359 -1730
987 -1730 1537 268 1145 1246 -605 -1391 -273 2132 5508 6358 3324 -1051 -4916 -4464 -3540 -1884 -2351
1004 -2351 -705 1155 1642 -116 -2163 -833 3114 5554 3516 107 -1419 -1422 -2289 -2221 -3381 -1037 1160
1021 1160 1244 -113 -1012 -375 1745 2009 1002 161 -282 2060 -270 -3340 -1745 -1809 479 966 -626 -951
1039 -951 912 875 616 -1084 -220 2273 1998 1052 -190 -1976 -1484 -109 -1520 -1663 -99 1402 824 -646
1057 -646 -1092 -883 2075 2342 402 261 -213 1386 -846 -1505 -3767 -1536 877 1139 -633 -1391 -990 1897
1075 1897 895 -275 -226 1237 1406 672 -642 -1871 -182 1260 -151 -1661 -316 767 2251 1770 -847
1092 -847 677 1652 909 924 -2451 -1133 1229 1110 -273 -1949 -578 934 2115 1096 -499 1515 1769
1109 1769 -705 -3483 -4029 -1460 2263 2070 622 187 861 1427 1123 311 1299 3308 3084 -1246 -5818
1126 -5818 -5881 -4175 -377 620 275 1034 1899 2812 397 -64 2281 6272 5705 753 -2612 -4883 -4992 -5287
1144 -5287 -6134 -4593 -1080 2859 1266 -467 -611 2681 5004 6220 5995 2884 1955 -1630 -5456 -9167
1160 -9167 -7586 -4811 -318 -440 -2537 -2052 1178 3332 4620 5911 6955 8168 6685 867 -3006 -6548
1176 -6548 -7042 -6458 -5393 -5353 -4017 -2780 -972 -1479 1104 5264 10570 12593 9658 5309 1295 -2219
1192 -2219 -4791 -6196 -7000 -4205 -3640 -4488 -7229 -6682 -3269 4678 9027 11264 12811 11283 6396 1088
1208 1088 -3599 -4675 -3330 -2897 -6375 -8960 -10055 -10634 -6491 -3623 3829 10101 13356 12600 7964 3130
1224 3130 1057 1268 901 -1395 -4130 -7436 -11530 -12833 -13433 -8618 -1282 6453 10146 9500 8490 7301
1240 7301 6379 5619 4562 4042 3706 -1698 -7185 -14555 -14181 -12134 -4944 -1458 1548 5609 4594 5460 4523
1257 4523 5528 6998 10271 9245 6163 -2031 -7571 -11911 -11928 -11139 -6665 -2909 821 -302 -1697 -820
1273 -820 3006 7105 11992 14068 13071 7579 1848 -5783 -10535 -11442 -8458 -5567 -4431 -6814 -7976 -7216
1289 -7216 -3325 4115 8830 16448 17823 16671 9274 -446 -4859 -8260 -7130 -6657 -8536 -9878 -11117
1304 -11117 -12767 -11402 -4524 4734 13751 20698 18834 13592 7070 1575 -2122 -4800 -4362 -5900 -9599
1319 -9599 -13192 -16838 -15469 -10387 87 9762 15621 17435 15866 12032 4243 1102 235 81 -648 -6444
1335 -6444 -11468 -16162 -16955 -13558 -7128 2208 9463 14713 13663 9632 4891 3588 4321 3949 3427 186
1351 186 -5371 -11159 -15300 -15439 -10197 -3232 3925 9164 9231 5392 5004 2815 3681 7402 7148 6468 1356
1368 1356 -4754 -10780 -12744 -12155 -6534 213 3560 4918 1846 -761 -1163 949 4661 9019 11270 7508
1384 7508 1257 -5973 -10531 -10600 -6874 -867 1693 3158 -252 -3620 -5557 -3430 2029 8330 11856 10824
1400 10824 5833 -1163 -7409 -9036 -6962 -2182 116 1880 -511 -5399 -6512 -6614 212 5793 11831
1415 11831 10102 7482 1205 -4716 -7203 -6223 -1552 407 2083 -1300 -3697 -6496 -7182 -1879 2967
1430 2967 8113 11143 9100 2730 -3619 -5883 -7016 -3060 -228 2115 380 -3246 -6077 -5313 -3804
1445 -3804 2350 7896 11381 10747 5856 -705 -5598 -7014 -5100 -1839 584 177 -2180 -6508 -7382 -5041
1461 -5041 281 8569 13371 12697 8978 3180 -3995 -6695 -6136 -2570 -1803 -1245 -4393 -8157 -10328 -9290
1477 -9290 -1570 6202 14109 16700 13989 7675 2455 -2659 -3799 -2194 -1265 -3694 -7162 -12781 -16386
1492 -16386 -14975 -8243 2947 12507 18803 19532 14913 8196 2929 -203 152 143 -3002 -8748 -18187 -21977
1508 -21977 -21013 -13117 -2347 8820 17310 20823 19427 14042 9896 7166 5602 3485 -582 -7934 -15765
1523 -15765 -22919 -24617 -21802 -12671 -125 11707 15704 16965 15966 13553 12075 11133 10012 5814 844
1538 844 -9411 -20684 -26883 -26175 -18800 -8752 -502 7139 12846 12843 12057 11770 12542 14124 14683 10009 867
1555 867 -9992 -18524 -21115 -20899 -16106 -9452 -3458 2409 2571 1733 4985 10360 18085 21731 20222 14915
1571 14915 5966 -2195 -12631 -18795 -18254 -13640 -10303 -10822 -11871 -11673 -7877 2814 11363 19538 26177
1586 26177 28467 21776 11132 -1229 -6943 -8399 -9640 -14824 -20455 -22181 -23518 -20773 -14070 -1797
1600 -1797 15109 27931 34005 30465 22892 17136 9940 2977 -5929 -12289 -19333 -25322 -32972 -34632 -28913
1615 -28913 -14106 3931 17325 26198 31985 32735 29900 21291 11311 6681 125 -9487 -23603 -35408
1629 -35408 -37001 -35712 -24911 -14282 620 16024 27299 30435 27912 23277 21803 19230 13495 331
1643 331 -11962 -22953 -29809 -34446 -35649 -26861 -9894 6259 13264 16109 18251 23392 25837 22215
1657 22215 19002 12727 7235 -3340 -17804 -29598 -32298 -25027 -14668 -10703 -4415 1399 8815 13247
1671 13247 12690 14314 21773 27725 22938 10715 -4463 -12357 -14890 -16983 -20593 -19132 -11245 -7216 -8799
1686 -8799 -9068 -4207 9045 22397 26465 24521 19821 16247 9556 -3129 -12330 -15821 -13755 -12179 -17191
1701 -17191 -23993 -20787 -13323 -945 6388 12735 21810 29983 27874 17240 5489 211 2502 -2463
1715 -2463 -13662 -23695 -25189 -22924 -21569 -19157 -10225 6666 22020 25901 21972 17757 17394 18137 10903
1730 10903 -5 -8749 -10293 -13945 -22990 -30929 -28053 -13378 2367 9203 10782 15285 22777 22904 15950
1745 15950 7016 5776 8028 3000 -10750 -24183 -26494 -21216 -13263 -11659 -6509 5426 16051 18085
1759 18085 11587 6826 10505 16237 14846 3423 -6463 -9813 -10959 -15039 -21790 -18722 -5375 7088
1773 7088 8392 2145 66 7887 14101 12646 7119 4478 8086 5226 -5919 -18693 -18327 -7270
1787 -7270 238 -981 -5651 -3846 5600 8646 3375 -99 6867 15808 14200 1223 -10701 -9756 -3818
1802 -3818 -2773 -8678 -11823 -2980 5974 3220 -4185 -5830 2945 13822 13253 2674 -3494 199 2383
1817 2383 -3627 -11689 -12314 -1813 6749 2388 -6757 -6143 4136 11149 7444 716 3379 9842 8419
1832 8419 -3452 -15056 -12405 -1568 3725 -4153 -9559 -3572 5599 8156 1015 -1246 6454 16702
1846 16702 14076 340 -9996 -7131 -1022 -3336 -11206 -12481 -3057 5334 2917 -7627 -6931 7357
1860 7357 19255 17523 5581 490 4885 5723 -4452 -15453 -15139 -4440 2041 -6528 -15962 -11483
1874 -11483 2859 12350 10063 5210 11807 20269 18347 2507 -9140 -5788 30 -1853 -15913 -23450
1888 -23450 -16039 -5585 -2642 -7070 -3870 12459 26164 23986 10899 5211 9655 13483 3567 -13041
1902 -13041 -20075 -14138 -10882 -17798 -24794 -20230 352 15434 14442 9200 15336 25423 28050 14398
1916 14398 -1860 -4531 1674 -3557 -20372 -34444 -29123 -13903 -6157 -7799 -6123 10706 28159
1929 28159 30258 18486 12048 15714 20400 11698 -8899 -22884 -20567 -15263 -21924 -31379 -25475 -6268
1943 -6268 11746 13255 7701 12244 25364 33311 23989 7042 1735 5506 950 -17562 -33712 -31656
1957 -31656 -17945 -7961 -11654 -14288 -1445 16857 24964 18058 13760 20263 29779 22634 1907 -15625
1971 -15625 -15544 -10941 -15784 -27789 -32070 -18928 -1697 806 -3531 888 20128 36224 30450 16347
1985 16347 9889 13583 14250 -1830 -23170 -28961 -20738 -14138 -22419 -29709 -19652 2300 16929 16876 13245
2000 13245 21355 35009 35038 16249 -2204 -5280 -2464 -7565 -27941 -39689 -30961 -15204 -8825 -12656
2014 -12656 -8159 11594 31724 35657 24545 16814 22863 24289 9546 -13422 -25087 -21926 -17129
2027 -17129 -25602 -35125 -29077 -7651 9417 13288 10087 16115 32553 38701 25142 6340 305 5364
2041 5364 -894 -20021 -35926 -32423 -19760 -11009 -15311 -15967 1135 23040 30042 20818 13884 20348
2055 20348 28593 19654 -1553 -15179 -13698 -9209 -17087 -30418 -32631 -15102 1078 4010 -273 2159
2069 2159 20550 32792 25154 12250 6463 13538 11767 -3977 -22629 -26606 -15126 -10600 -18963 -25224
2083 -25224 -14076 6826 18190 12939 7835 16394 29162 28308 10890 -4110 -4814 1126 -6654 -25236
2097 -25236 -33108 -23980 -7402 -3338 -10351 -7788 9198 26703 25009 13513 9623 17592 21964 8042
2111 8042 -13314 -21803 -14272 -9639 -15890 -26570 -21091 -2630 10394 6869 1419 10618 25234 30616
2125 30616 16450 -132 -2074 3520 633 -15795 -27008 -21731 -7490 -3548 -11234 -12743 1742
2138 1742 18279 21134 12019 5875 12877 19280 11948 -7347 -16167 -8251 -905 -7644 -20617 -19601
2152 -19601 -5995 7459 6113 -2342 1013 16021 22006 12844 -1437 -4530 4947 6947 -5735
2165 -5735 -17271 -15815 -4346 725 -7130 -12549 -4295 10423 16091 6378 -1024 4436 14179 10952
2179 10952 -3805 -10839 -4049 4261 361 -11631 -15668 -6777 7374 6542 -3142 -4719 7770 15101
2193 15101 9146 -5373 -7838 3455 8914 1131 -10940 -12531 -2614 4342 -1847 -9900 -5295 9291
2207 9291 15095 5676 -5152 -3610 7421 8660 -1645 -10757 -6759 2857 2912 -7861 -12915 -3664 10130
2222 10130 11073 452 -4067 1537 11126 7608 -3788 -8421 -1363 3992 95 -11714 -13293 -3203
2236 -3203 6500 3519 -3614 -1688 8422 14984 6730 -3308 -4392 5386 8294 -786 -12527 -12238 -2772
2251 -2772 990 -6978 -11060 -4213 7854 13410 4428 -1030 3265 12753 11334 1062 -6611 -4679 1098
2266 1098 -4516 -14600 -18614 -9919 2247 3896 -2744 -1686 7611 17208 14984 4759 2876 8252
2280 8252 10693 -342 -14203 -18545 -10906 -7092 -9556 -13197 -7616 5496 12194 9908 4680 9989
2294 9989 20377 21545 8014 -3793 -7697 -4701 -9682 -18939 -24534 -15793 -2515 1154 -2823 -2819 8469
2309 8469 21215 23408 14361 10068 9518 8935 -198 -14490 -22936 -17329 -10888 -11880 -16175 -12920 -884
2324 -884 11756 12725 11128 13310 21529 23041 10410 -2734 -7824 -4793 -6316 -15242 -20457 -17442 -7542
2339 -7542 -2490 -4944 -3442 5885 18303 22060 14418 8034 7583 9905 5772 -6235 -12618 -10362 -6450
2354 -6450 -9058 -16131 -15723 -7132 2951 6807 4469 6634 13631 18719 13746 5770 1130 3869 4577 -2205
2370 -2205 -11151 -15788 -13783 -9960 -13313 -13798 -6216 6124 12712 10242 7477 10940 17047 17916 9691
2385 9691 102 -2099 -2649 -9164 -18225 -24476 -17719 -8191 -4684 -3902 -61 8679 16863 20438 17029 14754
2401 14754 16053 14006 2567 -10527 -19528 -17829 -16083 -16709 -17988 -13543 -1700 5615 9735 10465 17196
2416 17196 23851 23932 17054 3912 -3151 -4314 -10997 -19315 -22962 -18708 -11743 -6772 -6232 -2117 6419
2431 6419 16503 20443 17751 14740 13432 9494 971 -8739 -14542 -14547 -12080 -12043 -13616 -11555 -4479 3959
2447 3959 5885 6896 10646 15628 17335 10389 3113 -1679 -1359 -3189 -7071 -10739 -10686 -7652 -5339 -6624
2463 -6624 -5550 -654 7286 10985 7656 5254 5368 6122 5560 833 -2066 -498 -524 -4655 -10174 -11576
2479 -11576 -9188 -4227 -1378 -2310 102 4918 8647 7210 3971 5135 7561 9184 3590 -3199 -7463
2494 -7463 -7404 -8017 -9354 -9704 -7219 -1597 2232 2162 2149 5178 9738 13393 10559 5472 2875 1653 -4066
2511 -4066 -9105 -12806 -10753 -7410 -5098 -5642 -3060 1227 5300 9374 8490 9943 9535 8860 5152 -2682
2527 -2682 -6145 -8208 -7368 -7793 -9636 -7206 -2873 1556 823 2540 5686 8757 11738 7771 2323 -541
2543 -541 -2309 -3377 -6725 -8128 -6541 -3266 -1606 -3410 -1958 854 4805 7176 6326 4498 3875 3739
2559 3739 -463 -3162 -5000 -3871 -2433 -2428 -3144 -4534 -1894 777 1555 1621 4744 4455 5144 2259 -1500
2576 -1500 -3651 -2242 371 -1671 -3671 -2292 -1147 -479 -1571 -829 130 4147 4342 3402 -68 -591 -885
2593 -885 719 -2192 -2371 -2141 -595 -626 -1805 -2213 -850 2856 3257 2412 2199 2383 1386 -496 -3000 -2606
2611 -2606 -1322 -555 -1273 -2151 -2663 -1344 -615 1206 1373 2926 3475 3244 254 -1405 -2131 -1027 -982 -1382
2629 -1382 -2154 -2206 -1340 -1336 -1269 -2 740 3247 4887 3328 1394 247 -991 -1279 -765 -2267 -631 -285 -760
2648 -760 -3459 -1720 -1003 855 3132 1352 1914 2050 1536 628 -555 383 803 1461 1358 -1809 -1735 -3066
2666 -3066 -1870 -1056 -1333 149 960 1156 576 305 283 2528 2756 3517 1999 1455 -785 -2667 -3632 -4472 -3192
2685 -3192 -1942 -2761 -2222 -1094 -264 2061 4236 5493 6057 6558 4175 2019 -1117 -3842 -4770 -4832 -5960
2702 -5960 -6289 -4519 -2384 -878 1132 3919 6350 7733 7751 6737 4378 155 -2490 -5322 -6636 -7810
2718 -7810 -6644 -5990 -3546 -1846 727 3767 7725 8052 9316 8743 6751 3111 -495 -3599 -6649 -6726 -6953
2735 -6953 -7487 -5507 -3424 -492 923 3782 6820 7214 7552 6012 2827 -838 -3496 -3951 -4988 -4504 -5811
2752 -5811 -5187 -2780 -1943 819 2008 3925 3923 4358 3492 1665 2438 -728 -1016 -1651 -1875 -3052 -1034 -933
2770 -933 -1864 -1080 -794 -64 684 1574 837 -471 476 205 -1293 -7 1726 2570 1717 1160 303 -304 -1805
2789 -1805 -2382 -2112 -2820 -3407 -3039 -2064 -304 946 2495 3280 4250 4173 3183 2526 1105 -2684 -2964 -5170
2807 -5170 -4611 -5203 -4412 -3368 -2020 1053 3133 4660 6260 5862 4846 1715 1871 -1706 -4410 -4810 -6404
2824 -6404 -6013 -4638 -3986 -3551 -617 1851 4261 5671 7564 5870 4288 1621 -426 -2267 -3246 -4988
2840 -4988 -6161 -4822 -2698 -2731 -579 893 3214 4153 5231 4937 3249 991 620 -1434 -3012 -4123
2856 -4123 -3300 -2039 -3600 -670 -324 1215 2123 3332 3351 2610 2112 961 -477 -1395 -1035 -2530 -1162
2873 -1162 -1192 -1377 -29 790 370 1713 1392 1145 172 411 549 -1608 -1221 -1676 -1222 -1511 -690 25 993 707
2893 707 783 1065 86 165 51 -1700 -751 -1832 -1947 -888 73 -212 1457 1461 1283 2641 1673 207 817 -1716
2913 -1716 -1228 -1192 -1333 -1597 -2839 -1277 -433 425 1512 1435 1786 837 659 223 -377 -1146 220 -1451 -571
2932 -571 -1146 -855 -1024 -333 1163 1708 1094 1634 974 104 -348 -863 -1162 -1704 -450 -1419 -760 -1319 -54
2951 -54 1178 159 202 909 881 894 -313 -515 123 -652 -699 -1011 -771 303 402 649 1799 1464 174 -245 103
2972 103 -79 -882 -183 -1241 -959 -80 -474 -977 -1074 27 424 515 358 88 891 768 790 -20 -36 641 -540
2993 -540 -341 -1006 -681 -1036 -994 1975 174 795 -451 1693 229 485 427 -324 87 -1286 -1031 -1665 175
3012 175 -28 29 120 -264 -116 580 137 120 -1099 -471 1052 828 -276 -975 -1317 -205 -94 -1496 -95
3031 -95 -134 1263 1017 437 -141 61 1118 -61 287 -416 -974 -5 -871 -855 367 714 1036 831 704 537
3051 537 788 2797 -286 -1122 -1400 523 -1061 -2021 -2445 -714 251 373 2659 1253 778 2003 1191 1672
3069 1672 -1008 -1007 -1780 -1639 -2168 -1522 -1118 -1036 414 1799 923 1821 2760 1656 1422 303 838 969 -2096
3088 -2096 -2612 -3298 -2019 -2475 -1634 -421 42 1830 3352 2810 1835 1044 1471 181 628 -999 -242 -1481
3106 -1481 -2344 -2687 -2176 -1874 -71 215 1612 2522 1040 1962 1865 147 854 1454 550 -1621 -448 -1882
3124 -1882 -1728 -1360 -2051 -1299 -443 943 440 157 891 1176 1699 1608 1038 1038 402 -275 -1649 -942 -2280 -2357 -2302
3145 -2302 -1382 -815 292 414 673 2098 2392 2631 2441 1898 2282 -634 -1551 -1201 -1895 -1037 -3059 -1837
3163 -1837 -1628 -259 -465 884 2294 3527 3419 3888 3563 2643 -158 -1559 -1390 -2930 -3042 -3254 -3518 -2732
3181 -2732 -1837 -274 1296 1398 3330 4813 4877 2463 2257 1662 94 -1506 -2722 -2985 -3565 -3876 -3870 -2273
3199 -2273 -165 207 1335 3660 4452 4423 3656 2340 1290 1105 -589 -1979 -3591 -3607 -3779 -4172 -2786 -1966
3217 -1966 9 170 2638 3138 3696 5070 3661 2913 2195 1614 -1059 -2191 -5125 -4373 -4892 -3791 -2823 -1075
3235 -1075 -30 1537 2774 3945 2931 3178 4273 3538 2191 -1009 -2838 -4520 -4439 -4320 -3339 -2934 -1701
3252 -1701 609 1270 1658 3501 5008 4157 4719 3321 3551 1400 -1359 -2725 -3540 -3505 -4230 -3278 -2791 -2699 -1326
3271 -1326 138 2015 3811 4898 4127 3143 1697 1040 -569 -2972 -2393 -2084 -3107 -2489 -2883 -3444 -514
3288 -514 587 1876 2832 4338 3826 2032 2177 281 -600 -816 -799 -2385 -3357 -2589 -3184 -2851 -1678 181
3306 181 1700 1231 1566 3044 2161 3954 1756 1901 397 -800 -647 -1594 -3186 -2932 -2286 -2932 -1483 819
3324 819 -102 430 685 1623 1654 2651 2055 1454 162 -1914 -2007 -1732 -2611 -2646 -566 161 61 1058 81 1114
3344 1114 2628 2816 1743 2432 796 215 104 -1724 -2195 -1400 -2321 -2163 -171 -1026 587 202 1346 836
3362 836 1340 1657 1464 868 -1621 276 -1924 -2402 -2547 -2379 -855 -209 -225 1512 -194 673 1183 2012 1334
3381 1334 439 789 -636 -1975 -1144 -1797 -1967 -1348 427 -652 399 256 318 863 1688 1094 664 999 -477
3400 -477 -2100 -2036 -2192 -1821 -1222 -100 -374 771 1232 1126 1191 2208 3250 2152 824 -458 -1705 -1859
3418 -1859 -1935 -3512 -2891 -2439 -762 -461 18 1900 2011 2823 3218 3391 1765 1010 -490 -2623 -3018 -3482 -2982
3437 -2982 -2889 -2908 -1643 -714 1212 2952 3079 4070 3989 3126 1760 -70 -991 -1162 -3222 -4565 -4905 -2738
3455 -2738 -3251 -1461 473 2441 3939 3889 6035 4230 4049 2345 205 -1649 -2854 -3405 -5480 -4912 -4620
3472 -4620 -3267 -1336 410 2269 4058 5349 4135 4225 3881 1780 1016 -291 -497 -2210 -4214 -3833 -4091
3489 -4091 -3233 -1280 -605 167 2037 2157 3419 2702 3354 3888 3323 1507 1186 -1004 -2135 -1919 -3569 -2705
3507 -2705 -3670 -3590 -3104 -1524 -499 2009 2104 3238 4715 4613 4612 2715 2677 247 -2571 -3767 -5767 -7077
3525 -7077 -7257 -5327 -2982 -1952 952 1561 5769 6965 8569 8550 6072 2657 379 -2847 -5349 -7085
3541 -7085 -9090 -8211 -7678 -4621 -2019 369 3484 7487 10123 10405 10089 7774 3754 1910 -2333 -6695
3557 -6695 -8704 -10022 -9936 -8612 -5651 -2719 1841 5374 8778 10183 8863 8964 6546 2686 -798 -3521
3573 -3521 -5219 -8652 -9459 -9571 -7560 -3611 -280 1857 4221 6859 8265 7076 6264 4846 2967 600
3589 600 -1602 -5549 -6293 -6227 -6057 -4824 -3820 -2101 483 2685 4764 3277 5379 5052 4072 2420 999
3606 999 -343 -1034 -2075 -2716 -4992 -4426 -3555 -3910 -2799 -2628 -861 674 2184 3099 3802 4392 4159 3768
3624 3768 2092 1078 -397 -2195 -2575 -5081 -6816 -6830 -5306 -3463 -3382 619 3003 5554 6545 7057 5991
3641 5991 6114 3840 -802 -2529 -5868 -6927 -7741 -8494 -6484 -5210 -1575 1192 4902 6233 9483 8646
3657 8646 8433 5425 2307 -459 -2459 -4644 -8263 -9073 -8739 -5199 -3781 -1372 2368 5357 7750 9428
3673 9428 7454 6090 5003 1793 -277 -3757 -6310 -7540 -7711 -7021 -6114 -2852 849 2322 4445 6048
3689 6048 5846 6409 4650 3004 390 -1236 -3196 -3559 -5511 -6706 -4610 -2727 -534 1150 2850 3185
3705 3185 4068 3858 4223 2191 1719 667 -1202 -1527 -2752 -1259 -1959 -2396 -1783 -733 -880 1694 1308 326
3723 326 171 1756 1531 1319 -86 369 -274 -1126 -2512 -1723 -848 -559 -355 -875 -960 -878 807 -218 -448 235
3743 235 1739 1892 862 -531 -588 -321 465 438 -848 -1581 -406 -109 -1027 -1347 366 1628 3059 1454
3761 1454 74 -554 -237 1127 855 -1215 -728 230 495 -1044 -1281 -2454 883 2418 1014 827 77 683
3779 683 566 -271 -1113 141 1056 1252 -927 -2356 -833 -400 927 1393 1688 1294 1533 637 -480 231 258
3798 258 448 199 -2033 -1739 -2415 -512 119 -1301 1094 1785 4019 2875 713 830 1479 1082 975 -692
3816 -692 -1621 -1726 -2104 -2798 -3707 -1371 981 2200 3648 2401 3244 4443 3585 1729 758 561 -954 -2920
3834 -2920 -5831 -5833 -5563 -3770 -2179 -177 1999 4240 6334 5875 3757 4837 3298 3591 -966 -4382 -6656
3851 -6656 -7606 -6359 -7764 -5855 -1992 2367 6161 6073 6652 6771 7241 6732 1542 -1134 -3082 -5089 -7105
3868 -7105 -10014 -9481 -5865 -2519 921 2189 4749 6598 7645 8055 4669 4145 2523 560 -3498 -7867
3884 -7867 -9570 -8400 -6695 -4075 -1287 1065 4860 5331 5800 4798 4247 4944 3838 1524 -2889 -4408
3900 -4408 -4792 -4537 -5229 -5281 -2890 289 890 393 756 331 3917 4457 1968 1692 1318 1521 448 -1978
3918 -1978 -2164 -1083 -256 -1988 -2675 -2690 -2566 -1977 -1472 -444 520 2545 4038 5155 4014 2983 3746 3743 1635
3937 1635 -1700 -2433 -5281 -6694 -7165 -8513 -5116 -1386 2407 3593 3689 7879 9435 7373 5994 2830
3953 2830 705 45 -4752 -9079 -12686 -11443 -8317 -5108 -2362 936 6514 9780 10092 8813 7863 7963
3969 7963 5487 717 -4192 -9624 -11241 -9821 -10744 -7845 -4620 1336 4528 8442 7523 8943 9703 8882
3985 8882 5418 988 -3555 -5542 -7729 -11119 -11580 -8010 -4157 238 1924 3190 6010 7287 8139 6333
4001 6333 4876 1854 1951 -2327 -5631 -8625 -5987 -3982 -2984 -1484 -930 1114 3697 3420 1095 2436
4017 2436 3630 4405 2342 -1068 -1729 -1924 -1179 -1982 -2086 -1467 809 1512 -1573 -2787 -2576 -195 884
4034 884 1974 568 1589 2757 2654 1804 1182 2287 3154 2013 -1747 -4650 -4157 -4488 -3975 -2855 -2112 1757
4052 1757 2216 4527 1399 3229 5547 5298 3346 339 -1947 -2012 -4925 -7394 -8132 -5825 -1979 1234
4068 1234 2505 3299 4032 4727 7227 4931 3040 2755 2626 -1776 -5877 -7738 -7209 -4240 -1422 -1035 -174
4085 -174 3210 4658 5138 3188 3334 5512 4595 1168 -1763 -4103
4095d103          $$ checkpoint
$$ Imaginary data points
##PAGE= N=2
##DATA TABLE=(X++(I..I)), XYDATA
0 0 0 0 0 0 0 0 0 0 0 0 32 -32 32 -32 64 -64 96 -96 128 -160 192 -224 288 -320 384 -448 513 -605 695 -796 909
31 909 -1031 1175 -1326 1502 -1684 1900 -2123 2376 -2648 2949 -3274 3630 -4025 4449 -4918 5427
47 5427 -5981 6594 -7263 7999 -8813 9717 -10720 11848 -13118 14571 -16230 18172
59 18172 -20459 23213 -26597 30881 -36492 44207 -55535 73883 -108728 199201 -965905
70 -965905 -2104363 -1202694 -989425 -829011 -1039762 -942159 -880684 -768704 -919632 -973779
80 -973779 -950076 -814561 -978543 -1312907 -1580500 -1418244 -1073606 -786510 -710411 -615724 -465643
91 -465643 -341803 -445293 -637741 -692029 -479071 -289304 -377509 -702198 -918195 -891134 -762380
102 -762380 -720234 -672757 -483916 -191902 -61400 -224372 -489973 -541462 -334423 -139062
112 -139062 -170782 -316907 -362695 -317194 -366541 -531390 -602308 -408448 -90008 48465 -106167
123 -106167 -337578 -390312 -282366 -226852 -275234 -251954 -76644 78412 654 -250985 -391853
134 -391853 -264951 -22615 63572 -49668 -167303 -170322 -177540 -313342 -454649 -379462 -84217
145 -84217 168254 165297 -15588 -121931 -51707 46990 25384 -50561 -26117 61768 8619 -247750
157 -247750 -491008 -474291 -222313 14562 76179 44440 80172 163042 143173 990 -82786
168 -82786 26979 194951 165786 -87349 -335647 -383639 -275379 -180316 -144857 -57703 134731
179 134731 282311 215005 6460 -92018 28757 195945 195797 35730 -110957 -153178 -174051
190 -174051 -258819 -319628 -203872 64213 260314 218686 41647 -37451 35810 116087 94024
201 94024 30405 37356 79171 16985 -179186 -337149 -272429 -40730 134278 131846 57140 49329
213 49329 85704 56565 -36132 -62262 52319 186382 157422 -43836 -222937 -215078 -89630
224 -89630 -8161 -2225 27978 118531 162777 63919 -99179 -142004 -8541 153475 163171 37735
236 37735 -61211 -64498 -53052 -102016 -136934 -46815 124354 206606 104821 -69166 -135197 -49598
248 -49598 54541 64236 30337 48844 86546 35012 -112867 -204447 -124501 58542 166103
259 166103 117334 7942 -32393 -9302 -15735 -62792 -48985 69144 172216 122885 -48489
270 -48489 -178719 -151442 -29918 43986 43065 43211 86594 94624 -1274 -125560 -124804 18011
282 18011 150726 141769 26129 -67101 -73964 -55130 -73569 -82354 671 130751 165058 48163
294 48163 -101052 -129395 -37526 53938 65941 43030 47347 59865 5123 -106985 -158479 -64254
306 -64254 89229 148344 74404 -26746 -58892 -42840 -46032 -61414 -25491 74377 147107 94049
318 94049 -42686 -120589 -69409 29485 69992 47377 32172 36466 4336 -87804 -166148 -132809
330 -132809 6050 122816 118412 36642 -7544 9467 24231 4943 841 52477 107840 73190
342 73190 -59191 -186702 -197044 -103834 -11897 23066 40926 86673 118990 79538 1355 -16794
354 -16794 50718 131631 119052 7368 -111676 -159870 -154727 -149161 -132143 -50542 76666 154275
366 154275 123175 42964 10144 59110 121141 121191 63771 4243 -39282 -105449 -200725 -243884
378 -243884 -169050 -22769 86814 106200 74446 60829 80206 92625 72398 59388 79998
389 79998 86325 11395 -127841 -222817 -206571 -116373 -29298 16757 47495 85491 103510 68481
401 68481 13582 11555 73408 125191 89067 -11481 -97096 -126518 -121909 -111706 -80503 -8155
413 -8155 76437 109507 58192 -19847 -38437 9951 60267 67459 44784 25826 7390 -38475
425 -38475 -92980 -105365 -47031 45057 90826 54404 -11224 -42505 -43413 -43584 -37710 -7600 49854
438 49854 83714 55826 -9565 -49356 -23304 35861 67003 53531 27936 3007 -40778 -103912
450 -103912 -142907 -112415 -25112 55264 74715 48488 27425 36529 52923 53983 54804 71088 72065
463 72065 19579 -78968 -162320 -179700 -127470 -52440 -1348 31145 65162 86741 76955 51661
475 51661 50279 85098 114315 85672 3444 -88899 -144537 -155920 -143179 -109510 -45282 33492
487 33492 83742 81246 49909 42447 72536 105830 105233 69223 16367 -40230 -98989 -150652 -167179
500 -167179 -120240 -31895 35908 56718 44314 38874 48237 59149 65101 68384 71585 56668 1312
513 1312 -77296 -131401 -127492 -76438 -24431 8643 30079 40677 37713 18675 -104 8452 44550
526 44550 75163 62097 10523 -42693 -67003 -67490 -55850 -27372 12019 46287 48466 12612 -29966
539 -29966 -46349 -19841 19703 41725 38666 27358 8090 -18712 -43085 -39157 -2432 39810
551 39810 58401 33765 -9834 -46164 -57370 -50418 -33064 -2113 32938 48988 29689 -3991
563 -3991 -22142 -7843 26320 52551 52090 30757 -837 -37492 -72848 -87746 -63082 -12476 29325
576 29325 41477 25365 5804 3102 11388 28159 42456 52688 47821 14188 -39129 -81915 -86620
589 -86620 -60216 -22673 9683 24616 27035 20417 10586 2963 12692 39144 61172 53575 16247
602 16247 -28589 -62443 -70516 -60499 -34518 -3283 24110 34107 21169 -1433 -8570 7287 33637
615 33637 48791 45082 24227 -7162 -39625 -63012 -63236 -36408 1033 28998 29501 11407 -4442
628 -4442 -8604 -1035 13278 32937 43815 35228 7751 -28161 -56561 -57764 -31888 344 20523
641 20523 24784 18074 2818 -12756 -14205 648 25073 43030 40680 13871 -21680 -45372 -48955
654 -48955 -36065 -11896 14010 28975 23442 4666 -13611 -15690 406 23139 39397 36629 17556
667 17556 -10138 -36857 -50828 -44571 -18794 9952 24006 21700 6351 -6682 -10062 704 18554
680 18554 33499 37996 25876 -2411 -33610 -49230 -44289 -24136 457 16671 19962 10287 -35
693 -35 -6226 -1557 14245 32393 38588 26414 1430 -24120 -41335 -42845 -28340 -7021 10689
706 10689 19827 14476 957 -8879 -5082 8389 24012 30918 26322 8862 -13800 -31253 -36941 -26539
720 -26539 -7795 12585 19713 12549 -1191 -12199 -15512 -6575 9123 22425 24083 13662 -2499
733 -2499 -19566 -24518 -15575 2418 18893 23346 15940 -868 -18358 -28428 -23513 -8539 6225
746 6225 17205 15781 3687 -7487 -9052 -2245 14498 28389 32050 21769 -909 -23817 -38033
759 -38033 -39223 -29434 -10200 5332 11405 6981 2725 3374 10540 25235 38185 40022 27868 4097
773 4097 -22918 -44070 -51758 -43328 -27307 -9442 2339 8009 8683 11059 18794 30761 41504 44232
787 44232 34309 11894 -16057 -40821 -51253 -49453 -36172 -17480 -3184 4233 8828 12329 19609
800 19609 28733 38806 44361 34755 16465 -7347 -32052 -46232 -46730 -37779 -20172 -4848 3873 7693
814 7693 8360 12132 20453 28931 34102 31817 19625 307 -20937 -32775 -36881 -28102 -14406 -2295
828 -2295 5389 5150 2720 2062 5838 12555 20544 21295 15586 3545 -9302 -20793 -22462 -13744 -3159
843 -3159 6972 10430 7017 -2777 -7252 -8297 -4268 4217 9526 10270 3733 -2981 -9191 -8766 -2318 9783
859 9783 18820 15833 9781 -1650 -11858 -18564 -17892 -11452 -2911 1444 1419 -1033 -1485 470 7626 16930
875 16930 22825 23464 13444 594 -13214 -21331 -23611 -20982 -13410 -7061 -1911 -558 1059 5719 11268
890 11268 19538 25949 26872 17693 4241 -10873 -22459 -27204 -22622 -17623 -10522 -3894 149 2557 3650
905 3650 9859 18517 22647 23305 17988 8053 -4708 -17485 -23108 -22303 -17998 -9809 -2086 295 987 2168
921 2168 7117 11686 15890 16854 14934 8562 16 -12804 -18311 -18800 -12648 -5906 -470 810 2283 1419
937 1419 1223 4136 7999 12412 12555 8240 -1804 -7431 -10371 -11300 -6237 -3217 893 4128 2726 776
953 776 -1284 -552 3334 5768 4778 1911 -1124 -2860 -5451 -5576 -4763 193 5826 5073 3859 122 -2699
970 -2699 -711 1381 -785 -907 973 1182 -1450 -5540 -4279 -318 2546 3774 5036 2455 986 -459
986 -459 -1687 -3418 -2293 129 1044 -556 -3238 -3038 -1466 1160 1525 2222 4175 5868 3847 -605 -3562
1003 -3562 -3686 -2434 283 745 -163 -779 -738 73 -450 -1737 3022 6207 5364 944 -2068 -1642 -1359 -1270 -2577
1022 -2577 -1431 584 1306 -183 -2368 -1866 -318 3984 3044 1841 508 886 225 -1423 -1905 -781 1175
1039 1175 3035 767 -2303 -2846 988 1619 346 313 -105 2805 1583 -213 -2327 -1839 105 188 -3711
1056 -3711 -3255 -99 795 2121 847 -1017 569 1711 460 -302 -320 1317 1920 209 -2852 -4463 -1727
1073 -1727 862 1197 -477 530 1598 1139 -449 -824 -537 1813 3147 1145 -2034 -2013 -1530 -1146 -1369 -448
1091 -448 1601 2091 1920 -1764 -3199 -1289 2488 2093 -197 -178 -50 -54 -839 -1725 -632 1311 4916 3615
1109 3615 1533 -2024 -1241 -867 -1028 -1675 -519 1150 2159 -437 -2228 -1658 1962 4175 3737 1332 2062
1126 2062 1886 -365 -3834 -6128 -4497 -409 185 -378 -2259 -1268 933 2875 2036 3760 5579 7782
1142 7782 3782 -1366 -5858 -5075 -3871 -2934 -3631 -3204 -1809 -407 -1672 -1986 862 6837 10004 8274
1158 8274 4850 1280 -864 -3075 -4373 -5871 -3758 -2203 -1708 -5321 -6451 -6316 -51 6386 8803 8458
1174 8458 9759 6498 2615 -1390 -3335 -1616 -61 -896 -5966 -10139 -9370 -6979 -3956 1891 4866 10053
1190 10053 12297 7636 4293 1647 1375 2530 1482 -736 -3960 -8062 -9836 -12271 -10212 -4290 3205
1205 3205 9138 9629 8709 6885 6780 5781 4773 4223 4097 806 -5017 -12221 -15051 -14369 -8824 -3108 2541
1222 2541 6235 8875 9119 6041 5663 5748 8228 8864 5575 -11 -6212 -12126 -14180 -14107 -9729 -2857 2515
1239 2515 5614 3747 1345 2866 6127 9963 11592 10494 5669 394 -5930 -11494 -14410 -9564 -5521
1254 -5521 -1605 -1040 -2837 -2421 -1031 1906 6022 12517 14467 13323 7252 253 -4021 -6836 -6115 -4726
1270 -4726 -4675 -4771 -7330 -8979 -8838 -6696 819 9447 15334 16490 12622 6922 2418 136 -1538 -2182 -2149 -4157
1288 -4157 -9299 -13688 -16145 -14698 -5661 2993 9027 14188 14620 12750 8903 4245 2770 3904 2648
1303 2648 -1416 -8656 -14705 -19744 -17717 -13660 -7379 3273 11158 14562 14181 9921 7401 7000 8035
1318 8035 8680 4347 -2545 -10072 -17478 -20050 -20437 -12380 -1972 5170 9631 9758 9343 8605 7848 9465
1334 9465 11190 9362 4535 -2343 -13171 -18945 -19129 -14010 -6059 50 5331 5696 4925 3572 3733 7730
1350 7730 11938 13351 11098 2958 -6354 -13498 -16406 -12883 -7635 -898 1977 3306 -507 -2049 -1146 3200
1366 3200 8237 12990 12847 9397 534 -6701 -11365 -10459 -5672 -1233 780 -393 -2803 -5355 -4588 -2047
1382 -2047 2968 8947 13435 11349 5919 -1339 -6159 -5886 -4318 -202 545 708 -3121 -7883 -10123 -6446
1398 -6446 -539 5876 10207 10847 7389 2804 -2293 -4564 -2987 357 4137 1981 -3272 -7207 -10182
1413 -10182 -9478 -4700 1589 9023 10426 8534 3655 -1484 -3991 -2213 1422 4454 3489 468 -6710
1428 -6710 -9926 -11281 -7103 43 7319 11512 8475 4092 -1348 -3948 -4626 -199 3347 4803 1747
1443 1747 -4034 -8964 -11349 -7820 -1479 6282 11290 10543 6874 645 -2734 -3444 -471 2416 3405 2221
1459 2221 -3186 -10273 -11465 -12521 -4383 3968 10162 11985 10394 3430 253 -261 266 2943 4353 950
1475 950 -5933 -11685 -15934 -14982 -9998 -1768 6721 11272 11552 8269 6481 3846 5364 6850 7124 3165
1491 3165 -3424 -11332 -17956 -20210 -16712 -8995 1037 8379 12002 11288 9621 8345 9957 11604 12008 9845
1507 9845 1713 -8146 -19888 -26563 -23665 -16239 -6633 2385 7255 10460 10806 11305 11962 14984 18047 15831
1523 15831 8800 -2862 -15670 -23647 -25862 -21934 -14098 -5725 947 4442 5221 7050 10959 16228 21557
1538 21557 21828 15723 5274 -6117 -16807 -23464 -21651 -17044 -9518 -4492 -4713 -4071 -534 5628 10695
1553 10695 19592 22935 22981 16177 5222 -5777 -13409 -14498 -11506 -9956 -10295 -11214 -12286 -12118 -8182 -1460
1569 -1460 9841 19268 24849 22271 15305 6739 2832 -1918 -3933 -6594 -7987 -11494 -17566 -22592 -24028
1584 -24028 -16984 -4372 7065 16454 21034 23277 21324 15941 11384 7813 6903 3808 -7002 -19516
1598 -19516 -29563 -32930 -28501 -21140 -10309 2673 16202 23974 24953 21968 21080 22179 20426 12641
1612 12641 1257 -11953 -23178 -34140 -40821 -36242 -24748 -8022 4997 13223 18078 22274 27229
1625 27229 30152 27652 23934 16092 5561 -12446 -30265 -41270 -38835 -29618 -18317 -11150 -1690 8540
1639 8540 16650 21051 25078 27917 32061 30235 15777 -693 -17576 -25444 -29376 -29433 -26411 -19197 -9411
1654 -9411 -1879 -1057 3252 13589 25647 33226 30243 22805 13306 3755 -7008 -17476 -23275 -20326
1668 -20326 -15363 -12546 -17335 -16565 -8994 1427 10043 16303 22615 26675 26723 16982 4225 -3657 -5730
1683 -5730 -4011 -7830 -16155 -21366 -19743 -17971 -17934 -13304 -309 14236 25873 23553 18069 13675 13767 13052
1699 13052 6147 -1727 -5472 -8808 -16802 -28013 -32030 -25765 -10859 2724 8422 12241 19349 24065
1713 24065 21772 15087 10549 12530 11106 2211 -13594 -28498 -29731 -25349 -22030 -16215 -5338 8876
1727 8876 18094 17240 13653 15974 22882 25743 17371 3785 -6218 -11137 -19591 -28418 -31027 -21587 -5380
1742 -5380 4232 2866 1437 7787 19525 23275 19412 14817 13057 9935 -130 -16741 -25341 -22570
1756 -22570 -12758 -8447 -10260 -8919 413 7458 9559 7883 10149 19716 22457 13043 -1584 -10695 -10185
1771 -10185 -7542 -11652 -16694 -12404 -2318 2060 -2171 -6132 -62 13030 20105 14694 6751 4123
1785 4123 5977 685 -10523 -15472 -9485 545 1509 -6258 -13013 -7262 4022 7903 4303 4650 11416
1800 11416 16245 8055 -6869 -11529 -4792 3625 564 -7954 -10570 -4575 -80 -1599 -6083 -960 11657
1815 11657 17669 9749 -1241 -5302 -1260 2200 -2601 -9384 -5972 1674 1474 -7440 -13274 -4380 10261
1830 10261 14372 8941 603 3879 7723 2955 -7622 -12319 -3852 5699 2476 -11310 -15168 -5924
1844 -5924 5160 7674 3269 2895 10390 16334 7287 -6655 -10076 -1277 5108 -1851 -13553 -14536 -5798
1859 -5798 516 -4423 -7932 139 15926 20812 12019 659 620 8334 7009 -4723 -12972 -9560 -2712
1874 -2712 -3664 -16751 -19947 -10689 8140 12689 7363 5643 14263 21580 15451 2196 -3680 1064 5371
1889 5371 -4821 -20619 -26519 -15990 -6412 -5906 -9473 -1617 14897 24024 17288 7440 7458 17611
1903 17611 17225 3474 -12871 -18657 -14219 -14893 -23850 -28255 -14432 2963 12820 8137 4961 15807
1917 15807 28280 29336 14813 3543 3318 4744 -7081 -26947 -34320 -25518 -10520 -8705 -13590 -8976
1931 -8976 8530 23600 24159 16109 18167 24701 27276 8879 -11743 -19939 -16327 -13753 -22863 -31461
1945 -31461 -24014 -4140 5719 1575 2 13043 31769 36238 22096 7081 7651 8891 1211 -18360
1959 -18360 -31158 -24719 -13791 -13267 -21786 -20534 -3332 15455 20570 15057 15472 26429 32593 21423
1973 21423 182 -10236 -6965 -4840 -15816 -30331 -31782 -18476 -6256 -8017 -10346 1885 22581
1986 22581 34994 26930 15069 14103 20182 16101 -1590 -19918 -22378 -15128 -18277 -30261 -33978 -19667
2000 -19667 1184 13545 11047 12327 25348 37985 33020 13590 2582 5780 5432 -8852 -31116
2013 -31116 -40252 -29101 -16235 -16207 -18417 -8689 14345 30990 27698 18107 19159 28864 29567 10351
2027 10351 -12232 -19737 -14929 -16802 -30416 -39232 -28392 -7191 7149 4129 3287 18386 35293
2040 35293 37336 22442 8570 9424 11937 363 -22691 -35080 -26795 -14034 -15600 -22765 -18237 704
2054 704 19939 21865 13554 14847 26281 32675 17879 -2884 -10080 -6286 -6428 -18484 -33144 -30397
2068 -30397 -12885 -574 -4056 -8542 2503 21226 30533 21287 11631 12878 19592 13648 -6149
2081 -6149 -22186 -19673 -10548 -11808 -23425 -26932 -12874 6424 11271 5124 6332 21296 32683
2094 32683 25848 7697 -2403 3479 6087 -5169 -24093 -29230 -17935 -7869 -10462 -17479 -9594
2107 -9594 12962 25397 21298 10763 13440 22987 21663 5485 -13591 -14978 -7396 -8895 -20987
2120 -20987 -28838 -18834 -1298 6290 1355 595 12478 28055 26811 11525 1154 5005 9518 900
2134 900 -17468 -25033 -15661 -6182 -8952 -16867 -14088 3981 18606 16515 6477 5663 16651 20089
2148 20089 8255 -8252 -10658 -1841 89 -12011 -22618 -17623 -2324 7306 1555 -5095 2023 17058
2162 17058 20835 6546 -2741 582 10016 6738 -8952 -17634 -11395 -873 -2187 -10857 -12260 393
2176 393 12829 10977 1169 -3202 6762 15230 9308 -5340 -9494 -250 3827 -4632 -15934 -13209 -28
2191 -28 8192 1120 -6275 -4761 9123 13282 5943 -6086 -1868 7203 7770 -3041 -14778 -10416 1740
2206 1740 4791 -2335 -8999 -2376 11723 10700 -682 -5749 1572 12417 7729 -4948 -11619 -4820
2220 -4820 3114 -1089 -9755 -9377 1629 10306 7178 -4133 -4339 7263 13862 6960 -5651 -6065 2455
2235 2455 4394 -5307 -15426 -12978 641 6583 964 -7005 -289 10580 12430 3868 -2397 2567
2249 2567 9419 8266 -6496 -14891 -9715 -990 -1135 -9937 -10056 -981 9034 8483 467 -524 8889 17320
2265 17320 12605 504 -5306 -1273 140 -5452 -16581 -16102 -5525 1593 -2303 -7860 -1767 10261
2279 10261 18951 14940 6433 7556 12596 9133 -4055 -15080 -14855 -8109 -6611 -14839 -18719 -10298 3881
2294 3881 10244 7373 7835 15913 23516 18401 5016 -4194 -3521 -1579 -8997 -19150 -23506 -14840 -7502
2309 -7502 -5466 -8183 -2524 11911 23562 21495 13172 10025 11655 10652 -1702 -12558 -17179 -10857
2323 -10857 -10555 -16840 -20255 -14037 306 10415 9679 10263 15513 22632 18888 8308 -1146 -3252 392
2338 392 -3993 -14680 -21857 -16685 -8444 -5580 -7806 -4089 8326 17357 16340 8492 7319 10530 13429
2353 13429 6645 -5008 -8569 -5604 -7133 -13770 -19598 -15020 -5395 2316 2577 604 3723 12073 16768
2368 16768 11705 7176 8790 10883 6669 -4824 -15561 -15188 -9733 -9212 -14088 -14626 -6409 1802 6849
2383 6849 4735 6633 16419 23073 19256 10429 2342 692 -1511 -10657 -18422 -21641 -16131 -10011 -9740 -10633
2399 -10633 -3832 8460 18292 20254 17702 17368 17741 13494 695 -11304 -15650 -13271 -14730 -19918 -21659
2414 -21659 -15809 -4627 3133 7624 11443 19857 25889 23693 12259 3385 598 -1759 -7149 -15805
2428 -15805 -21033 -18341 -14083 -10647 -10495 -3274 8850 18000 18644 14704 13302 12477 9751 2536 -6449
2443 -6449 -9384 -7747 -9377 -15009 -18031 -14244 -3676 4038 5699 6650 10013 14380 12767 7612 3403
2458 3403 1601 3982 696 -5942 -11543 -10425 -8606 -6007 -6236 -5235 677 6370 6403 3457 2854 5467
2474 5467 10788 7390 2865 847 710 -44 -5225 -10127 -10966 -5553 -2781 -4183 -4835 -2566 2310 5974
2490 5974 6626 6622 7272 10175 10361 3537 -4829 -6290 -5028 -5022 -9100 -10373 -7812 -4883 -2093 -1246 1706 8235
2508 8235 13383 14017 9332 4253 3093 616 -3954 -8777 -8782 -7326 -6284 -6929 -8283 -5569 382 7630
2524 7630 9832 8451 9063 9686 7467 1908 -3297 -3914 -5222 -4994 -8291 -9888 -8742 -5467 -618 1569
2540 1569 4030 7132 10167 9754 5008 1243 609 788 -1432 -4103 -6908 -7098 -5177 -4929 -3839 -1491
2556 -1491 3739 6966 7476 4718 3042 3312 2825 34 -1672 -2675 -2872 -2414 -3385 -6347 -3426 -723 2113
2573 2113 1755 3499 2421 2948 2416 1272 -764 -184 962 1367 -1154 -3872 -3160 -1678 -160 -139 694 2868
2591 2868 4022 3540 -454 -679 278 1417 714 -1727 -1771 -2069 -1903 -3373 -3446 -1404 1070 3812 3054 1057
2609 1057 1062 1197 623 -778 -1199 -196 556 -1491 -2858 -2824 -2636 -380 2550 2644 2864 2495 2596 1087 -58
2628 -58 -876 537 228 -201 -951 -2652 -3019 -2775 -2906 -548 1105 2125 2892 2516 509 1327 1302 1837 1796 -956
2648 -956 -433 -1020 -2067 -1749 -2414 -781 332 1729 0 -511 -474 577 1616 1813 106 1776 2215 858
2666 858 -987 -1420 -2313 -1383 -1401 -2361 -2051 -399 -1922 -801 335 766 3003 5377 4488 3947 1470 626
2684 626 67 -1480 -3485 -3881 -3614 -4487 -4207 -4875 -3773 33 4180 5070 6649 7607 5463 4939 1251 -1246
2702 -1246 -2052 -4577 -6108 -7496 -7446 -7064 -4101 -1674 1250 4742 8206 9352 8237 6341 3269 58
2718 58 -1007 -3928 -4465 -7765 -8148 -7593 -7537 -2743 125 4090 7762 7988 7286 6654 5197 2969 1198 -2118
2736 -2118 -4270 -6463 -7733 -7722 -6698 -3664 -619 2438 5068 7031 6489 5902 5586 1911 590 -302 -2788
2753 -2788 -4011 -4616 -4665 -5955 -3490 -659 -109 1410 3665 3972 2561 2286 265 411 535 -628 -554 -1129
2771 -1129 -1146 -2222 -2377 -1437 -572 657 786 -825 -915 -553 -203 -945 -102 1751 2251 1500 2133 2133 2303 404
2791 404 1084 -2193 -884 -2448 -3407 -3733 -3012 -2665 -247 1116 3631 4700 4119 3757 3214 2403 833 -1477
2809 -1477 -3268 -4059 -5014 -5965 -4842 -4184 -1067 1930 3153 5601 6237 6402 4628 3731 820 -1264 -2780
2826 -2780 -4691 -6217 -6377 -5631 -3792 -3377 -1089 2738 4273 6722 4669 4883 2889 2143 -957 -1881 -3340
2843 -3340 -3342 -5325 -5125 -3254 -1845 615 3138 2473 3749 4459 4741 3966 2535 70 -1608 -2029 -2736 -2440
2861 -2440 -2901 -1782 -541 1443 2252 2582 3225 2361 2160 950 852 -159 -689 -1943 -991 -1678 -1628 -727 487
2880 487 1259 1554 1299 1075 1431 1388 719 -1231 -2078 -1413 -680 -35 -232 315 850 949 1724 1707 2146 1419 15
2901 15 -960 -1008 -658 -1562 -774 -522 -547 490 1280 1269 1620 811 1849 2466 338 -827 -1103 -2937 -699 -1209
2921 -1209 -1591 -706 1030 -348 -195 1485 1519 418 1441 546 327 120 -497 -1082 -5 -509 -816 -82 1142
2940 1142 1452 729 1767 412 733 -540 -552 135 -569 -1148 -780 -35 1233 -150 -85 424 -213 600 540 231
2960 231 634 3 197 -257 -163 -413 -701 -611 426 419 -500 91 884 941 -476 509 481 -126 -375 -201 -145 -613
2982 -613 376 -628 -575 582 907 252 1010 475 278 1307 -156 750 -182 1428 -453 -1216 305 -1290
3000 -1290 77 -83 706 1088 -270 -103 108 991 865 -206 199 642 200 -1041 -324 -432 -761 -1108 1093
3019 1093 353 -492 447 967 -521 1116 9 -476 -83 -1216 -316 -1104 -852 -1216 342 393 -335 652 121
3038 121 54 610 235 460 304 -1731 -1198 -1152 -2648 -108 -681 -51 327 598 783 -192 1322 1560 1558 262
3058 262 -510 -1635 -1626 -1582 -1225 -681 398 985 -53 1072 666 2245 1501 1013 337 -871 -730 -1608 -2393 -2385 -1362
3079 -1362 -805 -949 380 369 1213 1428 2333 1755 1758 357 478 14 221 -1848 -2117 -1106 -2524 -1419 -319
3098 -319 244 1106 1978 2093 2642 1924 -5 839 -438 -491 -1650 -2251 -1404 -3534 -2128 -1428 1989 -60
3116 -60 1106 2225 1276 2352 1586 527 272 1263 -235 -1085 -1059 -1710 -1537 -1276 -1332 -1655 -1524 -32 -15 879
3136 879 724 2168 1845 2486 2104 1946 780 762 -1435 -842 -2284 -1706 -2179 -2838 -2274 -1583 921 703 2444
3155 2444 2101 3634 2307 2390 1749 127 -229 -781 -1826 -2884 -3150 -3487 -2709 -1792 553 1436 1560 3867
3173 3867 3391 2291 1618 2777 909 694 -1694 -1744 -1575 -4653 -4086 -3509 -2665 -1363 1567 2633 1672 3572
3191 3572 4143 3685 3562 1934 -724 -761 -1122 -4105 -4353 -3693 -4321 -2802 -1695 35 710 3230 4576 4084
3209 4084 2704 2573 2585 2498 440 -224 -3961 -3846 -3583 -4002 -3721 -2293 -709 -190 687 716 2776 3851 3863 3592
3229 3592 1941 736 -1336 -2664 -4098 -5282 -4429 -3587 -2624 -2931 48 1821 1372 3140 4813 5603 5101
3246 5101 2762 1681 830 -1324 -3249 -3010 -4273 -4874 -4072 -3766 -1676 50 2206 3206 4930 4773 3900
3263 3900 3509 2359 933 -1032 -2274 -3258 -2841 -2797 -3797 -3918 -2171 -62 1769 2614 2740 4120 4443 2395
3281 2395 2056 1131 1770 -1979 -2236 -3602 -2738 -3809 -3051 -2695 -683 1233 1362 2578 3481 2982 1845 2202
3299 2202 1348 1164 -407 -1393 -995 -1612 -3359 -2481 -2674 -605 -638 1735 -11 1692 847 645 1710 1765 510
3318 510 155 301 -765 -2185 -2648 -2651 -2848 -2213 383 -759 -156 1250 789 1967 2955 3617 2553 1064
3336 1064 149 -965 -1213 -1345 -2889 -1672 -2597 -1806 235 -126 961 1276 2117 2301 2204 1335 1173 580 -980
3355 -980 -847 -2850 -2321 -1314 -1866 -1713 -2019 784 702 1879 2134 3054 3470 795 995 76 -1270 -1132 -1647
3374 -1647 -2594 -1360 -828 -1351 205 1170 586 1399 1962 789 2052 325 -367 -924 -1520 -1952 -1167 -2007 -1538
3393 -1538 -1271 -537 -105 1077 1142 2574 678 1878 731 273 -390 -1016 -704 -1392 -1645 -1848 -629 -1184 -669
3412 -669 500 1231 2756 3354 3216 1323 313 45 -678 -1663 -2507 -2023 -3276 -2881 -2021 -564 156 2346
3430 2346 3276 4042 4009 3585 1808 731 -1379 -1573 -2372 -3794 -3286 -4894 -3561 -2182 -360 1601 3080
3447 3080 4733 4536 4565 3813 3883 1317 -134 -2173 -2967 -4803 -4378 -3544 -3485 -2348 -192 2122 2873 3917
3465 3917 5603 3900 2590 2100 1650 -1499 -2370 -2980 -3427 -5360 -4427 -3431 -2727 -58 276 2478 2749 3214
3483 3214 4464 3678 2864 1662 -135 -273 -1791 -3412 -3339 -4428 -4255 -2199 -2042 -97 392 1516 2683
3500 2683 2533 3390 4285 4219 2859 974 1213 -2298 -1662 -2785 -3615 -3757 -3800 -2288 -2878 345 1033 2510
3518 2510 4904 6337 6621 5629 3571 3173 322 -1786 -3272 -6445 -6431 -6376 -5639 -4793 -3307 251 2745
3535 2745 5326 6105 9007 8659 7292 4628 1744 -501 -5555 -8350 -9389 -9273 -9278 -6085 -3649 194 4189
3552 4189 7199 8857 10370 9695 8014 5377 1504 -2538 -5722 -8818 -9856 -9789 -8841 -4844 -2867 1716
3568 1716 4872 7229 7287 9084 9409 6292 4208 103 -3239 -4739 -7353 -8149 -7045 -6660 -4571 -1152
3584 -1152 1231 3159 5303 8406 7573 6788 5856 3343 2815 -860 -4488 -5337 -4588 -4792 -4974 -5105 -1348
3601 -1348 -321 262 3001 2977 3786 4362 4714 3599 1631 1458 -45 -913 -1255 -2984 -3176 -3521 -3952 -4127 -3595
3620 -3595 -2825 182 2192 2524 3679 4346 7408 5729 4114 1531 1218 346 -3519 -4975 -8087 -7302 -6539
3637 -6539 -4204 -2173 660 3355 4884 6779 7380 7723 7052 5041 1593 -2184 -5056 -7342 -8804 -9125
3653 -9125 -8775 -6364 -1394 1252 3667 4910 8017 10057 9468 6421 3489 141 -1525 -4947 -8615 -9342
3669 -9342 -7928 -5761 -3892 -1357 1428 5365 6287 7152 6958 6823 5282 2465 -619 -3651 -6584 -8513
3685 -8513 -6852 -6808 -4907 -1697 -40 1436 3351 5113 5930 5891 6483 3388 446 -927 -2253 -3162 -6162
3702 -6162 -4706 -2934 -2207 -567 -393 291 2297 3194 2777 3716 2729 2309 1335 -307 -1795 -1525 -1169 -782
3720 -782 -1560 -2369 -1981 -199 -529 620 -146 1034 2719 2493 541 -680 200 1138 674 397 39 -413 -102
3739 -102 -1631 -920 -1058 -956 -3 1111 1631 -349 990 2101 1001 -477 -198 -153 1106 104 -2349
3756 -2349 -2228 -2337 0 -104 586 1189 1358 1351 1382 -1198 -44 1431 1303 739 -960 -1526 -1078 -610 -1081 -268
3776 -268 -497 1584 1009 -461 -896 2184 1947 327 123 -392 155 -354 -643 -3038 -2457 -285 888 1813
3794 1813 -593 1499 828 1203 1103 -573 -23 1653 1154 -1598 -2879 -3044 -1689 -948 -371 -688 571
3811 571 3384 1502 838 562 1382 3576 2664 169 -1593 -2839 -3263 -3811 -2975 -4518 -370 823 1625 867
3829 867 1752 4395 5127 4863 2340 1736 757 -1340 -5584 -6204 -7076 -4634 -2653 -2587 -187 1011 3643 6407
3847 6407 5811 5663 6693 5658 2146 -1726 -4515 -7391 -6958 -6511 -6086 -4901 -1603 2209 4240 5019 6456
3864 6456 7746 8948 7118 3329 -1763 -4526 -4021 -8392 -9999 -8191 -5474 -2602 -366 431 3976 6436
3880 6436 9134 8063 6312 2973 3153 -1138 -4533 -8128 -7789 -5381 -3961 -3522 -3015 67 2115 4409
3896 4409 3874 5242 5985 5574 4503 438 -2760 -2968 -4156 -2588 -3999 -3188 -1536 101 505 -232 160
3913 160 2225 4273 3203 1908 454 2606 2750 -144 158 -210 1764 1329 -1550 -4071 -5063 -3205 -2771
3930 -2771 -1323 -2095 -60 2591 4210 2046 2661 4666 6555 5162 2845 -2283 -4836 -5540 -8172 -8718
3946 -8718 -8587 -6014 -1899 451 1120 3636 6893 11023 9522 8526 3664 2959 -2128 -6998 -9955 -11995
3962 -11995 -10123 -6626 -4714 -3120 962 4402 8284 9122 9912 9764 9579 5308 -1 -5815 -9237 -10458
3978 -10458 -9124 -9451 -8197 -3400 813 3592 4784 7730 9720 11182 9445 5364 803 -2649 -4895
3993 -4895 -6862 -10051 -8672 -5550 -3274 -1442 -787 779 5924 7912 6820 5349 3715 2576 -214
4008 -214 -3878 -6415 -5077 -4199 -1725 -3026 -2897 -1470 1160 1323 2602 2025 4549 4315 3439 744 -1856
4025 -1856 -1135 925 1325 -281 922 -847 -19 -1057 -3112 -3321 -842 -329 976 -479 -403 414 2557
4042 2557 2396 2331 3224 2490 3201 150 -3862 -5373 -5512 -2523 -3455 -3219 -1619 144 3698 2142 2919 4912
4060 4912 7357 6526 3456 76 -2545 -3802 -5249 -5844 -6375 -4491 -1924 1378 -642 776 3613 7809
4076 7809 7573 7199 4590 2054 1328 -3075 -5389 -7287 -4683 -2702 -2926 -2509 -1218 1278 3887 4431 5544
4093 5544 4539 4466
4095D466          $$ checkpoint
##END NTUPLES=NMR FID
##END=
