##TITLE=31P Tetra-salt(MeOH)
15.07.2013
##JCAMPDX= 6.0         $$ Bruker NMR JCAMP-DX V2.0
##DATA TYPE= NMR FID
##DATA CLASS= NTUPLES
##ORIGIN= UXNMR, Bruker Analytische Messtechnik GmbH
##OWNER= root
$$ XWIN-NMR		Version 3.5
$$ Thu Jul 18 09:29:13 2013 Russian Daylight Time (UT+4h)  zvl@DPX200
##.OBSERVE FREQUENCY= 81.013821
##.OBSERVE NUCLEUS= ^31P
##.DELAY= (6, 6)
##.ACQUISITION MODE= SIMULTANEOUS
##.ACQUISITION SCHEME= undefined
##.AVERAGES= 32
##.DIGITISER RES= 17
##SPECTROMETER/DATA SYSTEM= spect
##.PULSE SEQUENCE= zgpg30
##.SOLVENT NAME= Acetone
##.SHIFT REFERENCE= (INTERNAL, Acetone, 0, 182.463)
##AUDIT TRAIL= $$ (NUMBER, WHEN, WHO, WHERE, WHAT)
$$ ##TITLE= Audit trail, XWIN-NMR		Version 3.5
$$ ##JCAMPDX= 5.01
$$ ##ORIGIN= Bruker BioSpin GmbH
$$ ##OWNER= zvl
$$ D:/spectra/data/zvl/nmr/P31dec/2/audita.txt
$$ ##AUDIT TRAIL=  $$ (NUMBER, WHEN, WHO, WHERE, WHAT)
(   1,<2013-07-18 09:27:52.70 +400>,<zvl>,<DPX200>,
      <continue with go, POWCHK disabled, PULCHK disabled
       configuration hash MD5:
       11 64 04 C6 CF 8A CA 3B 7E DD FE 01 35 7D 01 E9
       data hash MD5: 64K
       44 AD 5F D8 CC A7 6E A8 80 26 6C CA E4 13 61 67>)
$$ ##END=
$$ 
$$ hash MD5
$$ E1 B7 F4 A9 4D E6 55 AC 41 D8 6D 52 36 C2 D0 D1
##$RELAX= 
##$RELAX= 
##$RELAX= 
##$RELAX= 
##$RELAX= 
##$RELAX= 
##$RELAX= 
##$RELAX= 
$$ Bruker specific parameters
$$ --------------------------
##$DU= <D:/spectra>
##$EXPNO= 2
##$NAME= <P31dec>
##$PROCNO= 1
##$TYPE= <nmr>
##$USER= <zvl>
##$AMP= (0..31)
100 100 100 100 100 100 100 100 100 100 100 100 100 100 100 100 100 100 
100 100 100 100 100 100 100 100 100 100 100 100 100 100 
##$AQSEQ= 0
##$AQ_mod= 1
##$AUNM= <au_zg>
##$AUTOPOS= <>
##$BF1= 81.014009
##$BF2= 200.13
##$BF3= 200.13
##$BF4= 200.13
##$BF5= 200.13
##$BF6= 200.13
##$BF7= 200.13
##$BF8= 200.13
##$BYTORDA= 1
##$CFDGTYP= 0
##$CFRGTYP= 5
##$CHEMSTR= <none>
##$CNST= (0..31)
1 1 145 1 1 1 1 1 1 1 1 1 1 1 1 1 1 1 1 1 1 1 1 1 1 1 1 1 1 1 1 1 
##$CPDPRG= <waltz16>
##$CPDPRG1= <>
##$CPDPRG2= <waltz16>
##$CPDPRG3= <>
##$CPDPRG4= <mlev>
##$CPDPRG5= <mlev>
##$CPDPRG6= <mlev>
##$CPDPRG7= <mlev>
##$CPDPRG8= <mlev>
##$CPDPRGB= <>
##$CPDPRGT= <>
##$D= (0..31)
0 1 0 0 0 0 0 0 0 0 0 0.03 2e-05 3e-06 0 0 0 0 0 0 0 0 0 0 0 0 0 0 0 0 
0 0 
##$DATE= 1374124573
##$DBL= (0..7)
120 120 120 11 120 120 24 19 
##$DBP= (0..7)
150 150 150 150 150 150 150 150 
##$DBP07= 0
##$DBPNAM0= <>
##$DBPNAM1= <>
##$DBPNAM2= <>
##$DBPNAM3= <>
##$DBPNAM4= <>
##$DBPNAM5= <>
##$DBPNAM6= <>
##$DBPNAM7= <>
##$DBPOAL= (0..7)
0.5 0.5 0.5 0.5 0.5 0.5 0.5 0.5 
##$DBPOFFS= (0..7)
0 0 0 0 0 0 0 0 
##$DE= 6
##$DECBNUC= <off>
##$DECIM= 4
##$DECNUC= <off>
##$DECSTAT= 4
##$DIGMOD= 1
##$DIGTYP= 9
##$DL= (0..7)
0 0 52 120 120 21 21 25 
##$DP= (0..7)
150 150 150 150 150 150 150 150 
##$DP07= 0
##$DPNAME0= <>
##$DPNAME1= <>
##$DPNAME2= <>
##$DPNAME3= <>
##$DPNAME4= <>
##$DPNAME5= <>
##$DPNAME6= <>
##$DPNAME7= <>
##$DPOAL= (0..7)
0.5 0.5 0.5 0.5 0.5 0.5 0.5 0.5 
##$DPOFFS= (0..7)
0 0 0 0 0 0 0 0 
##$DQDMODE= 0
##$DR= 17
##$DS= 0
$$ [...]
##$SUBNAM1= <"">
##$SUBNAM2= <"">
##$SUBNAM3= <"">
##$SUBNAM4= <"">
##$SUBNAM5= <"">
##$SUBNAM6= <"">
##$SUBNAM7= <"">
##$SUBNAM8= <"">
##$SUBNAM9= <"">
##$SW= 400.765351723535
##$SWIBOX= (0..15)
0 1 3 0 0 0 0 0 0 0 0 0 0 0 0 0 
##$SW_h= 32467.5324675325
##$TD= 65536
##$TD0= 1
##$TE= 0
##$TE2= 300
##$TE3= 300
##$TEG= 300
##$TL= (0..7)
0 120 53 12 22 120 120 120 
##$TP= (0..7)
150 150 150 150 150 150 150 150 
##$TP07= 0
##$TPNAME0= <>
##$TPNAME1= <>
##$TPNAME2= <>
##$TPNAME3= <>
##$TPNAME4= <>
##$TPNAME5= <>
##$TPNAME6= <>
##$TPNAME7= <>
##$TPOAL= (0..7)
0.5 0.5 0.5 0.5 0.5 0.5 0.5 0.5 
##$TPOFFS= (0..7)
0 0 0 0 0 0 0 0 
##$TUNHIN= 0
##$TUNHOUT= 0
##$TUNXOUT= 0
##$USERA1= <user>
##$USERA2= <user>
##$USERA3= <user>
##$USERA4= <user>
##$USERA5= <user>
##$V9= 5
##$VALIST= <valist>
##$VCLIST= <CCCCCCCCCCCCCCC>
##$VD= 0
##$VDLIST= <DDDDDDDDDDDDDDD>
##$VPLIST= <PPPPPPPPPPPPPPP>
##$VTLIST= <TTTTTTTTTTTTTTT>
##$WBST= 1024
##$WBSW= 4
##$XGAIN= (0..3)
0 0 0 0 
##$XL= 0
##$YL= 0
##$YMAX_a= 11740
##$YMIN_a= -15597
##$ZGOPTNS= <>
##$ZL1= 120
##$ZL2= 120
##$ZL3= 120
##$ZL4= 120
##$ABSF1= 60
##$ABSF2= -190
##$ABSG= 5
##$ABSL= 3
##$ALPHA= 0
##$AQORDER= 0
##$ASSFAC= 0
##$ASSFACI= 0
##$ASSFACX= 0
##$ASSWID= 0
##$AUNMP= <proc_1d>
##$AZFE= 0.1
##$AZFW= 0.5
##$BCFW= 1
##$BC_mod= 2
##$BYTORDP= 1
##$COROFFS= 0
##$CY= 10.7336750030518
##$DATMOD= 1
##$DC= 1
##$DFILT= <>
##$DTYPP= 0
##$F1P= 91.4548674951704
##$F2P= -47.2163834837822
##$FCOR= 0.5
##$FTSIZE= 0
##$FT_mod= 0
##$GAMMA= 1
##$GB= 1
##$INTBC= 1
##$INTSCL= 1
##$ISEN= 30
##$LB= 1
##$LEV0= 0
##$LPBIN= 0
##$MAXI= 13.09214
##$MC2= 0
##$MEAN= 0
##$ME_mod= 0
##$MI= 0.630608
##$NCOEF= 0
##$NC_proc= 0
##$NLEV= 6
##$NOISF1= 0
##$NOISF2= 0
##$NSP= 1
##$NTH_PI= 0
##$NZP= 1
##$OFFSET= 182.463
##$PC= 1.4
##$PHC0= 2238.034
##$PHC1= 68.20129
##$PH_mod= 0
##$PKNL= yes
##$PPARMOD= 0
##$PSCAL= 0
##$PSIGN= 0
##$REVERSE= no
##$SF= 81.0140089999434
##$SI= 32768
##$SIGF1= 0
##$SIGF2= 0
##$SINO= 80
##$SIOLD= 32768
##$SREGLST= <31P.CDCl3>
##$SSB= 0
##$STSI= 0
##$STSR= 0
##$SW_p= 29940.119760479
##$SYMM= 0
##$S_DEV= 0
##$TDeff= 0
##$TDoff= 0
##$TI= <>
##$TILT= no
##$TM1= 0
##$TM2= 0
##$TOPLEV= 0
##$USERP1= <user>
##$USERP2= <user>
##$USERP3= <user>
##$USERP4= <user>
##$USERP5= <user>
##$WDW= 1
##$XDIM= 64
##$YMAX_p= 0
##$YMIN_p= 0
$$ End of Bruker specific parameters
$$ ---------------------------------
##NTUPLES= NMR FID
##VAR_NAME=  TIME,          FID/REAL,        FID/IMAG
##SYMBOL=    X,             R,               I
##VAR_TYPE=  INDEPENDENT,   DEPENDENT,       DEPENDENT
##VAR_FORM=  AFFN,          ASDF,            ASDF
##VAR_DIM=   32768,         32768,           32768
##UNITS=     SECONDS,       ARBITRARY UNITS, ARBITRARY UNITS
##FACTOR=    3.08e-05,      1,               1
##FIRST=     0,             0,               0
##LAST=      1.0092236,     0,               0
##MIN=       0,             -15597,          0
##MAX=       1.0092236,     11740,           0
$$ Real data points
##PAGE= N=1
##DATA TABLE= (X++(R..R)), XYDATA
0 0 0 0 0 0 0 0 0 0 0 0 0 0 0 0 0 0 0 0 0 0 0 0 0 0 0 0 0 0 -2 3 -4 5 -7 6 -7 10 -10 14 -14 17 -19 18 -21 19 -23 25 -26 31
48 31 -36 37 -42 49 -53 58 -62 69 -76 88 -104 120 -134 161 -197 249 -342 528 6345 -4405 -9921
69 -9921 -7123 1278 -7135 -955 3194 -2690 3444 6100 -176 7479 7931 -468 9794 7184 2150
84 2150 10222 4578 1046 9134 1830 -1315 5101 -2740 -2518 2715 -5684 -4899 -380 -9775 -5100 -3232
100 -3232 -11613 -6159 -5788 -12682 -5170 -5937 -12323 -4280 -5917 -10640 -1752 -6010 -7881 368 -5111 -6644
116 -6644 2233 -2774 -3938 5185 -2459 -181 6108 -1443 3131 5594 -770 4516 5869 -453 4590
131 4590 4971 -2175 6425 2283 -3197 6131 -23 -2931 3687 -1351 -5182 2811 -4473 -6772 33
146 33 -8187 -5876 -1915 -9299 -6932 -3836 -11496 -6321 -3549 -11352 -3652 -2995 -9358 -689 -2270 -5722
162 -5722 2297 1073 -2837 6958 2083 815 9290 2614 2849 10025 1781 2977 7990 -1798 1585
177 1585 5659 -2012 771 2610 -6204 314 -1576 -8250 -180 -3429 -7993 -590 -3909 -8781 -431
192 -431 -4445 -7617 1654 -4554 -7135 2816 -5845 -3686 1627 -5504 -1690 2622 -3864 -1070 4133
207 4133 -5206 1637 2907 -4225 5021 2400 -2620 4938 1934 -1659 6073 1878 -2295 7185 476
222 476 -1481 6686 -1387 -641 4190 -2464 -2314 2113 -6807 -3117 194 -9746 -3205 -2602 -9796 -3851
238 -3851 -4302 -9047 -3436 -5473 -10057 538 -4173 -6444 3572 -2245 -2175 5992 1056 663 8101 1600
254 1600 3579 9971 911 5905 9007 1077 5521 6829 -1031 4453 3222 -4532 1905 -1495 -7161
269 -7161 1141 -4835 -8966 -629 -7535 -8464 -548 -7902 -7904 -1674 -8233 -6724 -79 -7496 -2944 1188
285 1188 -6880 -899 1380 -6480 1329 1701 -4141 2796 1622 -3741 5534 1597 -2747 6917 -125
300 -125 -996 5971 347 527 7432 -775 1067 8634 -1223 2947 5569 -2706 3227 3514 -3755 462
316 462 438 -7741 -522 -3748 -10564 -1106 -6559 -11316 -3684 -8804 -10969 -3095 -8603 -8699 513 -6133
332 -6133 -4816 2666 -3693 1073 5155 -818 4696 7210 617 7689 9124 1483 9498 8316 1335
347 1335 9032 5073 312 8531 974 -1135 4437 -1653 -4099 2314 -4647 -4531 705 -7393 -4964
362 -4964 -265 -9682 -3380 -1626 -8928 -3044 -1422 -8745 -1982 -3041 -9272 480 -3705 -6799 2297
377 2297 -3666 -4587 2734 -2173 -3206 5014 -1035 -416 7643 -1263 4580 6698 1093 4781 8034 1223
393 1223 6353 9628 -227 8276 5562 -1180 7242 2630 -2834 4379 -1255 -5477 1484 -6525 -8361
408 -8361 -1410 -9794 -8206 -3347 -10377 -8365 -3170 -11092 -5734 -2024 -9529 -2774 -767 -6612 1958
423 1958 2150 -3154 4698 3670 -858 8155 3999 1120 9909 3547 2804 9003 2337 2358 7559 -935
439 -935 1649 4847 -2822 -665 3086 -5533 -981 446 -7750 -1362 -1920 -8245 -1044 -4325 -7281 -592
455 -592 -3820 -8558 598 -5002 -8140 2369 -7246 -5805 1913 -5812 -4198 1471 -5464 -2968 2687
470 2687 -5837 74 3693 -3775 4212 2846 -1529 5045 5373 -543 6871 5078 -1156 8877 1797
485 1797 -132 6796 -1712 -1260 3896 -2772 -4129 997 -7545 -4964 -1100 -10614 -5048 -3339 -11165
500 -11165 -5815 -4206 -11293 -5551 -5011 -10783 -1902 -3908 -6778 1834 -2664 -4188 4764 -1241 -103
515 -103 7054 645 1909 8127 -99 3346 7141 -1898 3987 6670 -2886 3469 3130 -4763 1173 753
531 753 -5470 664 -2082 -7873 1056 -4495 -7947 -870 -5716 -7263 -236 -7194 -7589 -1242 -7905 -5585
547 -5585 -526 -8992 -3761 -658 -8521 -1294 368 -7546 -436 698 -7166 4127 1034 -3768 6581
562 6581 1090 143 6889 2014 722 7723 2120 2160 9183 -497 3439 7247 -2464 1166 2461 -5106
578 -5106 -719 781 -8531 -1949 -3740 -12471 -3491 -7788 -12369 -4158 -8854 -11500 -3871 -8067 -9129
593 -9129 112 -6694 -5761 1888 -4234 -1467 5035 -1837 1256 7425 -1639 5303 6030 -60 6004 5704
609 5704 -859 7591 4022 -2490 5041 -486 -3144 2682 -1612 -4278 4525 -2808 -4560 2207 -5687
624 -5687 -4012 1952 -7203 -3203 -295 -7661 -3427 -489 -8758 -2464 -2303 -10865 -993 -3302 -7567
639 -7567 -886 -3308 -6826 383 -2156 -5950 4695 -2756 -2195 6093 -635 2270 7354 577 3764
654 3764 8378 1277 4821 8049 449 6646 6491 -1786 4475 1549 -2767 2633 -1422 -7439 -223
669 -223 -5100 -9649 -1435 -8034 -9866 -2673 -10813 -7458 -2744 -9490 -6259 -386 -7687 -1990 1159
684 1159 -7132 519 3274 -4431 3274 3287 -2265 5397 3700 -247 7209 3687 -232 7953 1499 792
700 792 8248 26 239 6452 -906 1484 5852 -2992 403 4054 -5076 750 405 -5350 517 -1317
716 -1317 -7521 -1372 -3655 -9249 -678 -4353 -8709 -358 -6540 -6728 384 -5942 -3755 2077 -4807
731 -4807 -1752 4322 -3239 1294 6079 -1330 4588 6349 122 7124 7307 121 9369 7240 1148
746 1148 7841 3041 171 7528 494 -1387 4553 -2692 -3417 1400 -5258 -5790 -4 -8162 -5347 -2036
762 -2036 -8649 -3406 -2762 -9482 -1410 -1595 -7738 593 -1183 -6368 3783 -124 -4127 5774 1140
777 1140 -769 7010 1125 727 7374 1636 2947 9449 448 4152 7877 -67 4741 5865 -1915
792 -1915 3680 3914 -3328 1976 1649 -4673 3897 -1997 -5501 2592 -3396 -5586 1016 -5700 -7285 535
808 535 -7644 -6070 120 -8875 -4142 -1442 -8185 -2534 1268 -6506 -53 2676 -4574 4315 3666 -1719
824 -1719 6886 4557 517 9371 5778 2757 10727 4276 3073 8834 1807 3169 7155 -1629 1970
839 1970 4767 -4906 -270 987 -8345 -2545 -2785 -9357 -2438 -4818 -10557 -2607 -6608 -8661 -490
854 -490 -5610 -8172 -288 -4647 -5160 3482 -4217 -3201 4380 -2650 2034 5561 -1496 2913 5750 -439
870 -439 4785 6952 -151 6358 6197 146 7280 3885 189 6646 1839 -1082 6418 -887 -3228 4070
886 4070 -4345 -2999 1951 -7276 -4358 -1501 -7854 -5633 -3001 -10912 -4943 -3888 -11074 -4557 -4491 -10512
902 -10512 -1599 -3156 -7739 178 -2785 -5057 4042 -556 -327 7691 956 1674 7886 952 3916
917 3916 8861 1364 4673 7585 -345 5103 6176 -1975 4162 2673 -4027 2077 -1481 -6587 567
932 567 -2631 -8576 -191 -5402 -8011 26 -8543 -7148 -634 -8628 -6579 -1389 -8405 -3654 220
947 220 -7671 -668 1194 -5688 1977 477 -3813 3342 2871 -3130 5143 2567 -1603 7110 2163 -235
963 -235 7502 1378 1188 7249 -128 1119 7790 -1314 1266 4552 -4203 656 1206 -7484 -620 -1299
979 -1299 -8354 -3874 -3709 -10385 -2538 -6659 -11007 -1593 -6901 -8535 -1345 -5611 -7018 1491 -4021
994 -4021 -3539 3137 -2538 300 5988 -1570 3773 5872 -612 5440 5273 -195 5613 5126 -760 6636
1010 6636 3386 -2409 5484 593 -2723 3886 -3000 -3756 2214 -4003 -4614 2453 -6401 -4453 799
1025 799 -8556 -3313 -1585 -6977 -2593 -1830 -7739 -1371 -1249 -7931 1804 -729 -5572 2758 -518 -3006
1041 -3006 4194 -138 -628 5556 -23 1118 8270 298 3579 7019 566 4649 7003 -147 3356
1056 3356 5730 -2393 3338 2694 -3861 2796 -1499 -5036 1607 -3449 -6455 -1016 -6449 -7470 -801
1071 -801 -7508 -6972 -584 -6244 -4597 191 -6972 -994 931 -4325 1266 3872 -4089 4098 5341
1086 5341 -2255 6532 4834 260 7239 3899 1089 8232 3197 1308 7964 1571 -913 7208 -1594
1101 -1594 356 4900 -3836 -927 2518 -6502 -1577 538 -7269 -1180 -1233 -8594 -412 -3868 -7739
1116 -7739 -1496 -4066 -6500 244 -2654 -6879 2937 -4301 -3932 3404 -3071 -70 3910 -1128 931
1131 931 6417 -36 4624 6480 1125 7491 7409 1365 8633 6664 1381 6828 4574 -1022 6300 1823
1147 1823 -2375 4418 -2556 -3024 908 -5261 -6096 -982 -7617 -5341 -2023 -9106 -4011 -2023 -9491
1162 -9491 -2736 -1923 -7605 112 -1280 -5643 3112 659 -2240 4932 2195 -488 8164 2760 2572
1177 2572 9587 2639 4055 8702 2755 3728 7441 1595 3715 7902 -357 5471 3515 -2975 2863
1192 2863 822 -4912 1306 -710 -6210 1012 -3014 -6579 1798 -5341 -6167 -1165 -6704 -5922 -1228
1207 -1228 -6429 -5986 229 -6997 -2525 831 -6815 161 919 -3549 3332 3121 -2286 6828 5042 527
1223 527 9567 5515 2499 9840 5904 3940 9319 3269 2815 10029 960 2098 6348 -2680 818
1238 818 2434 -4873 -383 -332 -8503 -2897 -3834 -8608 -2490 -4154 -10727 -719 -4317 -7992 1007 -3768
1254 -3768 -4419 2969 -840 -1172 5952 -1382 696 6810 -20 3461 7760 -93 6448 7133 1767 6067
1270 6067 6432 368 6305 6099 -1367 6811 2135 -1349 6146 657 162 4164 168 -2145 4509 -3659
1286 -3659 -2764 2880 -5690 -2924 48 -7721 -3814 -1964 -8183 -3248 -1297 -8619 -978 -2132 -7946
1301 -7946 1435 -1182 -3825 2924 1191 -1031 6609 2149 1850 9633 2305 4787 10029 3861 4460
1316 4460 8887 2181 5024 6394 -417 4708 4517 -2964 1836 1504 -5420 1314 -1955 -7009 102
1331 102 -4485 -7570 -541 -5288 -6668 -447 -6182 -4349 1034 -5850 -2733 1608 -4370 966 3062
1346 3062 -3114 1907 4032 -2717 4892 4279 -921 6505 3631 72 6236 4375 188 6248 3016
1361 3016 -578 8998 -400 1497 6015 -1359 987 3821 -2333 -865 3345 -5887 -557 1503 -7303
1376 -7303 -56 -2838 -7810 -1468 -4405 -8451 -1782 -3968 -7005 154 -4562 -6110 1249 -4488 -2054
1391 -2054 3610 -1555 302 6252 -534 3269 8299 346 6773 8178 1493 7049 6675 1148 7204
1406 7204 4864 -457 6473 2035 -2841 4472 -2019 -4360 1662 -4798 -5708 255 -5919 -4827 -932
1421 -932 -8238 -4468 -46 -7791 -2581 267 -7335 -332 448 -5480 1824 1202 -2418 3660 2890 -1220
1437 -1220 6293 2626 176 7595 1434 1392 7472 1914 1691 7708 1709 4310 8026 567 5546 6643
1453 6643 -1099 3631 2945 -2662 2224 2056 -4464 1980 -1107 -6444 1604 -4658 -5767 134 -7012
1468 -7012 -6431 -616 -5965 -5026 779 -7440 -3295 1799 -6240 1040 2652 -1889 3272 5594 -92
1483 -92 6070 6979 1757 9916 6402 3724 10602 5393 3558 9806 3484 1724 7215 -24 431 5096
1499 5096 -2687 -528 3114 -5844 -1637 41 -8007 -1286 -1513 -7291 -1490 -2348 -7556 756 -1919
1514 -1919 -6874 1418 -2710 -4361 2251 -1921 -2785 4194 -1723 -640 5935 -1801 1605 6097 -577
1529 -577 3882 6095 313 4822 7481 365 7440 6808 85 9120 5075 955 6891 3149 -85
1544 -85 5615 658 -2626 4417 -2709 -2566 2792 -4967 -3663 1 -6730 -5123 -1823 -8930 -4982 -1883
1560 -1883 -8724 -1424 -1648 -7363 2024 -543 -2348 4189 2698 285 6914 4523 1618 10270 4670
1575 4670 5284 10499 3604 4807 7867 3464 4310 7711 -350 2419 4997 -2794 2795 2649 -4547 1040
1591 1040 -539 -5806 85 -3317 -6381 204 -3724 -5754 973 -4883 -5616 1616 -4688 -2093 1368
1606 1368 -4396 -487 3109 -4373 1206 4518 -2954 3764 3975 -1725 5104 4152 876 7393 5078
1621 5078 895 8676 5072 2035 9813 3090 3231 7899 2094 3665 6925 513 342 3504 -5158
1636 -5158 -234 2366 -6453 -1063 -1734 -7737 -1403 -3742 -8434 -2137 -2975 -7756 718 -2718 -5287
1651 -5287 2437 -2482 -1555 5494 480 1424 7280 2241 4393 8004 1423 6436 9404 1347 6516
1666 6516 7837 1544 6733 6003 -47 6043 4956 -1891 4890 1239 -2498 3608 -2446 -3117 1754
1681 1754 -2592 -3871 1685 -4947 -4460 3459 -5304 -1156 946 -6954 -576 382 -5031 558 2042
1696 2042 -4848 2127 1775 -3394 4646 496 -549 6304 2370 1984 7895 3031 3057 8890 2407 4661
1712 4661 9086 2372 6017 7897 864 4582 5435 -2148 3559 3202 -3799 2777 -369 -5208 936
1727 936 -3980 -7239 -434 -4853 -6613 -1374 -5340 -6196 -359 -5811 -2162 2318 -4923 370 3965
1742 3965 -1052 2796 4641 -64 6417 6414 508 7261 7584 2438 9307 4641 2525 7538 3370 498
1758 498 7794 1530 -594 5873 -2196 -982 3978 -3067 -216 2187 -4698 -1093 547 -5326 -523
1773 -523 -448 -7021 -45 -1976 -6259 1051 -2618 -4588 982 -2086 -4648 1609 -2190 -2683 5111 -1777
1789 -1777 349 6031 -203 3229 6830 1022 4628 9334 2106 7433 8424 2106 8277 5609 1764
1804 1764 7385 4786 -697 4972 1138 -2250 2319 -1435 -4874 1772 -6461 -4156 -671 -6696 -4512
1819 -4512 -1139 -7190 -4548 -1149 -6627 -2647 1305 -5195 2538 786 -2050 5112 3171 1047 6325
1834 6325 4366 705 9051 3706 2659 9547 3074 3692 7884 2021 3660 7344 1112 3064 7154
1849 7154 -1774 2752 3931 -3847 2359 1138 -2414 1938 -494 -3885 1424 -684 -5095 2234 -2851
1864 -2851 -5059 169 -5258 -3830 430 -5044 -2476 2699 -4692 -1393 3665 -4715 1989 4129 -2055
1879 -2055 3976 5330 1068 6777 6948 1495 8708 6510 3059 9549 4692 2460 7315 3139 1689
1894 1689 6182 -1110 496 4082 -3833 -2214 2335 -6340 -2998 -1011 -8307 -1888 -1823 -8405 -2096
1909 -2096 -1601 -6818 -439 -1238 -4721 3038 -190 -2155 5042 -197 395 6529 904 2055 8399 276
1925 276 4436 7742 405 6002 6763 670 4115 5362 850 4073 4413 -2370 5923 1760 -2478 4062
1941 4062 96 -2022 3022 -1481 -2963 1873 -3004 -3643 1667 -6143 -4115 799 -7019 -3550 -1785
1956 -1785 -5249 -1937 -226 -6564 937 728 -5097 3682 1929 -935 6482 3008 1710 7529 3283
1971 3283 3063 9723 3610 4471 10103 3031 5738 8340 1516 3199 5339 -1302 1953 2111 -3999 1490
1987 1490 92 -6971 39 -3035 -7816 -1242 -4613 -6539 -524 -4546 -5096 843 -4633 -3751 4334
2002 4334 -3806 -111 3226 -1828 2917 3882 -316 3240 6170 -963 5757 5384 331 7441 4668
2017 4668 1125 6988 4075 1492 5975 3834 221 7099 -285 1256 5583 -925 1343 3432 -4429
2032 -4429 -1375 2620 -6092 -852 1161 -6839 -945 -2708 -7813 -502 -4407 -6775 -406 -1615 -6129
2047 -6129 1302 -1276 -3113 3371 -1278 249 5808 432 3374 7649 1965 5544 9409 1850 6824
2062 6824 9022 2403 7327 6948 477 6286 5052 -1026 4106 969 -3019 1934 -2460 -5160 1035
2077 1035 -3546 -5972 -17 -6644 -3721 -96 -5661 -3265 983 -5221 -1907 2403 -4170 760 2174
2092 2174 -4211 2792 2913 -1438 4070 3241 -1521 6096 3697 -73 7735 1426 1668 6588 1220 2223
2108 2223 6422 2227 2444 7102 -447 3359 5540 -2017 3698 1507 -2257 1706 -358 -4722 259
2123 259 -474 -6712 -418 -3810 -7559 61 -5161 -6324 -84 -4261 -4875 1210 -4943 -1663 3454 -3396
2139 -3396 1459 5156 -304 3908 6561 794 7248 7946 770 7559 6422 1867 9050 4335 611
2154 611 7184 1655 496 4092 -1385 -1713 3443 -2853 -3767 2002 -5617 -1824 741 -7410 -2066 -1004
2170 -1004 -6414 -2471 -762 -6643 976 -1374 -5675 2175 -1009 -3336 2736 -1134 -1021 3606 147
2185 147 -29 6065 27 1669 7563 -939 3567 6763 817 4861 6317 128 5130 7837 -1540
2200 -1540 6374 5391 -1073 4625 1126 -959 2751 -1465 -3850 1678 -3677 -5917 977 -6449 -4509
2215 -4509 -679 -7898 -4927 -1715 -7090 -3524 61 -7443 164 983 -4393 1977 2532 -1685 5899
2230 5899 4048 1174 8020 4351 2767 8860 4402 3388 9005 2439 4065 7550 348 3129 4785
2245 4785 -1909 1650 2884 -3103 -88 1196 -5057 1545 -642 -5304 1482 -2675 -5018 390 -2409
2260 -2409 -4793 858 -4160 -5095 2696 -5252 -2331 1969 -3402 -327 1986 -2515 -26 3254 -2526
2275 -2526 3450 4524 -1605 6503 4969 32 7036 4946 1593 7332 4900 1571 8795 2523 1428
2290 1428 6630 408 1054 3415 -1850 -2079 2164 -5215 -2992 -209 -8172 -2941 -1723 -6913 -2297
2305 -2297 -2873 -7078 -1068 -2356 -5684 255 -1956 -3908 3645 652 -1175 5458 1134 3411 7949
2320 7949 1936 3514 7418 1252 4304 7835 413 3569 5130 -1784 4876 2536 -1258 2653 1130
2335 1130 -2200 1909 162 -4655 2370 -3187 -4434 1870 -3622 -3844 744 -3694 -3527 1461 -5367
2350 -5367 -3344 1076 -6620 -319 274 -4748 325 807 -3579 2529 2845 -2408 3188 1637 -2190 6724
2366 6724 2066 1618 7268 2611 2964 7067 1794 1346 7792 895 2986 5544 -2047 2234 2880 -4823
2382 -4823 -188 1143 -5948 -1603 -1419 -7768 -1710 -4942 -7565 -2056 -5326 -6654 -1898 -4635 -5207
2397 -5207 955 -3495 -2342 2597 -2595 808 4989 -1016 3569 5824 -119 3915 6785 340 5785
2412 5785 5353 502 5803 4588 -1684 5871 2300 246 3780 69 -1548 2605 -3438 -3100 2322
2427 2322 -5697 -3369 1661 -4513 -2604 -84 -5572 -1154 -577 -6503 -1682 -918 -7075 -881 -1992
2442 -1992 -5781 925 -2184 -3725 1986 -1676 -2447 5694 -332 855 6299 -62 3974 7377 2329
2457 2329 5835 8121 1784 4765 7253 -3 5010 4367 -1597 4696 1147 -3635 222 -2159 -5586
2472 -5586 -527 -4329 -8189 -1441 -7339 -6456 -1891 -7934 -5404 -1982 -7184 -3024 285 -6012 -1084
2487 -1084 2431 -4079 2459 3208 -2458 3586 2786 -1215 5727 3501 -263 6573 3881 372 6562
2502 6562 1319 311 7137 -527 1757 4260 -701 116 3597 -1839 611 2228 -4514 1801 756
2517 756 -4853 -335 -2497 -5612 -1042 -2747 -7489 -984 -5029 -7914 -200 -5333 -5690 -548 -4654
2532 -4654 -3397 1075 -3949 -1503 3217 -2822 2794 4890 -1413 5283 4738 880 7269 6180 2066
2547 2066 6855 6054 822 7704 3091 42 5518 -32 -978 2456 -2980 -2598 1050 -5023 -4395 -1438
2563 -1438 -6601 -4630 -1393 -7702 -3534 -2278 -7278 -1577 -2046 -6157 378 -1406 -3827 2950 -545
2578 -545 -2483 4725 -286 -289 5201 414 870 5680 743 1359 6827 -1593 2247 5169 -171 3971
2594 3971 3577 -717 2635 3158 -1529 4281 1939 -3180 4409 -289 -4080 1142 -1676 -4356 437
2609 437 -4247 -4079 886 -6166 -4069 -658 -7690 -3412 121 -5937 -1811 561 -4760 487 1581
2624 1581 -3293 4002 2792 710 6178 3692 841 7047 3329 2802 8560 3081 2330 6637 1090
2639 1090 2012 4779 -2130 1409 2211 -4870 -1137 -204 -5720 -2627 -1289 -6021 -2002 -2836 -8661 -763
2655 -763 -4162 -5477 -326 -2890 -4263 1800 -2422 -3063 3361 -3156 -672 5451 -1936 1674 4456
2670 4456 -209 1816 4030 -824 4194 4921 -761 5141 4088 -574 5363 2308 -686 4938 2194
2685 2194 -1187 5673 -684 -2311 3990 -2678 -2436 1045 -5252 -2924 -36 -5143 -2674 -596 -7784
2700 -7784 -2281 -2587 -7974 -1257 -3242 -7051 -762 -1280 -4343 1965 -212 -861 4666 850 820 6604
2716 6604 1396 2748 8075 1536 4007 7112 2207 4070 6267 -607 4837 4040 -2295 2975 491
2731 491 -3857 1358 -2279 -4992 -235 -3833 -7087 -1751 -5262 -6879 -152 -5692 -4409 -358 -5571
2746 -5571 -3178 823 -3590 -1848 2563 -3483 1413 2057 -2847 3192 1747 -1770 3223 2866 -884
2761 -884 4410 2835 -1046 7653 1678 1520 6574 764 1895 6170 1370 1778 5567 -818 264 4004
2777 4004 -3174 -182 755 -4676 -393 -2407 -6099 -2274 -2895 -8294 -2505 -4481 -8168 -2078 -5761
2792 -5761 -6208 -380 -3798 -4146 955 -3685 -971 4532 -1210 1844 6795 -739 4691 6246 1358
2807 1358 6658 5129 1841 7049 4847 338 4499 2928 -2165 3838 -513 -3008 2462 -3544 -3425
2822 -3425 -300 -4721 -5115 614 -5783 -3505 96 -6981 -1785 -1782 -6553 -1808 -2330 -5620 -1698 -67
2838 -67 -5472 454 -1823 -5168 2240 -2036 -2025 3019 -559 -1149 5086 -672 24 6008 -1357 2165
2854 2165 5113 -616 3441 4924 -711 4027 5070 -1374 2991 2101 -3537 2201 -1098 -4783 207
2869 207 -4553 -7171 -1556 -5536 -6936 -1505 -7495 -6045 -1450 -8625 -5685 -1698 -6472 -2884 -51
2884 -51 -4783 -1063 2539 -3396 2244 3224 -2209 5326 2782 -502 5872 3071 369 6896 1635 654
2900 654 4912 -427 -848 4683 -2593 -318 2606 -4126 -1539 452 -5165 -1613 -221 -5975 -1053
2915 -1053 -1466 -6843 -1302 -3988 -6680 -258 -4255 -4739 167 -2918 -6137 1607 -5101 -4376 2441 -4552
2931 -4552 -915 2280 -2844 325 3157 -1042 1750 5251 -1684 4005 4204 -482 4759 3674 1330
2946 1330 5263 1968 -339 5274 469 -2686 3664 -3305 -3303 83 -6394 -4730 -238 -7556 -5135 -2737
2962 -2737 -8277 -5341 -2862 -8359 -3661 -2318 -6780 -1303 -1566 -4328 2001 -189 -2311 3987 1279
2977 1279 20 6269 1092 862 6557 674 3245 6316 693 2313 5569 -1077 1642 3926 -3119
2992 -3119 2039 1336 -4486 1817 -1068 -4679 309 -561 -4433 -137 -2587 -6147 -51 -6187 -5182
3007 -5182 -819 -5690 -4754 -853 -4980 -4815 1052 -6266 -1678 1337 -6125 839 1015 -3113 1808 2129
3023 2129 -2393 3738 3820 -779 6716 3011 1141 6284 1451 1160 6799 425 1772 5065 -878 -414
3039 -414 3795 -3217 -1371 312 -5524 -1711 -2278 -7985 -4553 -4025 -8220 -4204 -5063 -8800 -1551 -4432
3055 -4432 -6992 345 -3912 -4078 919 -2394 -1149 3132 -579 443 5811 -1413 2041 5730 -491
3070 -491 2140 4005 -745 4426 3064 -406 4214 3729 -1808 4185 1704 -2375 3549 -1673 -2014 1388
3086 1388 -2816 -3322 1195 -4619 -2638 948 -6768 -2259 -36 -6736 -2853 -1494 -6344 -2393 -1243
3101 -1243 -7210 -591 -1750 -4958 1112 -1649 -2341 1948 267 -1516 4425 1218 948 6707 1326
3116 1326 2428 6827 799 4471 7591 394 3509 6144 -215 2658 2754 -3207 2506 224 -5519
3131 -5519 664 -2635 -6161 -1200 -4445 -6305 -1503 -5570 -6575 -480 -5671 -5117 127 -5263 -1199
3146 -1199 1183 -4285 1778 3207 -1959 2629 3828 -2306 4302 2841 -1313 5231 1902 -333 4645
3161 4645 2280 -388 4269 1578 -568 4689 -1881 372 5359 -2682 788 2105 -1711 -1298 1601
3176 1601 -4059 -886 -690 -6600 -315 -3305 -6483 -1715 -3626 -6854 -1348 -3474 -6508 -694 -4359
3191 -4359 -5328 1752 -4059 -1708 2648 -1337 146 4670 -603 2321 6986 -717 4982 5233 21
3206 21 5538 5644 143 4334 3028 -972 3939 -77 -2991 1944 -3436 -4099 -860 -4796 -6255 -610
3222 -610 -6946 -4617 -1252 -5981 -4479 -1380 -6968 -2741 -1055 -6055 -157 -1038 -4029 1262 -33
3237 -33 -3206 2106 334 -2663 3849 315 -1459 5130 247 325 4092 838 875 5396 -354 161 4166
3254 4166 -1529 1438 3493 -2265 1614 688 -3170 435 317 -4971 383 -2269 -6831 -901 -4893
3269 -4893 -6939 -1808 -6620 -6596 -2239 -6057 -5518 -1096 -6684 -4301 -770 -5729 -1153 1654 -2994 1337
3285 1337 3419 -515 4359 3790 383 6389 4137 455 5878 3377 1341 6731 2682 357 4717
3300 4717 -396 -2299 3100 -4391 -3631 359 -5859 -2660 -1494 -7111 -3887 -2679 -8154 -3719 -3514
3315 -3514 -8238 -1969 -3201 -7204 -354 -3599 -4605 468 -2615 -3408 1059 -1537 -2147 3083 -1576
3330 -1576 -278 3512 -2784 1416 3824 -837 2746 4242 -1262 3147 4525 -1649 5388 2055 -1374
3345 -1374 3843 611 -2239 2359 -1692 -3875 1922 -3768 -5426 -103 -6321 -4908 -2595 -8429 -4985
3360 -4985 -3244 -8636 -4772 -2869 -8498 -3306 -3151 -6878 -321 -1521 -4470 1775 121 -1186 4163
3375 4163 1283 600 6337 1895 686 6640 130 1520 6004 -108 2167 3295 -2266 1877 2371
3390 2371 -4174 375 160 -6115 -433 -1573 -5352 -27 -3778 -5057 -550 -4488 -6834 162 -4990
3405 -4990 -5571 1028 -5861 -2901 151 -5396 -2408 1524 -4398 -922 1501 -4408 867 1573 -2906
3420 -2906 2734 1452 -2173 3476 2979 -1007 5130 2317 -752 6102 574 358 5686 -2 1188
3435 1188 3922 -1746 -1403 2555 -4501 -1541 1133 -6204 -2312 -2542 -6675 -1933 -3353 -7150 -1838
3450 -1838 -3175 -7039 118 -3201 -5068 2149 -2958 -2323 2875 -1626 1116 4518 -477 1523 5822
3465 5822 592 2540 4883 -1536 3499 3945 -32 3461 2816 -1399 2395 1003 -3747 2570 -1293
3480 -1293 -4343 2153 -2875 -3776 278 -3679 -3552 -755 -5488 -4032 -256 -6560 -2142 405 -6025
3495 -6025 -515 -257 -4741 666 -407 -4283 1216 106 -3077 3513 917 -1724 3565 83 -697
3510 -697 5552 1645 312 6185 668 2105 5937 523 2937 3936 -162 2909 2658 -1873 692 325
3526 325 -4623 -70 -1923 -5587 -1117 -4298 -7634 -1067 -5319 -5975 -488 -4226 -5009 88 -4298 -3083
3542 -3083 1797 -3131 -79 3029 -1857 1210 4180 58 3980 6160 -216 5138 4942 -512 6960
3557 6960 2752 -51 5140 2693 -1132 4026 -350 -1678 3226 -2785 -3117 3400 -4645 -2319 -156
3572 -156 -4896 -1873 -1349 -5500 -2552 -1581 -5703 268 -2410 -7052 -717 -4116 -4817 143 -2383 -3092
3588 -3092 1013 -1850 -2112 3997 -1120 -341 4902 0 2631 5792 1968 3824 6661 1216 4665
3603 4665 5605 -193 6054 4366 131 4754 1215 -1643 3331 -1347 -3438 1053 -3177 -5467 -517
3618 -517 -5770 -5483 -2264 -7554 -5782 -2195 -6693 -4854 -1735 -5950 -2413 -88 -5509 2311 1185
3633 1185 -3446 2538 1661 -1078 4754 2941 -192 5970 2206 649 5734 1347 1759 5773 91
3648 91 2006 3286 -1470 407 4535 -1727 2055 2847 -3941 1874 -464 -3703 -596 -2319 -4633 -436
3664 -436 -2538 -6461 -391 -4050 -5558 -223 -5369 -4832 -1955 -5334 -3687 890 -4978 -2376 2073
3679 2073 -5052 1859 895 -2167 4595 4110 -90 4613 4191 180 6789 4337 818 6786 3030 480
3695 480 5428 970 571 4061 -1677 -2274 1723 -5003 -1870 202 -5981 -2957 -1266 -7405 -1975 -2949
3711 -2949 -5991 -1541 -3329 -5477 -699 -2183 -4959 1842 -2477 -2777 2688 -1050 381 3383 -423
3726 -423 873 3474 -248 911 4691 -1641 2666 2967 -2022 3696 3234 504 2231 2033 -3201 2987
3742 2987 1323 -1770 3659 -945 -1732 1564 -1344 -1765 1414 -3269 -3681 112 -6286 -3812 -313 -6471
3758 -6471 -3548 -1352 -5840 -3397 -857 -4909 -226 -871 -4202 2134 268 -1869 4123 212 573
3773 573 5024 2703 694 7128 1606 1985 6480 -24 1339 5312 -1161 1394 2721 -3129 983
3788 983 576 -5232 -954 -1419 -6209 -447 -3535 -6157 -1599 -4238 -7287 7 -4459 -4256 741 -3031
3804 -3031 -2813 3310 -2688 -363 2881 -2520 894 2429 -1113 2036 4730 -789 2256 3937 -1535
3819 -1535 4427 2534 -1308 4812 2109 -360 5245 2570 -1663 4815 -421 -1014 3683 -1710 -767
3834 -767 2300 -3335 -2260 912 -3862 -2636 222 -6678 -1561 -2911 -6396 -994 -3140 -5391 -1437
3849 -1437 -1738 -4499 1449 -1401 -2701 3812 -195 -194 4873 700 1873 6263 1676 3282 8141 2151
3865 2151 4770 7048 -318 4909 4431 -602 4477 1452 -2956 1540 -22 -3859 1082 -2916 -4767
3880 -4767 966 -4387 -5228 -1008 -4552 -3661 488 -4621 -2710 733 -3982 -1783 1693 -4679 1580
3895 1580 2044 -2881 2121 1858 -1874 3394 2586 -414 4061 2578 -390 7179 1303 792 6201 2124
3911 2124 2408 4724 1579 1668 5335 147 2223 4302 -1699 2456 1387 -2840 1313 -615 -3750 555
3927 555 -1637 -6393 -740 -3689 -6263 -591 -4740 -5491 -817 -5068 -4716 801 -3256 -1852 2506 -2947
3943 -2947 1446 3679 -1530 2929 5156 1139 6397 4907 665 6797 4738 923 6237 3994 289
3958 289 5805 1206 9 4598 -1555 -1694 2345 -2569 -2115 1065 -5196 -3534 601 -5084 -1114 -648
3974 -648 -4155 -1115 -1364 -4328 316 -1210 -4350 2036 -1282 -2970 3796 -1512 -968 2434 -655 -1147
3990 -1147 5186 -293 660 5990 -234 3073 5755 277 4305 5137 298 3305 5002 -806 4058
4005 4058 4075 -1355 4915 19 -313 1745 -966 -3280 378 -3852 -5191 223 -5399 -4192 -1094 -6743
4021 -6743 -3506 -753 -5496 -2604 -1026 -3715 -289 1073 -3438 3145 2089 -345 4810 2475 477
4036 477 6448 3875 2257 7307 3396 1964 7423 1338 985 5183 -1143 1645 3707 -1673 119
4051 119 1862 -3990 319 1237 -4694 64 -129 -5654 456 -1496 -4693 283 -2211 -4133 1986 -1714
4067 -1714 -3624 2034 -2800 -2604 2343 -3036 253 1605 -2224 339 2912 -1983 1748 4151 -1686
4082 -1686 4658 3926 -65 5742 3152 1726 5685 4197 469 6156 2981 -630 5290 -634 -212
4097 -212 2067 -2919 -1267 1275 -5113 -3366 -393 -6936 -1668 -2541 -6947 -2376 -3121 -5935 -1583 -2027
4113 -2027 -5467 1503 -1314 -3627 3640 591 330 4745 482 2364 5238 848 3749 6155 1716
4128 1716 2828 5881 -77 3839 4744 -1521 4000 1536 -2734 2505 407 -3581 716 -989 -4947
4143 -4947 1429 -2442 -3833 1833 -4087 -2315 196 -3388 -2698 337 -4022 -2793 367 -4720 -555
4158 -555 165 -4596 1379 -724 -1325 1306 1004 -2503 3842 1849 -1848 5221 915 2183 6730 1622
4174 1622 2157 6612 2733 2056 5974 1670 901 4951 -1775 3265 2092 -2901 756 -338 -4726 -294
4190 -294 -1091 -7085 -818 -4232 -6534 -1109 -3837 -4896 -689 -3593 -4488 1057 -2978 -3510 2718 -1621
4206 -1621 604 4117 -1177 3334 4620 588 4641 5309 429 4959 4884 627 4518 4399 105 5533
4222 5533 1124 -60 2616 -660 -75 2325 -883 -1894 3845 -3145 -1443 1138 -4291 -692 1218
4237 1218 -4548 -1227 720 -4462 74 -586 -4824 998 -1123 -4752 1407 -769 -1942 2272 -1119
4252 -1119 -1100 3521 265 -191 5076 487 2954 5270 1370 4548 5715 1008 4807 5090 402 4767
4268 4767 4741 -1663 3929 1569 -2414 2244 -1402 -4179 -41 -2832 -5032 462 -4434 -4966 -46 -5380
4284 -5380 -2868 473 -4436 -1209 550 -2280 -873 2509 -2562 2583 3699 -1041 4750 3000 216
4299 216 4937 2754 947 6156 2842 412 6256 2088 646 5878 -152 638 3537 -896 1232
4314 1232 2907 -1951 80 2596 -2728 1363 1085 -4123 841 -1365 -5187 716 -1534 -4768 365
4329 365 -2337 -4448 2077 -2893 -4109 1140 -3638 -2053 1078 -2236 -193 3765 -920 1641 4960
4344 4960 462 5314 5045 777 5820 4362 1882 6577 3965 1486 4635 2603 -180 5347 535
4359 535 -733 3706 -2652 -884 324 -3860 -3384 66 -4487 -2891 442 -5941 -1631 -383 -5009
4374 -5009 701 -737 -2993 1842 1066 -2168 3375 1747 -1508 4504 1160 1179 5909 1937 2116 5402
4390 5402 1832 1861 6423 -223 2974 5598 -233 3481 2666 -411 2945 2048 -1919 2914 2080 -2237
4406 -2237 2804 100 -2392 1070 -2856 -3236 1333 -3621 -4654 482 -4304 -2833 309 -4276 -1372
4421 -1372 727 -3692 -17 551 -2735 979 1909 -894 4410 4411 78 5842 4211 1122 7900 4845
4437 4845 2844 7474 3704 2719 6725 2469 1353 6002 -612 1533 2488 -2677 -123 824 -3034 -418
4453 -418 -519 -4766 -631 -1890 -6151 648 -1805 -5370 27 -2576 -3509 1076 -1362 -1938 3586 -940
4469 -940 253 4645 -1377 2633 4214 97 3122 5773 633 4114 5001 92 5899 4500 -100
4484 -100 5618 3098 638 5207 2240 -303 5359 528 -894 4364 -842 -1659 2936 -3851 -1438
4499 -1438 405 -4799 -1651 -264 -5892 -1938 -2021 -6170 -440 -1868 -4853 880 -583 -3138 2623
4514 2623 -115 -1337 4466 1279 1350 5889 1962 2218 7112 1642 4716 7131 2149 4021 5547 518
4530 518 3332 4061 -1800 2854 1708 -2370 3240 -1361 -4030 1000 -2321 -3452 -85 -2526 -5288
4545 -5288 1291 -3063 -3243 1934 -4755 -940 1788 -2828 -1797 959 -3332 -275 2249 -2650 3690
4560 3690 1059 -487 3735 2062 114 4469 2761 40 6798 1425 1074 6227 689 988 4567
4575 4567 1369 1310 4205 -641 1261 3591 -2282 724 1031 -4244 375 -809 -3188 -148 -1292 -5491
4591 -5491 -62 -2627 -5601 315 -3122 -2836 748 -3157 -3056 2546 -2075 1462 3391 -691 1025
4606 1025 4628 787 4401 6579 767 5706 5523 932 5442 3985 -559 5135 2125 -961 3087
4621 3087 1389 -2497 2842 -1878 -765 1691 -2457 -2465 947 -4128 -1910 132 -6170 -569 295 -5455
4637 -5455 -195 -237 -2911 1014 833 -3142 1646 362 -2100 3627 -557 -25 4162 813 938 4534
4653 4534 1324 1710 6449 802 3270 5454 1165 4463 3837 674 3716 4565 -1850 2299 2857 -1313
4669 -1313 3011 692 -3957 1261 -4208 -4105 700 -3807 -4713 -1476 -4534 -3492 629 -3836 -3440 1084
4685 1084 -5029 452 1873 -2007 1511 3144 -1530 3448 3478 -128 5934 3769 976 6787 3753
4700 3753 2910 7094 2384 1668 6181 371 48 4466 -944 283 2296 -2431 -229 1320 -3704 -1197
4716 -1197 250 -3701 -859 -505 -5725 804 -1433 -5437 1304 -1561 -3146 776 -1778 -2884 2086
4731 2086 -2244 -2201 2872 -1971 866 3172 -1729 1702 4265 701 3259 4490 -205 4938 4692 925
4747 925 5341 4410 1639 4628 3538 1184 5842 1943 -1095 4385 -1294 -2696 2281 -3056 -2685 1288
4763 1288 -5205 -3346 -871 -6161 -2398 -1516 -6590 -694 -2151 -4599 1454 859 -3549 1929 1959 -1036
4779 -1036 4530 2082 684 5848 1720 1504 7275 1474 2334 6127 1584 3957 5457 -570 2812
4794 2812 5729 -2171 3219 4182 -2929 2548 1031 -3077 1969 -716 -2611 1167 -1253 -4244 2045
4809 2045 -2113 -3943 1166 -3662 -1894 -1003 -2982 -3032 303 -3485 -1670 2723 -4441 1210 1870 -2467
4825 -2467 3228 2022 -538 4517 3306 673 6873 2607 2203 8012 2518 2261 6124 2881 2381 4865
4841 4865 656 1195 4329 -2113 1492 1145 -3461 -75 -425 -5363 -708 -651 -6141 -1791 -2239 -5679
4857 -5679 469 -3203 -4413 1759 -2066 -1850 2540 -403 286 3903 99 390 4888 868 2677 5789
4873 5789 -266 4289 4414 -330 3912 2999 114 2527 2638 -1184 3722 1071 -1727 3818 -655 -1376
4889 -1376 2133 -410 -2207 2560 -2631 -2418 1964 -4579 -659 931 -5169 -2119 -183 -3893 -677
4904 -677 -892 -4092 486 90 -3602 2251 -536 -2024 2952 969 -176 5155 1898 1264 5944 1514
4920 1514 1964 7047 1274 4730 5813 1492 2348 4428 -618 1758 2908 -3480 1300 -128 -3941
4935 -3941 907 -1408 -5472 -554 -2862 -4628 -915 -4035 -3528 1307 -3794 -3499 2077 -3545 -863
4950 -863 2121 -3140 1622 2888 -2078 2207 3682 -133 3923 2553 -1035 4764 1737 1066 4615
4965 4615 2286 394 5336 1154 -493 4844 -300 225 4141 -959 363 3968 -2559 -499 1733
4980 1733 -2521 -565 214 -5641 509 -1573 -5171 883 -3146 -4505 -1051 -1679 -4049 801 -2349
4995 -2349 -3868 3021 -1396 -991 2776 -493 1085 4406 212 2873 7232 573 5592 5495 950 5802
5011 5802 4179 -11 4801 3186 -530 3707 1499 -1872 2454 -2677 -3120 1418 -4052 -3465 612
5026 612 -5549 -4238 -195 -4896 -2493 -245 -5429 -1391 688 -5339 335 410 -3058 1159 925 -1669
5042 -1669 3984 1545 -1457 4455 1417 400 4411 -192 1150 3834 -272 1799 4855 348 1846
5057 1846 5078 -309 1910 3667 -2247 2519 748 -1216 2153 1853 -3409 1015 -448 -4105 1641
5072 1641 -3519 -3329 355 -3330 -4909 -971 -4786 -4376 -204 -4956 -2253 1206 -4199 -138 1778
5087 1778 -3067 1965 2585 -371 3240 3591 737 6317 3964 648 6778 2835 1432 5949 1785
5102 1785 1248 3890 -460 377 2693 -2875 -1654 1244 -4685 -645 -761 -4646 -1459 -1221 -6429 400
5118 400 -1295 -5211 -38 -1317 -5194 215 -2012 -3036 2676 -1926 -1712 2653 -808 72 3128 -1241
5134 -1241 418 4460 -2511 2832 2930 165 2724 3505 -1399 3427 3506 -520 4967 4062 116 3748
5150 3748 992 -220 2361 -243 -2114 2451 -1966 -3536 677 -4404 -3123 -398 -6060 -2585 -600
5165 -600 -5176 -2781 -939 -5318 -1641 -373 -4958 1095 321 -2921 3856 1026 -80 3903 2450
5180 2450 924 6809 2633 2171 5769 1280 2738 4241 521 1451 4258 -539 969 1945 -3245 579
5196 579 1478 -5103 585 -1741 -4329 742 -2726 -4388 -737 -3118 -4157 1228 -3186 -3934 2350 -3423
5212 -3423 -1075 2557 -2891 -245 2800 -1631 237 2361 -2906 2172 2353 -2368 3351 1499 -1515
5227 -1515 3993 2644 -176 3763 1928 -131 5274 1487 982 4894 488 1045 4229 -2100 -365
5242 -365 1997 -3311 -1171 972 -4551 -1585 -1798 -6288 -2323 -3020 -5537 -1008 -1897 -6232 233 -2476
5258 -2476 -4355 2816 -1119 -1663 3827 -679 1329 4389 760 2167 5174 602 3627 5856 1050
5273 1050 3951 5030 -1273 4770 2100 -2060 2026 802 -2678 2282 -1352 -4128 1907 -2799 -3047
5288 -3047 301 -3024 -2701 163 -3049 -2806 809 -3787 -1204 132 -5370 334 -662 -3716 1304 -511
5304 -511 -4018 1320 1091 -4037 3042 801 -1365 3846 -427 -220 4535 1895 360 4643 783 2128
5320 2128 5830 255 2987 4530 -20 1974 3621 -2001 1133 1573 -3150 281 -866 -5798 -769
5335 -769 -3021 -4881 -539 -4491 -4945 -1117 -4797 -4641 44 -4838 -3380 1890 -3635 -818 2487 -2543
5351 -2543 2029 2602 177 4094 3848 -19 4561 3986 658 5081 1976 -576 5580 451 213 3698
5367 3698 -592 -1153 2389 -1890 -1587 1963 -5272 -1247 427 -4123 -469 -362 -4053 -1238 615 -4801
5383 -4801 375 -378 -5073 1359 -1872 -3992 628 -1610 -2964 1113 -1354 -2151 2241 -2246 80
5398 80 2380 -964 2380 2484 604 2014 4900 167 3331 4125 -298 4809 3186 -553 2749 1830
5414 1830 -1462 2394 -231 -3458 1175 -2752 -4774 -15 -5605 -5081 -1759 -5697 -3103 -786 -6420
5429 -6420 -4201 -1114 -5753 -1679 -278 -3758 911 1257 -2696 3774 1698 -1045 5276 2174 692
5444 692 4571 2641 -58 4744 591 1141 4918 -1255 1722 3756 -510 870 2691 -3027 154
5459 154 1679 -4251 1052 494 -3798 8 -1191 -3700 -224 -1458 -4142 100 -3216 -5369 725
5474 725 -4032 -3254 -408 -3673 -3298 250 -3639 -2438 1691 -4247 1008 1581 -2843 2451 2267 728
5490 728 3856 3050 680 5533 3011 494 5424 2231 803 4571 376 -1150 3576 -1494 -1817 2377
5506 2377 -3794 -2258 -111 -5755 -3462 -1820 -7241 -2729 -3538 -6754 -2809 -3515 -4878 -279 -1510
5521 -1510 -3452 2340 -1591 -2137 3561 -720 164 3483 306 1161 4083 136 1501 4028 -996 3188
5537 3188 5241 -1000 3350 1766 -845 1725 2120 -1896 1983 434 -2937 2784 -1079 -1807 1266
5552 1266 -1467 -3172 434 -2293 -3563 814 -5057 -2886 142 -5611 -2568 -1175 -4099 -1455 -945
5567 -945 -5214 -563 462 -4217 2372 999 -2231 3928 1927 202 4680 1555 1235 5755 1684
5582 1684 3535 6391 767 1779 4999 -1082 1027 3168 -2539 -40 1042 -4899 469 -1480 -5591
5597 -5591 -1604 -2607 -6013 -488 -3306 -4341 -738 -4037 -3561 -686 -3638 -3746 1245 -2164 -1342 2737
5613 2737 -2500 931 1853 -1329 1614 2825 -857 2882 3319 -1848 3537 2606 -1511 3929 475 -546
5629 -546 2408 404 -1398 2305 -374 -1417 4168 -2890 -871 1846 -3290 -430 695 -3803 -2556
5644 -2556 -192 -5472 -2117 -1550 -6651 -496 -3574 -5583 -1365 -2286 -4690 31 -1557 -4078 2224
5659 2224 -1998 -1014 3958 -641 1107 4343 927 2465 4532 555 2564 4402 -1163 3354 3484
5674 3484 -901 3000 730 -2346 1374 -552 -3537 568 -2190 -4480 -10 -4323 -4663 11 -5550
5689 -5550 -4542 -513 -4672 -3032 342 -4749 -1469 1325 -4787 363 1004 -3217 1404 259 -2418
5704 -2418 2474 1518 -1343 2739 946 -2455 4007 -1040 -1622 4210 -481 2183 3156 -729 -366 4052
5720 4052 -1925 1423 3356 -2685 1486 1034 -3229 843 345 -4162 191 -1394 -6181 -978 -3519
5735 -3519 -6621 -610 -4811 -4383 -958 -4610 -3591 -50 -2392 -3082 2122 -3545 1495 3073 -700
5750 -700 2907 3630 -539 4852 3771 -1164 4559 3385 -228 4054 1994 -425 3950 -1353 -1900 2988
5766 2988 -2164 -2269 294 -4679 -2205 -258 -5098 -3771 -1338 -5837 -1129 -900 -5075 -1620 -727 -4143
5782 -4143 -626 -699 -5600 762 -1691 -4237 2493 -846 -860 2053 -328 -465 2533 -1220 -524 3872
5798 3872 -1866 1787 4695 -1685 2162 2794 213 1441 3403 -1138 2602 2237 -2565 3162 -510
5813 -510 -2580 1770 -1518 -3523 -778 -3129 -4373 -914 -5065 -5216 -1646 -6324 -3237 -1790 -5554
5828 -5554 -2573 -104 -4629 -974 528 -3206 1293 1928 -2381 3237 2437 -637 4258 2185 1232 4899
5844 4899 2553 745 4845 -99 558 3803 -1442 577 1376 -2360 -349 1303 -4255 75 242 -5283
5860 -5283 -1414 -622 -4515 -147 -2491 -4598 -26 -2895 -4083 -675 -2448 -3621 1216 -4162 -2486
5875 -2486 1737 -2967 -430 759 -2388 748 2156 -2164 1434 2808 -2142 2638 1706 -142 4696
5890 4696 1946 695 3748 2878 -816 3870 2162 193 4162 -1248 -1531 917 -2670 -1569 -19
5905 -19 -3501 -2325 -301 -5811 -2930 -2008 -5741 -1576 -1742 -4946 -1432 -2480 -5610 839 -799 -3127
5921 -3127 3075 -154 -1540 4642 222 1465 4595 481 1303 3857 1057 1427 4583 -71 2396
5936 2396 3402 -2540 1506 1336 -2772 1980 -1273 -2795 111 -1134 -4101 246 -3800 -4385 1495
5951 1495 -4807 -2824 -852 -3088 -2901 -20 -3837 -3285 1169 -4880 -2517 93 -4595 447 315 -3383
5967 -3383 561 452 -2738 2202 2284 -1367 4114 384 -798 5154 -436 1597 5001 530 1317 4048
5983 4048 -478 1256 3683 -2243 713 1337 -3186 -288 -571 -4479 -1634 -1128 -6284 -830 -4454 -6391
5999 -6391 -1623 -4450 -4793 -1228 -3093 -3921 219 -2732 -2177 2453 -2076 -34 3378 -1777 1913 3251
6015 3251 -1124 3271 1720 -859 2441 3091 -1095 3593 2166 -1789 4247 -1049 -752 1623 -1486
6030 -1486 -1297 1322 -817 -2763 1255 -4221 -2130 635 -4471 -2418 -1090 -3967 -1702 -1577 -4536
6045 -4536 -1942 -1667 -4642 -32 -1807 -4959 750 -2451 -2015 1200 -1273 -2708 2940 -210 96 3959
6061 3959 -612 1313 4989 872 3029 4373 -252 2843 3848 -636 2577 3201 -2415 2324 639
6076 639 -3546 1206 -1828 -3931 -636 -3995 -5126 -149 -4249 -4920 362 -6369 -3635 -308 -4837
6091 -4837 -2522 -378 -3935 -591 923 -2605 1338 2306 -1775 3230 2169 -890 4365 1248 -504
6106 -504 2526 1694 -490 4001 -741 -853 3602 -1161 1066 1569 -2121 364 2084 -882 -643 2174
6122 2174 -3152 -160 370 -4469 1030 -1395 -4672 -826 -1394 -5299 -1222 -3737 -4612 764 -4273 -4053
6138 -4053 290 -4078 -3336 746 -1566 -733 1765 -936 593 2623 -1037 3577 3275 -695 3803 4146
6154 4146 606 3719 2434 -169 3805 1607 -842 3313 -837 -2496 2170 -3405 -2827 -1162 -3777
6169 -3777 -3810 -946 -5189 -3414 -1366 -6467 -2203 -1592 -5180 228 -2102 -4329 -504 -45 -3004 2220
6185 2220 140 -2415 3364 -52 -387 3205 -211 1206 4086 -940 328 2266 -2068 1017 4466
6200 4466 -2095 1996 1750 -719 1682 933 -1275 1506 883 -3139 1452 -811 -3665 1593 -4234 -3366
6216 -3366 -458 -3099 -3881 -383 -4774 -3755 592 -5258 -2589 -1498 -5512 -1114 51 -3236 763
6231 763 1609 -1242 1702 1742 -359 3584 2388 -200 5171 2509 712 5388 1881 992 4713 479
6247 479 -1705 3619 -2198 -657 1061 -3620 -1195 -1185 -4584 -2372 -1400 -5485 -1409 -1496 -5338 -815
6263 -815 -1904 -5251 455 -2346 -3362 927 -2279 -2302 1590 -2057 -979 2857 -2399 1343 2323 -2293
6279 -2293 2336 2039 -1911 1614 2459 -2043 2867 2377 -1060 4825 924 907 2712 -115 95 3010
6295 3010 125 -1660 1877 -1647 -1959 694 -3921 -2796 -85 -4281 -2895 -1209 -5222 -3116 -1340
6310 -1340 -6336 -1624 -2140 -4103 -111 -1444 -3302 966 -1052 -1495 2650 107 458 4038 408 1490
6326 1490 5909 732 1605 5299 300 2180 3926 -188 2903 3015 -2506 2020 1632 -3417 793 -549
6342 -549 -3367 36 -2016 -3700 -797 -3138 -4505 -147 -3712 -3671 485 -4782 -1712 60 -2667 -1730
6358 -1730 1229 -3005 -2015 2183 -2417 1452 191 -1354 1882 816 -1537 1632 1210 -1027 3310
6373 3310 1369 -887 4845 -352 286 4659 -673 886 3625 -859 223 3348 -2760 921 1109
6388 1109 -3853 -181 -878 -4379 -2147 -2147 -5988 -1075 -2925 -6261 613 -3228 -3866 1643 -3031 -2799
6404 -2799 1052 -1687 -714 3256 -812 1823 3839 96 1843 5416 212 4008 3794 241 3776
6419 3776 2904 -832 2252 2065 -2102 2468 -1424 -2362 3153 -2802 -2448 1064 -3349 -2267 691 -2282
6435 -2282 -1980 1104 -4256 -1592 -529 -4844 71 -1022 -3805 -526 126 -3574 597 121 -3128 2148
6451 2148 -926 -1306 1934 -573 -854 2123 -665 -400 3686 -303 972 3956 -1149 3122 3681 -274
6467 -274 2010 2763 -1186 2458 2120 -3048 1798 105 -2536 1330 -1993 -3506 -128 -3283 -4432 -894
6483 -894 -4498 -4996 -1367 -5098 -2829 822 -4269 -1568 950 -2621 563 1826 -1026 3828 2399
6498 2399 -1102 3333 3129 267 5067 3058 848 5149 412 266 3533 338 -528 2135 -1656 -636
6514 -636 2789 -3575 -797 268 -3952 -91 -904 -3671 -669 -108 -4915 271 -1477 -4001 628 -2965
6530 -2965 -3025 95 -1569 -2892 1566 -1503 -2484 3248 -2773 823 2175 -1507 647 2530 110 1519
6546 1519 3867 -1296 2057 4158 422 5136 2951 214 3386 2590 -833 3393 808 -1440 3654
6561 3654 -1252 -2289 1325 -4697 -2439 -365 -5001 -3884 8 -5141 -2666 -720 -5821 -1859 -513
6576 -513 -4117 30 -1198 -3153 1341 159 -717 3871 1728 376 4780 1493 995 5666 239 1617
6592 1617 5328 1048 2113 3330 -1296 1513 3622 -1317 1182 1821 -2236 1470 -848 -3442 568
6607 568 -697 -3844 289 346 -3825 1208 -2298 -2879 926 -4559 -1965 -308 -2160 -2732 754 -3810
6623 -3810 -1462 1042 -3502 336 791 -2584 1081 2473 -369 3249 3374 -97 4885 3021 654
6638 654 6375 1868 1906 3988 741 567 3777 -583 -58 3681 -1228 -558 201 -3403 -982 -837 -4634
6655 -4634 -1777 -1305 -4540 -1216 -1415 -5472 -470 -2791 -3652 1372 -2068 -2731 2806 -218 -587 4054
6671 4054 347 1383 3611 -316 2002 4415 -594 4194 4547 262 3213 3040 -291 2272 1518 -1531
6687 -1531 3596 1963 -1698 4029 -285 -1917 2992 -1347 -2329 1145 -1818 -1597 2560 -3351 -1009
6702 -1009 1790 -3953 -1135 -325 -3691 -975 309 -4223 -308 -812 -3190 1908 201 -1677 3460
6717 3460 145 -335 3536 1183 472 4715 322 2400 6217 1277 2333 5666 1042 3792 4094 19
6733 19 1564 1980 -2377 1471 774 -3661 340 -2369 -3117 134 -2940 -4460 -513 -3466 -3379 2121 -3893
6750 -3893 -2619 1906 -2792 -940 2081 -2226 1426 2405 -1767 2611 2832 -853 1805 3053 -782
6765 -782 3839 2874 -216 5333 1728 688 3969 752 -506 3487 -557 -332 3119 -565 -160 3188
6781 3188 -1264 -475 1509 -2079 -1082 1478 -3476 944 269 -4352 -117 -2397 -4140 -422 -1086 -4525
6797 -4525 -33 -1661 -3100 2041 -2521 -1002 2364 -1010 1529 3613 277 1703 4326 741 3113
6812 3113 5189 -82 4427 3101 360 5150 2663 177 3472 1213 -1804 2184 -1778 -2313 1364
6827 1364 -2599 -3017 642 -3785 -2523 -564 -4872 -2381 236 -5009 -1879 1127 -3707 330 307 -1890
6843 -1890 2316 1159 -258 3090 2020 -749 5130 745 -1509 6055 -4 932 4267 265 1658
6858 1658 4988 135 576 3815 333 1710 3722 -1363 2595 2081 -1921 2383 431 -2583 557
6873 557 -677 -4202 1994 -3098 -3421 1402 -2889 -3419 -388 -3508 -3808 270 -3664 -2250 1884 -3277
6889 -3277 208 909 -2075 2108 2447 -418 3166 3371 766 5357 4180 499 5262 2225 885 4986
6905 4986 869 1667 3252 -657 -183 2728 -676 -1315 2508 -3196 -1443 -182 -3992 -1461 -627 -4277
6921 -4277 -1012 -1155 -4715 933 452 -3804 1869 -1305 -1961 2327 63 -1285 2882 -610 -23 3823
6937 3823 -899 363 4057 -1600 2511 3250 -831 2124 2605 213 2333 4374 -987 3511 1686
6952 1686 -134 4157 509 -733 3340 160 -1890 2628 -1349 -1893 2314 -3154 -1815 99 -4729
6967 -4729 -2158 -329 -2998 -2124 -908 -4669 -381 -762 -3614 871 756 -1900 2849 1057 528 3273
6983 3273 844 1741 4686 3164 2209 5699 721 2080 5573 421 1840 4565 -1077 1548 2386 -1016
6999 -1016 -52 2056 -2934 755 -694 -2669 766 -2603 -3805 473 -1253 -3132 787 -1445 -3419
7014 -3419 1614 -2774 -727 1361 -2592 1016 1254 -447 936 1823 -2659 470 1549 -1165 2697
7029 2697 1508 314 4667 2139 750 2943 3127 139 5287 1160 688 4782 772 1359 2684 -350
7045 -350 375 3342 -2453 -197 1250 -2770 -1232 -362 -4379 -305 -2170 -4732 -1472 -1339 -4166 1576
7061 1576 -1721 -3216 2284 -854 -779 4226 -265 282 4102 875 1308 5081 663 2418 4561 1695
7077 1695 3838 4192 -300 3937 2448 -1238 3348 671 -1589 1742 -492 -3251 3023 -2515 -2103
7092 -2103 2414 -2336 -1335 632 -1893 -1518 2447 -2218 -2783 1864 -3607 468 389 -2928 870 232
7108 232 -2204 1228 488 -2414 3766 521 -1051 3119 -16 1021 3355 1407 751 4318 1133 2440
7124 2440 5355 483 3619 4416 786 2883 3405 416 1329 490 -1969 1688 -103 -3285 454 -2071
7140 -2071 -5325 184 -2310 -4791 -46 -2297 -2714 -525 -2427 -1828 1924 -2353 229 3294 -256
7155 -256 2240 2857 -540 3012 3608 1508 3857 3340 471 4583 2275 -72 4567 433 464 2322
7171 2322 811 -655 3461 759 -938 2502 -2562 -717 1492 -2073 -2 -379 -1849 -922 -141 -4029
7187 -4029 245 407 -3849 1134 -523 -4037 1284 -1358 -2410 623 -910 -2212 2988 -869 401
7202 401 3943 -1801 2145 4088 1082 2855 4255 1214 4521 5102 956 4636 3291 -12 3670
7217 3670 2302 -3 2499 1454 -672 2039 -1361 -2556 736 -2524 -3404 -1065 -5056 -2614 11
7232 11 -4414 -1464 -358 -2630 5 768 -2205 -148 2155 -1335 2987 2341 -195 4179 2532 954
7248 954 5377 2671 52 5429 606 967 5016 -99 1531 3233 -66 1823 2500 -901 883 2408
7264 2408 -3098 1321 -81 -2269 2150 -340 -2686 583 -202 -2420 1240 -884 -3279 1835 -2825
7279 -2825 -2159 833 -2660 -1905 535 -2474 -2082 2291 -2625 2160 2753 -682 2574 3131 1055 3341
7295 3341 3136 31 4929 3394 660 5005 1829 980 4064 892 609 3129 -1110 -742 1583 -2691
7311 -2691 -1049 661 -3426 -1760 -351 -4228 -2030 -1427 -4343 224 -468 -3529 462 -24 -3169 2572
7327 2572 1090 -2041 4563 -585 -79 3779 520 2044 4088 617 620 4823 -675 1951 3439 -1683
7343 -1683 3009 2844 -254 1589 1991 -1201 2189 1993 -2176 3339 239 -947 3246 -1644 -244 949
7359 949 -705 -2052 1037 -2650 -1875 1318 -4301 -1369 9 -3641 -682 -26 -2306 220 1416 -3196
7375 -3196 2410 1628 -2108 3884 1853 -143 5198 3531 1576 5555 1623 2098 4995 1859 2056 5038
7391 5038 745 2157 3802 -1198 536 498 -2787 157 -387 -3379 -237 -912 -4511 -419 -2634 -4375
7407 -4375 -148 -3353 -3201 631 -1250 -1956 2356 -642 -462 2840 -1351 1794 4152 223 2578 2800
7423 2800 416 2831 3577 -1161 2521 1935 -576 5187 1134 1239 3022 1326 495 3227 599 -1212
7439 -1212 4050 -1413 -357 1596 -1672 1006 1979 -2479 -1040 -74 -2910 -263 -450 -5137 -555 -1404
7455 -1404 -3144 211 -1624 -3506 805 154 -2092 1717 -1120 -18 4206 706 1821 3658 1247
7470 1247 3210 4772 1340 2955 4018 356 4652 3046 674 3102 1636 -1325 3475 136 -2453
7485 -2453 957 -1106 -3419 965 -2621 -4358 1463 -3148 -1642 674 -3680 -2319 -442 -3083 -1168
7500 -1168 1308 -2188 6 2200 -2927 2529 1063 -106 2473 2222 119 2633 2337 -1553 4597
7515 4597 1183 -324 4527 -260 1599 4435 467 1366 3758 764 1332 3808 -1594 2328 1606 -1562
7531 -1562 2133 277 -2024 -578 -113 -3143 437 -2404 -3628 709 -3304 -3594 -264 -2330 -2921 545
7547 545 -1640 -1768 2007 -2338 1225 3370 -277 2858 3583 806 4980 3762 1842 4297 3869 714
7563 714 4434 3131 -158 4469 1128 -335 3213 312 -950 1211 -1250 -1802 133 -2857 -1990 453
7579 453 -3553 -1478 494 -3239 -50 1123 -3206 240 272 -3042 2165 379 -1909 2435 -434 -747
7595 -747 2383 497 -820 2762 592 500 3978 -342 1298 4574 -440 4018 3156 538 2315 3957
7611 3957 921 2387 2635 -1516 3189 606 -949 1089 -932 -1967 1476 -1680 -3377 623 -3518
7626 -3518 -3233 432 -4206 -2313 -711 -4115 -1060 217 -3428 406 879 -1957 2350 2854 -922 4369
7642 4369 2841 982 4773 2218 1762 5850 2423 1746 5812 604 434 3509 -1079 290 2934 -1494
7658 -1494 639 915 -2615 -765 945 -3488 -584 148 -3019 183 -1174 -3652 1056 -1890 -3526
7673 -3526 875 -697 -2074 2422 -919 -1106 2736 -1838 -22 1948 -1855 571 2760 -1437 960
7688 960 2899 -60 3363 3267 -268 4414 1890 2229 3667 3050 -571 3700 2422 221 4303 145
7704 145 -90 3247 -2713 -1438 198 -3140 -2105 625 -4236 -2752 -1033 -4783 -1221 -1852 -5063 -688
7720 -688 -854 -2948 -348 -1189 -1492 2073 1050 -763 3470 1146 2313 3946 792 2650 4254 1117
7736 1117 2023 4351 -765 2702 4430 -1075 789 1860 -904 2057 -257 -1680 390 -204 -2887
7751 -2887 1573 -793 -3660 1040 -1814 -2639 946 -2680 -1030 836 -2552 -2194 1322 -3159 -824
7766 -824 659 -4199 1138 848 -1186 1143 543 -1146 1232 1641 -1049 4183 456 943 4732 1255
7782 1255 2034 4618 1540 650 4496 1614 1410 4232 -1229 1553 1980 -1858 883 -718 -3005 -856
7798 -856 -994 -4351 -616 -927 -3869 55 -2087 -4016 -538 -2389 -3314 1498 -1820 -1802 1584 511
7814 511 201 4484 284 2100 2988 402 3744 2808 728 1894 3538 -1138 2073 2628 -719 3758
7830 3758 861 -968 2318 -341 -1120 1103 -1302 -1485 2554 -2329 -1349 128 -3546 -844 -438 -2794
7846 -2794 1134 -126 -3142 -286 -281 -5148 371 -978 -3209 645 -171 -1872 1667 -1434 -903 1479
7862 1479 379 -386 4534 366 239 4870 71 2431 4826 1616 3937 5489 326 2480 2218 -2128
7878 -2128 2554 1036 -2641 1808 -353 -2984 616 -2198 -3867 -702 -2377 -5299 -1134 -3387 -3398
7893 -3398 579 -3812 -1385 -77 -2273 -96 1618 -489 1257 2707 -1782 2724 1882 -315 2901
7908 2901 1699 1046 3563 2209 12 3878 490 -386 3638 -892 890 2544 -1146 461 1042 -499
7924 -499 -719 1982 -2317 791 1766 -3175 1422 -895 -1674 97 -1220 -3750 -1160 -2062 -3000 1133
7940 1133 -2623 -3140 661 -2631 -1903 1121 -2788 -1174 1690 -175 1494 2965 -554 2491 3007 362
7956 362 4033 2980 1215 4293 3501 1206 3330 1902 -569 2970 -316 -1486 949 -2336 -1795 783
7972 783 -3327 -2861 -1004 -3491 -2448 -983 -4458 -2240 -1117 -4936 592 -595 -2698 660 1046 -1206
7988 -1206 1148 982 -2859 3057 -114 -138 3665 113 1138 3061 367 -12 3642 -454 1648 3953
8004 3953 -2318 1574 2338 -1607 1149 640 -888 1461 616 -2355 1409 -1507 -2967 2492 -1480 -2344
8020 -2344 508 -2408 -2860 -1130 -2710 -2637 -286 -4610 -2404 -1058 -4306 -787 -525 -2122 -835 1361
8036 1361 -1606 2378 1334 -1298 4174 3180 -398 4737 2117 573 3733 1546 1185 3625 500
8051 500 262 2585 -1091 -711 1654 -2503 -973 -29 -3761 -1254 -1823 -3061 -1783 -891 -4000 -347
8067 -347 -1958 -4597 1730 -2298 -3263 691 -1284 -1556 2105 -182 -1849 2640 -1717 285 2687 -1641
8083 -1641 3163 2467 -775 1661 1854 -1309 1756 2836 -1934 3560 1722 -414 2195 87 -679 2348
8099 2348 1442 -1623 2423 -1263 -1673 1753 -3134 -2093 260 -2840 -1861 -561 -4449 -2845 -510 -5219
8115 -5219 -990 -789 -3577 35 -1237 -3338 477 -20 -1508 2179 311 -565 3374 692 611 5033
8131 5033 -108 2623 4079 677 2295 3294 -413 1266 2311 -1645 1184 114 -3437 653 -1695
8146 -1695 -4237 172 -2219 -2939 -1438 -2275 -3988 -159 -2935 -3392 171 -3406 -1459 -287 -2082 -637
8162 -637 858 -2109 -254 1949 -2882 1394 1174 -2382 2521 491 -340 1001 530 -1397 3289 663
8178 663 -442 4584 -4 1145 3141 -724 2027 2516 851 -472 2411 -1381 -600 647 -3778 -154
8194 -154 -1428 -3485 58 -995 -5736 -1615 -921 -5231 403 -2684 -4492 -460 -3057 -2956 35 -1167
8210 -1167 -1761 2027 506 1384 2063 442 2660 2456 -1345 3681 3752 611 3946 1833 -615 2485
8226 2485 894 -1945 1222 -194 -3269 1867 -2053 -2873 -140 -4144 -3080 -1108 -3105 -2367 -22
8241 -22 -2523 -2891 596 -4947 -116 -1111 -2811 -466 -69 -3366 165 -134 -4068 2682 193 -2339
8257 -2339 2116 -1513 371 1417 215 -935 3769 -765 -778 3996 -1138 2657 2734 -6 2219 2687
8273 2687 131 1643 1018 -1933 1440 -236 -2260 371 -1612 -4274 210 -3867 -4066 -529 -4377
8288 -4377 -3764 -553 -4550 -3821 471 -3708 -1601 346 -2392 -159 1406 -538 1639 1788 -816 2977
8304 2977 3368 -457 3851 2218 140 4291 316 -438 3038 491 -1016 2469 -1307 -1299 1362 -2399
8320 -2399 -411 411 -2781 -726 -265 -3791 -768 -336 -3433 -129 -340 -4534 459 -2484 -2871 407
8336 407 -810 -3194 1241 -2011 -1534 1457 -2056 -1231 957 -2633 -411 936 -1280 583 2967 -1266
8352 -1266 2350 3405 -726 3349 1756 -435 3655 2174 1025 2756 868 -1262 2113 -1520 -2540
8367 -2540 1017 -4205 -2988 -13 -3599 -3468 -1052 -3956 -2039 -917 -4906 -3662 -575 -4643 324
8382 324 -438 -2444 1980 766 -2681 2627 1132 -744 3127 1771 460 3799 -189 1018 2981
8397 2981 -1026 1155 1346 -2016 12 1969 -2070 911 1034 -3825 1756 -94 -2661 574 -404 -2889
8413 -2889 -262 140 -3331 1020 -2768 -3098 586 -3554 -2325 -1296 -2666 -3652 572 -2835 -2353 731
8429 731 -2890 -440 478 -2447 978 -180 -1021 1380 2336 -948 2819 2073 -1267 4766 -67 788
8445 788 3755 1146 1042 2633 62 -321 1759 -2356 -1522 1112 -3652 -1514 -1600 -3573 -1842 -1792 -4237
8462 -4237 -1436 -1846 -5490 -1158 -2822 -4740 899 -1135 -3035 1063 -1910 -382 1933 312 -468
8477 -468 3589 329 1107 3255 -614 1659 2903 -1489 2591 1044 226 1099 1095 -2100 1702 899 -2778
8494 -2778 2887 -1518 -918 1579 -1921 -2260 581 -1637 -2338 1104 -3124 -1881 1062 -4076 -2105 -752
8510 -752 -4702 -1899 -1106 -3728 -513 -1567 -3376 209 -957 -2528 1003 -381 448 3090 652 249
8526 249 3457 861 851 4348 713 2489 3923 408 1732 3527 -339 1284 1585 -2362 639 -934
8542 -934 -4017 -316 -1888 -5036 -1131 -4013 -5539 -1442 -3144 -4429 -1432 -2898 -2345 -68 -3535
8557 -3535 -1383 1772 -2819 419 1014 -1791 1587 1799 -1915 120 2495 -1230 2523 1174 -1194
8572 -1194 3378 249 -437 1867 297 -1092 2737 -1909 -480 2685 -2641 144 592 -2604 -360
8587 -360 860 -2000 -364 987 -3231 -1491 -1027 -3504 -46 -2568 -3984 -1503 -1916 -3749 -948 -1814
8603 -1814 -3568 865 -2498 -1792 900 -1102 -15 1169 -301 1325 3754 265 1823 3979 -321
8618 -321 3862 1761 -478 2596 2290 -1111 2157 -268 -2637 1162 -1239 -3119 673 -3632 -4142 -1156
8634 -1156 -2987 -2973 -1623 -3019 -3190 -969 -4130 -1274 476 -4279 551 -821 -1812 366 88 -1213
8650 -1213 1896 801 -2742 2010 361 -1884 2692 268 -207 2706 -1020 -1100 1982 -37 -309 3086
8666 3086 -902 799 2118 -2799 1931 2198 -830 388 1205 -2536 -308 602 -2507 710 -2197 -4225
8682 -4225 8 -2709 -3059 -1064 -3554 -3313 -868 -3027 -2192 515 -3058 -1176 759 -2382 1993 1402
8698 1402 -584 2075 3409 338 4570 3279 -291 2855 2751 325 3518 -29 -1256 2066 -761
8713 -761 -624 752 -1961 -2639 300 -3653 -1728 286 -4962 -2025 -1467 -3870 -1388 -846 -5174 -693
8729 -693 -350 -4509 787 -982 -2388 1076 -1593 -1418 1119 -623 -2514 1344 -815 -1183 2079 -1853
8745 -1853 882 1446 -1416 1071 1201 -709 1035 2811 -606 2185 2073 -995 1961 -26 -870 1420
8761 1420 316 -2069 173 -1873 -3324 516 -3281 -3178 -505 -3728 -3359 -2011 -4077 -2845 -1865 -4710
8777 -4710 -1289 -287 -3964 -177 5 -1486 2252 -24 -449 2900 1856 0 3883 3202 988 3981
8793 3981 -276 751 4599 136 1647 1903 -1080 167 1878 -3890 -2017 -69 -3417 -425 -1416
8808 -1416 -3485 699 -2412 -2911 -681 -1737 -2718 497 -1410 -3125 1777 -3471 -2009 247 -2330
8823 -2330 -994 722 -1261 -827 1529 -2507 1137 1878 -2706 2074 451 -567 1721 2141 -402 2587
8839 2587 1836 -631 4102 298 -982 3144 -188 822 3110 -833 690 1070 -1638 -435 -395 -4186
8855 -4186 -1961 -1149 -5986 -2293 -2622 -5525 -1657 -2437 -4328 -1036 -1028 -2828 313 -466 -1731 2418 -499
8872 -499 -336 2869 448 1099 3540 1589 2223 4938 -374 2736 3637 -694 2528 1098 -1173 1415
8888 1415 -49 -1908 443 162 -2845 1046 -1523 -2124 787 -2332 -2581 -75 -2285 -2557 702 -3404
8904 -3404 -2059 800 -4065 -289 383 -3030 74 -1908 -2499 -179 269 -2402 928 -358 -2339 2748
8920 2748 136 -80 1954 698 21 3247 1586 164 3602 599 2403 3299 -897 2334 2797 -1579
8936 -1579 184 463 -3629 353 -1207 -4121 68 -2286 -4756 -1332 -3244 -4474 -800 -3929 -3471
8951 -3471 -314 -2830 -1486 1126 -2839 -563 1908 -1485 1952 3082 -286 2150 2788 -647 2796
8966 2796 2328 -230 2819 2099 -1340 2785 -101 -1387 1857 -1324 -1598 1670 -1415 -1530 2741 -2630
8982 -2630 -1204 572 -3487 -420 -538 -3225 -955 -1 -3270 -63 114 -4063 237 -827 -3544 668
8998 668 -1203 -2746 -207 -670 -3321 728 -2056 -605 2624 -1211 1417 2977 -475 2361 2641 705
9014 705 2580 4012 21 3005 2830 -831 3546 2355 -978 1226 -190 -1789 667 -1261 -2162 7
9030 7 -3921 -3856 -1439 -5157 -2607 -980 -4674 -2372 -213 -2723 -296 707 -2416 1005 1874 -1422
9046 -1422 1361 796 -1208 3206 935 -221 2665 1683 245 4166 860 -387 4265 -337 1866
9061 1866 1920 -1035 965 1302 -672 -677 1674 -3112 34 1202 -2299 388 -993 -2708 -395 -1614
9077 -1614 -3102 -370 -839 -3924 531 -3513 -2248 283 -3367 -1627 -794 -1506 -2779 1001 -2988 -138
9093 -138 1970 -1517 2232 1535 1160 2596 2787 378 2533 3298 53 4847 1613 -590 3118 79
9109 79 -453 2551 -1353 -1043 619 -3186 -1966 -700 -3642 -2267 -678 -4842 -1769 -762 -4696 -2148
9125 -2148 -2039 -4171 -264 -253 -3103 337 388 -1347 3196 -71 -713 2814 -488 479 2870 -118 -345
9142 -345 2296 -950 601 2496 -1338 1644 2801 -742 1219 1309 -1352 880 1948 -3631 1671 -107
9158 -107 -2811 2369 -1027 114 404 -862 -2875 1587 -2637 -2334 1172 -3672 -1655 -516 -4068 -927
9174 -927 -817 -3632 -829 -119 -2971 1184 1129 -883 3124 469 914 3414 2558 655 2884 1881 1426
9191 1426 3898 957 2117 3185 -623 773 1899 -1923 68 578 -2232 -668 -572 -3738 -402 -1719
9207 -1719 -4025 -1371 -1919 -4063 -1228 -2087 -2868 381 -1489 -1311 1419 -782 -876 2403 -1416 426
9223 426 2110 -953 1487 1835 -481 1679 1798 -797 1170 1935 -1503 3333 1199 169 1636 1332
9239 1332 -629 1935 944 -456 2767 -1147 -82 2490 -1909 478 859 -3052 -1865 809 -2357
9254 -2357 -2160 -735 -4550 -5 -1209 -4149 -904 -2940 -2783 364 -994 -2845 1852 376 -1623
9269 -1623 3615 233 1861 4027 270 2664 3819 400 2502 4781 -62 2113 2631 -823 2639
9284 2639 1991 -1467 620 638 -2049 514 -1905 -3816 -321 -2659 -4235 108 -3745 -3304 442 -3204
9300 -3204 -565 1525 -2098 -200 1801 -2481 372 1408 -2876 1988 252 -954 1907 1048 -871
9315 -871 2219 1398 -1492 3374 169 -1212 4032 -520 825 3501 -914 239 3120 -90 421 2843
9331 2843 -844 1435 1835 -1489 961 440 -3197 529 -624 -3089 -483 -1235 -4624 329 -2437 -3036
9347 -3036 -106 -3051 -2267 694 -2077 -2377 1377 -1413 419 2984 -167 1727 2875 -64 2852
9362 2852 4264 720 2843 3430 718 3611 1330 508 3064 656 -238 1424 -469 -1680 340 -2257
9378 -2257 -1201 -13 -2435 -1450 1130 -3107 -293 1120 -3445 -567 -769 -2122 -357 354 -2944 154
9394 154 -86 -2808 2035 -1166 -596 2060 -218 -150 1714 -57 796 2556 -538 30 3949 -1321 2272
9411 2272 2596 15 2146 2573 -222 2571 2163 -910 2877 1329 -1864 2056 -465 -1418 680 -2276
9427 -2276 -2432 -674 -2647 -4134 173 -3655 -2373 -1045 -3354 -1782 -662 -3284 -410 483 -2334
9442 -2334 314 1332 -441 3625 2218 309 2741 2140 1092 4024 2870 1090 3333 1258 394
9457 394 3804 -1266 284 2545 -538 151 367 -2668 -1117 525 -1709 -201 -161 -3873 1250 -627
9473 -627 -3470 505 -1401 -2780 288 -303 -2091 502 -1401 -1803 1584 -2745 -308 2014 -2269 -114
9489 -114 1686 -1465 1318 2151 -1180 2135 2658 -395 2591 2479 968 2638 1576 590 3374 1876
9505 1876 220 4897 522 -123 3531 -1221 -1056 201 -3067 -1371 -617 -2547 -2087 -551 -4826 -1780
9521 -1780 -770 -4165 -379 -1119 -2762 230 -555 -1588 1563 1739 -421 2836 704 569 3816 -44
9537 -44 2041 4024 1404 2734 3789 102 812 4045 -1258 1474 2047 -2197 1594 229 -1486 381
9553 381 211 -2322 1213 -1055 -2518 1823 -1977 -1658 1237 -1895 -495 127 -2323 -1055 976 -2952
9569 -2952 -443 1491 -3003 909 -72 -1584 466 1028 -1052 1981 1306 -1541 3508 1542 138 4063
9585 4063 1770 476 4207 1626 1384 3649 156 1578 3124 -277 1116 1750 -1704 1313 122
9600 122 -3483 -893 -568 -3465 -554 -996 -4655 -708 -2693 -3512 -548 -2198 -1632 1090 -405 -881
9616 -881 1611 -8 782 2751 -291 2699 4060 920 3288 3755 1056 2470 3694 -535 2403 3431
9632 3431 -1282 2487 472 -502 2324 220 -792 1648 -38 -1298 1854 -1328 -828 2600 -2947
9647 -2947 -694 553 -2411 -505 -103 -2679 -464 492 -3284 78 -530 -3501 600 -1334 -2095 1672
9663 1672 275 -376 2436 356 -790 4722 1248 856 4714 480 2045 3800 878 3164 4592
9678 4592 640 2511 3114 -90 2096 1901 -1019 2094 440 -3001 1029 -1530 -3601 480 -2909
9693 -2909 -2501 512 -3557 -3268 -209 -3565 -1429 399 -1831 -21 2229 -1786 1155 2996 -1283
9708 -1283 2359 2839 -678 3800 1905 473 2833 2168 1003 2783 1003 6 4177 -581 743 3624
9724 3624 -948 477 2360 448 243 2298 -1430 926 1970 -2840 795 -375 -2311 -1086 211
9739 211 -1938 200 353 -2871 376 -1503 -2242 1098 -2248 -1310 1946 -1106 -367 2002 -730 1594
9755 1594 2967 163 2630 4173 1181 4397 4502 1095 3507 4070 459 2723 2772 -716 2597 407
9771 407 -897 2548 -1710 -1604 1182 -3126 -2212 325 -2301 -2294 272 -3591 -917 -632 -3077 133 1009
9788 1009 -1210 825 972 -1379 1431 1591 -1651 3630 386 -219 3415 26 1253 3518 1200 356
9804 356 2747 163 521 2986 -1197 1709 2920 -639 1448 1194 -173 1423 2020 -1836 2011 1129
9820 1129 -1613 1897 -2313 -1292 584 -1374 -1795 190 -1665 -2261 1083 -2842 -1484 426 -2450
9835 -2450 -529 259 -2184 434 1406 -863 2050 1977 -603 3149 3435 1413 4532 2149 1674 5258
9851 5258 2235 2012 4625 -163 113 2127 -109 -911 1840 -2605 -889 901 -2930 -495 38 -2798
9867 -2798 -701 -544 -3510 -235 -700 -2923 723 -1891 -2384 1356 -462 -379 2441 910 -883 3854
9883 3854 -396 364 4317 -1268 2353 2166 252 1443 2915 212 1304 3704 -679 3663 2314
9898 2314 -234 4120 1428 -159 1598 1238 -913 2906 -390 -625 2360 -2445 -678 1278 -1851
9913 -1851 -2169 -640 -3040 -1860 -51 -3514 -1428 -1618 -3225 350 -1099 -2735 1504 -21 -527 1721
9929 1721 1701 1061 4072 2254 2153 5944 2707 2380 5078 1854 2128 3470 877 1102 2807 -842 1765
9946 1765 3039 -2012 154 -324 -2494 -65 -950 -1971 -52 -1071 -2840 730 -1257 -2739 2076
9961 2076 -1960 -569 1117 -1535 -709 2636 -422 -568 3010 -1292 501 2532 -1433 3221 1129
9976 1129 -169 2503 2059 -326 2462 1681 -53 4277 320 1695 3347 665 1754 2917 386
9991 386 -28 3711 -1322 537 1828 -2519 1499 -213 -2536 553 -380 -2258 -536 -1461 -3940 145
10007 145 -862 -2330 2121 -1837 -1882 1252 -440 -637 2798 -787 611 3329 310 2353 3355 -334
10023 -334 3134 3960 712 4643 2297 340 3156 1256 -477 985 458 -2442 2719 -806 -1858
10038 -1858 1371 -3088 -1029 648 -1043 -1942 736 -2264 -620 878 -3713 966 -327 -1487 197
10053 197 664 -757 -260 1643 -2094 2069 -74 -839 2466 -1337 414 2510 249 -55 2853 960
10069 960 726 3387 -245 2363 3862 -277 3220 3158 592 1613 2459 -575 2363 2241 -2468 1456
10085 1456 -1145 -2197 -490 -2059 -3559 167 -2643 -3724 -60 -2581 -2245 465 -2810 -691 1448
10100 1448 -1322 -24 2481 -968 2006 3310 1252 3710 3740 826 4187 2586 775 4854 1989
10115 1989 1058 3919 549 -204 1827 -525 -418 2769 -2619 -677 1418 -2487 -607 -224 -1021 -382
10131 -382 460 -3845 -1142 -39 -2734 1620 -403 -2494 593 -1250 -2597 1090 -382 -2227 2569
10146 2569 -687 -658 2849 -924 24 1973 209 1217 3658 793 2691 4616 211 2667 3068 859
10162 859 4136 1998 70 2362 2041 -442 1664 115 -1252 2318 -1434 -1736 833 -3430 -2474 84
10178 84 -4290 -2238 -1310 -3026 -1169 -339 -3011 1066 617 -2905 1403 211 -161 3466 1931 576
10194 576 4442 1684 353 3835 1347 855 3200 -135 1072 2959 102 1686 2824 -1406 744
10209 744 2125 -1907 1484 1492 -2384 619 154 -1723 226 470 -2379 1176 -268 -2623 1397 -1873
10225 -1873 -1162 1779 -3418 -898 1054 -2494 -1435 2499 -2780 -396 1582 -3417 1189 -245 -1101
10240 -1101 818 1998 148 3953 2907 741 5535 1771 634 4736 1045 1496 3988 295 -244
10255 -244 3028 -33 -530 2168 -1996 -544 -120 -2657 -1634 -1165 -2342 -437 -1125 -4811 -807 -1007
10271 -1007 -3319 1071 -951 -1847 2594 -338 -203 2783 411 806 3862 1283 57 3562 -751
10286 -751 2280 1914 -1039 2047 2121 126 871 2090 -1616 1570 1511 -2448 1443 -196 -1062 1632 -1498
10303 -1498 -1198 1158 -583 -1027 2261 -2641 -2161 1587 -2921 -645 246 -3356 -628 202 -3491 -662
10319 -662 -44 -3218 141 -328 -2311 968 -8 197 2788 2522 1093 3966 1008 1595 4668 1166
10335 1166 2086 3733 260 2005 2846 443 1697 1704 -1734 267 412 -2478 903 -1299 -3544 104
10351 104 -1407 -4035 164 -2165 -3064 -54 -2237 -2182 822 -1657 -877 2327 -1785 1374 2570 -1199
10367 -1199 1666 2507 -435 1752 3028 -1503 3142 2961 -506 2733 760 438 1714 1598 -1287 3244
10383 3244 -56 -891 4329 -677 568 2705 -1985 387 2387 -1582 -209 2636 -1244 199 742
10398 742 -4179 523 -1259 -2709 -159 -1281 -2814 79 -594 -3271 924 -1480 -620 1757 -1118
10413 -1118 -233 3004 -143 966 4284 816 1859 5342 601 3515 3631 -323 3248 2697 -760
10428 -760 2698 1456 -1260 2113 -444 -2286 1459 -2142 -2695 471 -3712 -2675 -598 -3465 -1891
10443 -1891 589 -3270 -1525 1034 -2291 -248 806 -1655 1502 770 -648 459 1353 -432 2077
10458 2077 1716 -1147 3299 134 667 1881 -578 933 3270 -362 11 2051 -812 1724 3244
10473 3244 -1271 1412 2061 -806 2285 731 -1739 1753 763 -2084 410 -72 -4181 1482 -1708
10488 -1708 -2815 123 -1046 -2687 -143 -2890 -1821 1549 -2887 -441 684 -2126 688 2360 -178
10503 -178 2484 2491 888 2884 3985 -293 3587 2973 420 3948 600 942 2879 275 -198 1205
10519 1205 -546 -664 1107 -2695 -679 688 -3533 -551 -394 -3101 -1813 127 -1775 -90 88
10534 88 -3577 1662 -610 -1817 2110 -1203 -575 1543 -272 -602 2964 -572 -1110 1992 -996 -99
10550 -99 1505 -482 665 1889 -120 1043 3385 -285 2131 1868 -1333 3013 507 -223 1530 182
10566 182 -617 1344 -538 -1702 986 -3031 -2043 774 -2950 -2346 -199 -3617 -2052 -789 -3300 -1074
10582 -1074 -979 -2581 55 1108 -1589 930 1027 -529 3096 1584 395 4039 2339 383 4089 51
10598 51 -247 5034 -481 873 1743 -388 739 2447 -2378 244 510 -2935 -367 -816 -4017 -453
10614 -453 -1902 -2041 -289 -1122 -1832 436 -162 -3071 1418 -1506 -691 1642 -2551 365 921 -1490
10630 -1490 609 1924 -975 623 2306 -1854 2137 525 -259 1836 1855 -137 2544 1867 -248 3363
10646 3363 251 -26 4263 224 848 2222 -926 -490 1984 -1412 -1362 1010 -3906 -1703 -117 -4323
10662 -4323 -1473 -1647 -4471 -656 -2075 -3198 -192 -1151 -2777 1029 -1406 -2037 1689 -24 -202 3201
10678 3201 404 923 2446 871 2807 2891 686 1806 3911 -794 3014 1845 -1419 1328 -450
10693 -450 -1641 746 -28 -2058 1789 -802 -2360 2155 -1931 -2160 849 -2823 -1519 775 -2068
10708 -2068 -1786 1721 -2627 -170 480 -2071 -100 463 -2715 -607 831 -1980 447 598 -1984 2099
10724 2099 -79 -382 2058 627 413 3024 1489 875 4227 527 1904 3031 -1028 1826 2120 731
10740 731 45 1421 -2527 264 -483 -3570 91 -1865 -4030 -1175 -2211 -3801 -737 -2736 -3915
10755 -3915 -571 -2505 -2363 1250 -1315 -888 2355 -695 849 2317 -1473 2485 1967 -379 2470
10770 2470 2785 -213 2416 2247 -981 2662 -393 -1376 2785 -375 -430 1116 -700 -1450 1435 -1209
10786 -1209 -865 1429 -2348 -607 111 -2712 -2077 -649 -2107 -845 80 -4676 575 -886 -3233 887
10802 887 -1634 -2934 525 -701 -2671 1659 -249 -1839 3219 -553 248 3057 -1355 1452 3205
10817 3205 186 2506 3800 165 3589 3275 -52 2661 1361 -838 1180 232 -2025 1102 -1362
10832 -1362 -3202 290 -3125 -2927 -201 -4545 -2863 -395 -4529 -2021 -1482 -2886 -1478 708 -1721
10847 -1721 -229 1558 -1579 1868 1838 -1149 3122 660 -473 3259 1323 84 3886 199 -1278
10862 -1278 3542 -1033 42 3375 -1454 -103 1620 -1468 -151 2053 -2776 245 634 -3240 1404
10877 1404 397 -2176 -622 -66 -2855 1080 -1616 -3311 1081 -1322 -2580 782 -3231 -2247 48
10892 48 -1923 -2321 871 -2730 -222 2102 -1330 802 745 -1734 2884 2730 449 2628 3002 592
10908 592 5008 2130 -572 3573 -79 -363 1039 -509 -1491 1340 -2578 -1915 186 -3030 -2192 -1975
10924 -1975 -3946 -1425 -1551 -4540 -1718 -863 -3301 1050 -951 -2891 244 805 -1747 2915 730
10939 730 -327 2106 -653 580 2911 117 596 2384 -905 -815 2992 -2028 1502 729 -1112 569
10955 569 1162 -771 1145 1307 -2023 1833 -639 -2474 1057 -1848 -456 -29 -2528 -3026 402 -1116
10971 -1116 -2680 981 -3466 -1678 -1517 -4295 -1243 -451 -3417 -1636 43 -3492 238 -332 -2626
10986 -2626 2477 927 -327 2339 2458 759 4150 2419 1157 4114 374 1690 3805 -516 63
11001 63 1783 -2941 598 1641 -2695 -1135 -1323 -4177 -1492 -1137 -4913 -795 -1456 -2751 -910 -1162
11017 -1162 -2852 568 -1774 -1109 1352 -1708 -1755 1133 -1321 272 2632 -631 1079 1361 -341 1464
11033 1464 1650 -1375 1420 1988 -2397 1984 114 -1441 1503 106 -491 1006 259 -889 2249 -436
11049 -436 -1023 2391 -2153 -630 1246 -2110 -1339 -214 -2438 -2279 -139 -4378 -835 -1741 -3188 -634
11065 -634 -1822 -2783 -999 -931 -2902 903 -655 -1558 2975 -540 -99 3701 -490 1218 3532 738
11081 738 1190 4129 -122 1911 2186 -1090 202 1169 -2036 399 -876 -3405 30 -1604 -3790 -108
11097 -108 -1901 -3637 41 -2356 -2913 651 -3234 -2464 -298 -2202 -1997 611 -1861 -649 668 -2407
11113 -2407 436 -121 -2198 1438 9 -1583 1617 225 -1255 1515 1006 -2180 3536 -17 340
11128 340 2258 182 136 1535 -437 -260 3332 -2029 643 736 -2451 -171 -472 -2002 -826 -484 -2744
11145 -2744 -519 -1652 -4808 218 -3264 -4597 -696 -2959 -2503 -31 -2370 -2660 513 -2738 -2600
11160 -2600 1700 -1193 1266 3192 -818 2636 1936 -661 3261 2472 526 1776 1680 -802 2580 -78
11176 -78 -2007 1532 -1957 -1613 199 -2456 -2039 -142 -2694 -2319 237 -3763 -1853 -855 -2998 -1234
11192 -1234 -134 -2072 -470 129 -3139 -725 198 -3246 1973 -649 -2050 1144 -698 -1235 1018
11207 1018 -364 -1324 2062 -760 -524 1264 -1805 915 2626 39 1257 2330 -376 1109 2402
11222 2402 -1791 2251 1988 -3134 1934 -1694 -1993 490 -2763 -2961 -1594 -2804 -3676 -134 -3651 -2930
11238 -2930 -1262 -3567 -1422 484 -2037 -1276 228 -1548 414 708 -1295 1756 2232 -95 2659
11253 2659 2078 1031 3419 1757 -363 2319 396 -554 1964 -443 -849 2376 -2967 -660 290 -2268
11269 -2268 -53 222 -2330 -1388 -8 -3076 532 -225 -2466 250 -1269 -1334 165 -484 -1815 135
11285 135 -1028 -2703 1847 -2292 -1233 518 -2489 53 1544 -1156 -535 1630 -1027 756 2106
11300 2106 -850 2122 1553 77 2242 1711 71 2468 1258 627 2118 -419 -1722 1059 -933
11315 -933 -1524 1783 -2425 -1402 -1403 -4267 -2675 -896 -3742 -2535 -1535 -4109 -1180 -1769 -3282 -800
11331 -800 -1434 -1754 1648 800 -1090 3129 130 -44 3370 -3 1102 2931 31 622 2413 -154
11347 -154 -305 2938 -2601 541 1130 -2681 849 -329 -2163 525 -1620 -3210 -437 -388 -2479 1842
11363 1842 -1942 -2244 1313 -2757 -2091 517 -2772 -1899 1129 -2508 -1843 267 -3357 -817 -948 -3937
11379 -3937 367 -49 -2803 734 807 -1746 1970 -151 -303 2676 585 521 3334 48 428 3386
11395 3386 308 645 3305 -831 249 2072 -2136 -261 -1255 -3134 -1062 -1543 -4335 -966 -1478 -4110
11411 -4110 -1752 -2024 -4708 403 -2171 -2939 346 -2157 -2100 531 272 -1692 2157 -481 550 2969
11427 2969 -658 2612 2380 -530 1501 2193 -670 2072 481 -2182 2264 464 -1080 2382 -1213
11442 -1213 -1271 1599 -898 -2547 536 -871 -1364 2373 -4244 -1227 1072 -1651 -1200 -266 -2026 -923
11458 -923 668 -3719 -1027 -1086 -3655 971 -2110 -2586 1352 -1408 -2181 1342 565 -73 2785 -580
11474 -580 929 3293 300 1615 3217 265 1332 2197 -632 887 1889 -1554 1817 -154 -1932
11489 -1932 985 -829 -3289 1178 -2025 -3694 -1295 -1960 -3528 -338 -2534 -3280 -637 -3355 -1858
11504 -1858 1576 -2851 -440 1098 -1202 63 1810 -513 1736 2097 -1303 2205 1320 -608 2873
11519 2873 259 -952 2025 1319 -1208 3039 -1499 -700 2660 -2542 199 979 -1334 347 1759
11534 1759 -1690 183 1426 -2261 1093 -221 -2417 -137 195 -3191 -175 -627 -4133 -133 -2469
11549 -2469 -2812 473 -2890 -2317 -99 -1886 -2127 731 -435 -562 2973 -165 1027 2453 -976 2420
11565 2420 3282 -274 2363 2087 -854 2615 549 -1755 1228 -416 -2099 1371 -1110 -3385 166
11580 166 -3393 -2237 -534 -3714 -2136 -615 -3046 -2472 -391 -3830 -1011 -641 -2560 774 281 -1642
11596 -1642 1128 2372 -1917 2372 788 -734 3002 -28 -24 2356 332 -323 1542 -210 -1122 3656
11612 3656 -1770 1972 1943 -1816 1027 474 -1224 807 797 -1921 588 1207 -2462 1113 -1352 -2320
11628 -2320 459 -1346 -2963 555 -1695 -3439 410 -3331 -3162 47 -3199 -1394 -448 -2130 153
11643 153 1589 -1706 669 1230 -1075 2972 1158 224 3002 2369 -261 3418 747 556 4052 1275
11659 1275 200 2392 -165 -739 2111 -2910 -389 392 -3981 -359 -651 -2652 -657 -1011 -3620 -1904
11675 -1904 -1225 -4153 1041 -1057 -1633 1035 -1016 -627 791 65 -1374 1994 -1456 -195 2196 -1922
11691 -1922 1405 1609 -1772 722 1404 -849 1028 3195 -1913 2282 1578 -1030 2735 658 155 963
11707 963 453 -219 2038 5 -1550 2464 -2506 -1022 896 -2915 -2211 -489 -1890 -2596 -589 -4928
11723 -4928 -1502 -1010 -5233 -1607 -1172 -2486 356 920 -1523 1343 1091 -980 3733 809 153 3301
11739 3301 1899 1439 3764 -79 1382 3629 -268 502 1340 -1173 1042 1564 -3107 137 -1050 -3074
11755 -3074 138 -1998 -2921 528 -773 -2138 610 -634 -3445 2453 -2191 -1079 -5 -1156 -544
11770 -544 502 -764 -609 2342 -1584 996 1562 -1582 779 220 -1362 1770 2120 -1170 1327 1515
11786 1515 -1980 2448 1127 -494 2609 347 1644 2368 1024 -439 1874 -1285 -835 1977 -3343
11801 -3343 479 297 -2568 -677 -601 -2920 -1201 -1764 -4230 -416 -2220 -3524 145 -1283 -2326 1284
11817 1284 -960 -1029 2471 -545 -171 3139 1011 678 3058 882 1886 3462 392 2995 2689 -1024
11833 -1024 2054 1247 -1535 1914 962 -2085 1682 -1424 -2772 1076 -1559 -2483 -277 -1054 -2050 487
11849 487 -2448 -1665 893 -3904 -287 1491 -2957 701 14 -919 -856 434 -3020 1523 989 -1817
11865 -1817 2491 -761 3 1297 -551 -915 2763 1564 48 3341 -351 541 3972 -268 1833
11880 1833 1571 674 1216 2570 -1317 590 563 -2543 1204 -1070 -2030 578 -1437 -3420 -1323 -1630
11896 -1630 -2762 -275 -3409 -2515 1040 -3707 -1311 1177 -2132 44 2168 -104 877 2357 798
11911 798 2814 1585 -1021 3842 2687 -312 3026 1367 482 1687 966 -961 1862 -323 -1180 1821
11927 1821 -1148 -289 336 -2953 -128 427 -2106 -321 -300 -1904 -427 412 -3512 1107 -1266 -2903
11943 -2903 1490 -1329 -1153 425 -393 -3061 1635 -977 -1452 2374 -2002 -333 1405 -1820 -390
11958 -390 3377 -992 970 3794 -659 2446 2366 -172 4079 1890 181 3168 1439 -282 2521
11973 2521 716 -2572 2144 -1036 -1690 802 -3217 -2050 -560 -3073 -1990 -636 -2723 -2084 -255
11988 -255 -2736 -160 1351 -1616 1315 29 -1433 2619 1231 315 2785 1260 491 3914 1143
12003 1143 1058 3014 -760 1004 2772 -434 560 1165 -1095 -476 2077 -1861 851 183 -1808 1555
12019 1555 239 -1242 1418 306 -1988 1469 -474 -3171 1346 -2497 -1907 268 -1368 -1442 495
12034 495 -745 -2213 971 -2144 -427 1716 -2904 1017 -163 -1457 1443 1674 -449 2674 2546
12049 2546 -181 4520 1575 -837 4036 2261 989 2508 467 62 2388 -456 -821 1659 -3298
12064 -3298 -416 386 -4442 -1208 -1156 -3200 -1048 456 -3683 -447 -1355 -3619 1295 217 -1168 2744
12080 2744 -209 -817 2569 -740 582 3558 686 795 3284 -1572 710 3071 -320 2017 2011 -1212
12096 -1212 986 2090 -1450 515 1041 -2071 2322 -185 -1227 2019 -910 -1088 1979 -1498 -1466 1833
12112 1833 -906 -1669 1700 -2865 -366 58 -3272 -1810 -873 -1874 -1129 -230 -3398 320 -174 -2119
12128 -2119 791 922 -834 2172 1489 -147 2732 1819 278 4650 -190 1215 4102 132 2564
12143 2564 2520 -1141 873 1569 -1212 1506 1616 -3514 547 -533 -3689 -55 -1944 -3300 -28 -2258
12159 -2258 -2804 428 -1172 -1963 2291 -2498 -6 2569 -977 1034 1723 -387 187 2533 -926 977
12175 977 2786 -278 2340 924 -983 2941 1410 -894 1781 1389 -51 2658 1039 203 3261
12190 3261 -1000 120 2353 -376 1312 2551 -1388 -53 1790 -2128 -89 1047 -3470 80 -1553
12205 -1553 -2406 227 -1084 -3019 380 -1377 -3986 792 -1050 -959 2075 -1001 444 2087 -492
12220 -492 940 3704 759 889 3749 218 2377 3873 176 2894 2167 -230 2699 788 -1407
12235 -1407 1085 808 -2078 909 -452 -2095 826 -2254 -1992 -131 -2013 -896 45 -2041 -1131 505
12251 505 -2804 578 1320 -1993 1553 597 -888 1093 1647 9 1324 1967 -1291 2859 -69 -754
12267 -754 2716 -1214 373 2777 869 896 2303 -657 709 2877 -1634 2181 2493 -976 2223 877
12283 877 -862 908 1149 -2055 843 -664 -2773 71 -1310 -2697 200 -2835 -2446 -968 -1736 -1995
12299 -1995 787 -2372 -564 2260 -1172 1332 2069 -618 1989 3273 121 2682 3148 -203 3521
12314 3521 2544 -528 4898 271 209 3502 -151 -857 1507 -235 -1433 1303 -1191 -2562 659 -3503
12330 -3503 -601 333 -3327 321 303 -1491 -254 740 -2711 1201 238 -1134 2179 -291 -1302 2392
12346 2392 746 -389 1531 118 -1010 2769 -653 360 1847 -427 2341 2185 -717 1448 2138
12361 2138 -64 3051 1872 -783 3315 2174 -376 2038 889 -955 1570 1192 -1986 858 -1177
12376 -1177 -1507 232 -2980 -1538 -131 -2745 -1473 -219 -2576 -677 32 -1414 216 927 -776
12391 -776 1526 2131 -1261 2984 1725 1104 3406 3137 1892 3914 981 291 4120 221 1197 2664
12407 2664 -774 501 1207 -1150 -499 927 -2269 -476 944 -4144 1173 -1714 -2971 788 -595
12422 -595 -1222 613 625 -2976 1610 26 -1223 1999 -1216 -1 1087 -667 -358 1431 -985 120
12438 120 2181 -1196 1550 1745 -1363 1895 2255 8 1389 1281 110 4170 2524 -55 3949 711
12454 711 381 2311 -197 581 1409 -984 -537 1515 -1912 -965 -309 -3185 -985 330 -2760 -1166
12470 -1166 -946 -3968 619 -1208 -3013 1046 -20 -1711 2081 695 -361 2953 1572 1642 3053
12485 3053 1362 1963 3728 775 2372 3426 348 2609 1950 -757 3186 335 -1088 1243 1209 -2270
12501 -2270 650 221 -3387 1471 -1192 -1561 -159 -792 -320 1749 -627 -1017 2104 -1921 -261 769
12517 769 -3433 1240 88 -1710 297 1537 -942 1469 1567 -2170 1804 527 -248 3147 271 1444
12533 1444 2955 1887 253 3864 603 722 4614 -445 1738 2457 219 1755 2294 -2080 955
12548 955 1621 -2366 -286 -640 -3086 -36 -1437 -3224 -294 -1799 -2598 1162 -1046 -1513 1307 -1012
12564 -1012 349 2133 -1330 1901 2940 -487 2048 3581 921 2417 3330 79 1742 2159 -1716
12579 -1716 3278 1755 -654 3081 -91 65 1273 117 -2205 1446 -373 -1426 2101 -600 358
12594 358 1061 -1300 9 341 -1087 480 815 -2647 866 -77 -2682 541 -807 -743 1223 -399
12610 -399 -1737 1154 40 -981 2406 -1492 130 3504 -161 1312 3298 243 2093 3276 913
12625 913 2806 4311 140 3921 2557 322 2765 680 -1226 1194 -760 -2028 523 -1720 -2284
12640 -2284 1589 -2116 -1700 175 -3219 -2090 1037 -1868 -1008 371 -1575 454 2328 -1061 1296
12655 1296 1882 -138 2468 1626 502 2423 1529 -212 1942 1723 -182 3095 997 746 1838 -823
12671 -823 963 1456 863 1053 2817 -867 531 1890 -1258 1440 1499 -1427 879 -291 -1331 592
12687 592 1111 -2616 1557 -1693 -2103 1543 -2585 -905 953 -1829 -3049 1607 -518 -520 2466 -1221
12703 -1221 2020 2563 -697 2264 2296 1153 3496 3861 87 3549 3330 602 3224 1811 203 3411
12719 3411 -312 418 1349 -1078 -1091 566 -2033 -1730 -84 -3044 -1161 -271 -2941 -250 198 -1921
12735 -1921 753 366 -778 1062 844 -1769 2859 -220 -1295 3447 -88 670 3189 527 918 2898
12751 2898 -319 1094 3451 -67 1570 2476 -1118 2678 1314 -627 1398 1950 -481 1348 1593
12766 1593 -2704 2938 678 -522 1038 -199 -1326 1329 218 -973 873 -2742 -317 1143 -2051
12781 -2051 -781 72 -2202 -208 682 -1814 30 1754 -2573 1915 2051 -600 3530 1671 1173 4320
12797 4320 2553 1364 3114 547 456 4017 -201 285 3130 -1055 1511 609 -2181 -440 1051 -2412
12813 -2412 -714 -887 -3099 -446 -1250 -3492 526 -974 -1511 1276 -835 -973 1755 -10 -76 2080
12829 2080 203 318 2651 -2248 827 1918 -473 1538 2294 -831 1631 2739 -1693 2841 1138
12844 1138 -969 2144 712 313 1751 2087 -754 2830 -518 -321 2690 -1637 322 1614 -1592
12859 -1592 -160 329 -1572 -1356 797 -2722 -1216 -1422 -4209 244 -183 -1971 -1280 -421 -957 838
12875 838 35 -1248 2497 235 171 3686 -135 1361 2997 637 2382 3086 692 1145 3569 129
12891 129 1869 2153 -2280 2105 1019 -2667 -323 99 -2083 736 -6 -2509 440 -2968 -1642 1033
12907 1033 -1610 -1315 149 -1348 69 862 -2225 546 1484 -712 1444 2295 -1125 2510 398 -939
12923 -939 1327 1475 -290 1236 1467 -845 2741 935 842 2432 486 682 2317 -412 881 1770
12939 1770 -136 1161 2519 -1478 411 1977 -626 1455 783 -2539 579 -431 -3444 -650 -1275
12954 -1275 -2948 1602 -2235 -2512 492 -1673 -1291 1717 -772 -844 3370 -920 1723 2852 -372 2902
12970 2902 3643 -244 3475 2150 1112 2907 1935 -690 2970 868 -1504 2244 -1702 -1182 42
12985 42 -904 -1778 877 -1227 -1317 1896 -2286 -902 838 -2298 168 562 -1400 -62 1149 -1162
13001 -1162 358 30 -842 1553 639 -953 2305 -11 -1774 1472 -192 -640 2299 -6 -378 2146
13017 2146 -697 1824 1532 -996 1637 1942 767 1310 2116 -139 2086 1886 -1488 1880 -334 -1543
13033 -1543 1404 -610 -1781 -116 -954 -2869 1232 -2737 -1937 700 -2273 -1205 -295 -2166 -356
13048 -356 479 -1264 692 1511 -1174 2118 2487 -447 2532 2026 -1246 2596 2395 483 2573 852
13064 852 -585 2595 -401 -53 3139 -1188 743 2081 -1837 -798 1357 -1392 -13 535 -3543
13079 -3543 -195 -199 -3731 1208 -415 -2245 155 -209 -2465 2024 -91 -2654 2606 -721 -841 1105
13095 1105 -1134 258 1655 -789 -53 1116 -1742 1452 2407 -747 3243 1345 -705 3404 1698
13110 1698 -546 3128 1149 -852 3331 258 -691 1816 -882 -41 982 -2514 -1143 795 -2672
13125 -2672 -2375 258 -3675 -1399 -788 -2601 -262 -1322 -2426 40 -166 -765 1733 340 -604 1173
13141 1173 1229 273 3396 273 2168 3783 -609 538 2965 -230 102 3581 -913 -44 1793 -1355
13157 -1355 1088 589 -2021 198 667 -2379 21 804 -2503 1135 -89 -2447 1055 -1277 -678 741
13173 741 -278 -1288 1306 -1003 -806 701 -2907 -804 707 -1629 225 1293 -1763 1053 797
13188 797 -1606 1943 1201 -147 2408 1225 -20 3825 1035 -102 2839 1371 367 2160 -512
13203 -512 548 2688 -1521 344 1132 -1756 -284 695 -4395 -1249 -121 -2802 -781 -1290 -3728 557
13219 557 -617 -2480 1504 -542 -438 918 304 7 3239 -414 746 3319 -391 1341 2717 -29
13235 -29 1749 2239 -1344 579 2119 -1637 1656 480 -925 2086 -1410 -1010 1282 192 -2250 1395
13251 1395 -1234 -1907 2014 -1806 -402 1459 -1683 26 270 -1719 -1444 -231 -2923 -458 567
13266 567 -3630 261 -1038 -2303 1399 -947 -1221 946 31 -1030 1458 244 -113 2270 -40 532
13282 532 3251 -49 1637 4005 1187 863 2443 -606 1024 2465 -1135 -72 -715 -2231 445
13297 445 -1633 -2261 -282 -1375 -3388 788 -1802 -3015 797 -3072 -1657 609 -2110 -1069 1286
13312 1286 -709 566 1736 -792 1751 1950 -2322 2117 1575 -597 1443 744 142 836 769 -862
13328 -862 1414 -335 -392 3321 -1544 1008 1050 -544 31 516 -1123 -1546 1691 -2667 1163 1323 -1808
13345 -1808 -11 -451 -2667 -273 -847 -3494 314 -1511 -3053 609 -2664 -2048 187 -1304 -600 1324
13361 1324 -1120 -476 2553 -582 1405 2946 -62 1994 3165 -92 3647 1898 128 2177 1601
13376 1601 -8 1523 494 -1696 1185 -451 -1392 1294 -1979 -2359 -641 -3331 -3352 -182 -2130 -1490
13392 -1490 191 -2982 -96 651 -2730 802 521 -1402 1252 848 -601 2328 1026 -1359 1629
13407 1629 186 -571 1747 42 -46 1185 -269 -817 2342 -1343 -222 2447 -2109 1327 1278 -1105
13423 -1105 894 1543 -942 -246 1540 -2494 1459 -464 -2399 1387 -1935 -2091 -320 -1566 -3305
13438 -3305 -665 -1430 -2168 463 -3658 -1138 665 -2181 -73 368 -1567 -323 1655 -825 1862
13453 1862 1410 -489 3225 1181 -495 3761 1645 722 3002 1845 -286 1756 -20 -636 1932
13468 1932 -2350 -1145 -63 -3797 -1009 46 -2835 -782 -145 -3308 -1071 -428 -2668 518 -689
13483 -689 -2053 718 -764 -1163 508 -404 -1076 2343 -1399 -1574 2103 -1478 663 1923 -750 179
13499 179 864 -271 210 1607 -1330 747 749 -1925 3403 -92 336 1792 424 -367 1745 200 -917
13516 -917 2140 -336 -1205 897 -2598 -1858 -722 -3394 -1879 244 -2544 -2603 583 -3644 -873 -768
13532 -768 -2911 -401 304 -1147 1684 216 -642 2092 479 -259 3830 368 1527 3464 1009 1038
13548 1038 1979 221 547 1826 -1506 690 442 -1954 -20 -855 -2627 -1 -1863 -2375 -391 -1629
13564 -1629 -2998 -147 -287 -1992 793 -2650 -1282 1232 -1766 -288 93 -1644 -659 220 -1917 68
13580 68 1267 -2296 368 179 -911 742 -830 -1702 913 530 -1832 2149 1429 -129 2921 71
13596 71 667 890 0 38 1123 -1105 -1547 993 -3401 162 1081 -1943 800 -1364 -2510 -33 -889
13613 -889 -3674 -1656 -1413 -2888 -204 -2277 -3032 516 -354 -339 2041 -251 187 2000 -821 1281
13629 1281 2161 296 1513 3227 -364 1350 2465 -1659 1612 876 -1232 125 525 -2607 1811
13644 1811 -381 -2672 798 -1652 -1753 181 -1115 -1329 856 -1175 -1917 1276 -2308 -817 274
13659 274 -2964 120 -352 -1538 -985 459 -1668 527 1301 -2097 1258 -460 -2051 861 -204 -899
13675 -899 659 -19 -637 3358 -531 7 2280 -39 1914 2253 205 1244 2151 -753 684 1048
13691 1048 -2731 -181 -1738 -2461 -314 -2195 -3675 -116 -2321 -3682 -938 -2079 -3583 -105 -1749
13706 -1749 -1001 1187 -1847 813 304 157 913 1470 -454 1161 2568 -848 788 2792 -115 2716
13722 2716 882 -1375 1531 269 -1223 2094 -1232 -1664 1511 -1501 -1578 760 -2579 -259 726 -2184
13738 -2184 -1988 227 -2247 -13 764 -2545 480 118 -2220 138 -903 -1626 -475 -1069 -2312 999
13754 999 -1698 -2523 1839 -1753 521 2139 -991 1122 877 -876 678 2176 -655 2052 2393 -1139
13770 -1139 3219 1029 226 1784 378 -987 2284 482 -2143 1402 -980 -1763 925 -2974 -2511
13785 -2511 -1328 -2262 -2164 -874 -3997 -2679 112 -3069 -776 149 -1903 843 1033 -953 1340 1185
13801 1185 195 2795 1407 -384 2613 269 -94 2905 -509 -314 825 -1404 -555 1754 -157 -1055
13817 -1055 608 -1810 -467 627 -3096 -383 -489 -1872 759 -193 -1452 1111 94 -2170 478
13832 478 -898 -1742 1025 -2035 -2343 1013 -1353 -2163 -365 -2387 -1913 1422 -2614 12 -343 -1806
13848 -1806 1191 857 -213 1591 1774 -45 3233 1606 -114 2960 356 488 2863 440 543 1874
13864 1874 -970 -695 483 -1727 -1385 571 -2757 -1755 -461 -2823 -2718 -1098 -3131 -905 -367 -3391
13880 -3391 -272 -1277 -1266 2014 -836 -959 1962 -430 332 1725 -39 -37 1654 -56 322 2120 -1802
13897 -1802 1390 1977 -1240 64 1517 -2361 -261 2168 -1880 1157 -1024 -1672 1687 -205 -1343
13912 -1343 990 -489 -1361 -64 -1083 -1206 2258 -1835 -497 -1314 -2923 -330 -842 -2412 -2342 -594
13928 -594 -3505 -7 276 -2439 1421 270 -2158 578 -490 -957 2094 703 72 3731 471 -87
13944 -87 3039 431 405 2113 -1037 280 1727 -1175 -534 483 -2106 49 -1313 -3641 425 -1561
13960 -1561 -2617 40 -1935 -2542 -913 -1302 -2962 549 -2486 -1858 1844 -2199 -955 1860 -926
13975 -926 986 781 -1110 516 1842 -481 706 989 -2606 1542 1018 -875 1167 430 -2106 1192
13991 1192 298 -747 2229 -466 -320 1190 -1348 -489 1396 -1314 -1084 1222 -1938 -705 -211 -3075
14007 -3075 510 -1195 -2864 -844 -2584 -3577 -635 -531 -2923 156 -2181 -1343 1884 -2085 -1372 1817
14023 1817 -486 823 2157 46 328 2007 -197 1009 1492 -953 2009 1848 -777 2027 64
14038 64 -1180 -452 -651 -2227 -391 -1407 -2906 534 -3119 -1503 -434 -2876 -2034 -566 -1233 -1886
14054 -1886 602 -2126 -273 578 -2280 1876 -604 -1926 357 727 -1464 1062 47 -1600 2034
14069 2034 -540 -171 1516 -441 -155 2013 -645 -354 1198 -626 -600 2746 -1192 1582 1604 -740
14085 -740 968 1601 -289 156 636 -2664 475 -359 -2982 52 -1905 -3408 184 -2681 -1827 -775
14101 -775 -2413 -2358 612 -2140 -1794 1360 -2085 950 361 -1209 1779 964 75 1825 1682 -441 1583
14118 1583 2911 -915 2751 458 408 1931 -615 52 1257 -1976 -1787 523 -1861 -1060 -36 -3330
14134 -3330 -1632 -498 -2669 -605 -326 -2322 -1241 538 -2917 855 1010 -1710 1670 -1178 -1587
14149 -1587 1257 43 -1659 540 19 -1952 2720 -1616 -181 1484 -1207 729 997 -490 -118
14164 -118 1919 -790 800 1840 -1460 2578 345 -1482 1527 -643 -540 828 -100 -1320 324
14179 324 -1050 -3266 -447 -2439 -1865 -1051 -3642 -2497 -993 -3735 -1940 -207 -2892 -1608 299
14194 299 -2430 302 789 -792 2135 426 -428 2150 1204 -109 2639 1459 378 2055 -255 341
14210 341 1739 -1191 323 -161 -923 -1636 156 -2551 -1644 -761 -3099 -281 -1003 -3168 957 -1503
14226 -1503 -2304 298 -121 -2130 1013 -267 -2064 1850 -2134 -684 100 -1000 24 554 -408 -1164
14242 -1164 1783 -2869 585 825 -1864 1991 63 -649 502 755 -1017 2395 2224 -461 2546 -996
14258 -996 184 2048 -1181 120 1583 -1338 -743 383 -2010 -1156 -356 -3166 -1498 -1112 -3163 -1263
14274 -1263 -1319 -4414 -739 -677 -2547 310 -722 -1855 1537 -1344 152 2845 -45 -202 2242 -738
14290 -738 338 3161 -439 1711 3363 -825 1277 1982 -2425 588 -589 -1455 -681 -464 -1721 546
14306 546 -301 -2046 1006 -501 -2155 641 -1564 -1239 984 -795 -2456 1418 -1552 -1426 2252 -2512
14322 -2512 1221 -270 -2816 -948 194 -2122 -58 636 -2411 1933 -656 -1887 1329 -767 -169
14337 -169 1997 421 -73 2163 -101 417 1675 -749 723 2112 -394 509 711 -975 -135 738
14353 738 -3033 -217 -671 -3567 -287 -2278 -4186 -228 -2278 -3059 516 -2434 -2171 979 -2220 -1812
14369 -1812 1189 -794 -144 2120 -128 1717 2053 -361 1498 1597 -564 1558 1403 -1228 2736 287
14385 287 -2068 2511 -638 -1336 856 -65 -2087 273 -473 -1126 2928 -1579 12 1387 -222 22
14401 22 307 -723 -531 1002 -3203 -138 -161 -2852 -24 -644 -2000 -639 -1223 -2407 311 -675 -2887
14418 -2887 2576 -650 -769 2270 331 771 2303 471 804 3416 -157 1090 2658 -203 2272
14433 2272 1814 -1373 2190 -235 -1017 1507 -498 -2441 23 -2161 -2636 -889 -2274 -2937 182 -1984
14449 -1984 -1216 -696 -1487 -768 281 -2233 -731 1097 -1187 1876 1546 -2199 1678 1421 376 898
14465 898 1182 -228 2174 339 -1613 1803 -64 -230 1645 -409 652 194 -549 -312 1575 -478
14481 -478 390 1895 -1833 866 497 -814 1853 291 -1270 396 -636 -2411 1008 -434 -2217
14496 -2217 1227 -1747 -2000 319 -1593 -938 32 -1202 -1432 1136 -342 1333 2176 -24 2301 1362
14512 1362 21 1802 3479 -265 2279 2812 -26 2791 349 -745 2459 819 -842 1369 -1614
14527 -1614 -904 296 -1462 -1932 -140 -1881 -1886 -1527 -3560 -375 112 -1773 91 116 -362 -504 -429 -902
14545 -902 852 372 -1522 1439 -103 -1019 2262 562 137 2019 -137 -1303 1779 -1293 55 1466
14561 1466 -1441 1158 747 -1136 594 1042 -1044 1175 1038 -1687 2294 538 -1459 934 -391
14576 -391 -469 955 -879 -3562 353 -2073 -1479 1383 -3828 -1951 -83 -2073 -756 97 -1776 -143
14592 -143 2039 -2103 1923 449 -977 2697 963 1275 2801 1551 300 3265 1569 685 2741
14607 2741 -10 149 1882 -1348 -439 537 -1276 -441 60 -1810 -1323 -329 -4166 -864 -209 -2863 396
14624 396 -1714 -2141 230 -250 -334 1058 -43 -464 2621 -672 812 2486 -900 1040 446 -891
14640 -891 1448 873 -1553 63 770 -768 2195 1227 -1083 2196 592 -1001 933 478 -721 2091
14656 2091 636 -749 2715 -815 -890 1888 -1155 65 186 -1182 -227 405 -2293 -1150 200 -3411
14672 -3411 -464 -998 -2532 357 -918 -1345 961 -270 -1232 2102 -79 -177 3090 456 386 2890
14688 2890 536 1636 2012 716 1265 2452 -260 818 2087 -1776 681 -20 -2473 368 -368 -1978
14704 -1978 -70 -673 -2916 597 -541 -1176 1480 -1727 -9 509 -461 -329 1506 -518 -218 1599
14720 1599 -829 646 1967 -1954 604 63 130 1633 1213 -1321 1807 950 -1156 1934 544 350
14736 350 1911 503 237 1975 443 1038 2704 707 118 3195 -1226 -77 1179 -555 892 803
14752 803 -1510 433 -522 -3728 15 579 -2604 -13 -2191 -2048 621 -1523 -1306 1119 -253 -669
14768 -669 2190 -488 1813 2509 -142 3054 2297 -338 2357 2075 92 2474 1569 -1219 2397 857
14784 857 282 1601 -965 -1347 291 -1233 -1088 434 -1159 -1888 973 -435 262 1661 -2190 -202
14800 -202 645 -845 929 258 -502 312 1351 -2056 1945 164 -1901 1833 -262 -2076 756 486
14816 486 -418 2172 42 -541 2724 -729 1163 2337 -528 786 2062 971 940 3478 -496 1145
14832 1145 1463 -1334 538 -83 -1849 1109 -630 -1297 78 -1850 -2092 -342 -2222 -2810 656 -2842
14848 -2842 -1650 -260 -1572 -394 494 -2015 575 2218 53 1300 2308 -103 2711 1461 701
14863 701 2879 1618 1877 2116 1979 -997 2529 -253 107 2484 -1077 -16 957 -1125 -146 645 -1695
14880 -1695 -1309 1525 -1932 -20 562 -2178 1514 -173 -1100 1019 -125 -1981 998 393 -1846 1891
14896 1891 -1229 -527 371 -1707 -1002 172 -307 -860 1200 -831 852 2326 -1305 2167 1555 695
14912 695 2731 1512 -418 2553 2410 -707 2312 1509 -549 2815 -783 -499 1873 -1651 -1825 148
14928 148 -1714 -2173 342 -2108 -552 768 -3077 -756 88 -2069 490 -1139 -2203 832 392 -802
14944 -802 1975 1041 -1157 3255 878 99 3610 830 1939 1781 1114 -118 1862 -396 1468 2246
14960 2246 -1674 627 395 -768 1546 -615 -1297 -105 -62 -1934 1821 -145 -1214 1815 -1108 -255
14976 -255 -61 833 -1362 1636 -651 -280 1060 -2537 484 1106 -1346 721 607 -1243 191 740
14992 740 -1122 1680 869 -283 2067 1506 1016 2781 691 1130 2696 745 -278 2874 1272 110
15008 110 2144 -228 445 880 -2058 200 126 -1972 304 102 -2714 -787 -1865 -2379 577 -267 -2223
15025 -2223 311 -1101 -37 1432 306 -52 1941 309 406 3204 181 1133 2625 -810 1597 1863
15041 1863 271 881 1488 -747 873 1234 -1804 1983 -433 -749 891 260 -216 288 -585 -1279 1728
15058 1728 -1478 80 1946 -1722 260 920 -1667 -378 167 -1592 -100 -30 -2565 799 -774 -2405
15074 -2405 997 -450 -1065 1061 802 -1835 1752 896 -555 1875 327 643 3093 447 1799 2890
15090 2890 515 2068 3255 63 2110 1911 -738 511 -136 -458 -60 -1049 -2150 235 -642 -2033
15106 -2033 54 -194 -1759 1497 -1089 -1484 1013 -1451 266 1357 -1376 718 1960 734 881
15121 881 2533 -605 1602 2362 -1166 2332 420 -248 1886 1453 -513 2568 -2 -610 2576 -1580
15137 -1580 596 2103 -494 268 587 -460 -278 2374 -1253 882 1608 -929 1849 -739 -953 252
15153 252 251 -1902 -485 -231 -2139 476 -915 -1322 1303 -1990 -888 808 -868 -64 1428 347
15169 347 1757 2587 898 2078 3361 1256 1822 2716 100 2294 2534 -316 1662 668 -1135 254
15185 254 -1050 -958 920 -1282 -363 510 -2229 -2468 592 -1507 -1384 794 -2292 -1012 185 -1133
15201 -1133 956 981 -306 1142 1074 -1066 817 1761 -481 3019 900 346 1799 355 4 1180
15217 1180 816 -426 2084 -683 -185 2662 -792 1795 1609 -477 1990 1411 410 741 1703 -1444
15233 -1444 2076 964 -2512 2232 -1459 -938 -1175 -1821 -2118 171 -1153 -1807 1540 -2146 -1391 439
15249 439 -2713 -660 1759 -657 546 2406 -469 1581 2281 90 3058 1048 233 3117 1486
15264 1486 638 2398 1107 330 1722 -53 503 2310 -1108 -1005 741 -1643 143 -114 -2871 -1012
15280 -1012 586 -1590 -1047 465 -2580 1154 305 -1160 2168 554 -391 1112 988 -136 1098 351
15296 351 272 2926 -1047 -133 2476 -530 252 1331 76 864 2128 -161 1032 2436 -537 3030
15312 3030 1021 437 1784 803 -272 1112 976 -1924 2982 -505 -1311 889 -2098 -282 186 -1452
15328 -1452 -1123 -318 -1438 -1516 -125 -2553 -1168 -144 -1819 632 -544 -627 2494 634 160 2449
15344 2449 1066 694 3417 1499 1069 3762 657 552 3129 311 1168 1957 -1330 211 1119 -1487
15360 -1487 564 675 -1782 642 -409 -954 -289 -950 -1593 550 -588 -924 1596 -452 -1322 1280
15376 1280 -534 -14 1644 -383 -226 1223 -1469 -515 1648 -1994 1405 1028 -479 984 -439 -619
15392 -619 816 2212 -373 2193 1271 -1432 3269 516 508 2689 800 1097 2491 -70 -675 3101
15408 3101 -780 -279 2137 -2003 -280 541 -2202 -95 -1046 -2555 -1346 -1239 -3025 132 -1092 -1457
15424 -1457 939 -1337 180 2590 -1380 1005 2959 898 1309 2973 222 2766 2713 -623 2133
15439 2133 1817 -145 1606 1991 -786 1637 370 -758 1311 -644 -2103 2005 -1786 -973 570
15454 570 -1140 -923 702 -532 -1559 1808 -854 -66 1487 -1395 566 1124 -1224 1121 1483 -2029
15470 -2029 -359 798 -1900 628 93 -1000 1807 -142 -1262 1834 1168 -264 2289 857 695
15485 695 3225 451 2042 2413 832 1119 1917 -892 929 1603 -569 262 853 -2659 421 -916
15501 -916 -1638 -401 -1133 -2749 -946 -348 -2008 1331 -2232 -1238 1132 -451 912 1293 -1267 2088
15517 2088 1589 -82 1966 2711 -774 2488 1697 -61 2822 1545 -145 703 1021 417 1526 492
15533 492 -806 117 -1203 -509 2337 -1461 -775 408 -1150 -114 443 -1225 -663 1041 -1817 191
15549 191 -179 -1833 1818 214 -558 300 -1100 -1221 975 -636 -1586 1704 -788 -69 1620 -1184
15565 -1184 1582 1582 612 1393 2813 513 1707 3008 -79 2660 2260 -1102 3208 2059 -437 254
15581 254 457 -1025 1152 -630 -2316 1064 -1270 -1834 428 -1748 -1223 -670 -2009 -2555 812 -1163
15597 -1163 -1425 872 -1877 1004 821 -291 1280 763 -634 2199 2021 29 2741 403 -175 2512
15613 2512 -1149 603 1940 -716 493 757 -728 -445 2071 -1031 553 771 -1427 1270 1017 -1170
15629 -1170 -30 1017 -1243 1185 629 -1864 880 259 -1444 1292 -2163 -1608 864 -1254 -1016 850
15645 850 -1386 -814 520 -1654 -162 548 -1562 -6 1495 -58 1686 1413 189 2067 2810 772
15661 772 2774 1932 -176 2716 698 926 1612 265 -1259 910 -1096 -1466 448 -2304 -1100 172
15677 172 -2994 -21 -1218 -2075 -246 373 -3052 339 1095 -1561 1509 394 -203 975 588 727
15693 727 1576 738 111 3151 -29 508 2354 -1211 1631 1079 -485 986 1153 -1379 1676 1086 -1732
15710 -1732 2050 229 -1060 2199 252 -147 1924 -440 -1088 455 421 -1183 1852 -1728 -1556 621
15726 621 -1633 -309 -31 -1132 -1872 -684 -2421 -857 911 -1758 1892 -156 -1138 2559 -7 484
15742 484 2496 -156 600 3311 1355 865 2010 1053 980 2131 -345 -174 1577 -505 -8 362 -973
15759 -973 -601 987 -2711 487 -1348 -1888 -134 -2435 -1617 -1024 -553 -1548 263 -684 -1290 1844 -1212
15776 -1212 373 1823 -2329 1020 1454 -445 -584 2005 -1449 1707 1710 -2365 753 163 -1223 796
15792 796 193 -679 1007 329 -1794 1781 591 -1114 1629 -649 661 1505 -729 301 2176 -1272
15808 -1272 -422 1174 -2548 -502 300 -2075 -504 -1337 -2305 -19 -664 -3114 1171 -600 -2299 406
15824 406 -164 -1390 1193 -409 816 2703 67 1583 2245 421 1120 2426 334 1594 1727 -1112
15840 -1112 2323 450 -21 564 45 -2179 593 336 -3552 577 -2093 -1564 -293 -2086 -1288 46
15856 46 -1011 -1762 1080 -358 -619 1295 -1940 658 765 -420 454 1382 -607 873 1217 -1505 2316
15873 2316 615 -1331 2041 29 -655 567 -358 69 1831 -82 -1024 1645 -1823 1110 1847 -1193
15889 -1193 1198 1558 -1171 401 921 -1077 196 222 -2736 853 -661 -2962 -58 -1537 -1902 61
15905 61 -1586 -2046 1477 -964 -830 1798 -1287 415 1650 -12 1449 3627 1057 2282 1907 163
15921 163 2257 2835 -83 1654 1752 91 2664 -91 -971 1024 -1152 -990 782 -120 -1669 549
15937 549 -2356 -1817 -44 -2355 -386 -36 -662 -264 411 -1354 218 873 -2740 1662 -13 -1201
15953 -1201 762 -612 223 503 -113 -1688 1563 907 -1006 2479 -2287 717 245 -324 295 2761
15969 2761 -1049 496 2302 -941 2282 775 -310 2036 854 -355 705 -128 -1017 404 -878
15984 -878 -2302 445 -1204 -1014 201 -1580 -1680 -867 -1511 -1274 -74 -2050 -129 587 -1627 560
16000 560 1196 -490 2341 822 -132 1689 1014 756 2106 1062 614 3072 -650 981 1779 -649
16016 -649 87 1021 -1517 -749 498 -1219 -737 553 -2682 -405 -332 -1826 423 -1208 -2037 -71 215
16033 215 -2026 355 -400 -2733 1627 -1960 -372 1491 -564 -893 -288 -685 -575 1884 -1499 973
16049 973 518 -1698 1434 106 -614 1114 361 -302 1821 1998 39 2219 715 -362 3146 -793
16065 -793 617 389 -317 8 611 -1352 -870 238 -3143 -1142 144 -3229 -1417 -405 -2091 -574
16081 -574 -418 -2353 134 258 -1604 749 217 -1134 2526 661 210 2391 399 -94 892 -173
16097 -173 1320 2312 -419 326 1980 -1929 586 -225 -1531 114 198 -1486 267 919 -1976 1486
16113 1486 -1407 -2271 170 -1003 -1744 690 -659 -1859 1178 -1504 -594 1818 -1908 -447 -145 -2688
16129 -2688 337 1034 -1205 -1007 1793 -2314 843 978 -1801 1775 -417 -201 1824 557 574 1881
16145 1881 408 -832 3092 177 537 2679 -197 1334 1417 -1194 -170 -17 -1653 -627 28 -3382
16161 -3382 450 -1714 -2593 -1006 -1886 -2594 8 -1349 -913 1101 -788 -949 660 -218 -1108 1602
16177 1602 -1433 1146 1920 -869 1711 44 -477 1377 1630 -952 1958 1090 -1318 830 -1037 -1232
$$ [...]
32767a55
##END NTUPLES=NMR FID
##END=
