##TITLE=31P Tetra-salt(MeOH)
15.07.2013
##JCAMPDX= 6.0         $$ Bruker NMR JCAMP-DX V2.0
##DATA TYPE= NMR SPECTRUM
##DATA CLASS= NTUPLES
##ORIGIN= UXNMR, Bruker Analytische Messtechnik GmbH
##OWNER= root
$$ XWIN-NMR		Version 3.5
$$ Thu Jul 18 09:29:40 2013 Russian Daylight Time (UT+4h)  zvl@DPX200
##.OBSERVE FREQUENCY= 81.013821
##.OBSERVE NUCLEUS= ^31P
##.ACQUISITION MODE= SIMULTANEOUS
##.ACQUISITION SCHEME= undefined
##.AVERAGES= 32
##.DIGITISER RES= 17
##SPECTROMETER/DATA SYSTEM= spect
##.PULSE SEQUENCE= zgpg30
##.SOLVENT NAME= Acetone
##.SHIFT REFERENCE= (INTERNAL, Acetone, 0, 206.059)
##AUDIT TRAIL= $$ (NUMBER, WHEN, WHO, WHERE, WHAT)
$$ ##TITLE= Audit trail, XWIN-NMR		Version 3.5
$$ ##JCAMPDX= 5.01
$$ ##ORIGIN= Bruker BioSpin GmbH
$$ ##OWNER= zvl
$$ D:/spectra/data/zvl/nmr/P31dec/2/pdata/1/auditp.txt
$$ ##AUDIT TRAIL=  $$ (NUMBER, WHEN, WHO, WHERE, WHAT)
(   1,<2013-07-18 09:27:52.70 +400>,<zvl>,<DPX200>,
      <continue with go, POWCHK disabled, PULCHK disabled
       configuration hash MD5:
       11 64 04 C6 CF 8A CA 3B 7E DD FE 01 35 7D 01 E9
       data hash MD5: 64K
       44 AD 5F D8 CC A7 6E A8 80 26 6C CA E4 13 61 67>)
(   2,<2013-07-18 09:27:58.70 +400>,<zvl>,<DPX200>,
      <Start of raw data processing
       efp BC_mod = 2 LB = 1 FT_mod = 6 PKNL = 1 PHC0 = 2219.276 PHC1 = 119.4013 SI = 32K 
       data hash MD5: 32K
       98 55 60 21 20 DB FA 0A 24 1B F2 80 E2 A2 14 D3>)
(   3,<2013-07-18 09:28:17.57 +400>,<zvl>,<DPX200>,
      <pk PHC0 = 18.75849 PHC1 = -51.20001 
       data hash MD5: 32K
       BE B2 14 DD 5D 45 9C 84 D4 93 F6 D5 CD 8E 31 10>)
$$ ##END=
$$ 
$$ hash MD5
$$ 1E 62 CE D6 03 02 7A 32 BB D0 2A 11 4B 20 73 AB
##$RELAX= 
##$RELAX= 
##$RELAX= 
##$RELAX= 
##$RELAX= 
##$RELAX= 
##$RELAX= 
##$RELAX= 
$$ Bruker specific parameters
$$ --------------------------
##$DU= <D:/spectra>
##$EXPNO= 2
##$NAME= <P31dec>
##$PROCNO= 1
##$TYPE= <nmr>
##$USER= <zvl>
##$AMP= (0..31)
100 100 100 100 100 100 100 100 100 100 100 100 100 100 100 100 100 100 
100 100 100 100 100 100 100 100 100 100 100 100 100 100 
##$AQSEQ= 0
##$AQ_mod= 1
##$AUNM= <au_zg>
##$AUTOPOS= <>
##$BF1= 81.014009
##$BF2= 200.13
##$BF3= 200.13
##$BF4= 200.13
##$BF5= 200.13
##$BF6= 200.13
##$BF7= 200.13
##$BF8= 200.13
##$BYTORDA= 1
##$CFDGTYP= 0
##$CFRGTYP= 5
##$CHEMSTR= <none>
##$CNST= (0..31)
1 1 145 1 1 1 1 1 1 1 1 1 1 1 1 1 1 1 1 1 1 1 1 1 1 1 1 1 1 1 1 1 
##$CPDPRG= <waltz16>
##$CPDPRG1= <>
##$CPDPRG2= <waltz16>
##$CPDPRG3= <>
##$CPDPRG4= <mlev>
##$CPDPRG5= <mlev>
##$CPDPRG6= <mlev>
##$CPDPRG7= <mlev>
##$CPDPRG8= <mlev>
##$CPDPRGB= <>
##$CPDPRGT= <>
##$D= (0..31)
0 1 0 0 0 0 0 0 0 0 0 0.03 2e-05 3e-06 0 0 0 0 0 0 0 0 0 0 0 0 0 0 0 0 
0 0 
##$DATE= 1374124573
##$DBL= (0..7)
120 120 120 11 120 120 24 19 
##$DBP= (0..7)
150 150 150 150 150 150 150 150 
##$DBP07= 0
##$DBPNAM0= <>
##$DBPNAM1= <>
##$DBPNAM2= <>
##$DBPNAM3= <>
##$DBPNAM4= <>
##$DBPNAM5= <>
##$DBPNAM6= <>
##$DBPNAM7= <>
##$DBPOAL= (0..7)
0.5 0.5 0.5 0.5 0.5 0.5 0.5 0.5 
##$DBPOFFS= (0..7)
$$ [...]
##$SUBNAM3= <"">
##$SUBNAM4= <"">
##$SUBNAM5= <"">
##$SUBNAM6= <"">
##$SUBNAM7= <"">
##$SUBNAM8= <"">
##$SUBNAM9= <"">
##$SW= 400.765351723535
##$SWIBOX= (0..15)
0 1 3 0 0 0 0 0 0 0 0 0 0 0 0 0 
##$SW_h= 32467.5324675325
##$TD= 65536
##$TD0= 1
##$TE= 0
##$TE2= 300
##$TE3= 300
##$TEG= 300
##$TL= (0..7)
0 120 53 12 22 120 120 120 
##$TP= (0..7)
150 150 150 150 150 150 150 150 
##$TP07= 0
##$TPNAME0= <>
##$TPNAME1= <>
##$TPNAME2= <>
##$TPNAME3= <>
##$TPNAME4= <>
##$TPNAME5= <>
##$TPNAME6= <>
##$TPNAME7= <>
##$TPOAL= (0..7)
0.5 0.5 0.5 0.5 0.5 0.5 0.5 0.5 
##$TPOFFS= (0..7)
0 0 0 0 0 0 0 0 
##$TUNHIN= 0
##$TUNHOUT= 0
##$TUNXOUT= 0
##$USERA1= <user>
##$USERA2= <user>
##$USERA3= <user>
##$USERA4= <user>
##$USERA5= <user>
##$V9= 5
##$VALIST= <valist>
##$VCLIST= <CCCCCCCCCCCCCCC>
##$VD= 0
##$VDLIST= <DDDDDDDDDDDDDDD>
##$VPLIST= <PPPPPPPPPPPPPPP>
##$VTLIST= <TTTTTTTTTTTTTTT>
##$WBST= 1024
##$WBSW= 4
##$XGAIN= (0..3)
0 0 0 0 
##$XL= 0
##$YL= 0
##$YMAX_a= 11740
##$YMIN_a= -15597
##$ZGOPTNS= <>
##$ZL1= 120
##$ZL2= 120
##$ZL3= 120
##$ZL4= 120
##$ABSF1= 0
##$ABSF2= 0
##$ABSG= 0
##$ABSL= 0
##$ALPHA= 0
##$AQORDER= 0
##$ASSFAC= 0
##$ASSFACI= 0
##$ASSFACX= 0
##$ASSWID= 0
##$AUNMP= <proc_1d>
##$AZFE= 0.1
##$AZFW= 0.5
##$BCFW= 0
##$BC_mod= 2
##$BYTORDP= 0
##$COROFFS= 0
##$CY= 12.7816944122314
##$DATMOD= 1
##$DC= 0
##$DFILT= <>
##$DTYPP= 0
##$F1P= 140.218990882182
##$F2P= -77.483057783598
##$FCOR= 1
##$FTSIZE= 32768
##$FT_mod= 6
##$GAMMA= 0
##$GB= 0
##$INTBC= 1
##$INTSCL= 0
##$ISEN= 30
##$LB= 1
##$LEV0= 0
##$LPBIN= 0
##$MAXI= 13.09214
##$MC2= 0
##$MEAN= 0
##$ME_mod= 0
##$MI= 0.630608
##$NCOEF= 0
##$NC_proc= -5
##$NLEV= 6
##$NOISF1= 0
##$NOISF2= 0
##$NSP= 0
##$NTH_PI= 0
##$NZP= 0
##$OFFSET= 206.0588
##$PC= 1.4
##$PHC0= 2238.034
##$PHC1= 68.20129
##$PH_mod= 1
##$PKNL= yes
##$PPARMOD= 0
##$PSCAL= 0
##$PSIGN= 0
##$REVERSE= no
##$SF= 81.0133612526294
##$SI= 32768
##$SIGF1= 0
##$SIGF2= 0
##$SINO= 80
##$SIOLD= 32768
##$SREGLST= <31P.CDCl3>
##$SSB= 0
##$STSI= 32768
##$STSR= 0
##$SW_p= 32467.5324675325
##$SYMM= 0
##$S_DEV= 0
##$TDeff= 65536
##$TDoff= 0
##$TI= <>
##$TILT= no
##$TM1= 0
##$TM2= 0
##$TOPLEV= 0
##$USERP1= <user>
##$USERP2= <user>
##$USERP3= <user>
##$USERP4= <user>
##$USERP5= <user>
##$WDW= 1
##$XDIM= 32768
##$YMAX_p= 381907723
##$YMIN_p= -16464900
$$ End of Bruker specific parameters
$$ ---------------------------------
##NTUPLES= NMR SPECTRUM
##VAR_NAME=  FREQUENCY,     SPECTRUM/REAL,   SPECTRUM/IMAG
##SYMBOL=    X,             R,               I
##VAR_TYPE=  INDEPENDENT,   DEPENDENT,       DEPENDENT
##VAR_FORM=  AFFN,          ASDF,            ASDF
##VAR_DIM=   32768,         32768,           32768
##UNITS=     HZ,            ARBITRARY UNITS, ARBITRARY UNITS
##FACTOR=    0.990860697272637, 1,           1
##FIRST=     16693.5166009986, 0,            0
##LAST=      -15774.0158665339, 0,           0
##MIN=       -15774.0158665339, -16464900,   0
##MAX=       16693.5166009986, 381907723,    0
$$ Real data points
##PAGE= N=1
##DATA TABLE= (X++(R..R)), XYDATA
32767 -538166 123197 -420015 -460590 -202142 37103 72905 -344352 -415436 -864669 -139359
32757 -139359 -205882 -145643 611386 917837 840477 25840 -104237 234480 14198 27438
32747 27438 413361 558118 -94039 -630241 -84049 -508718 53915 67791 -31190 -616988
32737 -616988 48186 274589 244624 451457 289203 41048 45056 -229252 58393 -76882
32727 -76882 748102 391669 463665 660809 343171 41423 -87423 748680 311817 -891626
32717 -891626 -457261 -20142 66652 -695733 -423124 175330 76524 -192793 -395265 564360
32707 564360 -47762 -358045 -534946 86179 -683897 -258746 153632 134980 -96542 -298625
32697 -298625 384935 784014 984858 1479478 757405 211322 86376 7128 -419923 443511
32687 443511 -449046 483193 133272 -355403 -150181 559656 220276 428249 -781229
32678 -781229 -699923 160969 -60175 -623343 -353025 -935101 -265080 160808 285493 -341111
32668 -341111 -82746 5643 -68536 6821 -245164 -312770 165514 -74636 -382254 81203
32658 81203 267732 680700 49531 -417450 -705764 -277944 375057 783812 56616 -21454
32648 -21454 -200453 770287 3110 78672 -459117 -218341 -187159 -567253 -868568 -415106
32638 -415106 219044 443626 436033 437197 38439 -217967 229695 154924 -706270 -863796
32628 -863796 -657437 -745743 -458141 -912452 -329643 -340775 -226682 -434070 -479688 -644576
32618 -644576 -546550 -623412 -234625 -448119 -25003 -536935 255939 738918 377323 -523753
32608 -523753 -746186 -787823 -306675 -208704 -153929 -246893 -671509 -320716 421307 450328
32598 450328 22813 263542 196247 412425 211959 472575 546911 762903 -151536 -711930
32588 -711930 -756818 186948 886701 -292368 -1073938 -355270 -805112 -833970 -269793 -320249
32578 -320249 -691450 -748688 311231 723467 623442 222556 182961 829107 1080371 385761
32568 385761 516586 414904 -19839 501470 196190 -33883 -415471 -719417 316999
32559 316999 616793 410620 309689 -99327 128222 481508 -441121 -399704 -525144 -1046632
32549 -1046632 -839405 -610332 -459045 228848 508059 292842 -474537 65094 -654505
32540 -654505 42304 -11176 -409928 306521 15455 414832 196189 194922 -820590 -988044
32530 -988044 -946248 -845724 -849628 -279142 -233498 -1097277 -983751 -319696 -431226 -296571
32520 -296571 232135 -307897 -100188 -327696 -266290 -333680 -211769 -545924 -297843 -56981
32510 -56981 -84323 -471347 -130105 45374 184968 -26992 126937 530896 114508 -128899
32500 -128899 -331142 -429712 -996626 -480732 -453348 -704077 -369283 -989449 -835657 -915787
32490 -915787 -865248 -1043014 152837 615950 -679399 -275720 -181062 -782795 295527
32481 295527 -409059 37927 211772 459940 -187385 -680377 -439103 -44167 -779396 177101
32471 177101 -284752 -502031 154268 -263767 -523937 -312777 -586591 -493937 -305160 -563707
32461 -563707 -616625 -739048 -1265039 -318581 20614 -91997 -227986 -153131 -179167 -184599
32451 -184599 1210752 66464 -476237 -237382 141706 357475 407710 269530 283905 880747
32441 880747 -22116 -1043172 -1876487 -1268998 -890062 -636130 -1268220 -1393439 -418799
32432 -418799 100836 -203131 -87941 -390257 -428950 -362266 249522 -39286 799420 243966
32422 243966 372722 127939 -640693 -328204 -434762 289727 876422 516623 601474 196325
32412 196325 -24095 320026 -272606 12409 -203164 -565024 -316722 -457422 -297243 601134
32402 601134 408335 464293 321305 204664 -56804 351735 -291396 44295 1021328 56849
32392 56849 -1179829 71371 326437 -104689 142874 -113777 749471 975402 -263500
32383 -263500 -415692 526360 486155 364821 -815466 -1157661 -198418 -1100990 -1417181 -1033353
32373 -1033353 -500421 604290 368560 597977 467998 91064 -464764 -87272 356884
32364 356884 -560852 -964954 386333 628086 261813 109360 139793 240621 -338326 -235062
32354 -235062 -160913 556730 413929 75786 527431 215833 -473970 -526795 -60145 105329
32344 105329 909364 1086723 1028167 473583 1016046 379676 599807 -428306 -77826 -108841
32334 -108841 -52375 -280045 -892847 -221264 349927 454965 679349 -2660 -392380 -238878
32324 -238878 -126740 -209121 381170 846785 313013 830671 -243409 -2804 1100835
32315 1100835 589020 -308898 -474331 -134389 225920 278303 429647 208580 223649 -52734
32305 -52734 -470811 -1278555 110397 427973 448305 -368688 -902140 -452694 -720101 -729779
32295 -729779 35458 636397 950334 1159444 257403 1310746 -147698 -835814 -188676
32286 -188676 -351506 -294751 114085 -614312 -209677 161942 -956353 -460975 31730 191340
32276 191340 -232215 164873 133579 615852 -470387 -1224875 -653661 301995 350714 -720091
32266 -720091 175603 426759 -339152 -939791 -1288351 -682251 401175 194160 -329215
32257 -329215 538935 158688 -442763 -353809 158348 1039808 1083510 639672 354003 1121099
32247 1121099 653115 448570 387639 -1335603 321934 134904 -691021 483599 -45532
32238 -45532 503332 458174 124761 906924 1319906 772900 676304 612791 306693 -62917
32228 -62917 74687 55323 -90118 323710 537429 375070 1023472 675402 -251391 -780029
32218 -780029 122673 554739 700528 330318 -389046 -208078 174823 -16242 12524 -495819
32208 -495819 -369029 935273 385527 379178 666334 616026 -453145 -70789 -581381 -424409
32198 -424409 -389730 -387206 -693756 -157023 -161548 -580475 -154578 276084 -23493 11496 193924
32187 193924 1240114 243826 379105 -49300 162224 -781473 -711449 196826 -178861 -256983
32177 -256983 -731190 -827368 -631163 7210 -557064 -1058766 11340 -119037 845129 529566
32167 529566 -56364 -292350 -5901 67674 -69143 -370623 -1053508 -114696 66210 -257544
32157 -257544 -795116 -572743 -174725 -436614 -244873 954708 841369 -780835 13182
32148 13182 -346700 -564885 -297697 -751797 -1095930 -345311 -72800 21495 -905608 -1275868
32138 -1275868 -711769 111016 69631 -423199 -254751 550106 563865 430522 672410 -23766
32128 -23766 251236 1183981 645834 267577 555399 449293 129349 448534 -234812 -1176462
32118 -1176462 141849 479745 -534352 -732984 -320024 -534309 202245 742886 -812110
32109 -812110 237784 -558498 -458123 -611608 -477140 -105872 -535937 181417 133483 -81466
32099 -81466 10146 718771 37449 -1242000 -778544 -182984 485999 -114691 -192430 908944
32089 908944 177457 -56657 -1217842 -837942 -904528 -1169210 -921839 -912271 -298205 -434169
32079 -434169 -219515 -749041 -948944 -626341 150433 -324038 -565695 -308338 126812 905740
32069 905740 -179742 -1121768 -933102 538013 174687 -466304 -726100 -349473 -181860
32060 -181860 53853 -123799 31941 -16601 -252269 267186 321051 418955 -669159 166039
32050 166039 516941 82236 -397215 277637 643685 195620 91843 -769545 -751356 -361363
32040 -361363 16708 235825 283884 733901 986129 514036 -126218 296420 474001 117532
32030 117532 -266087 17417 252020 395298 -28710 179514 -545055 -794223 -327871 -829629
32020 -829629 -458043 -12752 838309 219221 266309 -78781 -593522 -632888 -56361 -343743
32010 -343743 -825114 -68110 145087 -255641 -4059 -1164386 340401 1055923 723174
32001 723174 324617 -238592 197199 469775 565052 669094 14423 266137 520723 476197
31991 476197 1159291 873323 -658228 291788 72329 123382 516727 207958 1069867 703379
31981 703379 683800 487383 -287927 -275575 42294 372911 5948 385938 961636 -726163
31971 -726163 -45876 134506 945777 1160971 17288 454303 -344118 -709153 -646967 -974772
31961 -974772 -250320 -413336 -701943 47598 97400 -400670 5296 -115150 113067 -232760
31951 -232760 -1586122 -1364645 -554028 28060 -1445489 97504 244213 -307213 -100604
31942 -100604 267985 -142348 221145 277460 932507 1674288 1345185 1191240 989465 688874
31932 688874 509362 543952 -337386 621592 27387 1164710 251429 241785 391167 -383307
31922 -383307 -236170 574240 275498 -755804 -8714 21273 -781672 -353854 -613455 -724728
31912 -724728 77544 644269 1318621 943894 1362956 -120095 -508069 156399 428606
31903 428606 217296 192388 121945 121142 50268 535099 1104661 473999 -90775 -801825 -1126400
31892 -1126400 -1123981 -691459 -607560 -1273013 -164248 -563595 -1003050 12432 457533 -463110
31882 -463110 275394 257337 262729 359920 156918 -669245 -567466 175823 1011315 995945
31872 995945 174616 89626 257626 -193442 -349709 140928 -528183 -883634 -656336 352279
31862 352279 574422 473479 200862 -266801 5306 40535 368063 -157761 -751073 -578163
31852 -578163 -631868 -74382 723370 95776 -1041912 -735541 -443211 -641743 397927
31843 397927 247325 -14215 397370 418573 369269 1126449 549280 -220706 -156214 283563
31833 283563 1124060 -25337 -405205 -1575442 -604511 -911828 -130649 347 -548409
31824 -548409 -1089820 -411664 194051 -23095 -867868 731621 582695 128735 265837
31815 265837 -411916 -1203701 -367670 -589232 42907 987350 -670740 -1375808 -370587
31806 -370587 -369079 -192655 -730230 -772667 -705452 -708602 -1263077 -822684 142531 -584355 -1026815
31795 -1026815 -646855 356722 182845 -353514 -1016753 -556527 -49396 598613 1266990
31786 1266990 1156205 1187710 151549 -668821 -193944 -307825 486248 7081 -585078
31777 -585078 -919950 -506476 269809 421624 -256365 -554111 -1087283 -904669 63942 -718370
31767 -718370 -1144627 -386825 -853095 -671064 477275 61651 -1121515 -243588 263033
31758 263033 -520646 -745704 -70490 246871 359275 112218 926631 -42551 -415217 -1005816
31748 -1005816 -941978 -467008 -410783 -430542 -414899 -824046 -497381 -832477 -133818 -792264
31738 -792264 -601764 -228480 -1332340 -1318870 -663612 -60125 -288384 -277974 387068 723821
31728 723821 -379278 29950 -989185 -831833 -481870 -174229 223930 208749 735473
31719 735473 39729 -589629 248458 -352384 -37556 550459 -97070 28823 -20345 287444
31709 287444 331599 -514046 -609727 -700160 -634247 -1344910 -43659 -548895 266829 11386
31699 11386 -311842 -841751 -262306 -118859 423900 167973 241711 387057 -545204 -1194255
31689 -1194255 261095 498984 -373996 -613801 -82164 931285 1000276 349645 -249993
31680 -249993 396370 261050 -700331 -83414 477001 -553772 -8240 -183501 -704577
31671 -704577 -1253790 -1181715 -481207 -557640 -1239048 -717835 -114859 -613499 85787 326490
31661 326490 -246928 -708957 -128508 -66557 -849617 -481655 -1396355 -405282 -114774 96678
31651 96678 779994 1204058 232675 -308186 -139660 -684603 -239186 -304576 420593 798537
31641 798537 -205158 -161940 -709512 -909836 113765 178806 645437 1196716 -319989
31632 -319989 -1261999 -340765 -200131 486562 268445 735520 102927 -12240 294954 524148
31622 524148 395130 -418467 -1364409 -777620 993275 106459 -656155 -82090 -32594 555113
31612 555113 311713 181749 -659967 -549328 18200 553627 -624409 -1314021 -742931
31603 -742931 -883524 -739736 -900007 -540683 -1054561 -905551 229751 905878 516625
31594 516625 671882 -256081 -644374 -246049 -4018 -119670 -399617 515799 876114 224960
31584 224960 112485 518322 38210 356031 200405 -877191 -94358 -567065 -1017310
31575 -1017310 -952922 -746192 202412 331279 -49982 -39294 -1068100 -165754 283973 659965
31565 659965 1332963 633687 76450 535492 313844 -119714 -703200 -1018936 -474052 -124273
31555 -124273 130264 -314323 -247185 -207031 -798660 503185 230991 -505982 -1217472 -270879
31545 -270879 434129 37458 498637 -176121 -1046646 -548361 -155885 -1036290 -885902 -277390
31535 -277390 -617878 -677445 -906139 -1125006 -1560398 -790825 -798811 -652700 -791913 -553535
31525 -553535 -649676 118497 71383 -262198 692305 179553 377609 585818 153861 -14254
31515 -14254 -15485 1080163 332834 739612 -171484 556925 -64392 -9302 433100 596386
31505 596386 230797 409795 -348838 1121506 407934 -225622 641885 1082659 -170155
31496 -170155 20927 -425776 -551888 4600 -459475 -987031 -249684 -714348 -708428 -390652
31486 -390652 450164 228789 87638 319598 573501 242662 -355992 -537815 -200928 -1026921
31476 -1026921 -39758 -547436 -572500 -984306 53160 404227 -168838 -106503 339535 -73110
31466 -73110 -104834 -60501 461467 461093 -152001 71819 -404235 -593958 -625697 20233 11004
31455 11004 -302608 -715461 -792431 -96602 283566 -476735 -30278 279553 -231931 -411526
31445 -411526 20691 778153 1248129 135635 461141 581600 1082200 986536 -326239
31436 -326239 712735 843513 -220472 -25788 554129 471022 -800351 -938568 -926621
31427 -926621 -984062 -1118701 -198356 528097 -1316279 -610465 -214802 -358726 -155988 -297386
31417 -297386 55022 259642 295272 85835 415830 -374417 -382175 608896 -343269 400657
31407 400657 -93164 -156771 -518028 -334466 41061 -124509 -701395 -364385 -101898 -84392
31397 -84392 -223172 98671 -177163 322483 -626533 -18780 408375 373447 767234 477762
31387 477762 1306491 1264265 576237 242907 -136256 -47316 -278464 344933 -143296 -180259
31377 -180259 810092 160327 -288016 -175729 -324056 856523 1018387 306807 505596
31368 505596 -196785 -1146978 -1057784 -398806 -551475 -878972 -724453 -304179 168421 188394
31358 188394 -278700 -342726 852388 917631 329393 478402 -168718 -319129 484531 -132301
31348 -132301 79940 317803 98515 203901 500047 -522414 -439273 191783 -8968 -907921
31338 -907921 -1269984 -324290 418362 -292940 -730452 -215939 289400 30098 -227945 -97076
31328 -97076 266101 -294555 -880597 -817668 530825 1036645 796043 219829 121272 -407086
31318 -407086 112763 -290107 171351 619358 -430239 -580845 708999 -677797 -224750
31309 -224750 -747981 -1008484 -255729 -65465 445915 -354419 -730265 -154811 -309611 517629
31299 517629 -499893 -815193 -1044834 -1017074 -110147 223597 -355363 -1173002 -221643 -193232
31289 -193232 -713086 -478021 -355026 -456570 -1030730 102986 606989 755972 72655
31280 72655 -223045 446323 112838 -691985 -377018 112680 -984048 -1133448 -1769512 -1851199
31270 -1851199 -1636063 -478374 148421 317353 -956920 -1561789 -310945 316601 -371355
31261 -371355 865267 36347 202427 -273258 -1225671 -800439 -434291 708967 97949
31252 97949 -95939 -69391 1315948 733405 419176 -1206042 -2403440 -474936 -149326
31243 -149326 -68490 -338837 -500050 -203809 361642 83023 -496286 -35935 128454 -913157
31233 -913157 -842234 -15281 -206146 -588424 -419474 -20157 122787 -844623 -728930 -1635824
31223 -1635824 -680575 1182727 881361 -353214 -752837 230212 560837 -203121 154223
31214 154223 -655485 -740414 227294 -194016 -411462 544906 -126292 -134629 128289 -912296
31204 -912296 -124280 -65576 746388 403871 -21691 -144703 316976 -50313 236167 -312039
31194 -312039 -348564 -1255526 -141809 -1230518 -568792 -699023 174895 515431 212894
31185 212894 126062 431635 488544 -105612 -691831 -741126 23171 48687 -768172 858074
31175 858074 128789 -240424 150847 -525781 -955819 -1153739 -297356 381125 -809856
31166 -809856 -1095039 -441874 -101042 -567537 207742 -280464 -316507 -180198 -538465 444555
31156 444555 456847 151927 -164335 358049 511413 -68266 -653591 -1202187 -469089 -475219
31146 -475219 -929263 -1055749 -547629 49441 -740453 -1044122 90161 242818 -477764
31137 -477764 -818337 -782003 -1420461 -1030736 -62774 497118 347126 -959608 -1569589 -1251496
31127 -1251496 -526344 -497846 161292 -905761 -72817 1050418 413182 505410 1041725
31118 1041725 230065 -128726 -687563 -1143409 -1684527 -586587 151622 303932 -314513
31109 -314513 1158255 799722 608148 228132 361433 91264 -358668 -459322 -735100
31100 -735100 -1061 -156229 -29056 -296118 -311627 228267 -237883 63116 647916 812748
31090 812748 -461630 -220985 1399034 182256 248501 -579341 407796 1144325 -36598
31081 -36598 -297374 -68843 -402949 371453 -722473 -29598 55949 241800 678154 724650
31071 724650 -219531 -1141321 -902577 440351 822740 1246222 212937 -113737 71486
31062 71486 -342342 -543195 -1295481 -1911740 -1007419 -885805 -785240 -674784 -564501 280248
31052 280248 448978 116807 -297952 -2204550 -329229 181910 389981 307713 -1412869
31043 -1412869 -1357627 -730403 189316 807081 103407 110501 -288393 -484454 -154383 58832
31033 58832 -328845 56793 370473 748411 -355163 73031 372474 -886546 -444363
31024 -444363 351604 277381 -482521 -71218 62004 527306 143172 593663 -27709 327056
31014 327056 126232 227049 622583 337427 -605127 -677677 239799 175853 -94012 538124
31004 538124 88244 -758921 44685 694461 -489005 -323415 2180 -91536 -284591 -658362
30994 -658362 -1214249 -369697 -275300 510384 525197 -164541 -395959 -1295576 193595 -1069207
30984 -1069207 -814358 -499787 -63396 235229 348678 800043 544132 1099339 953259
30975 953259 -200990 -55963 -289663 -135942 -888855 -195448 255174 -409714 54050
30966 54050 -394427 -66867 -171881 -649728 -1525269 -702480 178767 -320353 -245077 854226
30956 854226 497274 -210112 -339853 -950513 -211852 -246453 -124095 -335354 -275352 -1075687
30946 -1075687 -938090 -466318 -848460 -487469 -1117506 -1334045 -173336 606826 -115520
30937 -115520 1016374 458507 786801 188629 -389553 51474 -756638 -951979 -906943 -463127
30927 -463127 -886880 -1173478 -652862 -923800 -1151940 -1218834 -797425 -1122044 -1247377 -1285550
30917 -1285550 -863954 -15181 -630936 -231546 -8378 72853 499659 33508 -154630 165239
30907 165239 -611019 -344688 -191451 -588793 -1034694 -828897 244258 -230494 51132
30898 51132 -518533 130690 -192413 323504 -1323527 -665492 473588 877172 692746
30889 692746 508964 -60919 323667 334840 358883 -33966 431296 -180827 -554123 -1207617
30879 -1207617 -1561220 -829463 -397965 648403 402777 8862 -586198 -322554 -894474
30870 -894474 -880762 -67204 602510 292251 -336052 -666916 -489205 144565 -46714 -219635
30860 -219635 -64395 -417341 436564 -14986 236638 114405 15382 709656 306661 -671480
30850 -671480 -305230 -412952 435567 50334 -73962 -459123 -845014 -804525 -945211 433763
30840 433763 520408 -1123279 -815086 -629490 588991 588044 1129206 1301044 140476 -727625
30830 -727625 -366410 -91120 -432394 -56604 -1227510 -606692 -566976 114677 392464 787114
30820 787114 1232561 719379 687346 532397 -587102 -315180 -679992 -591130 609786 224837
30810 224837 -170809 246210 416785 -206711 -161597 -191589 353127 680828 -121360 -174139
30800 -174139 188053 -188770 931887 435832 296141 108192 373715 382048 1119054 659842
30790 659842 585757 -392580 -863351 -257542 -253018 -29317 194640 609216 188730 -879594
30780 -879594 -331201 -306914 130774 -48280 -89459 33638 -31242 126324 541506 102441
30770 102441 357115 -209433 12768 -650312 -707162 -321818 193481 340036 -534236 -10663
30760 -10663 931938 108300 -384229 -570151 207550 -64377 -253030 -701528 -1604072 -779811
30750 -779811 -114958 429999 326838 144133 758085 441635 -483243 -536858 -1061180 201032
30740 201032 -735024 -860548 -1151784 -603247 -348387 168924 -43465 -119194 -238548 -988724
30730 -988724 -1021672 24993 -134436 -533792 -560366 -1695985 -204769 308027 480372
30721 480372 1555990 608231 847364 257821 -551052 28193 -379309 -843107 434887
30712 434887 565648 -1116797 -638434 -804201 -938705 -469954 -455015 -78671 102128 -534284
30702 -534284 -144174 1332353 -26406 155040 -609518 -858926 222766 567469 573333
30693 573333 -39777 -380856 -512992 -415996 -718123 -197203 48188 -1026946 -761877 -1018729
30683 -1018729 -835451 222236 422455 -236442 -451405 432000 -38296 -467420 -512519
30674 -512519 740496 962814 972108 1159514 238351 443473 -517845 -248179 507437 -905910
30664 -905910 -670912 -923532 -376379 -450577 129031 -4510 523208 724995 -44709 -274023
30654 -274023 -1044174 -493661 -477971 -48634 -188563 -514150 -409691 -278210 656344 527318
30644 527318 398037 1283920 906937 385590 412177 494865 -35388 66146 698349 529371
30634 529371 944384 671941 251017 330758 -200235 -616502 -664031 196989 62303 -784839
30624 -784839 221182 272240 -306049 140259 -913713 -12906 -373477 -191657 -858940
30615 -858940 -111947 697481 -22308 -94172 34077 -1617753 -395418 -1151319 -1270227
30606 -1270227 -699836 -207981 -18517 -450760 312634 1637 717110 -14777 -279991
30597 -279991 -577623 416984 782065 507222 -792952 -454856 425892 -110331 -230921
30588 -230921 -79678 -282431 -1579387 -895778 -211171 -139774 381664 102235 -674679 -247609
30578 -247609 -595897 -302556 118250 -41068 203942 60407 762080 1362575 658321 -139811
30568 -139811 -823357 -1614127 -829058 -436612 -814787 179281 -17578 -1213380 -941475
30559 -941475 -693884 -653218 -1752820 -1258720 -316106 768275 377349 155449 337939
30550 337939 -141608 367617 27207 157708 -559332 238801 -791099 484941 650795
30541 650795 -410487 -785443 -845122 326711 -547638 -341817 111057 -894117 -536824
30532 -536824 490350 1233492 783291 1573153 1570303 626234 -482436 -236661 691835 63315
30522 63315 -579379 -465876 -98044 241451 504909 657879 262570 348463 1453376 359747
30512 359747 773327 -366672 -407941 -141774 -48408 504383 528938 377108 -54665 -848411
30502 -848411 -278423 -400100 -818231 578101 676688 495905 642972 -32684 186066 -655930
30492 -655930 -899051 -306532 808868 685187 25508 -83324 152723 -183039 -427616
30483 -427616 -814527 -81181 143898 -878180 -1229258 -225794 250354 163871 -264937
30474 -264937 765931 731717 57726 640145 -461940 520804 32995 940324 867088 -333700
30464 -333700 -473431 -530536 434 996062 262942 996813 468766 655678 520918 557336
30454 557336 -299320 288965 -45618 178128 442785 243657 -400066 152242 -527804 -475909
30444 -475909 -882548 -944246 -716179 -335231 -1034584 -579394 303116 814655 257657 -194182
30434 -194182 -894658 -208052 -615939 -291368 -202144 -139919 -192333 -153155 -101341 74560
30424 74560 -848646 -579650 -753039 -804024 -1241249 113198 554265 8924 159075 59031
30414 59031 88389 323835 404340 33464 -548041 -1169173 -1144701 -903066 -1155725 -509943
30404 -509943 -767391 66801 -216337 334105 -244241 -612702 -76677 -135428 -462184 218776
30394 218776 837319 959416 -263241 -340329 -337931 -683079 535928 85724 553616 246310
30384 246310 1192913 511008 30568 -636020 -226879 525206 101594 417923 690630 -34007
30374 -34007 573307 203456 182798 538824 388139 201749 221794 -42862 12453 -249825
30364 -249825 -294748 89732 236171 -118295 -608524 -356821 -1071912 -1457531 -857449 -872603
30354 -872603 -1135967 -856068 -157599 -319790 -780303 538954 1173194 705270 312500
30345 312500 495833 1373180 651055 -332789 -578108 -588823 -675183 -910948 -948896 265286
30335 265286 -881367 -259836 -485436 246284 570680 506752 559573 1010192 961987 133623
30325 133623 277068 113183 -587588 109125 593102 -289037 124834 -322790 -1676113
30316 -1676113 -602062 328417 808009 855944 -282045 59504 -132093 107201 386457
30307 386457 371520 389846 572593 391590 -110423 -900143 -2394583 -1582832 -100811 673985
30297 673985 173187 398946 25064 249009 591503 -450494 78356 749868 675923 640686
30287 640686 114794 -359164 278846 -376881 421237 517694 -661821 -992926 -135185 -571753
30277 -571753 -666154 -254213 -155415 -292760 295740 145151 -394127 17231 -629994 -37754
30267 -37754 108960 -109870 156093 66759 273461 752837 20299 -176291 -247340 -738272
30257 -738272 444027 181947 -265116 -804399 -199779 -189529 -234591 -39473 385896 -288577
30247 -288577 -143409 1148475 232041 -153024 -170124 -475205 393814 -850142 -1414860
30238 -1414860 -858580 -357294 280670 -379786 270303 -260677 -236249 116692 1368363
30229 1368363 313423 -249473 -118362 73461 -956259 -1215325 -369328 454615 707382
30220 707382 1075036 710945 701419 210646 17651 -507534 -356945 -364233 -207006 188669
30210 188669 158991 190580 318219 256717 627575 -636317 -78607 320212 -290122 -212925
30200 -212925 -252279 -109782 -44742 657711 568921 36502 453898 245892 856837 1265021
30190 1265021 275664 -944620 -14819 49516 618134 -507634 -25579 -198655 -436831
30181 -436831 -662515 -202339 653004 -76403 -637980 44981 882261 379584 -851122
30172 -851122 -154039 541068 -310650 -424252 496631 132441 -879223 -1368789 -59644
30163 -59644 -245047 -640239 459195 -108364 575843 781114 718623 663002 468472 620291
30153 620291 759423 809697 55296 -510375 -589433 -128278 -128027 346137 -329793 -319101 14802
30142 14802 -536064 -204101 128798 301136 796779 516389 -1041856 -1231314 -37579
30133 -37579 260075 -11483 -459125 -335988 -279079 -825062 -140547 -1359286 -3105 -553886
30123 -553886 -1298672 -963903 -648584 -461966 -61135 -313263 -51925 -389122 274740 806495
30113 806495 -630719 -1197081 -693198 -1242978 -328134 135804 1320986 545106 132141
30104 132141 -321727 -87306 -496163 1410 198669 194909 -152282 36246 -15574 -552946
30094 -552946 -448840 -710136 -1116386 -351784 -214752 744804 794067 -349194 93219 -432132
30084 -432132 -155658 -848959 -228302 -123247 478782 104112 -913441 -881377 106249 956334
30074 956334 231420 174893 -375809 -534491 -700829 98920 287101 21875 291666 917335
30064 917335 -667139 165160 538748 -971317 -1061079 -276174 341494 21609 -656290
30055 -656290 3493 -152015 -310922 -134418 92114 315642 -200881 212609 -49141 -129241
30045 -129241 -13313 364771 -270875 -219859 7719 771690 738366 70543 193718 -129535
30035 -129535 -570771 -781366 -347809 244383 334120 596833 158099 33189 -174376 -719695
30025 -719695 398985 765908 778960 330503 322547 -154902 303374 -208777 -326785 -1072742
30015 -1072742 -541148 -870864 -680603 -641813 -1260985 -499798 -567376 -567400 -353893 315300
30005 315300 -111079 374655 -85573 254048 143689 -384418 418564 782597 590738 746650
29995 746650 215006 -212794 -429163 552177 581302 409242 118125 623974 -398453 -664791
29985 -664791 -22061 -63204 -728495 -128765 -340934 48780 57416 -339645 616769 513170
29975 513170 -680072 156118 234957 410019 474782 -48705 576140 -470349 -462137 -203607
29965 -203607 -714664 -13270 517378 479210 -267642 -165552 -407003 345700 990885 556133
29955 556133 -650551 -326050 462016 135037 -337779 -792408 88404 237826 -436621
29946 -436621 341261 253867 -926543 116218 528069 -272556 -141355 -294852 265217
29937 265217 -505135 408611 433585 262188 107405 -661633 -426283 -754972 -569380 392932
29927 392932 -554084 -503757 -180945 21731 -650949 -127782 180515 -267132 -292083 190821
29917 190821 -96330 -783372 749518 108070 308786 393855 -568532 17953 370604 156538
29907 156538 293195 -882921 -1153050 -684369 -73430 -653087 -1343589 -216636 -645829
29898 -645829 -255243 459662 520621 -57948 -471013 -1012716 -1049522 -674345 -972447 -948021
29888 -948021 -528708 -943512 -546407 -861930 -841668 -1384617 -411736 587432 444800 119392
29878 119392 -563775 -619981 -845939 -753080 -37857 -78961 391685 376402 -510946 -939687
29868 -939687 -377558 -97453 -910944 254479 273356 280180 -617980 355934 342827 173437
29858 173437 -649301 -312773 36229 -906730 -278231 89135 -1058040 -570239 -627309 -585235
29848 -585235 -685235 455196 -32677 -418875 -1191426 -1308066 -623475 1004601 326915
29839 326915 -389482 -1317198 -713386 -735176 -313739 -1258708 -1040735 -132121 -1800464 -260185
29829 -260185 -1540938 -571112 572314 28832 476531 366260 -324575 -329035 -27880 -468935
29819 -468935 -368830 45800 -139253 -111312 212060 -244399 -616092 -454674 79669 -702990
29809 -702990 -547085 -1969156 -895478 100447 -388942 -368772 -479047 152578 190229 -101150
29799 -101150 -255479 -37065 15392 790926 591337 -41632 -506918 -700375 -588690 -644287
29789 -644287 -400667 115708 37468 -158952 521402 347417 -349525 -224459 572988 75012
29779 75012 237404 -334750 -341811 247702 -866076 269215 -688567 -1375341 690376 638898
29769 638898 102081 590317 531228 338035 -57827 -449389 673 63685 -556420 -169343
29759 -169343 -323797 -176170 -39532 -688829 -929698 -1202950 -1062790 -468919 448109 -649228
29749 -649228 -533196 386051 -373153 8092 467289 -464762 415056 628445 -519246
29740 -519246 -597793 -785410 -477004 -475655 512974 -449063 -628294 187716 -383038 -543800
29730 -543800 -327936 -431394 -513572 -518927 -1069147 -812160 -196384 612372 -217374 -418138
29720 -418138 471549 793564 451343 1220124 440500 835799 1145543 784259 152340 -427531
29710 -427531 -1132617 -863843 -962651 -974489 -1293802 210189 -396289 -953782 479723 294906
29700 294906 474031 324693 1173159 768920 19643 -467520 -716242 -387838 -715054 -552138
29690 -552138 -660574 -907395 -77486 -148498 309385 278543 -61759 -216428 -288193 -1301905
29680 -1301905 -606405 -140919 -1531113 -108216 61764 -775652 98265 -595787 -795679
29671 -795679 289026 866590 438272 -227575 -360630 -103256 106318 273459 -267724
29662 -267724 -541881 -196253 86325 293225 -137517 -343450 -933130 -27333 394485 -281785
29652 -281785 -456751 -1767319 -598504 -1089217 -876490 -1689830 -874531 782986 602851
29643 602851 -374564 -27780 -138758 -34755 -203273 -1436365 -624035 -559204 -1274684 -1162633
29633 -1162633 -501089 188027 -141456 74642 -879356 -771801 -401294 -367966 -34511 -181424
29623 -181424 -14033 167472 740534 -61301 -1447513 937256 933661 162879 -600918 58585
29613 58585 -679804 310639 1035893 289478 175839 -1052475 -600761 -266345 574868 485156
29603 485156 54439 -167459 -526032 183270 250715 815330 390545 148527 -508010 73388
29593 73388 548834 1411203 776592 65597 417885 304618 383336 -291375 -402844 -339108
29583 -339108 -226958 -210013 81370 344443 1546 252503 695758 668959 21636 184313
29573 184313 -191686 -276132 -173390 149492 -699628 -299565 -794213 -1726034 -925104 910543
29563 910543 962871 561962 -192445 -517962 -1358259 -1599260 -839722 -322856 -618723 12778
29553 12778 296605 -126758 -505817 -443645 -650571 -368746 464045 -631723 -710406 248631
29543 248631 316649 139488 210482 143755 -290320 76227 759238 -194449 441885 121072
29533 121072 -416098 -820315 86293 343305 251814 212131 124630 974606 63766 358803
29523 358803 458520 174298 1192158 1362644 136052 837766 820796 1047975 708958 619065
29513 619065 -789658 128573 449110 340137 188584 -434888 -88266 -50946 96949 -290341
29503 -290341 -179728 323421 -472157 -254689 1031261 605424 -17482 109427 36334 -508813
29493 -508813 -192159 -388819 -220942 -126210 -464744 -901887 -689749 -851436 -394605 474129
29483 474129 930524 231739 -346524 137590 -637953 1330151 375038 -50759 -143972 -101122
29473 -101122 -812641 -401683 -453317 -286915 -214773 -27760 -679860 -968930 -236277 -645919
29463 -645919 -748555 -443619 -157036 315013 83102 -39835 609527 849991 489873 -264047
29453 -264047 -248774 -500184 -411538 353753 896443 1557534 289276 -1181373 -784038 -537578
29443 -537578 574436 -464928 -1077160 -928737 -853098 -614892 186438 -385927 -66495
29434 -66495 -325732 -541702 544258 588737 -465403 -988051 -160068 -40523 -645330 181798
29424 181798 164383 -1070372 -788025 -996936 447868 378614 -250061 -446803 -390682 -554320
29414 -554320 -166159 -438958 -421899 289002 169652 105416 -362656 160621 -271687 262095
29404 262095 222669 111401 -190066 -234670 647934 1450470 639293 -947176 -1458313 -848017
29394 -848017 -781564 -622031 -502242 -835193 -698886 -1562187 -644363 -651656 -805074 229873
29384 229873 -24875 -308674 -1427956 138522 -397041 338954 -167768 -115015 -104468 -1243399
29374 -1243399 135770 -323182 273510 944406 28290 687120 505821 559487 1141495
29365 1141495 697255 696992 -781408 -638757 571734 217165 24591 192541 457455 -258933
29355 -258933 172703 -92837 452995 216278 -290259 -602682 -169162 -333546 334656 294965
29345 294965 -3573 -214670 -343241 -853830 -1511042 -702409 -754379 -1466197 -932124 -619086
29335 -619086 328228 586070 -159936 31009 -283541 -1273030 -1668546 -1128367 -719076 480987
29325 480987 1425850 499884 -778158 -946695 -977819 -859051 -159330 -616818 -435267 153321
29315 153321 1275 -1401339 -730072 -411441 -662512 -1432670 -433992 -4660 -428873
29306 -428873 -425772 -278536 -817843 -103188 433738 1083706 -246451 -65070 370638 590303
29296 590303 -391231 -374807 -584772 -374486 -400364 -502985 -638068 29279 -110990 345524
29286 345524 -183554 -739098 -297083 -1279434 -1405090 -1969020 -1034156 -998170 -150437 -597833
29276 -597833 -252252 -558607 -409788 -116263 426463 -61005 -325727 -917727 -427564 -988523
29266 -988523 -215688 355869 173514 -116481 -247539 109060 772667 538189 211274 -687438
29256 -687438 -1003631 -422814 15681 -526882 -518634 -8822 -712648 -555460 -1070407 -893113
29246 -893113 -333602 204887 -412195 -199212 -289202 540716 677052 -216941 -93045 -80939
29236 -80939 72495 -149028 430449 825547 250842 66575 -40209 -433185 -355618 98726
29226 98726 144278 108922 -634451 -925151 -1037102 -344428 -86769 134872 523122 476491
29216 476491 105172 -367624 248981 133311 -176052 -265322 -36446 638412 313965 -385361
29206 -385361 -716070 -17255 -206666 100412 277046 970351 -124449 561510 844325
29197 844325 720715 11949 -285866 477347 733414 -319149 -782891 -151602 10154
29188 10154 9959 -542743 -740192 -666925 -149395 73957 647160 -94071 -599100 -402058
29178 -402058 -670778 -404370 -286301 -847372 89081 182513 385928 886042 -15007 -231755
29168 -231755 69355 449968 -44787 -698316 -619209 220670 -852692 -850672 -720585 -1634231
29158 -1634231 -246906 405279 -118396 -1571046 -1069500 -969598 -16262 91720 338283
29149 338283 -186981 25848 -352038 697806 165756 578537 179354 189335 178841 -685779
29139 -685779 -1282132 -1055232 -432809 -783360 108295 658771 512914 319470 380087 312887
29129 312887 278725 196269 143748 -170394 -236540 -163952 -301245 -29671 377303 276848
29119 276848 176108 -118064 481932 -177062 -106957 128339 500155 -70494 -628710 -75694
29109 -75694 363492 -178114 -582903 -528143 393238 -531684 -699396 -720609 -315908 428220
29099 428220 -379841 -60902 114709 -484557 -1408494 -1528752 -989458 -391447 -290348 160394
29089 160394 -136871 -567477 -97106 716197 -281037 -569454 -1045521 790986 -33675
29080 -33675 -190018 -828956 -810256 -958771 -809911 -146149 -511122 236496 491049 1311267
29070 1311267 476870 62853 116086 -1074546 -1015031 -712367 471596 -177004 -362734
29061 -362734 -375853 -600470 -561023 -571030 -534439 -596319 -520910 239209 117348 -293260 -540179
29050 -540179 -112230 281117 -1022946 -422650 -468393 -86146 -834078 -761103 370911 -26337
29040 -26337 -74369 192399 593225 344378 -20339 -998163 -860565 -939547 -519046 -430298
29030 -430298 -440146 -43471 46460 -1010562 -697760 -562140 -1158128 -492856 -974981 -1285612
29020 -1285612 -929511 -517540 -933074 -1594058 -388037 -572562 384917 742518 296110
29011 296110 -108686 -427954 -148912 5017 98593 624958 492164 324713 -388186 695878
29001 695878 -138315 161818 116088 -408998 -688041 311263 933753 1056708 -33624 236634
28991 236634 -327148 280176 677025 68933 -80695 -158815 185327 -492134 176477 -394806
28981 -394806 -16450 295660 508043 143007 -624137 -61906 -17657 -854594 -418097 -333023
28971 -333023 32481 -41293 -202195 -376049 122358 556856 -270102 -178069 -470275 -8745
28961 -8745 -200974 -430797 -335588 -715819 -624176 -1070385 53783 1571331 422103 473718
28951 473718 929279 414727 -563429 -838788 -208773 1039663 292590 49250 -399191
28942 -399191 -850912 -700525 -430522 -245229 -206474 -706022 139773 27809 -445188 429511
28932 429511 819674 233429 5605 -50477 280126 649073 65116 105297 -156550 313727
28922 313727 -103388 -789287 -231900 481940 674094 333166 -86710 14223 -432080 -658535
28912 -658535 -801757 -521917 552255 -423987 27460 921925 750971 -64654 -636525
28903 -636525 -682784 -525096 -646983 530687 317085 -490944 -231355 125555 -470533 -323539
28893 -323539 -481224 68070 -45334 806848 575594 317192 228408 571362 878997 -87584
28883 -87584 -278940 -397903 -466610 1182216 813282 221390 -741802 -344965 -606723 -337528
28873 -337528 -869262 -282094 -838237 -125794 -348592 -834929 -640124 -255497 -338104 233721
28863 233721 -169929 -1613998 -1590142 -292452 -235634 248949 708494 378711 -722984
28854 -722984 -52846 -602966 -131547 271625 -68199 -280893 207304 79721 226143 412801
28844 412801 -1109544 -416526 -110747 -537776 -214120 -678079 -850071 -848044 -380222 81482
28834 81482 -18847 -388873 -1401 -140316 -861430 -957241 -836524 -195348 969279 31478
28824 31478 -517072 -276266 246156 -200323 36160 -247282 -982803 99102 -59415 -187909
28814 -187909 25507 -451879 -70710 -344999 -458606 -612536 41656 772173 -53275 13342
28804 13342 410940 -1280055 -620962 412531 181270 182958 182254 -744172 -257508 1081838
28794 1081838 1119647 514609 -451810 259570 569175 -806855 90538 -666990 156803
28785 156803 20328 -378992 146189 -74297 -333723 -289173 713754 120355 -1434085
28776 -1434085 -933762 -489094 -233410 -600402 -47109 -274433 -1364140 -1573829 -1676065
28767 -1676065 34450 22093 -261426 -184172 -980465 -502221 -501443 -478103 -1323964 -1543333
28757 -1543333 -1406014 -1189154 -607818 -582989 96843 135130 -456459 -161918 -257055 -33088
28747 -33088 -139301 -562193 -514800 -885679 -197672 -1077656 -791859 -184240 697390 1432522
28737 1432522 767706 204794 -889229 -150099 -813663 -244872 487186 669360 72199
28728 72199 -138395 379039 378675 293000 -137277 -882535 -289519 -337545 -349169 -1202692 83413
28717 83413 902740 639363 -438966 -981019 -711892 -790399 -232370 -304938 377072 558106
28707 558106 -13799 -140128 156048 35384 263652 876602 525183 381366 168786 -474471
28697 -474471 -1807 482423 -29664 -902351 148499 356784 -519641 -628645 -568755 -534593
28687 -534593 -99206 -548041 -961204 664126 205121 718394 416974 307675 -448846
28678 -448846 -1154323 -276107 -386629 -657600 303192 100599 196594 -242980 294550 124288
28668 124288 166954 446509 -694478 -735307 -1096424 -350923 -1399962 -101171 -694028
28659 -694028 -256040 -403585 -803937 -757532 -236785 -130482 423067 125355 649950 582229
28649 582229 344098 113409 351377 363066 512384 388895 219842 35936 481461 599319
28639 599319 382148 319446 409068 115980 5175 -229382 592634 -150488 -686399 -688383
28629 -688383 -464724 -267250 498339 394119 325214 -1222344 -589704 -364552 125793 313329
28619 313329 284680 268715 268283 -100772 -581024 -1398553 -1299875 -1162990 -742172 -136045 -486635
28608 -486635 416868 633747 761189 -5045 -1304264 -570370 -536579 -179319 -622639 -204429
28598 -204429 -533635 -986289 -857901 -736140 -27355 -2233 266334 -507261 140280 529267
28588 529267 691478 198213 -676468 -728904 -674812 -447803 519054 -275342 -635453 -86201
28578 -86201 -437284 -1479135 -1050205 -756108 -1036459 743559 798673 113045 -128879 409573
28568 409573 402498 610316 407355 -404097 -558607 -156243 -729039 -575451 -615687 -620340
28558 -620340 -332333 -299485 -303859 -490515 583845 452081 -482101 -475474 -250838 -303634
28548 -303634 78377 -591360 610432 476988 367632 -667621 -887691 -288219 -359601
28539 -359601 -1699075 -1569714 -392095 -159170 -693813 621416 -708922 -854185 -453583
28530 -453583 97896 162645 347321 -422253 -894545 -315566 170825 -52851 -640057 555173
28520 555173 888616 264221 302015 145781 418192 370960 -234121 -709933 -134556 -471769
28510 -471769 -1064131 -1214719 -369584 -209942 22980 -330996 -1556354 -364628 379309
28501 379309 -235616 -939295 -624938 -692380 -120386 579410 207418 -563944 -414241 -130354
28491 -130354 -538083 28885 645755 -277140 -1108443 135825 223995 -205591 -679668 -1210528
28481 -1210528 -740676 -360587 498676 -454302 -320075 89490 -710663 -366474 -637608
28472 -637608 344757 -74889 -404061 -362438 238540 789749 -98942 662091 804017 148142
28462 148142 -322377 -1195577 -1080328 699954 870032 158948 -835140 -1293697 -893943
28453 -893943 -1302797 -1201821 132959 1445910 939343 431072 -133122 359073 407095
28444 407095 765550 -162030 -147935 -1058187 -695348 45295 -190296 -1069595 -1016012 -249853
28434 -249853 -528412 -1275303 -594009 406021 -8849 -332991 -415762 757785 590978
28425 590978 653392 12651 92357 -541870 -241588 -348237 -594147 -1002427 -252993 55629
28415 55629 -657351 -355910 -487669 -34259 201175 -505748 -299189 349998 717871 -319162
28405 -319162 -50402 687159 1222941 565102 -17680 155752 962923 202656 -586765 -84105
28395 -84105 641250 893919 899317 -142932 -519563 -590558 -32141 -377590 30111 856584
28385 856584 1118452 375788 383403 -92189 58530 829679 528155 742267 531395 -254314
28375 -254314 -561296 150133 -170072 481583 -108227 -788502 320282 559482 376994
28366 376994 -167680 -110271 -830097 -759406 532699 44117 187257 89738 -119971 160288
28356 160288 -99159 -720186 -296385 -234339 274378 -25585 391695 -258709 -534333 -877095
28346 -877095 -805117 -1414312 -1222923 -1631179 -447673 -796831 -1181386 -256606 -624287 -419174
28336 -419174 121706 -309022 -399874 -984279 -991813 -167198 -145009 -827054 -566823 -1045399
28326 -1045399 -1471019 292427 169198 289351 -299550 123903 -14298 524905 1160506
28317 1160506 1258709 1338630 -345822 -759650 59713 -184397 -598359 -415862 -731871 -363076
28307 -363076 147490 438978 711439 -354149 123525 569649 -454355 213518 -980254
28298 -980254 -423855 -310397 -765076 -389446 939458 -37665 -1172863 -695591 -575193
28289 -575193 6281 94241 -734394 -1233367 312010 316881 224648 449913 -815802 2532
28279 2532 -573495 -1099203 -1673931 -2229976 -1171206 179135 981867 625268 -25661 -690330
28269 -690330 342240 768092 -473565 -366948 -598355 -546774 342999 372686 549963 -356533
28259 -356533 -229781 -73209 -1097202 -954009 -48244 594689 546725 311889 396973 -147776
28249 -147776 -130825 -494743 211182 -1151781 -1876085 -1016626 -541661 354351 -866469
28240 -866469 -1182290 -1105276 -45479 891060 158413 -50049 1124575 -78693 432104
28231 432104 766430 -602326 -823040 115366 -94787 -395801 -63539 14921 -805648 72657
28221 72657 17041 -140545 70302 518691 -86085 1265203 625922 468369 -459435 -531804
28211 -531804 282311 -291054 -546499 -1447244 -308023 -314713 426995 264614 -756490 40139
28201 40139 362114 197469 638245 1144588 411315 1042949 401904 607291 229976 -519367
28191 -519367 192651 -18784 31961 1576924 243857 513710 707091 265237 -49260
28182 -49260 18523 -396988 -400587 75379 143792 49449 29991 -433494 -191899 -366571 -1327553
28171 -1327553 -323598 -76002 472918 695183 781208 477374 579963 -58475 -617727
28162 -617727 180783 45411 -347951 -29727 598850 706985 -138319 -1446051 -629881
28153 -629881 -579258 -787192 -1016976 -740392 -212411 216778 536003 340365 -881753 -501024
28143 -501024 -20301 -446329 -72599 -362374 95542 -166978 -87616 591738 -251841 270852
28133 270852 544902 572391 165431 -536242 -586676 112022 255034 249171 5081 -185559
28123 -185559 368549 1215139 648632 1212827 -218044 -675201 -827431 604054 1247630
28114 1247630 -9019 -1273393 -595515 21664 89377 -11653 -138822 -170612 391382
28105 391382 314802 619914 -431885 338416 445915 626514 225633 11322 22612 297947
28095 297947 690882 -382250 -244683 800877 -419685 340415 -137526 -65772 -612858
28086 -612858 -315598 -530136 -418533 -129868 -299920 -367695 -168485 -514077 -863725 -319886
28076 -319886 -109589 -607010 -345879 379690 -69435 -425722 267568 -201309 -214741 645526
28066 645526 1717940 1102623 850719 287870 -557264 -101401 -343512 -623897 37463
28057 37463 -139645 -72759 437118 -16781 237926 -160449 78819 -323475 -448630 -1306275
28047 -1306275 -1135962 -115614 930591 -505903 -179764 362694 -105598 58510 32955
28038 32955 170428 -113462 490507 195858 -738652 -37752 210909 71360 536214 611511
28028 611511 -614959 -249556 88789 658832 631469 290298 204994 305772 945119 937535
28018 937535 1485746 -446377 -96008 418201 -338154 -1065523 -978548 -1436926 -16326
28009 -16326 -531 817348 102166 -404053 213084 -459640 323484 177182 -368469 394836
27999 394836 414028 338912 26343 851917 118552 -29314 -403823 1005849 628064 117250
27989 117250 -211564 -708656 -795784 -391165 -283869 -820087 -1145932 -722822 26629 466975
27979 466975 843864 972553 -296909 -334789 288270 232420 564480 1052374 719749 317123
27969 317123 -429414 358427 -18242 -227180 -108710 -612652 -65195 627564 -142753 -257684
27959 -257684 -1825397 -1272906 -12480 -429790 -833946 -970666 -785068 -547082 -916423
27950 -916423 -428914 -785011 -828106 364742 517026 -687439 -624592 -635932 -284957 -157791
27940 -157791 680348 958506 243909 -668545 354484 -80821 -168108 663861 559195 -190206
27930 -190206 596534 -63115 308298 782225 115668 -545289 -532852 -511202 -205568 61322
27920 61322 1068304 657422 428356 18604 -413341 -414685 -173595 79306 10689 -115949
27910 -115949 643685 118178 256310 252002 484681 333918 358246 -130938 -210711 -50635
27900 -50635 -690506 -417252 -640874 -563875 -938029 -643616 -867509 -94208 -420656 -22480
27890 -22480 -987384 -467739 -420527 -222757 569211 -271761 16514 -124784 485552 429232
27880 429232 -539947 -612941 -521467 207230 -1285034 -1381613 -57295 -557436 -621874 242013
27870 242013 380753 106450 -569365 763939 797659 446889 -396049 -482358 -398813 -478340
27860 -478340 336833 2015498 4756056 6592771 1602185 1173351 103003 140078 -576577
27851 -576577 -344818 -1072864 -103779 237682 -277140 455069 45400 -327694 886387
27842 886387 218672 268570 1201661 1054256 901699 835701 983973 -286840 -877301 -1094184
27832 -1094184 -943698 -176035 -1049997 -479904 -392343 -49860 -9996 -709135 354064 -649090
27822 -649090 -25034 -500004 -828180 399729 814903 418639 449499 -161701 -820655 691755
27812 691755 886839 860955 -277854 125076 196053 454558 -202504 -699435 -534697 -1293129
27802 -1293129 -781266 305334 222375 -40804 -85432 238567 773045 97855 407975 -718149
27792 -718149 -757525 -1164965 -924044 -796162 324761 834382 1092495 1352637 54330
27783 54330 -581607 143524 -857450 -1550435 -1058324 -421447 -359906 1031159 485485 -797085
27773 -797085 -55322 -568802 47059 545556 -269170 637164 1201536 707271 1406881 434993
27763 434993 99562 431447 -218674 175312 901323 1149077 515913 10477 -71901 -141966
27753 -141966 277597 -92011 329073 -342778 325443 768355 1037031 638948 83951 229998
27743 229998 146998 -592904 -198857 -279066 -896363 396370 363972 40159 444964 1545849
27733 1545849 2025829 2818499 2709763 3788549 4593947 5908105 7814777 12247718 16953326
27724 16953326 24887775 28795964 41995416 74841184 135678379 274891948 350247923
27717 350247923 94866258 42092574 24113983 15086895 13285793 8255737 4493559
27710 4493559 3787047 3623584 2726620 2673755 2108624 1579819 633360 690680 -455987 -108154
27700 -108154 782886 1288970 773722 -269805 428099 349817 -173261 -281373 -538922 11356
27690 11356 -1059230 -895203 -32961 -453310 -39266 169964 1294501 -107645 -796898
27681 -796898 -878079 12209 283115 1418785 -22922 175832 702671 263699 1017283
27672 1017283 -426449 -569321 -296868 -1050380 -330742 401471 -356787 -561645 -205645
27663 -205645 -833001 -312607 602334 852109 -642091 139176 415002 229868 21317
27654 21317 698185 -12799 -296495 -119607 464572 1365822 915815 883099 444376 -574706
27644 -574706 -388227 772731 527638 236270 283691 -144468 -73888 -366185 70595 38613
27634 38613 -472963 106029 260579 7428 -430486 -707898 -778090 -27496 -414228 -1110965
27624 -1110965 -434297 230562 128833 363375 728066 -412813 -915036 -363260 -230314
27615 -230314 127035 -309373 283384 448360 -226742 -621024 -27860 682320 79383 83526
27605 83526 138837 373545 35486 -195461 -245983 -737860 -1347382 -963207 -501600 -178628
27595 -178628 109330 -119415 71975 176187 101841 -457087 -266433 496045 118551 -325024
27585 -325024 -760046 -434998 -494204 -596635 -220367 265081 587007 -31503 -252637 -1164260
27575 -1164260 -606773 130969 491271 265039 1069702 291311 73929 -255960 -266747 -367488
27565 -367488 -820501 -753432 -423840 -700105 205479 -679032 -168959 -230541 -142950 429338
27555 429338 156416 -357735 -424999 -563549 610684 -400552 -1390928 -1034841 -748290
27546 -748290 -282935 -246628 -412524 -833913 671723 878246 -1075409 -647264 -107577
27537 -107577 147736 403275 326877 -353284 -4917 491656 881352 959248 1078667 701341
27527 701341 658167 -498425 -696455 -135924 -883647 66683 245009 260033 104459 153239
27517 153239 -339859 507479 -675092 -1310167 -894947 243064 -156255 -134061 -466756
27508 -466756 -508738 -700684 -121136 5996 -729528 -473023 101684 354062 -53788 1608492
27498 1608492 1565553 -115700 29282 -400908 -221040 79004 -645279 -400282 -548012
27489 -548012 -387157 155792 548445 412018 -295727 -160997 -1351851 -1279996 -581366 354719
27479 354719 -341272 -292103 -722073 -413230 517768 697250 646661 721953 590727 118275
27469 118275 258009 552976 991066 -309356 -469069 -295036 -374338 -474379 -902985 -1323105
27459 -1323105 -1044440 -253265 -565582 -417043 912940 1759861 1285198 203464 670185
27450 670185 256265 290722 197815 18130 1029472 529383 -93956 -316113 -11297 -318036
27440 -318036 -295958 45856 345115 78414 -171942 715634 928929 233012 453115 188256
27430 188256 -355965 611005 75750 -238303 836571 933799 480934 96736 -378712 66691
27420 66691 -195018 -81693 -918312 -1653979 138725 -137692 -1077317 -531394 -492773 -831880
27410 -831880 -259624 1141579 1351858 27676 33550 580508 403165 728352 176732 52554
27400 52554 -103812 -1146490 -878127 -379176 -23864 1059982 529229 908757 -686002
27391 -686002 213354 -381797 -422928 -999557 -110383 194968 782235 194144 -130100 426732
27381 426732 -1075669 -1177084 -328321 81598 492602 903207 1152597 365649 160424
27372 160424 -1045440 -1115368 -909431 -810791 -195608 461740 300997 636504 328517 64467
27362 64467 -376553 85273 -150354 -988714 253774 834066 -132482 -210064 -706099 -34741
27352 -34741 551474 722353 194707 -825160 -325880 -683704 -562069 -937163 -450190 259887
27342 259887 736158 984818 293184 -275227 -509964 143934 1202757 512535 213321
27333 213321 442232 192395 614796 1209525 693154 -124821 -552838 -1157217 -369517 -500306
27323 -500306 -381499 -233551 20403 -351009 143442 292392 -642372 -456669 71689 -242830
27313 -242830 -375125 440153 -499491 74787 -798316 508554 989607 391294 120328
27304 120328 219431 583415 174972 -424077 -226450 -32148 191361 -133688 -734130 226732
27294 226732 1066483 159552 -4560 168132 111859 -232628 287673 1153052 -408337 -415554
27284 -415554 -704341 -224026 -80519 -298820 -354369 105682 234848 550919 -503 350036
27274 350036 980284 589114 -319849 -1593481 -935228 10193 -859293 -234425 -509262
27265 -509262 -588503 -544319 -714500 -940342 -62032 731870 -21099 -322027 -157267 -450032
27255 -450032 -537883 -561414 -847850 -271092 -342853 -624031 -32773 144885 326967 -476448
27245 -476448 441392 917593 1099501 -114331 1004145 621177 889778 637239 44407
27236 44407 -460050 -101455 227257 653273 -553232 724285 950625 -117540 -111919 -452375
27226 -452375 -79370 -235721 -714928 -1129055 -830126 -1351447 -120706 600004 532600 -349417
27216 -349417 -355325 -1138425 -247594 678499 1186034 827710 -190270 -339298 -547794 -1006151
27206 -1006151 -581846 -60856 -266538 448618 -59653 -384383 -1307806 -864356 -571562
27197 -571562 -1389318 -1409315 -1157704 -525847 -196251 136832 -55807 521676 107225 -240015
27187 -240015 -486463 323443 763337 1052313 -1115085 -707627 -567463 -777405 -1072109
27178 -1072109 -537872 -44992 -40947 73056 -424955 -707185 -186084 -55506 74446 669303
27168 669303 610487 -416804 177244 -320442 692467 404140 -656699 -1098252 -487228
27159 -487228 -816886 388864 -663100 30986 721068 -818469 -601871 -450635 284780
27150 284780 63947 118226 -340547 -1066858 -893310 494662 -132507 798741 752211 -763120
27140 -763120 -756007 -148174 466819 405192 118914 344974 -466441 -66620 -156059 156292
27130 156292 -238395 -547101 -730801 486275 -56765 -409681 -232908 -990702 -864916
27121 -864916 -622375 -840136 -631338 -78562 -193396 -366010 -20749 800621 610028 74654
27111 74654 -78044 71480 183035 243131 -679382 -728273 -287702 -828394 -34399 -318643
27101 -318643 -514721 -426729 -1011318 -801629 -224568 229197 -392936 -193078 -171738 73420
27091 73420 -236717 1052613 161127 683674 1175017 401617 403693 -44040 -25260 -135999
27081 -135999 -429864 193484 -1362298 -715619 -386584 -1132766 -1320034 -476111 110883
27072 110883 -647772 690676 485104 -17858 -39199 18350 740294 -112816 -954856 -1142626
27062 -1142626 -618746 -402609 367949 810182 -376540 437292 74258 159603 -1266968
27053 -1266968 -568227 -309229 141908 408837 363352 -1035293 -1371381 -1411707 -684746 23534
27043 23534 231316 244369 258081 -23139 -559703 -1315027 -658641 -576766 -144292 -302800
27033 -302800 201006 -46028 -932290 -771024 -473744 -281414 -34409 146983 -8162 13152
27023 13152 -561958 -869191 -1241277 16481 903556 283038 -772044 -1086369 -415834
27014 -415834 -630643 120377 117060 -79294 29508 -379693 -239542 -11401 -325420 195304
27004 195304 1080585 215550 645062 326706 -308450 -737015 -840841 -543189 441451 332041
26994 332041 -535004 76223 215097 399227 90444 -918245 -441833 -588772 -850073
26985 -850073 104488 114367 510900 -346781 -239791 -185394 76353 622930 1147874 1385321
26975 1385321 619626 44582 -121249 90629 -180860 41645 222286 142571 632840 629455
26965 629455 545030 813298 -55299 -929088 -252178 323848 -207086 165642 -111948 8183
26955 8183 -516236 -388544 -877252 -1154279 -424060 -402971 -20729 403627 447656 12949
26945 12949 308844 263132 153421 521004 559082 975803 491767 313441 270996 -37350
26935 -37350 11405 397037 413972 182834 -473000 851127 397016 423970 629512 866359
26925 866359 676744 384172 694957 74875 -570170 -141185 -174006 -640 -605859 -791743
26915 -791743 -689256 -728512 58774 -397845 -644350 384733 -441363 -868745 -694684 104346
26905 104346 -248320 -122810 182453 -441923 -704659 -932422 62987 -48976 638127 987953
26895 987953 161867 422122 976391 610402 529196 436639 358895 928537 1095922 -248088
26885 -248088 572979 376092 189956 422013 530022 826794 175151 -74022 -478054 -463101
26875 -463101 322478 -546890 -568277 481402 572315 212708 74972 688624 568624 -1256903
26865 -1256903 -283304 -1065836 -1373446 -219244 -364536 -315648 -334390 -470933 268656 518657
26855 518657 542780 256269 -126708 -219629 415148 245977 -233008 -556031 182357 767800
26845 767800 187953 511799 72288 -620410 -1127173 -486544 -255960 -205243 -543097 -996951
26835 -996951 -385486 -537470 -632926 7464 41114 418532 -306546 300904 355414 -147751
26825 -147751 435399 -923559 -123527 44215 -944703 -277673 -1262325 -445364 -1213773
26816 -1213773 -1931600 -603932 -241283 30728 -245652 568905 626220 478886 668595
26807 668595 322974 78824 -228586 -290568 303069 136646 291456 282569 453024 -835549
26797 -835549 -86335 696371 302999 790428 100309 782616 707468 -160850 -80834 558283
26787 558283 277829 -65678 -541882 15332 766338 386087 -216464 -309385 -402643 -252063
26777 -252063 -870106 39233 -382029 -1023806 -1088653 -745929 -1165278 -1363907 -624565 579409
26767 579409 -237161 -926292 -785470 -532367 -150216 -259520 -453232 -888157 -563254 -466786
26757 -466786 129926 -688926 -415211 -664203 -1883989 -1093627 -298720 -324929 -729113 -1538176
26747 -1538176 -340235 192383 1142551 567068 214588 -782020 -1365220 -617104 -215015
26738 -215015 -921781 -1180014 -39531 -373176 638247 -799619 -1132748 -1032566 -405543
26729 -405543 -501706 -23175 -40989 -828987 -586872 -141448 28418 91076 600197 288046
26719 288046 589095 -270926 144938 450272 -353928 534192 -314125 870107 334149
26710 334149 -872001 -953111 -701922 548113 -41232 99739 350772 107910 682467
26701 682467 1521874 803347 204196 -613738 -1236351 -448430 -461558 -864964 -572773 117099
26691 117099 -164561 296597 1156642 1258764 263286 -158481 -1121290 -402908 -925703 -816732
26681 -816732 -529044 -982807 -623896 -216949 -1666510 -336027 -596959 -83425 -1017124
26672 -1017124 -1168009 -504550 613319 369231 -231800 916736 883314 -25220 505833
26663 505833 -195765 -372754 -421165 -1014492 -36927 -140956 463950 333490 267457 433992
26653 433992 395085 1280105 2415939 5767964 2146557 598399 201055 347485 -66186
26644 -66186 -238192 -126181 1240068 334936 21377 -120519 296131 -315692 -441249 -793327
26634 -793327 -396793 -150828 -340556 -785726 -1035799 -1073055 -1185849 44948 516005 51206
26624 51206 48972 -466413 197946 -941701 -1617440 -1625648 -1424695 -658579 -25213 291430
26614 291430 62158 -1463322 -641679 -134546 -169341 -979821 -3087 -476268 -532444 -718971
26604 -718971 -924835 -649495 -1422487 -1646614 -846880 84981 191848 -166412 -96443 340575
26594 340575 -579617 54874 54116 -716724 -910099 -932652 -798502 -551010 12096 -1297973
26584 -1297973 192713 380485 -23122 -412722 -838661 -664797 -776853 -983178 -62239
26575 -62239 -484611 -503574 -353280 -831734 -725382 273909 -836 -356513 53582 -451343
26565 -451343 -196569 -595385 -206164 280298 27696 -11894 -302511 343434 653019 -192973
26555 -192973 -73039 -117151 -879260 -1423839 -954289 37860 -256285 -1015434 -1770312 -1115117
26545 -1115117 -1768992 -975216 1270938 674912 753782 -7839 -394426 148681 -893027
26536 -893027 -375035 -346477 -985029 116690 -287939 149036 789446 -576373 -636897 52280
26526 52280 121393 -234422 -1406435 -945354 -454038 -1161286 -823152 379590 -102669 -1285866
26516 -1285866 -474507 -106101 -436779 -900119 -1342879 -1555295 -670158 94608 -929864
26507 -929864 67473 397522 491509 287311 1143661 81483 -148552 -275894 3865 278603
26497 278603 -585078 -1534114 -727122 -545984 -479249 272353 67570 461885 101797 -196160
26487 -196160 614405 -299590 -814030 -1174071 -149166 251682 57740 -674967 -769216 109226
26477 109226 960597 -235653 573675 41996 231856 -419555 -112499 -357888 845550
26468 845550 -258862 -654606 273479 177863 57319 204929 657916 -770982 -320675
26459 -320675 212691 559995 -461214 -862800 -649674 28014 352461 -137945 -334593
26450 -334593 439549 809699 -327082 -905841 -294564 42453 160622 228211 349764 282323
26440 282323 711794 -377504 -1067683 -707861 114293 -607881 149162 183890 -154604 -541371
26430 -541371 -316931 -148561 -363952 317696 -399611 -352012 300383 -398237 622522 -470065
26420 -470065 -530335 -129803 -735487 -171915 462510 110561 -61158 -80993 -84107 160914
26410 160914 -486135 -533878 -173168 218837 691955 657831 -49918 75181 -433496 -316429
26400 -316429 270930 -503178 -72516 -65748 -1280414 -659846 549492 230566 -379869 -913257
26390 -913257 -177612 579818 526259 69090 -976864 -260974 -590580 -1103473 -300113 -622000
26380 -622000 78286 551110 -388537 -69410 -286394 -743916 -257823 -223023 -1751874 -946110
26370 -946110 -383308 -522326 -151221 147821 -189889 -504307 -70519 -277043 -228050 267797
26360 267797 -671899 316111 -483051 -345646 124 -591101 -878710 -660087 -671853 -54837
26350 -54837 265727 202252 91611 715266 -85743 -6799 131323 1108199 823550 547495
26340 547495 -469867 -318898 179441 1175007 230741 683637 1137072 -133983 53990
26331 53990 -285365 -569261 -155675 -316383 124846 527629 376709 297771 1132570 566534
26321 566534 351805 83681 305108 16767 -628400 -166260 -552190 -63714 58682 -151098
26311 -151098 -104614 -50582 -57284 -112091 118325 792928 330289 -68994 208290 -10092
26301 -10092 -9972 -9242 -77362 580557 232594 275373 510181 2517 426606 -303138 -240386
26290 -240386 88456 118788 926051 861246 164091 -310089 -216673 -886540 -1490413 84314
26280 84314 871742 15527 222452 -123423 349006 105546 -245772 -283295 784659 610793
26270 610793 -859383 -1210412 -1018465 -1170943 340752 -162930 -412922 -1067513 -387478
26261 -387478 -1160901 -1135614 -1030215 -401976 -296401 -438611 -89768 -567329 100239 -466215
26251 -466215 -713501 -496663 -328988 12539 215298 -425892 591982 -825467 -716910
26242 -716910 637791 889431 95720 -221275 -609806 -322663 211281 426049 24660
26233 24660 512402 -38845 -1249636 -520887 177291 1064821 932588 -281357 -770444
26224 -770444 172694 324171 183672 -2887 504240 152591 -728939 -603171 -226090 -1064618
26214 -1064618 -1074084 -719164 34421 -643243 -613882 -672959 -76337 253083 101479 -482757
26204 -482757 -565078 -397298 -98377 -1059356 -52057 -24384 -741448 -657342 -16518 -194819
26194 -194819 -24561 170534 710148 73183 -312821 180928 -600034 315219 248139 85828
26184 85828 29589 -184129 -436674 -426524 -434114 -846362 -631811 93954 149278 87297 231631
26173 231631 -374863 -565661 164945 325817 182228 322301 -363093 -926344 -506000 416873
26163 416873 300791 126627 12398 -670776 -385441 1042 -266901 50359 596305 -152860
26153 -152860 -303713 -819708 -477857 -640646 127733 -137240 -457326 542309 -29273 -105890
26143 -105890 511246 -416207 -327477 -22545 -202404 467447 248594 781881 66167 -662594
26133 -662594 -940957 392432 1252837 823260 790191 -231708 -404898 -139403 -567365
26124 -567365 -845786 144914 296322 78203 -438640 -1165366 -1178093 -211290 -482701 -55550
26114 -55550 -1891673 -1014805 -502436 81615 688750 34901 -329083 -541890 465134
26105 465134 1081630 232759 -172640 -780097 -140255 -223245 -1188728 -403528 -376752 209164
26095 209164 173732 -334041 -252715 536466 390698 311057 645558 293529 -72317 -845979
26085 -845979 -50112 339752 -595395 -865830 -1474816 -546926 -1054517 -256178 182818 286536
26075 286536 421535 -621835 -508656 -267839 -968491 -1723204 -907504 286235 783031
26066 783031 1049099 831325 245719 -848634 -507149 -795988 -915903 -615821 -553970 -16656
26056 -16656 485973 -31854 325404 -69715 308415 -960332 54444 -6934 -208307 -293032
26046 -293032 -278849 -165945 -712469 3551 265127 -250110 96494 -61010 76237 -37245
26036 -37245 -27679 -187682 -529827 -331968 -130387 -187447 343732 292168 -985056 -1118365
26026 -1118365 266053 110196 -559658 -297191 -685636 -836043 -192123 -532497 -437222
26017 -437222 -999375 -638893 -266841 214113 27359 -588899 -385100 544234 -287771 73714
26007 73714 -486230 -1273803 -902685 -505877 -932349 -1555717 -683432 276296 -413803 -143886
25997 -143886 -140743 -525136 501332 100008 -939712 -1043430 -866933 -402870 337057 478719
25987 478719 449486 171560 792143 -96150 -157289 -63818 263564 -85470 1427801 96620
25977 96620 88823 78153 115405 602179 -431789 -253805 51630 -512025 -933643 200718
25967 200718 -15087 -500 -504270 -630272 -565170 -304868 -293174 -482640 -6043 -3557
25957 -3557 1178232 519498 488267 691219 -461057 -639964 -452353 -61442 295019 -434461
25947 -434461 -325591 73300 602951 -437420 251248 223404 315317 -907483 25276 130666
25937 130666 -332274 -587262 -230267 -294385 40329 -646693 453572 -157212 -273792 -1365773
25927 -1365773 54515 386908 -113713 50680 798160 680726 833955 1197940 446288
25918 446288 720197 1301606 -8809 -158493 -85709 253227 478817 378322 313113 424722
25908 424722 -819738 77333 -378230 250892 486874 1281434 1244862 262549 32080 -490050
25898 -490050 -995228 5562 -646158 714873 488411 -351616 -526555 -43973 9408
25889 9408 486537 -108592 -415950 -847351 276309 275466 -413844 -492185 -641253 -405290
25879 -405290 -195131 -153066 -1719074 -1213624 -1112473 -930348 -438344 -876977 -541957 -99740
25869 -99740 -85352 -247155 677997 310922 -249061 1605501 949044 965309 182056 237549
25859 237549 -150235 -585071 -1116487 322627 520600 514882 103920 176484 173268 -475816
25849 -475816 -562715 -513895 -46604 -807919 19702 -323776 -1062341 669355 271434 -170454
25839 -170454 -238090 -341180 387598 560964 125229 -360290 4510 822912 326817 102825
25829 102825 641891 -98794 804578 1087870 857701 326609 -1186721 -368166 121254
25820 121254 583275 897162 640922 1142523 218539 780192 231081 274740 356793 621136
25810 621136 894240 1614323 713628 -83828 694570 779892 -140400 217305 -9885 -450473
25800 -450473 -7019 74003 -83727 48637 -695438 -88432 565724 -173657 300003 -747166
25790 -747166 -938844 -370693 -1083640 -932753 -1573018 -935431 -610605 -262227 286874 -503736
25780 -503736 -1200470 -856743 -53032 -543723 -1228493 179426 -755236 -1460009 -1779033
25771 -1779033 -639621 -179215 615629 479788 840836 548629 872612 412093 184223
25762 184223 311879 -38018 -318679 -362643 -1143789 -727033 -383320 515708 796106 321367
25752 321367 -172180 -1030743 -326037 -102366 -122564 -409419 -738931 -92744 -587509 -1089761
25742 -1089761 -892198 -1873 85873 -1323159 -444532 -419742 -67377 -401009 -940049 -161185
25732 -161185 -190702 320338 -782689 -571970 426278 774072 1333294 963019 -130441
25723 -130441 674617 518295 443360 804089 1029529 568506 -466367 -280675 -196962 -339043
25713 -339043 112144 169788 -574256 -776842 -1158542 -1232566 -1347740 -615971 295030 -38889
25703 -38889 919466 717486 -301866 -665487 197436 118476 -826432 -689513 -444333 -171932
25693 -171932 -40284 -806493 -344857 -448074 632561 488450 -289090 -1415320 -1077524
25684 -1077524 -458717 293540 264458 -56444 -418448 -292473 77319 -186304 -320672 -619603
25674 -619603 -191 -142428 -996019 -715869 -369363 -464020 -31813 759096 15998 -110055
25664 -110055 -108591 -164976 -1090996 -636840 -244197 -402114 -1123013 -1036072 289425 94823
25654 94823 -970935 -1011160 -191461 583121 806109 -35174 274697 490175 -573586 -206830
25644 -206830 -570439 -579106 -776071 -1948797 -1362380 -55393 -507331 163236 -190167 11407
25634 11407 36906 -515247 -598133 -407168 -605370 464936 7694 653792 -311028 329332
25624 329332 -146037 130062 -40717 -896071 -704440 -488240 -553968 914954 909613 -447079
25614 -447079 -214191 -871002 -367762 -46794 -761581 -965019 86523 -945326 -1592572
25605 -1592572 -1025385 -344383 336057 953026 364147 -203488 747763 2335590 1004837
25596 1004837 -263609 -387385 -114504 -725537 -520246 -500963 168257 313883 90842
25587 90842 -123986 858958 162415 272902 -519770 -786093 -553585 -808103 -511449 -335095
25577 -335095 -704154 -433253 -397920 -520050 -279039 -447285 -556111 -137264 28596 -338052
25567 -338052 -438193 325990 736322 80952 -553476 -710180 -436356 443139 429934 -426208
25557 -426208 -117199 226464 829055 412941 1120955 859683 936291 20722 -126796 -912790
25547 -912790 -1045635 508683 -17146 -708356 -1730738 -595320 -299259 -183213 -183718 459565
25537 459565 67546 130335 -274696 -354810 83127 -215292 -25687 316446 -207232 -357182
25527 -357182 -178880 187593 39253 -126923 -120520 351697 -465329 808991 467362 105253
25517 105253 758567 34669 -321753 -201834 26529 247061 134649 -76491 238185 491656
25507 491656 66280 -144489 -532423 -731474 -604919 -127622 652341 405943 -324792 -143431
25497 -143431 21987 135765 -282127 -192066 86767 181013 -319828 108971 362355 304343
25487 304343 -422809 -679024 48297 756854 138872 18273 -217744 -311344 -318859 -343136
25477 -343136 -237051 -1177205 -1493293 -357171 27865 937178 -484437 -614191 -172681
25468 -172681 641555 -678178 -1362805 -1784900 -1464287 -450791 -1451335 -1042995 -455077
25459 -455077 43202 608684 194411 122041 -941545 767785 357848 -533263 -329766
25450 -329766 -779228 -966425 19786 -695883 -282460 -218521 -288671 -194138 349085 69782
25440 69782 -783183 -41507 156947 -473208 -1902859 -516080 182062 78406 34284 87333
25430 87333 451007 -954207 -1155373 -492865 72532 177194 -75519 -1372820 -367846
25421 -367846 -248642 -455241 -1417107 -2125246 -943865 -233195 -25732 -436964 -1233240
25412 -1233240 -1429344 -1208306 -1357592 -1536224 -1635048 -1103958 -634356 -253515 100883 1008938
25402 1008938 1138305 614438 134347 224052 -323101 -396143 -37857 438133 -162147 -378653
25392 -378653 -309825 -769985 -700595 206450 -846802 -347429 -559947 6260 1360811 605510
25382 605510 792670 1066529 390660 513593 -92748 -720513 -1127393 -1061393 -706764 -1145153
25372 -1145153 -1037032 -1703143 -900193 -744913 -314485 -78654 237173 259915 -468407 -75548
25362 -75548 -330153 290772 -250153 181984 -318836 485577 273374 -456719 -531746 -636547
25352 -636547 -831189 -743213 -979903 -172457 -409410 268391 311273 -279082 -967744 -466929
25342 -466929 -808644 20491 -587902 111303 -735309 -1079490 -233200 389940 -1146336
25333 -1146336 -828202 -520117 -99709 -377141 136589 -1004410 -540100 -692637 -650446
25324 -650446 677328 585851 -297138 -858460 -903920 -493357 53986 -872604 -680824 -612649
25314 -612649 -815115 -1367069 -476749 -648471 -738355 681778 -351083 242536 972865
25305 972865 1840088 663705 890774 1020094 212440 8219 -247711 -726301 -823300 -612756
25295 -612756 -137680 -512230 -397745 -414049 178996 -640858 -64364 -890134 -102005 1626
25285 1626 366978 640182 -880359 -162044 493197 -114233 -219330 617812 356400 -334150
25275 -334150 -1578055 380185 -113377 73987 -664320 -1519661 -231172 111519 131936
25266 131936 91075 -725798 -931299 -273566 39589 -326943 -616177 -560458 -204552 -586897
25256 -586897 -1443108 -1281885 -872815 -981404 -371678 -477243 -323462 347010 218927 -530274
25246 -530274 -660416 -364974 -949658 -936871 -628597 -846595 -387909 -43919 375968 139573
25236 139573 -124751 -23382 -338981 -96271 -125325 -305157 90045 -636956 -1147062 -282683
25226 -282683 -478949 1069444 158442 -788204 356804 479705 -647648 -115432 134163
25217 134163 916402 951714 356026 658689 852730 457075 260979 -176439 -695236 -529275
25207 -529275 -188976 -515246 -379109 -94531 193058 542233 286544 -637518 305226 857130
25197 857130 584435 132372 787416 552732 -624200 -582390 -589706 306498 21445 -300257
25187 -300257 -586629 356354 -55329 -80409 477700 10161 -536538 -1057361 -833364 -123619
25177 -123619 295541 519931 390178 -158440 -550346 31886 64990 -297833 103515 -398276
25167 -398276 -271100 -639481 -968146 457063 -237480 177023 105436 276562 -322866 -1026597
25157 -1026597 -529881 -693582 295535 -447490 -872888 -298618 -527519 -350244 203244
25148 203244 271270 287239 -324045 -575501 -399438 716796 824426 -83390 -648606 -338198
25138 -338198 423753 392835 626359 154398 510869 -35224 -195343 -856686 164972 451766
25128 451766 262340 940902 53176 -356117 -264451 561313 178858 -1162704 47473
25119 47473 414291 -87034 -909935 -225124 -618200 44126 -291703 -557586 -325934 41307
25109 41307 389986 675883 320595 -40466 -183488 -1349430 -1418986 -1478457 -553754 -659302
25099 -659302 -1014487 -770757 -756976 -726047 557518 552505 200078 389778 101381 201326
25089 201326 472450 1002689 359520 -476781 -1280052 -1208711 -753257 250539 344608 312171
25079 312171 -346744 -217006 -39111 -1210250 -450308 -25685 871694 371504 651639
25070 651639 145207 -269554 -798296 -854376 -197659 -632755 -464533 -474272 -1003026 -330290
25060 -330290 637214 -438581 -514992 359225 -391189 21759 58403 192637 -126106 -1127692
25050 -1127692 -464287 149796 658955 785506 830193 330569 473782 -178238 -359664 -449315
25040 -449315 -778548 -306697 -275096 -695752 -163614 -831196 -899281 -440736 -520591 -490825
25030 -490825 -1158746 -461293 -438107 -11585 -682401 -213008 611490 817429 234857 -390578
25020 -390578 450705 31253 -109324 718698 136002 965244 554469 -1399 28017 842429
25010 842429 1437700 756423 940523 796310 1141998 1422151 1130209 177915 -419187 191265
25000 191265 -924764 690051 1286528 254573 -816074 -418673 -11865 -273894 -569955
24991 -569955 255008 687093 545286 385389 -261584 -140461 86241 -89135 1288624
24982 1288624 782110 863514 202731 -334564 -20725 -310658 -154218 -188672 -119178 311305
24972 311305 -616181 -588486 -175982 -65595 -5725 100274 86292 -646912 -1168345 -435628
24962 -435628 -648856 -331945 -897387 215349 1250545 73524 85657 -498628 -147101
24953 -147101 587830 214349 -206260 163254 570580 201268 -632742 -636238 915944 437021
24943 437021 190489 -452062 -265748 -655172 297640 15347 -210658 225433 488481 528331
24933 528331 290947 -652557 -1032767 -822582 -67646 -717210 -582987 -549393 -419976 -736612
24923 -736612 -1002698 -349137 -1045844 361534 939785 -84015 -786665 -834279 -464655
24914 -464655 165035 548857 903183 222892 -970283 -295290 -501145 -1258317 -1087835
24905 -1087835 -466837 821582 1570419 625430 112392 -122681 -186779 -561007 -1047035
24896 -1047035 -948342 -885009 -1585529 7981 -352117 -627439 57629 125007 15219 319854
24886 319854 -194314 104060 -118680 1102293 -957024 -1405797 411256 241328 627395
24877 627395 943930 -178166 573899 828715 374360 93353 539532 896162 862710 2998
24867 2998 43038 157588 313024 -823743 -116069 579512 115783 747070 651657 509768
24857 509768 -570477 897175 997790 674030 168161 -585550 -366756 30827 36665 -748773
24847 -748773 -899045 -188829 1019372 569050 -666029 -598079 -763237 -412898 -289024
24838 -289024 237823 -322004 278552 -141503 277165 -22685 -129858 635516 -256326 -267727
24828 -267727 -828580 -1285032 -864890 -875087 -1711002 -1446650 -1111129 -409698 -191010 -662934
24818 -662934 -292503 -823726 292309 -40051 -752192 -1387107 -1517664 -796483 -434078
24809 -434078 36558 -994994 -1405976 -936501 -203857 -235969 -116405 184758 -899656
24800 -899656 -429807 -254122 -340516 270384 217807 -611880 -673740 -184678 -434705 -1576560
24790 -1576560 -1312510 -528199 94806 -454245 -113226 204831 -1200285 -813143 -826836
24781 -826836 -386367 -453563 -645287 -191372 656137 375050 48976 118119 616393 523462
24771 523462 110474 413001 -69462 -409969 174055 326446 483850 778106 286015 407280
24761 407280 357922 133083 -529221 -1408724 -859744 128351 268619 183678 -188312 461194
24751 461194 -106500 -395330 -977730 -865833 215155 678868 127336 -425926 247628
24742 247628 -120010 -613109 -310478 -393148 -195714 -224785 580008 528800 210775 210159 -1069374
24731 -1069374 -1161556 -284650 -142018 -1006971 -743632 86687 566085 419599 168164 742023
24721 742023 630240 388922 842781 -483613 -766331 -788852 -510648 -302527 591785 -187040
24711 -187040 -149872 -826680 -150814 25405 648204 -22866 470012 808480 -16846 -769407
24701 -769407 -769397 -912438 -511230 522209 516886 -307079 222454 564324 -60277 -273771
24691 -273771 -332903 -908832 -712956 -488656 -1226537 -1095798 -1572549 -602246 -710096 -733149
24681 -733149 -583676 -428150 -608096 -650906 -1626342 -1035255 -1508051 -2140066 -1230187 26917
24671 26917 -409043 -34169 397973 -207936 -252856 -333720 278155 913983 667365 -54742
24661 -54742 466499 1339736 804261 -15369 72655 -102480 -406249 -763979 -527381 133025
24651 133025 285385 -321026 -378578 -122690 -866380 -1011954 -2029346 -699677 -789914 -636895
24641 -636895 -108918 952753 -543959 -40232 -238126 -200988 -442999 -379888 -224293 -391763
24631 -391763 -140778 56391 -89225 -502004 -401068 -142005 -199441 -1161870 -35101 205088
24621 205088 860346 837120 251217 -446982 -535639 152333 509492 87876 -538267 -127261
24611 -127261 336909 143729 110864 1032270 730299 727955 520968 839205 392945 -714160
24601 -714160 -902782 -384407 -132139 -365818 337621 507199 -543392 -263800 633664
24592 633664 680335 355540 -231090 -466037 -230465 240836 -242103 -446391 696157 346385
24582 346385 349138 -244110 -518889 -238200 -607579 181240 -1028286 -587465 434588 881906
24572 881906 -128682 649589 -44594 -636159 -323232 646637 412115 235048 -297309
24563 -297309 156580 -371172 -509149 -947781 103322 605465 -513594 -493590 -296748
24554 -296748 -193728 -172121 -93245 694943 -281115 40380 -735948 200450 -472645 -776915
24544 -776915 -1205679 -1018729 128998 607816 746497 360818 -278709 972333 1222474
24535 1222474 522345 -145157 163064 810466 128765 -819528 -416677 -877060 -698814
24526 -698814 -68089 -306314 -580642 -408974 -345044 -220264 285188 -140239 161658 -691429
24516 -691429 135769 -263722 -615751 -471936 -421138 -444706 323647 -509885 -208319 -210150
24506 -210150 33475 -39409 832148 243961 -139515 -138234 -248526 -227575 -574201 -1211418
24496 -1211418 -1072608 -860121 -1248087 -1917969 -891622 -1075608 -601004 -669330 -263191
24487 -263191 45532 431673 362548 -259175 -151518 563553 50408 -71481 -104034 18931
24477 18931 -256909 176669 812251 -80908 -691321 -1858006 -1726270 -1168033 -546577 -122719
24467 -122719 -150143 668640 -711185 -1179357 -587318 -247392 78308 262416 485321 367034
24457 367034 799432 231474 420115 306719 443867 -324680 -1035669 -663669 284758 539997
24447 539997 932983 927035 111282 -298940 30401 -16256 -870050 -870908 -665445 -228224 -631347
24436 -631347 -518140 205365 -251169 -76643 323135 4757 338255 1008519 822839 1997046
24426 1997046 786278 -1134800 -832060 -492168 57990 786011 -1142861 -703553 571476
24417 571476 911832 1190493 7355 -148896 -390528 -444593 -898425 -49000 -38860 192999
24407 192999 559572 138975 525326 369489 -31065 568794 245728 329811 -90110 287450
24397 287450 877753 647960 -68962 -298627 -209350 -134881 47573 477056 249529 -83864
24387 -83864 332731 -832307 -901830 -489038 -410414 497516 -679568 316197 476095 454428
24377 454428 -359591 65910 -89183 320292 416304 97428 409935 1085942 415154 -30021
24367 -30021 -362564 -487242 -215738 -1067375 -4606 66922 -711439 -2619 -1024075 -501617
24357 -501617 155436 884430 -187122 -1402043 -614445 -780306 -1400693 -701688 -357417
24348 -357417 30517 -659846 -1058939 -696260 -19906 -161097 -816058 9221 -393403 -954851
24338 -954851 -626998 -592933 -248211 -261489 112149 -1085397 -647680 -1004358 -461349 102524
24328 102524 -604056 -111654 -720358 -1690527 -1348053 -1321910 364584 77696 -440213 30675
24318 30675 -9611 -378468 -420622 -153527 578 251117 -175567 -768233 -152007 1038485
24308 1038485 699486 568880 967968 -9892 -482844 -402786 -100147 -152605 910889 803543
24298 803543 -22277 86040 382077 -523591 -842727 -827090 326193 58729 -62560 262476
24288 262476 807961 881118 504436 177856 -1491942 -1303401 -1401080 50547 -327690 -305051
24278 -305051 48570 393641 261405 134430 -493532 595313 936251 -113957 -351449
24269 -351449 -699528 -112514 -410589 167341 193649 -134054 162849 -456284 388683 -352864
24259 -352864 -285461 -572538 -140831 -69494 -388746 -25180 -539103 -995441 -1300232 -695915
24249 -695915 -382963 -666415 -407444 -964894 -603088 -203132 -869057 26000 -318896 166007
24239 166007 -257142 29598 95845 170861 144080 312138 1048853 587861 -267337 -220251
24229 -220251 932741 701466 428296 192460 569461 42528 408435 998594 271318
24220 271318 25496 -746794 -646948 -766805 81597 -52600 -30940 447137 494803 1140137
24210 1140137 189431 111033 -569363 -242147 -538544 -488571 -769920 -877911 -698009 -775018
24200 -775018 -61771 301151 435360 658557 -507627 -1703185 -164883 218812 -282205
24191 -282205 380230 198929 241708 -463689 -1241357 110133 -343500 -482733 -533670 -537549
24181 -537549 -646183 -544257 -264630 269796 676079 413956 -159828 -601364 -128906 351457
24171 351457 686861 671294 101292 -55736 -550416 -936336 -793247 -469028 657525 215292
24161 215292 -50049 -74469 471330 307957 -52651 582968 -155565 439303 554212 596192
24151 596192 -81225 258864 -412856 -339380 154592 804382 -274216 -73613 -66813 174358
24141 174358 -109926 91969 -328998 85990 561841 231571 84702 -182412 -608352 13342
24131 13342 -634257 -531471 163593 57099 424290 -12659 404071 592435 258647 124782
24121 124782 -391542 -39728 -179139 -4369 765179 -32871 642451 580092 -109117 550617
24111 550617 -389007 155653 -450664 -278940 67686 -297064 -387400 -789347 -839343 -1008199
24101 -1008199 -834370 -1272829 -1325451 -577597 -337338 -610334 -1004788 -237157 507836 567436
24091 567436 1079892 -219528 -177779 11888 -49506 5727 130743 -295124 -292309 728100
24081 728100 427642 68268 -168074 -198654 -101712 312062 -652549 -698037 -675776 -33236
24071 -33236 658670 277631 430754 -289251 -487931 -724171 -1035465 -261036 -483226 -304723
24061 -304723 178408 3648 -8067 245516 452133 -189599 -512350 -957956 -391368 -768144
24051 -768144 -269594 -530998 -459455 181807 87688 115591 -1116745 -974754 -552391 -26918
24041 -26918 257595 167638 -397456 -115517 -311099 -202050 -30551 -12206 -735769 -271841
24031 -271841 -519518 -701808 -537626 -363659 48003 -501912 -1355983 -330502 -969314
24022 -969314 -1333905 -985504 -888470 -961863 -1189185 -412561 -102074 573722 126822 -424
24012 -424 -621225 556238 629166 794440 -337082 -489375 -1082966 -206574 31994 191524
24002 191524 392523 -345145 -76348 -498792 -489740 633316 78572 -16176 -81209 -952397
23992 -952397 -1007007 -666863 -195339 647769 -119344 274320 455442 801896 937851 -112871
23982 -112871 516278 9786 414255 69963 385854 825754 -7082 -560717 -731266 -131864
23972 -131864 -26294 -435923 -116576 -248014 -195366 -293464 -308167 -546845 -36072 -957942
23962 -957942 -260747 -522986 105618 185576 -160004 573936 832526 -191493 -529704 -796318
23952 -796318 -585707 -1179800 -1100978 -1375381 -1539389 -1274097 -1270249 -864308 -612409 -1009981
23942 -1009981 -897086 -319163 317450 88576 -968207 -997622 -1421739 -221172 -333521
23933 -333521 394475 558575 -105171 -77085 -664335 -482998 351555 -314653 -459349 473775
23923 473775 623286 430930 -412610 -575897 -606022 -455753 -208307 -182184 -588585 -1006117
23913 -1006117 -1197563 -1236621 -673139 259049 -1053966 215311 632849 -418885 -462236
23904 -462236 188828 -661192 -487588 -99590 -793842 18097 676979 615348 334421 -1096350
23894 -1096350 -760527 -42291 -177342 -535255 -137981 -27138 -734310 -531276 -846271
23885 -846271 -399169 -703130 214442 360019 -517092 -1403431 -1048564 -538755 -102601 916572
23875 916572 -61932 -445454 -1223747 -897707 -26622 342388 745285 265754 -325490 325703
23865 325703 -292649 -653210 -968844 -361299 329367 964340 260396 -566602 -681959 -361400
23855 -361400 -400322 -803354 -1127922 -1056979 -1059887 -468343 -1034883 -383632 -542828 -1013036
23845 -1013036 -1217635 -150805 559831 736099 1707345 830441 561484 333461 1242795
23836 1242795 716979 -39613 -1479872 -178606 -160815 -361215 -446355 19835 -469166
23827 -469166 -857280 417132 10662 -171331 -376843 -847658 -569377 -561833 -60585 -956598
23817 -956598 -360585 156868 143519 472802 297973 585574 -513478 -443409 -305874 -186618
23807 -186618 -1120108 -150270 -114674 330607 515226 1123167 910341 373420 -189295 34211
23797 34211 -800005 -388151 -566072 -35103 -911387 -890528 -823665 -919462 -494922 -227569
23787 -227569 1006649 -257236 -391942 -406431 -243923 34313 50191 116464 -1171390 -255621
23777 -255621 68044 449613 -516622 -105832 -355188 -655996 -429519 -1045271 -695715 -673852
23767 -673852 -1505668 -465167 -44076 83166 -310246 -396682 -1330007 -1135575 321925
23758 321925 393914 163587 26768 -216115 -692207 -691231 -1187858 -519978 -879336 -247516
23748 -247516 1042857 -448704 -576709 -883011 -31095 -300232 -415459 -38067 153675
23739 153675 651376 555239 6511 -44778 -431614 -172649 397856 -73979 -564594 900840
23729 900840 216564 351713 -26555 -1000653 -313438 56208 74093 -900892 -561949 -566421
23719 -566421 -1872352 -2217645 -1439313 -201787 -491983 -1140630 -613788 -838751 -584923
23710 -584923 317096 167548 -476801 -444893 789184 604920 905044 24185 -465898 44497
23700 44497 16280 -526144 -553055 377277 176985 -948449 -611376 188607 -141239 189735
23690 189735 47982 275464 -351053 -206964 408687 1320093 34627 -147033 181296
23681 181296 455343 212772 93472 402403 -294199 -404895 259647 332820 -190966 518704
23671 518704 89997 -402607 -853510 -1167585 -538103 -585950 -368396 -212750 362264 295263
23661 295263 -1474483 -1333229 -240174 -196979 -414395 -446932 -584785 -131627 -296925 -274639
23651 -274639 731692 106208 167391 510670 332227 -789303 11344 -522964 -75611
23642 -75611 -82255 -1008548 -1077585 -1199668 -763217 -259132 -476229 -862337 -987213 -1326181
23632 -1326181 -1440692 -940537 205488 -560529 -371307 -500431 -572659 -702273 -262151
23623 -262151 277647 213764 6882 -233170 -1007904 21555 439952 637761 482067 -1006675
23613 -1006675 -1453231 -785272 96245 309016 434707 -38559 116906 26116 -759754 208424
23603 208424 -238637 -1354031 -712452 -206421 -322882 -1110861 -895976 -331676 702762
23594 702762 19897 167321 -557852 15053 -114339 66985 846474 943995 163674 427675
23584 427675 -211053 -334901 -640275 456969 -317270 -485584 122441 61514 -339910 -587964
23574 -587964 -189501 92230 754530 138100 -176973 -292769 -591843 -1264852 -651790 -728282
23564 -728282 -735135 -502215 111726 -49478 -555629 -791455 -867142 -246795 207901 842625
23554 842625 520515 -580466 -847442 582242 375728 -1103423 -690957 -228728 266542
23545 266542 306390 -278966 -184049 -465344 -156982 -226488 75318 -318227 565647 268293
23535 268293 174486 -830726 -603315 -308688 -152618 235370 -557296 566757 -199478
23526 -199478 -244079 408930 -959225 -1423940 -665761 -116496 -851580 -520716 -820796 79560
23516 79560 187608 92166 283158 224004 579391 527795 255247 249323 -331510 -470093 -545835
23505 -545835 -606883 -267747 -447214 -394430 -702241 -320147 -623150 -642746 -1034166 -47361
23495 -47361 426893 216474 294026 -754775 -739855 109943 -491707 -793207 -737034 -283965
23485 -283965 101475 539637 -374526 128730 314818 235786 -157914 -543017 215862 -318618
23475 -318618 665309 395313 -136972 -192735 -19511 228453 335435 568089 81581 705350
23465 705350 557953 583790 -56885 196304 -36367 267783 10289 -385953 -1676437 -1271064
23455 -1271064 -563084 -442745 -570687 -595827 -48579 -286171 -1029056 -79779 37143 1051545
23445 1051545 728326 439739 813579 394643 -193588 97993 -82749 -294148 -1055145
23436 -1055145 -349879 -234527 36011 24479 798164 447129 186087 -356579 65990 -263780
23426 -263780 -471385 -518723 64205 -510501 -190853 -328661 -215737 -127947 262039 -281117
23416 -281117 6957 -581828 -626153 1002303 405447 199700 -152653 -289319 -555250 -780806
23406 -780806 -10334 -274263 -12332 -1466779 -418208 -489372 -321007 473870 684937
23397 684937 -147330 -544092 -583865 -237670 -145551 -618939 -964477 -850397 -233487 94533
23387 94533 151540 253060 -1316333 -640735 -959810 -722587 -577090 26932 257545 -782657
23377 -782657 -746512 -25159 -299548 -479143 -765198 -834071 70067 739336 -374377 -255144
23367 -255144 -109849 219890 -126309 -1025837 -570118 -863075 -795720 -543937 -1014216 -85965
23357 -85965 -18937 -739410 -443750 -23778 320975 491262 -263861 54865 574780 1049185
23347 1049185 819481 80618 -588261 -275169 -640359 -80001 -139070 -896165 -794167 -692248
23337 -692248 539344 234821 768425 459741 213965 -218627 -972489 66054 62099 -560810
23327 -560810 -626228 -854218 -784419 -451410 802028 8265 302116 634145 1139381 566895
23317 566895 -126890 422433 -911694 -705808 -365182 -299634 -560238 -501117 230210 246185
23307 246185 539246 -64406 -356549 -245818 -333070 -431033 348048 223625 -4187 246390
23297 246390 202534 -108269 -522571 -1148786 -2287525 -1175274 -441206 -264990 -489200
23288 -489200 195757 475639 -413784 -309764 -335463 -330687 -810685 -937043 -1317738 -15421
23278 -15421 -145725 -864451 -2072181 -708221 -154620 432609 -614408 -1046602 -905998
23269 -905998 -490571 -394952 -915124 -318847 333955 -849154 -530156 310338 510980 383756
23259 383756 -362928 54864 -45176 810922 260710 402466 113148 919093 966666 -425755
23249 -425755 -287596 -70206 63534 -501494 -1543550 135370 -5501 -394318 -451951
23240 -451951 -1694660 -1342663 -1106671 -487921 -651300 -171867 -517841 -652167 357544
23231 357544 233832 -468504 -312437 -391571 -314875 404811 -697765 212526 966151 512280
23221 512280 820167 36687 -475686 -385544 -1293091 -89690 -176992 -19148 173976 -602003
23211 -602003 -64935 70982 -652313 -243456 -588891 -263559 -182285 -403561 -647555 -434569
23201 -434569 -901184 -449615 -171518 109483 374881 791970 -584009 -836145 -474043
23192 -474043 -74030 -446636 -1192499 -355152 84456 -1290818 -97763 161920 -28219
23183 -28219 -369319 -1488329 -252777 117932 334297 -523523 -220065 -534915 -825974
23174 -825974 -1016459 -4690 640456 1209988 481062 -1281477 -1381720 -1325409 -165271
23165 -165271 15807 -352116 -908691 298422 -324481 -437531 -283450 -746364 -919619
23156 -919619 -844791 -182162 -1024384 -476642 -417776 -112357 394786 -76473 -273254 -334805
23146 -334805 -247038 -100566 85510 -988382 -253648 646738 -643626 -1064931 -1430188
23137 -1430188 -62170 -157964 -585848 -790446 -467344 252849 386695 248335 77600
23128 77600 -733671 -425943 -721951 645864 195859 307909 -578263 -749867 203476 213148
23118 213148 9626 -182410 542239 641593 -496123 -77503 -630405 -525477 -1036173 -394015
23108 -394015 -154575 64677 35977 378008 850667 -331142 274549 866396 -418499
23099 -418499 41833 -741423 -97980 -353348 -76303 -426695 -144465 -176842 -300346 -22828
23089 -22828 -69744 -324893 965410 469915 310292 -749806 319095 -330746 -357745 16173
23079 16173 486778 -17552 985052 564709 -1108 275724 166060 732233 530139 -601101
23069 -601101 457887 -106759 -274600 54446 370087 804301 932065 -83501 1021328
23060 1021328 125130 -381832 168148 -178252 -223300 -442852 -388938 -851839 171692 -946534
23050 -946534 -1650856 -828545 -646619 -498108 -462149 -1164534 -282045 -402888 -764894 -751539
23040 -751539 -497058 769091 217802 -24670 20661 333127 -375997 -390227 -1169294 -872694
23030 -872694 -281470 418123 111023 671039 506358 99468 47411 85184 295284 482985
23020 482985 -275851 30185 428942 -495445 -756164 -918140 2916 407932 309075 -36860
23010 -36860 -241956 140776 125270 154020 83051 -68319 272710 607964 848427 502438
23000 502438 -88007 -581861 164521 -171930 449436 -209417 -1315862 -108799 765827
22991 765827 667479 -265897 -581261 -1426879 -1038782 287005 573755 212732 349255 -313534
22981 -313534 -123751 -220551 483228 13294 428812 -401025 -1267694 178859 -641410 -121842
22971 -121842 478065 -59985 -887609 -328600 -303553 51429 486868 -706570 -609682 -349646
22961 -349646 -363717 -623851 -870390 -93450 -926834 -1315651 714426 396340 -638693
22952 -638693 -564627 -1433034 -1672288 -99237 -408989 339759 -733213 -21467 -330881
22943 -330881 -957284 484554 547055 388970 -148205 -533332 -626658 1329633 819803 1038367
22933 1038367 537536 696234 54068 -472851 -28400 -514229 495024 1316803 399965
22924 399965 168073 366482 824405 690041 1024778 618522 -628788 -91456 -221249
22915 -221249 -128572 217568 -123942 -424798 -337232 2720 765400 -564939 -59624 139514
22905 139514 241514 169825 17674 553543 646882 211446 -321466 -732530 -396191 -495560
22895 -495560 -100528 27560 1139253 802006 583423 203701 440000 554156 -88236
22886 -88236 -878152 -701400 -249626 394009 -305024 123817 -792631 -358234 650181 -926490
22876 -926490 221779 -281657 1931 57750 145881 -4915 -374962 -285732 -483700 65796
22866 65796 113720 389463 584807 -260249 450833 239500 457179 634502 329053 557223
22856 557223 -346228 -906281 -47806 -636659 -129728 -410421 350093 183399 -67538 734094
22846 734094 391089 627041 -849881 -1137333 -682252 -803859 -706880 -150869 644781 -548031
22836 -548031 -731212 286220 5490 350482 154655 -278204 831951 699689 -408365
22827 -408365 -1613698 -1255176 -382989 69310 -146817 -97488 -966651 -226159 37487 392664
22817 392664 185074 218623 -1086730 -951171 -1514173 -1819692 -1237599 -240713 -320321 -824823
22807 -824823 -230953 520872 406788 -622613 -257156 335715 -1278677 -255216 12685
22798 12685 730499 -199670 -737610 -417862 66945 -495020 -547152 -1200438 -438554 14276
22788 14276 -151577 -51380 175311 -59902 -1050176 -790178 -607451 -669601 -544855 384575
22778 384575 593907 -569077 -945230 209504 -137000 -773848 -928340 -68598 -652807
22769 -652807 -255380 -125118 -901118 775702 -285936 -1035774 -202869 -14078 -548849
22760 -548849 22263 5262 -522272 -131899 234380 111430 346379 5770 -64184 -49923
22750 -49923 518869 -244443 -649344 -772656 -598396 -501780 -1154160 -146434 132608 -246713
22740 -246713 -220358 -1081572 712353 1216006 224115 -106435 335145 -830547 -656789
22731 -656789 -577259 457184 465344 69115 -316621 -587232 -391269 -955483 -239440 -237157
22721 -237157 9969 66158 4250 -188084 -843383 -2031165 -700599 983081 611451
22712 611451 -556495 -88833 234743 628017 228097 155156 -501946 -812233 -256267 -526131
22702 -526131 -54828 694050 -366065 81737 80057 -346913 225781 81559 -253251 296846
22692 296846 521910 749759 -38129 -138289 66851 1016746 618877 -213875 656583 -457530
22682 -457530 202265 -54881 -15112 20987 -210291 10469 -804041 77547 763727 943798
22672 943798 -157600 -417592 297724 468468 -157667 428228 40794 464870 18655
22663 18655 355097 -539317 -53186 179691 304267 -430500 -127054 -342684 -750759 -579072
22653 -579072 -228925 -719752 -1697462 -1878134 -1134612 265050 590661 725070 -301680
22644 -301680 -542540 -727691 -139060 -285157 -856490 -763300 -773911 -599355 -1554808 -636953
22634 -636953 -344202 -149039 -1062018 -1720816 -1051395 341082 232741 322340 271269 237340
22624 237340 552051 -198881 -313079 886353 883867 -453537 -111665 -257878 -404008 31335
22614 31335 735885 -698052 -534689 479653 -97106 -499001 434121 337876 -59641 -187215
22604 -187215 -138932 -494455 -1289222 597743 1223617 -129969 -360346 -9620 -78088 -861136
22594 -861136 -9535 -594856 -45405 -597655 65161 -231379 -389616 -708307 -300112 -1336888
22584 -1336888 -801228 42244 -137996 -774486 -36361 -1079161 -555170 -401543 4561
22575 4561 19343 61887 -203240 -211377 -354047 -165759 -680171 -591331 -633026 -120719 -350143
22564 -350143 -103719 -270977 -530365 -509219 -1239757 -404180 110208 174965 314836 144393
22554 144393 91146 -342106 39556 -80257 107954 -71261 -399695 -813145 -384259 -71011
22544 -71011 13968 881130 264964 819369 268860 -652667 -148808 360688 -107261 -148832
22534 -148832 -623786 -58297 1331256 -373202 -545696 -600459 74495 218419 238992 105130
22524 105130 -153331 201430 -278065 -71007 -855442 -977263 -103646 774294 -155007 -426662
22514 -426662 483427 660503 408920 -262144 446609 167373 -791549 170488 216549 151178
22504 151178 141713 -1351540 -1310099 -367047 784819 238848 -1027666 -866318 6338 -1165352
22494 -1165352 -178798 -166121 2839 202595 -471012 363637 823336 397604 379120 989948
22484 989948 -347511 83567 186823 -176001 -243627 -430178 156133 451649 54781 246016
22474 246016 -770043 -600232 82815 -290247 185047 -509512 -1490800 -506270 714701
22465 714701 -190798 -1237364 41684 119268 -474085 -857727 -922956 -145217 -872400 -1066685
22455 -1066685 -1095657 -818330 -1539534 -1211765 -752146 74184 1409890 169995 -166137
22446 -166137 -474808 -109398 556805 918296 851795 333394 291656 329783 164490 -626191
22436 -626191 -605424 806538 1135250 433893 -484006 -709125 116149 706613 59552 -285238
22426 -285238 -495995 -148547 175243 870498 60617 445306 589721 -48332 505720 649835
22416 649835 1280885 280397 -71504 961952 328694 645308 428949 303991 -220488
22407 -220488 409289 208761 368401 -81964 24800 136573 35605 420360 -54442 -832867
22397 -832867 178325 887367 -33743 382291 -54771 456207 -95684 -226402 -163389 -1702115
22387 -1702115 -1572131 -1808444 -1338436 -205731 375874 82288 807441 1149729 295228
22378 295228 -476144 -1165464 -696849 -389591 -669074 -1233102 -1378401 -1065404 -440432 -425788
22368 -425788 44391 211296 12947 103666 372587 89418 -248360 -5417 356566 279988
22358 279988 -846385 -554223 66633 163014 -390617 717904 1134165 1071466 257614 -410711
22348 -410711 -369381 -572228 -297587 53454 130279 -584183 -741936 603827 -468801 685918
22338 685918 254925 90338 565754 153267 -353611 213116 -588835 -876976 -1305622 -622158
22328 -622158 -969511 -1080763 -728685 -1261508 -589670 -1311897 -1117380 -432701 -787807 -288074
22318 -288074 446796 466251 564066 963276 1369048 331151 170111 418286 -160218 927571
22308 927571 285722 -734477 -1059421 284808 -674818 -424691 -769529 -1067844 -301255
22299 -301255 91259 -184336 -536995 -351461 -1121561 -789710 -547811 -543082 -1230156 133788
22289 133788 -424032 -1191213 -1039220 -724472 -1215277 -1171271 -1143088 -746433 118689 -684181
22279 -684181 -773974 -844454 -712796 -320143 740458 629993 -369926 761 -816428 -1051324
22269 -1051324 -649627 -880356 -47308 -394056 -430287 -721077 144364 609102 845645 773178
22259 773178 880736 465845 -24542 204400 41352 359227 -284615 624871 1009925 112580
22249 112580 105253 -460872 -1058850 -1281416 -1616141 -1200398 -1270221 -1406341 -1498397 -1886997
22239 -1886997 -805608 -489123 442290 806395 -265845 -187567 95090 -379357 -150291
$$ [...]
##END NTUPLES=NMR SPECTRUM
##END=
