##TITLE=31P_DE-80H_X3
 64 sc D2O
 26.2.2025
##JCAMPDX= 6.0         $$ Bruker NMR JCAMP-DX V2.0
##DATA TYPE= NMR SPECTRUM
##DATA CLASS= NTUPLES
##ORIGIN= UXNMR, Bruker Analytische Messtechnik GmbH
##OWNER= root
$$ XWIN-NMR		Version 3.5
$$ Thu Mar 20 16:59:02 2025 Russian Standard Time (UT+4h)  Yarkov@DPX200
##.OBSERVE FREQUENCY= 81.013821
##.OBSERVE NUCLEUS= ^31P
##.ACQUISITION MODE= SIMULTANEOUS
##.ACQUISITION SCHEME= undefined
##.AVERAGES= 64
##.DIGITISER RES= 17
##SPECTROMETER/DATA SYSTEM= spect
##.PULSE SEQUENCE= zgpg30
##.SOLVENT NAME= CDCl3
##.SHIFT REFERENCE= (INTERNAL, CDCl3, 0, 198.062)
##AUDIT TRAIL= $$ (NUMBER, WHEN, WHO, WHERE, WHAT)
$$ ##TITLE= Audit trail, XWIN-NMR		Version 3.5
$$ ##JCAMPDX= 5.01
$$ ##ORIGIN= Bruker BioSpin GmbH
$$ ##OWNER= Yarkov
$$ C:/Bruker/XWIN-NMR/data/yarkov2/nmr/P31/2/pdata/1/auditp.txt
$$ ##AUDIT TRAIL=  $$ (NUMBER, WHEN, WHO, WHERE, WHAT)
(   1,<2025-03-20 16:57:39.76 +0400>,<Yarkov>,<DPX200>,
      <created by zg, POWCHK disabled, PULCHK disabled
       configuration hash MD5:
       00 E9 B6 7A A2 85 ED C7 34 08 36 98 17 FE 4E 26
       data hash MD5: 32K
       23 E6 2C 83 7E 6E D5 29 9A 9B D4 AB E5 B8 BD 06>)
(   2,<2025-03-20 16:57:43.59 +0400>,<Yarkov>,<DPX200>,
      <Start of raw data processing
       efp BC_mod = 2 LB = 1.5 FT_mod = 6 PKNL = 1 PHC0 = 1802.344 PHC1 = 6.095414 SI = 64K 
       data hash MD5: 64K
       89 9B 47 92 4C BB 66 8C 01 9B E4 D7 41 57 00 4C>)
(   3,<2025-03-20 16:58:22.03 +0400>,<Yarkov>,<DPX200>,
      <pk PHC0 = 14.08952 PHC1 = -8 
       data hash MD5: 64K
       36 A6 97 E5 F6 0D 91 68 70 C0 82 FD 7C 37 67 F4>)
$$ ##END=
$$ 
$$ hash MD5
$$ 58 FF 01 70 3E 87 3F 11 EB 29 E7 D5 9C C3 D4 A9
##$RELAX= 
##$RELAX= 
##$RELAX= 
##$RELAX= 
##$RELAX= 
##$RELAX= 
##$RELAX= 
##$RELAX= 
$$ Bruker specific parameters
$$ --------------------------
##$DU= <C:/Bruker/XWIN-NMR>
##$EXPNO= 2
##$NAME= <P31>
##$PROCNO= 1
##$TYPE= <nmr>
##$USER= <yarkov2>
##$AMP= (0..31)
100 100 100 100 100 100 100 100 100 100 100 100 100 100 100 100 100 100 
100 100 100 100 100 100 100 100 100 100 100 100 100 100 
##$AQSEQ= 0
##$AQ_mod= 1
##$AUNM= <au_zg>
##$AUTOPOS= <>
##$BF1= 81.014009
##$BF2= 200.13
##$BF3= 200.13
##$BF4= 200.13
##$BF5= 200.13
##$BF6= 200.13
##$BF7= 200.13
##$BF8= 200.13
##$BYTORDA= 1
##$CFDGTYP= 0
##$CFRGTYP= 5
##$CHEMSTR= <none>
##$CNST= (0..31)
1 1 145 1 1 1 1 1 1 1 1 1 1 1 1 1 1 1 1 1 1 1 1 1 1 1 1 1 1 1 1 1 
##$CPDPRG= <waltz16>
##$CPDPRG1= <>
##$CPDPRG2= <waltz16>
##$CPDPRG3= <>
##$CPDPRG4= <mlev>
##$CPDPRG5= <mlev>
##$CPDPRG6= <mlev>
##$CPDPRG7= <mlev>
##$CPDPRG8= <mlev>
##$CPDPRGB= <>
##$CPDPRGT= <>
##$D= (0..31)
0 1 0 0 0 0 0 0 0 0.06 0 0.03 2e-05 3e-06 0 0 0.0002 0 0 0 0 0 0 0 0 0 
0 0 0 0 0 0 
##$DATE= 1742475459
##$DBL= (0..7)
120 120 120 11 120 120 24 19 
##$DBP= (0..7)
150 150 150 150 150 150 150 150 
##$DBP07= 0
##$DBPNAM0= <>
##$DBPNAM1= <>
##$DBPNAM2= <>
##$DBPNAM3= <>
##$DBPNAM4= <>
##$DBPNAM5= <>
##$DBPNAM6= <>
##$DBPNAM7= <>
##$DBPOAL= (0..7)
$$ [...]
##$SUBNAM3= <"">
##$SUBNAM4= <"">
##$SUBNAM5= <"">
##$SUBNAM6= <"">
##$SUBNAM7= <"">
##$SUBNAM8= <"">
##$SUBNAM9= <"">
##$SW= 400.765351723535
##$SWIBOX= (0..15)
0 1 3 0 0 0 0 0 0 0 0 0 0 0 0 0 
##$SW_h= 32467.5324675325
##$TD= 32768
##$TD0= 1
##$TE= 0
##$TE2= 300
##$TE3= 300
##$TEG= 300
##$TL= (0..7)
0 120 53 12 22 120 120 120 
##$TP= (0..7)
150 150 150 150 150 150 150 150 
##$TP07= 0
##$TPNAME0= <>
##$TPNAME1= <>
##$TPNAME2= <>
##$TPNAME3= <>
##$TPNAME4= <>
##$TPNAME5= <>
##$TPNAME6= <>
##$TPNAME7= <>
##$TPOAL= (0..7)
0.5 0.5 0.5 0.5 0.5 0.5 0.5 0.5 
##$TPOFFS= (0..7)
0 0 0 0 0 0 0 0 
##$TUNHIN= 0
##$TUNHOUT= 0
##$TUNXOUT= 0
##$USERA1= <user>
##$USERA2= <user>
##$USERA3= <user>
##$USERA4= <user>
##$USERA5= <user>
##$V9= 5
##$VALIST= <valist>
##$VCLIST= <CCCCCCCCCCCCCCC>
##$VD= 0
##$VDLIST= <DDDDDDDDDDDDDDD>
##$VPLIST= <PPPPPPPPPPPPPPP>
##$VTLIST= <TTTTTTTTTTTTTTT>
##$WBST= 1024
##$WBSW= 4
##$XGAIN= (0..3)
0 0 0 0 
##$XL= 0
##$YL= 0
##$YMAX_a= 8483
##$YMIN_a= -14099
##$ZGOPTNS= <>
##$ZL1= 120
##$ZL2= 120
##$ZL3= 120
##$ZL4= 120
##$ABSF1= 0
##$ABSF2= 0
##$ABSG= 0
##$ABSL= 0
##$ALPHA= 0
##$AQORDER= 0
##$ASSFAC= 0
##$ASSFACI= 0
##$ASSFACX= 0
##$ASSWID= 0
##$AUNMP= <proc_1d>
##$AZFE= 0.1
##$AZFW= 0.5
##$BCFW= 0
##$BC_mod= 2
##$BYTORDP= 0
##$COROFFS= 0
##$CY= -3
##$DATMOD= 1
##$DC= 0
##$DFILT= <>
##$DTYPP= 0
##$F1P= 0
##$F2P= 0
##$FCOR= 1
##$FTSIZE= 65536
##$FT_mod= 6
##$GAMMA= 0
##$GB= 0
##$INTBC= 1
##$INTSCL= 9.790993e-09
##$ISEN= 30
##$LB= 1.5
##$LEV0= 0
##$LPBIN= 0
##$MAXI= 10000
##$MC2= 0
##$MEAN= 0
##$ME_mod= 0
##$MI= 50
##$NCOEF= 0
##$NC_proc= -8
##$NLEV= 6
##$NOISF1= 182.463
##$NOISF2= 159.3651
##$NSP= 0
##$NTH_PI= 0
##$NZP= 0
##$OFFSET= 198.0616
##$PC= 4
##$PHC0= 1816.433
##$PHC1= -1.904586
##$PH_mod= 1
##$PKNL= yes
##$PPARMOD= 0
##$PSCAL= 0
##$PSIGN= 0
##$REVERSE= no
##$SF= 81.0140089999434
##$SI= 65536
##$SIGF1= 159.3651
##$SIGF2= -187.1042
##$SINO= 113.3802
##$SIOLD= 16384
##$SREGLST= <1H.CDCl3>
##$SSB= 0
##$STSI= 65536
##$STSR= 0
##$SW_p= 32467.5324675325
##$SYMM= 0
##$S_DEV= 0
##$TDeff= 32768
##$TDoff= 0
##$TI= <>
##$TILT= no
##$TM1= 0
##$TM2= 0
##$TOPLEV= 0
##$USERP1= <user>
##$USERP2= <user>
##$USERP3= <user>
##$USERP4= <user>
##$USERP5= <user>
##$WDW= 1
##$XDIM= 65536
##$YMAX_p= 109180210
##$YMIN_p= -312913060
$$ End of Bruker specific parameters
$$ ---------------------------------
##NTUPLES= NMR SPECTRUM
##VAR_NAME=  FREQUENCY,     SPECTRUM/REAL,   SPECTRUM/IMAG
##SYMBOL=    X,             R,               I
##VAR_TYPE=  INDEPENDENT,   DEPENDENT,       DEPENDENT
##VAR_FORM=  AFFN,          ASDF,            ASDF
##VAR_DIM=   65536,         65536,           65536
##UNITS=     HZ,            ARBITRARY UNITS, ARBITRARY UNITS
##FACTOR=    0.49542278885378, 1,            1
##FIRST=     16045.7642231865, 0,            0
##LAST=      -16421.768244346, 0,            0
##MIN=       -16421.768244346, -312913060,   0
##MAX=       16045.7642231865, 109180210,    0
$$ Real data points
##PAGE= N=1
##DATA TABLE= (X++(R..R)), XYDATA
$$ [...]
##PAGE= N=2
##DATA TABLE= (X++(I..I)), XYDATA
7488E462665p26379l142697k885850j693391n13044O65522J040780L2453p82870
7479b542811M07906K312551J849191j318844m093996m004549j768629N31996J844020
7470f783165K120741J532207N00994l60963p40466n28525M79078J987017K770275
7461I77193J890098L2631j224406j020162N38410K687184L679484J696074k357831
7452F898675m550272k568597P67118J254056p81721j671542n75954k96208j764930
7443c289375k188575j52683J458883J02755k084489j540706J474380L885607M273127
7434A938924L352328J438699j341177l163069k134899L15071P05022j499543k916626
7425c305270j089388K110598L204843J495213o61403r28189P34893K236765J290334
$$ plain form
7488 5462665 4736286 1593589 -1292261 -2985652 -3498696 -2833174 -1792394 -1759941 -2542811
7479 -2542811 -2134905 177646 2026837 707993 -3386003 -7390552 -9159181 -8627185 -6783165
7470 -6783165 -4662424 -3130217 -2629223 -2990186 -3730652 -4259177 -3780099 -1793082 977193
7461 977193 2867291 2899922 1675516 655354 1193764 3880948 7560432 9256506 6898675
7452 6898675 2348403 -220194 546924 1800980 1019259 -652283 -1228237 -1524445 -3289375
7443 -3289375 -5477950 -5630633 -4171750 -4068995 -6153484 -7694190 -6219810 -2334203 1938924
7434 1938924 5291252 6729951 5388774 2225705 90806 405877 1110899 -388644 -3305270
7425 -3305270 -4394658 -2284060 920783 2415996 1754593 826404 1561297 3798062 5088396
7416E088396k029963m472615k661773K494693N929899M048093r53381l802111
7408C641238k362921N71134J453863R3547j144781r59565m83659j101494k148043
7399b440681j762205K94922J949651J550892K48441L10317J599256J581341q33386
7390B498548l340585l279216j183455L14657J97560k21899Q2785N54831O58893
7381c717881R29895J609894J731291P01160k84104K68995J883571K640821J661564
7372G425206j61174j761032k886822l228086j905553J167264M082762M317640
7364G050205J500292j937003l313820k494378j523923j669037j817586l84968
7356d590218K046776L272434K439872R98684K96352k34275j456850k446025j729073
$$ plain form
7416 5088396 3058433 -1414182 -4075955 -1581262 4348637 8396730 7443349 3641238
7408 3641238 1278317 1849451 3303314 3396861 2252080 1292515 808856 -292638 -2440681
7399 -2440681 -4202886 -3907964 -1958313 -407421 -158980 151337 1750593 3331934 2498548
7390 2498548 -842037 -4121253 -5304708 -4990051 -4792491 -5014390 -4931605 -4376774 -3717881
7381 -3717881 -2787986 -1178092 553199 1254359 970255 1239250 3122821 5763642 7425206
7372 7425206 7264032 5503000 2616178 -611908 -2517461 -1350197 2732565 7050205
7364 7050205 8550497 6613494 3299674 805296 -718627 -2387664 -4205250 -4590218
7356 -4590218 -2543442 728992 3168864 4167548 4463900 4229625 2772775 326750 -1402323
7347a402323O2343P00849m78187j674030j252865K91877J644922K449244K790928
7338C132758K178527M30161j179561j154082P8450N92421l40357j160692j65102
7329B412523K037151L038951J495838j213159k599429k012354j170124j522463
7321D66934k103887j094282J104873K022100N27404j515739j766712k92926J079762
7312a572473J333729J037965J155540K035305L157885L252299J364223j564775
7304A0199698l161793k487751j269558j185312j349157k23458J282103J044092
7296B848864o76581j596164j214041j336894k276719j551256K055948N569167
7288A822324N230798J456983j867190k413202j652013k000432l415705l701501
$$ plain form
7347 -1402323 -1339980 -639131 -1117318 -2791348 -4044213 -3752336 -2107414 341830 3132758
7338 3132758 5311285 5741446 4561885 3407803 3486253 4078674 3738317 2577625 2412523
7329 2412523 4449674 7488625 8984463 7771304 5171875 3159521 1989397 466934
7321 466934 -1636953 -2731235 -1626362 395738 923142 -592597 -2359309 -2652235 -1572473
7312 -1572473 -238744 799221 1954761 3990066 7147951 10400250 11764473 10199698
7304 10199698 7037905 4550154 3280596 2095284 746127 522669 1804772 2848864
7296 2848864 2172283 576119 -637922 -1974816 -4251535 -5802791 -3746843 1822324
7288 1822324 7053122 8510105 6642915 4229713 2577700 577268 -2838437 -6539938
7280f539938j640333J036892J390157j003436l051658j860955J408655L167325
7272g093291K385911J448116J723471J346500r57044k606518o32984L198706M070637
7263B883504N94408l355887l756926r55164J838538K669288K159563J803423K153451
7254F034198K437295J532543m58949j812927j101089P08313J195798m00367k271238
7245E863577k592105j697275r02348k48223J227418L272094L843273J420330k640291
7236G546450m978041l792305r24863M19912l27156p64049N67154J739162L37623
7227a76113k506676l175767l69122L268811M709924L888942K633825J735618M41220
7218A0450662j722317l751944l952760j737655J270660K323887M82629j848872
$$ plain form
7280 -6539938 -8180271 -7143379 -5753222 -6756658 -9808316 -11669271 -10260616 -7093291
7272 -7093291 -4707380 -3259264 -1535793 -189293 -1146337 -3752855 -4385839 -1187133 2883504
7263 2883504 3477912 122025 -3634901 -4590065 -2751527 -82239 2077324 3880747 6034198
7254 6034198 8471493 10004036 9545087 7732160 6631071 7339384 8535182 8134815 5863577
7245 5863577 3271472 1574197 671849 423626 1651044 4923138 8766411 10186741 7546450
7236 7546450 2568409 -1223896 -2148759 -1728847 -2056003 -2820052 -2252898 -513736 -176113
7227 -176113 -2682789 -5858556 -6227678 -2958867 1751057 5639999 8273824 10009442 10450662
7218 10450662 8728345 4976401 1023641 -714014 556646 2880533 3363162 1514290
7210A514290j504153J400171L493325K535800Q2035j132747q66957r09201k021811
7201B590752l198535l598215l474155l027004j798820K67268K200685L042656
7193f995368K826048K050386Q78246m90516j186526l43973J604035L024845K715259
7184D082436R89305r85488k331637k594057j463724P20154K518968K559769J256951
7175D752677L28832L40105n6811j749223l252192k470094K60430K268470J606417
7166B028611r95197l201700l309338j483125N55264J155666M64459J24741R41607
7157c719012J787729J503776O31942Q7182n18390j497069j396021R06758L412521
7148A199416L207366R60301L5798J217593J905595J046355Q16816J918966J354532
$$ plain form
7210 1514290 10137 1410308 4903633 7439433 7521468 6388721 5521764 4612563 2590752
7201 2590752 -607783 -4205998 -7680153 -10707157 -12505977 -12238709 -10038024 -6995368
7193 -6995368 -4169320 -2118934 -1240688 -1731204 -2917730 -3261703 -1657668 1367177 4082436
7184 4082436 5071741 4086253 1754616 -839441 -2303165 -1583011 935957 3495726 4752677
7175 4752677 5081509 5421614 5364803 3615580 363388 -2106706 -1846276 422194 2028611
7166 2028611 1033414 -2168286 -5477624 -6960749 -6405485 -5249819 -4785360 -4660619 -3719012
7157 -3719012 -1931283 -427507 204435 291617 -226773 -1723842 -3119863 -2213105 1199416
7148 1199416 4406782 5367083 5402881 6620474 8526069 9572424 10389240 12308206 13662738
7139A3662738k366319n426820l902316j00943P00849j708652k497381L83853L100717
7130A845726J961270j208089k013994M63803L008863K690214O2624j962923j413233
7121C434261P90181J936297N07848k243389l914839l535880j958149l38968Q34588
7112d488050J568510K017725K148279J516226R7815o62555P13079K776498J999482
7103G687009k009964m793177l058018J20637j66606k852736k556877J457896L573548
7094b598288N02205l450886k937355N11341J330990j473975l131228k94203M390892
7085g150507O160112M119233J447037O39301O53132o17181k561625k559489l17194
7076a87181J019589o06191k843285k499358m79742J29907m68826N61738K953343
$$ plain form
7139 13662738 11296419 5869599 1967283 1866340 2567189 858537 -1638844 -1254991 1845726
7130 1845726 3806996 2598907 584913 1048716 4057579 6747793 6810417 4847494 3434261
7121 3434261 4224442 6160739 6668587 4425198 510359 -3025521 -4983670 -5322638 -4488050
7112 -4488050 -2919540 -901815 1246464 2762690 2860505 2197950 2911029 5687527 7687009
7103 7687009 5677045 883868 -2174150 -2053513 -2220119 -5072855 -7629732 -6171836 -2598288
7094 -2598288 -2096083 -5546969 -8484324 -7972983 -6641993 -8115968 -11247196 -11541399 -7150507
7085 -7150507 -990395 3128838 4575875 5215176 5868308 5251127 2689502 130013 -187181
7076 -187181 832408 226217 -2617068 -5116426 -5596168 -5466261 -5935087 -5373349 -2420006
7067b420006K959589l79159l167058k661285j079424r16430n75948J875889M121235
7058b242597L036359K63420j69853J717397K227249K2335k379999k998905k475155
7049b999749j533520J78008K139412K845604K303751K047475K173474J003593
7041H158048j621504l258477k119113N40077K168388J536702p61573k815292k376818
7032e49562P37798L303177K031486j716249l255972r68689J661015J381834m95712
7023B129126q97793L94715J204815M13213j144522k219049k015154m56657J200910
7014a390396J109042p09958j871032p66475J118731J387440O211j124801r42851
7005c184089p2945M65567K16912m86739m65837J262320L655464M099410J658444
$$ plain form
7067 -2420006 539583 160424 -3006634 -5667919 -6747343 -7663773 -8239721 -6363832 -2242597
7058 -2242597 793762 1057182 887329 2604726 4831975 4854310 2474311 -524594 -2999749
7049 -2999749 -4533269 -4355261 -2215849 629755 2933506 4980981 7154455 8158048
7041 8158048 6536544 3278067 1158954 1699031 3867419 5404121 4642548 1827256 -549562
7032 -549562 188236 3491413 5522899 3806650 550678 -418011 1243004 2624838 2129126
7023 2129126 1231333 1626048 2830863 3244076 2099554 -119495 -2134649 -2591306 -1390396
7014 -1390396 -281354 -991312 -2862344 -3628819 -2510088 -1122648 -1116437 -2241238 -3184089
7005 -3184089 -3257034 -2791467 -2574555 -3061294 -3527131 -2264811 1390653 5490063 7148507
6996G148507j462080k859927k882028l118198l399059k385576l20181R66289O37778
6987g674475j95218j07926J154621K578545K472996r4718l528605m470334j668397
6978a1533511K021116L074072J584262K02469j1307r1684k09908P61840K495402
6969a707249K829294J058672o72564m47551P77325R20392k24801j150904r65720
6960D16894k98718j38036n03121l40460J187188L118337L117415L94110k606626
6951D346983k980866j220871k71114j087121j719755j078479o34145j151205n44201
6942f340774K824171O726493P456809M450662L42912k537585l542296k606015
6934F774377m06500Q22063p22273l520771m192568k035414K82955R45715J226572
$$ plain form
6996 7148507 5686427 2826500 -55528 -3173726 -6572785 -8958361 -9278542 -8312253 -7674475
6987 -7674475 -7869693 -7977619 -6822998 -4244453 -1771457 -1866175 -5394780 -9865114 -11533511
6978 -11533511 -9512395 -6438323 -4854061 -4651592 -4662899 -4754583 -4964491 -4202651 -1707249
6969 -1707249 1122045 2180717 1508153 1060602 1837927 2758319 2533518 1382614 416894
6960 416894 118176 -19860 -522981 -863441 323747 3442084 6559499 6953609 4346983
6951 4346983 1366117 145246 -125868 -1212989 -2932744 -4011223 -4645368 -5796573 -6340774
6942 -6340774 -3516603 3209890 10666699 15117361 15460273 12922688 9380392 6774377
6934 6774377 6367877 7189940 6467667 2946896 -1245672 -3281086 -2998131 -2052416 -825844
6925h25844K477975L467757K527101M01746j088579j773159k427169k613044j603904
6916a457120n80541j251955k612329j846516J233091L343928K220118m32399j730627
6907c114350j267097m00183K64826P75191O26937l18742p74221J70243J168199
6898b869197N74217p40809q96051l76408r88543j995649p77508K363968L711765
6889a994215J663408o30867o7902J976782K478677J444147P71005M23761q30957
6880E233839k040915r68249J877246L274320J697481r00199k156145j871632j023005
6871C122741l35102m96977j890753l352250k883386l87978J765620J649334q0680
6862b889431j594920k109033j911015j335253n97809R2844Q43293J864521K718143
$$ plain form
6925 -825844 1652131 5119888 7646989 8048735 6960156 5186997 2759828 146784 -1457120
6916 -1457120 -2037661 -3289616 -5901945 -7748461 -6515370 -3171442 -951324 -1383723 -3114350
6907 -3114350 -4381447 -4781630 -4516804 -3741613 -3114676 -3433418 -4207639 -4037396 -2869197
6898 -2869197 -2294980 -3035789 -3931840 -4308248 -5296791 -7292440 -8069948 -5705980 -1994215
6889 -1994215 -330807 -961674 -1029576 947206 3425883 4870030 5641035 6064796 5233839
6880 5233839 3192924 2224675 4101921 7376241 9073722 8173523 6017378 4145746 3122741
6871 3122741 2787639 2290662 399909 -2952341 -5835727 -6223705 -4458085 -2808751 -2889431
6862 -2889431 -4484351 -6593384 -8504399 -9839652 -10437461 -10344617 -9501324 -7636803 -4918660
6853d918660K573822J402566R6368o77038q88666m92341O23195J977188K635568
6844B332002J979624n3854k664143l599625p57208M105003N583139J347133l545211
6835D726860k955018J585703L535322J502090J79924R49469p02642n803308p704031
6826d685631k306024M076147L677102j013183k121141Q11803J535252j312403
6818a338078k380447L48443K171179K32811j915802j102830N81351R13565J677366
6809h12442L916218M357580R65930k392486j513393J591478K394004Q69513o4321
6800I312081k97278j442001k190683l48903J887303M59877l281690l688974L32266
6791G41998L288404J527772j513457j265258R81070P08455k781747n670075m944104
$$ plain form
6853 -4918660 -2344838 -942272 -845904 -1522942 -2411608 -2903949 -2280754 -303566 2332002
6844 2332002 4311626 4257772 1593629 -2005996 -2763204 1341799 6924938 8272071 4726860
6835 4726860 1771842 3357545 6892867 8394957 8574881 9524350 8821708 3018400 -4685631
6826 -4685631 -6991655 -2915508 761594 -251589 -2372730 -1560927 -25675 -1338078
6818 -1338078 -3718525 -3370082 -1198903 -966092 -2881894 -3984724 -3403373 -2489808 -812442
6809 -812442 3103776 7461356 8427286 6034800 4521407 6112885 8506889 9376402 9312081
6800 9312081 9014803 7572802 5382119 5033216 6920519 7380396 4098706 409732 741998
6791 741998 4030402 5558174 4044717 2779459 3760529 4468984 1687237 -3982838 -8926942
6782h926942j545954J607747K794258K472373K110332K285388K055221P08648
6774C561071m90058J07947J487624Q22631k125211l944975k245565Q10454J615003
6765d01079J33070n69248J005390L005574L168031J563735j98666j159571j496545
6756E050691j497023j025483j28620N10102M26126M56846J788019L544620K949674
6747A2074952p45685m082992l564554q78855o08602l028275l411931L09687L624607
6738c11648K069362j836695k399122Q39221L105071J766564q67808k086534j870670
6729a592259q18281J100494K576108J425179j376407j621873J986386M853421
6721F532768K565405k642599m980260k974707m94437n57346j790803j563606K80840
$$ plain form
6782 -8926942 -10472896 -8865149 -6070891 -3598518 -1488186 797202 2852423 3561071
6774 3561071 3071013 3178960 4666584 5489215 3364004 -580971 -2826536 -2016082 -401079
6765 -401079 -268009 -837257 168133 3173707 6341738 7905473 7706807 6547236 5050691
6756 5050691 3553668 2528185 2399565 2909667 3335793 3792639 5580658 9125278 12074952
6747 12074952 11329267 7246275 3681721 2802866 2194264 -834011 -4245942 -3936255 -311648
6738 -311648 1757714 -78981 -2478103 -1638882 1466189 3232753 2364945 278411 -1592259
6729 -1592259 -2410540 -1310046 1266062 2691241 1314834 -307039 1679347 6532768
6721 6532768 9098173 6455574 1475314 -1499393 -1993830 -2551176 -4341979 -5905585 -5624745
6712e624745J965151K175774R10362q22604j480853j96243J995229K958990J791396
6703C672457l27566j584403j097914P06917K370314K365953P81323m89784l66074
6694F031223m55698k479513m754134m042345p14323J246371J65814p75989J300338
6685d478256M333348M503016J744467r81898k269962k855514k802754j642593
6677d450146p52127j907841l461847j836128K472084M431384J714403j483810
6669e274028o24637K516381L132195R01759l45167O22232R35414p17505j597659
6660d51015J32902J855967O61126j833007k159485n80352k62482j746286k127079
6651f509711j08495J718864J061803n36474m86137O47324L75406j450761k394327
$$ plain form
6712 -5624745 -3659594 -1483820 -573458 -1396062 -2876915 -3073158 -1077929 1881061 3672457
6703 3672457 3344891 1760488 662574 1369491 3739805 6105758 6887081 6397297 6031223
6694 6031223 5575525 3096012 -1658122 -5700467 -6414790 -5168419 -5002605 -5778594 -4478256
6685 -4478256 -144908 4358108 6102575 5120677 2850715 -4799 -2807553 -4450146
6677 -4450146 -5202273 -7110114 -10571961 -12408089 -9936005 -5504621 -3790218 -5274028
6669 -5274028 -5898665 -3382284 -250089 651670 306503 928735 1864149 1146644 -451015
6660 -451015 -318113 1537854 2198980 365973 -1793512 -2373864 -2636346 -4382632 -6509711
6651 -6509711 -6618206 -4899342 -3837539 -4374013 -4860150 -4212826 -3837420 -5288181 -7682508
6642g682508j234212N11244J318543J722280K610768L198825K258858M22307l68421
6633B757684N18696J624623J388412m3336j363323j820999j861319k218782k777822
6624c796166k561778r28547J338014K446298J323505j164478k889910k413128
6616h646190l05827J419869J281340k47106j462445j508232j080906q41992j81143
6607a1572632J425665K703321J918193l21281j484888n86355P01019J019585J314906
6598d882467K523975L187299J437200j756523l476470k515673l66497J077797
6590d771359J177076K43372p91221o18863J076864K781823K999841K312570K035125
6581F445228J731874K74127j323457q54907J381920K564289J277619j085813l050576
$$ plain form
6642 -7682508 -8916720 -8405476 -7086933 -5364653 -2753885 444940 2703798 3126105 2757684
6633 2757684 3276380 4901003 6289415 6246079 4882756 3061757 1200438 -1018344 -3796166
6624 -3796166 -6357944 -7286491 -5948477 -3502179 -2178674 -3343152 -6233062 -8646190
6616 -8646190 -8952017 -7532148 -6250808 -6497914 -7960359 -9468591 -10549497 -11391489 -11572632
6607 -11572632 -10146967 -7443646 -5525453 -5846734 -7331622 -7917977 -7216958 -6197373 -4882467
6598 -4882467 -2358492 828807 2266007 509484 -2966986 -5482659 -5849156 -4771359
6590 -4771359 -3594283 -3350911 -4142132 -4760995 -3684131 -902308 2097533 4410103 6445228
6581 6445228 8177102 8451229 7127772 6272865 7654785 10219074 11496693 10410880 7360304
6572G360304m376622m382993k209813N16216P47476j106776j072694J979582L873748
6563A328428J625111j618763j662580L15759P34199p5258M65531J539264N25694
6554C177385j238043j60035K776298K955625J12996q86038J516247K615955n82145
6545A0288245m209280l908076j442955o60501q62829R13111L822296M402294K232050
6536A0574355l3811j247345k371862l226822k438857m23209Q53393R56449J007096
6527C649387J016751O8415j240583j491448j268000k263226l789376l413887j165235
6518i897202K19692k76309n40944Q09583K264365K267858J433416O84994j12746
6509c147293l91583J381461M464808N121853J470687l210109m592970k883591
$$ plain form
6572 7360304 2983682 -1399311 -3609124 -3092908 -2345432 -3452208 -4524902 -2545320 1328428
6563 1328428 2953539 1334776 -327804 -12045 722154 646896 1112427 2651691 3177385
6554 3177385 1939342 1779307 4555605 7511230 7624226 6738188 8254435 10870390 10288245
6545 10288245 6078965 2170889 727934 67433 -795396 117715 3940011 8342305 10574355
6536 10574355 10540544 9293199 6921337 3694515 1255658 832449 1685842 2642291 3649387
6527 3649387 4666138 4734553 3493970 2002522 734522 -1528704 -5318080 -8731967 -9897202
6518 -9897202 -9677510 -9953819 -10494763 -9685180 -7420815 -5152957 -3719541 -3034547 -3147293
6509 -3147293 -3538876 -2157415 2307393 7429246 8899933 5689824 1096854 -1786737
6501a786737j527071j765569j643458M8963J832751J989105P85285m48584r94803
6492c510118q43255j14459R71405J926506K057120P96861j490933l013500k025823
6483e246196N82948J540685p37203l528474l028253N57871L269045K675614P61346
6474c152617P68785K839185M154727K653258p45245l590517m549533m098454l133245
6465h853656j798388R7557K209943L748748L997454K380755j018618m153083l646992
6456g036280J170158N787633N049086J53829k331018N38398L830955J905850l489571
6447E579040o036061l651024j90007Q18923j07027j132346j636513j075404J278125
6438f152294M014719L934431N28309k294800j064028K478869L687161R49220k788541
$$ plain form
6501 -1786737 -3313808 -5079377 -6722835 -6673872 -4841121 -2852016 -2066731 -2515315 -3510118
6492 -3510118 -4353373 -4467832 -3496427 -1569921 487199 1284060 -206873 -3220373 -5246196
6483 -5246196 -4663248 -3122563 -3859766 -7388240 -10416493 -9858622 -6589577 -3913963 -3152617
6474 -3152617 -2383832 455353 4610080 7263338 6518093 2927576 -1621957 -5720411 -8853656
6465 -8853656 -10652044 -10554487 -8344544 -4595796 -598342 1782413 763795 -3389288 -7036280
6456 -7036280 -5866122 -78489 4970597 5124426 2793408 3331806 7162761 9068611 5579040
6447 5579040 -457021 -4108045 -4298052 -3479129 -3586156 -4718502 -6355015 -7430419 -6152294
6438 -6152294 -2137575 1796856 2325165 30365 -1033663 1445206 5132367 6081587 3293046
6429C293046l919640j859264J100251K410310J564052K53994K40128J249339J664324
6420E996540R54601K4012q13648k253196l773675l110540N21068M205054M276222
6411F026438Q36879k340737k248868K54202J841008M58839k519747l860909k296690
6402c849585j12410O9769q63273j16731J972343J776287j794206m681830l135912
6393a0735548R60267L088781K307208J174341R97758Q29802N25353J120631K035017
6384B303610J209322j344214k994202k315938r30327n64350n92206K68831J661459
6375c298015K245815J407272m12847j890484j128063K461969O223936O238020
6367A1847603K018100k590779m033823k755508j379847j088668j180991q37707
$$ plain form
6429 3293046 -626594 -2485858 -1385607 1024703 2588755 2842749 3082877 4332216 5996540
6420 5996540 6951141 6975153 6161505 3908309 134634 -2975906 -2454838 1750216 6026438
6411 6026438 6863317 4522580 2273712 2527914 4368922 4827761 2308014 -1552895 -3849585
6402 -3849585 -3961995 -3892226 -4755499 -4872230 -2899887 -1123600 -2917806 -7599636 -10735548
6393 -10735548 -9775281 -6686500 -4379292 -3204951 -2207193 -1377391 -852038 268593 2303610
6384 2303610 3512932 2168718 -825484 -3141422 -4071749 -4636099 -5228305 -4959474 -3298015
6375 -3298015 -1052200 355072 -57775 -1948259 -3076322 -614353 5609583 11847603
6367 11847603 13865703 11274924 7241101 4485593 3105746 2017078 836087 -1620
6359a620K6358Q42224O52164p36650j757271q36024Q33162N60035j417979j622252
6349c457853J449565M700466M789245K436256K64400j092284k148505k151344
6341D789946n24507J036496R15479M50981J414607K247852M06776k720983l186839
6332D829808l22903K515402K919431J586610l85853k577613l401395j197680K031778
6323E997585J926399j921709m725985l186659L02512K179551K724691L672851
6315F969236M046915K032324j051451k224889j127368J29644L80463K9846p16025
6306H468695j627861j418006M46539J806766M36698k234178l042749k076794k229452
6297a470342l814001l530500L7821L452806L187079P93007N17685L159885N183358
$$ plain form
6359 -1620 24738 866962 1519126 782476 -974795 -1810819 -977657 -417622 -1835601 -3457853
6349 -3457853 -2008288 2692178 7481423 9917679 10182079 9089795 6941290 4789946
6341 4789946 4265439 5301935 6217414 6668395 8083002 10330854 10737630 8016647 4829808
6332 4829808 4506905 7022307 9941738 11528348 11142495 8564882 5163487 3965807 5997585
6323 5997585 7923984 6002275 1276290 -1910369 -1607857 571694 3296385 6969236
6315 6969236 11016151 13048475 11997024 9772135 8644767 8774411 9154874 9184720 8468695
6306 8468695 6840834 5422828 5869367 7676133 8112831 5878653 2835904 759110 -1470342
6297 -1470342 -5284343 -8814843 -8777022 -5324216 -2137137 -1344130 -826445 2333440 7516798
6288G516798L762340K89147j920207j842133j329265j995528k964140k385753
6280h68741l78653Q63259k7975j857658k623122j891059n45593P89211J834137
6271d706194J969783R56126r2846R1047R80583Q99025m96046j759547j721049
6262c879118o88994N11343J419769J647247R34791j01379k83153O61589J667355
6253A889450J591887L52114j130615j592529m63247J098455J036757p05093j351871
6244G25308Q31646L111230J613154k492317l812656m37995K913530J500608k746239
6235A206269m138452r75570K846126L254859K13915l413427m824577k769641J880708
6226f719790O175856O925743L491899j506126m533298m121227j820180m82545
$$ plain form
6288 7516798 11279138 11568285 9648078 7805945 6476680 4481152 1517012 -868741
6280 -868741 -1247394 -384135 -412110 -2269768 -4892890 -6783949 -7329542 -6540331 -4706194
6271 -4706194 -2736411 -1780285 -1873131 -1782084 -801501 97524 -398522 -2158069 -3879118
6262 -3879118 -4568112 -4056769 -2637000 -989753 -54962 -156341 -439494 222095 1889450
6253 1889450 3481337 3833451 2702836 1110307 647060 1745515 2782272 2077179 725308
6244 725308 1556954 4668184 6281338 3789021 -23635 -461630 2451900 3952508 1206269
6235 1206269 -2932183 -3907753 -1061627 2193232 2407147 -1006280 -5830857 -8600498 -6719790
6226 -6719790 -543934 6381809 9873708 8367582 3834284 -286943 -2107123 -2589668
6218b589668j283422k379721j228457J802002L538443K180553l70196j473946
6210a804412j255532j321884j500657l81349J633085K473671J590199O65032Q95080
6201I93233J649549K150021K415423K097153M97970j611963k367508j832506k324263
6192A667109m474502n436777l027705M92917J418164j61095j045159J16757J727313
6183h722978K678228L469508L602840J439850k077286k944919M14976L917242
6175A777461K973513j070892l005018j120731J143396Q54513o52828o87479Q82687
6166A094622K146000J775445j16093k383257l284914j911148K69650Q81012o7720
6157a596403n25469k91369j393812l515995k905124J647974N427016M117862M43667
$$ plain form
6218 -2589668 -3873090 -6252811 -7481268 -5679266 -2140823 39730 -330466 -1804412
6210 -1804412 -3059944 -4381828 -5882485 -6263834 -4630749 -2157078 -566879 98153 993233
6201 993233 2642782 4792803 7208226 9305379 9803349 8191386 5823878 3991372 1667109
6192 1667109 -2807393 -8244170 -11271875 -10778958 -9360794 -9521889 -10567048 -10450291 -8722978
6183 -8722978 -6044750 -2575242 1027598 2467448 390162 -2554757 -2139781 1777461
6175 1777461 4750974 3680082 675064 -445667 697729 1552242 899414 211935 1094622
6166 1094622 3240622 5016067 4899974 2516717 -768197 -2679345 -2409695 -1528683 -1596403
6157 -1596403 -2121872 -2413241 -3807053 -7323048 -10228172 -8580198 -3153182 964680 1408347
6148A408347j53600J950196J920840r72084k397030o73672Q09592J91850Q8000
6139B172439J584142J114128l059261o312526m147085P99167L106725K652768
6131b089503L012581M282857L367194K73003j560496j149512j052566k052519
6123C031039j530097J582511M299517L767693Q44184k010918l715618m117766
6115B150545l128196j727166j640576k683946k385808N15752L980225N216727
6107B97557L791107J278872o55758j002893K91099J893454K063239N39441j479451
6098G016667l018467l638354k708974m33731R70836k82231k280783j604731J322870
6089d656898K587134Q54729q18729l43729L31662n08906q97617J107181L423387
$$ plain form
6148 1408347 1254747 3204943 5125783 4153699 1756669 1082997 1892589 2084439 2172439
6139 2172439 3756581 4870709 1811448 -4501078 -8648163 -7848996 -4742271 -2089503
6131 -2089503 923078 5205935 8573129 8846132 7285636 6136124 5083558 3031039
6123 3031039 1500942 3083453 7382970 11150663 11994847 9983929 6268311 2150545
6115 2150545 -977651 -2704817 -4345393 -7029339 -9415147 -8899395 -4919170 297557
6107 297557 4088664 5367536 4711778 3708885 3999984 5893438 7956677 8496118 7016667
6098 7016667 3998200 359846 -2349128 -2782859 -1812023 -2094254 -4375037 -5979768 -4656898
6089 -4656898 -2069764 -1215035 -2033764 -2377493 -2045831 -2554737 -3452354 -2345173 1078214
6080A078214L009330O21103p77150n67891k59979j73150M00267O30539j092638
6071B868645m035682n304641l330828M81616L476099L977805K387234R56009J505865
6062B982122K732839J520955k205494m454415k668998M16763R25378o05593r84421
6053b340864K40309P61752k33536j297705j651628j794424j591676n35668N28754
6044g914686N23866L64535J489032K974268K869268J539372P43684L20969r39581
6035A970727k034581j088445O20600L9198k341905k744748j35794K139475J726196
6026a849277L75376L24139J073455J387459J485773J667710J324629N41973K61987
6017F593224J08962j284385l364907m191275m119705n140291o147464l600374
$$ plain form
6080 1078214 4087544 4708647 3931497 3363606 3103627 2930477 3330744 3961283 2868645
6071 2868645 -1167037 -6471678 -9802506 -9320890 -5844791 -1866986 520248 1476257 2982122
6062 2982122 5714961 7235916 5030422 576007 -2092991 -1676228 -750850 -1356443 -2340864
6053 -2340864 -2100555 -1338803 -1572339 -2870044 -4521672 -6316096 -7907772 -8443440 -7914686
6044 -7914686 -7390820 -7026285 -5537253 -2562985 306283 1845655 2589339 2910308 1970727
6035 1970727 -63854 -1152299 -531699 -492501 -2834406 -5579154 -5714948 -3575473 -1849277
6026 -1849277 -1473901 -1149762 -76307 1311152 2796925 4464635 5789264 6331237 6593224
6017 6593224 6702186 5417801 2052894 -2138381 -6258086 -11398377 -17545841 -21146215
6009b1146215J896051M865674L006802P26666J629124K846783J071874q89946
6001e993187P76982L343564J675757k777915m103786j642455n29331k562614l407297
5992a5220282l32311L320075L818167K222145J054732j2074j868211k711944p79244
5983a0508947J841421J724430p14534j777709J85814K837825L507696K449008
5975d54996J525169J328554J110277Q33844J470780K805239K586695n39173m174761
5966F491628m528645j549460R19934P23275N0994Q95322J175437j419627m326990
5957a568132l189629J199846L614187J927202n13520p40785o6142n04893j157107
5948i98973n65021K94415k4365p71925p97426r82625k290730l155956j699700
$$ plain form
6009 -21146215 -19250164 -14384490 -11377688 -10651022 -9021898 -6175115 -5103241 -5993187
6001 -5993187 -5216205 -1872641 -196884 -2974799 -7078585 -8721040 -9250371 -11812985 -15220282
5992 -15220282 -15552593 -12232518 -8414351 -6192206 -5137474 -5149548 -7017759 -9729703 -10508947
5983 -10508947 -8667526 -6943096 -7657630 -9435339 -9249525 -6411700 -2904004 -454996
5975 -454996 1070173 2398727 3509004 4342848 5813628 8618867 11205562 10666389 6491628
5966 6491628 1962983 413523 1333457 2056732 2107726 3003048 4178485 2758858 -1568132
5957 -1568132 -4757761 -3557915 56272 1983474 1469954 729169 663027 158134 -998973
5948 -998973 -1563994 -1269579 -1293944 -2065869 -2863295 -3845920 -6136650 -9292606 -10992306
5939a0992306P10404J111801n42317j452686l34999J122251J435860J304722J615900
5930f021370J798985J393801J356521K235127K480418M94744k368169k883596
5922a513539j61817K897463L058691N05975j841772k067863j066467o86166j285931
5913b161426j769841j352457l86698M58440J052423J504094J493356N33875j048714
5904a676948j969399j304714K97568J349838J294303O29394o47713l113915n728775
5895a0870361n502556j285844L467771M346737J746733P8958J360717K970954
5887c686891K494653J222313J051559J110343J4630j062999m56587Q33934R26433
5878B447388K96671L23250K55398j136461k347710j194111R71899R36080j106879
$$ plain form
5939 -10992306 -10281902 -9170101 -9712418 -11165104 -11500103 -10377852 -8941992 -7637270 -6021370
5930 -6021370 -4222385 -2828584 -1472063 763064 3243482 3738226 1370057 -1513539
5922 -1513539 -1675356 1222107 4280798 4786773 2945001 877138 -189329 -875495 -2161426
5913 -2161426 -3931267 -5283724 -5670422 -5211982 -4159559 -2655465 -1162109 -628234 -1676948
5904 -1676948 -3646347 -4951061 -4653493 -3303655 -2009352 -1379958 -2027671 -5141586 -10870361
5895 -10870361 -16372917 -17658761 -14190990 -9844253 -8097520 -8018562 -6657845 -3686891
5887 -3686891 -1192238 30075 1081634 2191977 2206607 1143608 687021 1520955 2447388
5878 2447388 2744059 3067309 3322707 2186246 -161464 -1355575 -383676 552404 -554475
5869e54475j915652o05916L84213o9185l38072P0613o12973k363867k202962R56055
5859g252221L793435L198032N37432r05370l09490R25657J605983J132706m39059
5850B287105j359003L34287L057423K558057j744017m846510l089159N61791J418070
5841h21956n7772l79830O37515M29869j064132j491992p23491r16899k070464
5832f459152j704481N57396J835804L55978k061560k869100j786286j75951O31780
5823a1675572k627j362167j457721N41277K574571K382609R36656O31923J186510
5814f244541O16999n82039j68370J262059P73899j421566j520108J594921M007197
5805a681549K677155k46136j393605q45427j51324Q81393K213623J467162k394722
$$ plain form
5869 -554475 -2470127 -3076043 -2691830 -2761015 -3099087 -3028474 -3641447 -6005314 -8208276 -7252221
5859 -7252221 -3458786 -260754 276678 -628692 -938182 -12525 1593458 2726164 2287105
5850 2287105 928102 1262389 4319812 6877869 5133852 287342 -2801817 -2240026 -821956
5841 -821956 -879728 -1259558 -622043 -192174 -1256306 -2748298 -3471789 -4388688 -6459152
5832 -6459152 -8163633 -7606237 -5770433 -5414455 -7476015 -10345115 -12131401 -12307352 -11675572
5823 -11675572 -11678199 -13040366 -14498087 -13956810 -11382239 -8999630 -8062974 -7431051 -6244541
5814 -6244541 -5627542 -6209581 -6377951 -5115892 -4341993 -5763559 -7283667 -5688746 -1681549
5805 -1681549 995606 749470 -644135 -1489562 -1640886 -759493 1454130 2921292 526570
5796E26570n627476m058707O62681L256369K240777R30559J282349J168978j151389
5787g69289l565786l137639k36355K354094K939718J801005l05033k666607l960619
5778g546511k728237Q57434M381035N136269K832265r1512j198684o39038l01649
5769G01372r09571j357534r39648n01082p07428p98880j44151M36644K67680L96988
5759c555610J863723L396694K779272K167k673522l429088k126897N76553L476688
5750C09980M545157K549292q65346k577094j766171n10169k94738k8869J461305
5741B823347K794535J609450j991462n052075m829579j586265J683159K140667
5733b408223q7896k085489j448863J017146K612345K130402O93237l36501n92832
$$ plain form
5796 526570 -5100906 -9159613 -8496932 -5240563 -2999786 -2069227 -786878 382100 -769289
5787 -769289 -4335075 -7472714 -7709069 -5354975 -2415257 -614252 -919285 -3585892 -7546511
5778 -7546511 -10274748 -9417314 -5036279 99990 2932255 2840743 1642059 1003021 701372
5769 701372 -208199 -1565733 -2505381 -3006463 -3713891 -4512771 -4656922 -4220278 -3952598 -3555610
5759 -3555610 -1691887 1704807 4484079 4486246 1812724 -1616364 -3743261 -3166708 309980
5750 309980 4855137 7404429 6539083 3961989 2195818 1685649 1390911 1362042 2823347
5741 2823347 5617882 7227332 5235870 183795 -4645784 -6232049 -4548890 -2408223
5733 -2408223 -2496119 -4581608 -6030471 -5013325 -2400980 -270578 422659 86158 -506674
5724e06674N4962J613119K988866K749611J353893P21243J013847J92350k115856
5715H065361k983302n53802K285868J631231j576996k917462j063195P50160J87198
5706C825061r23262k54306J129399Q29471r44935j946516j298515j42160N21719
5697G95956O94808L54662o86892j833659k033998j285992p29206j032206j572357
5688g328884j370125j10898J763330L247729L193154J456155l99729n72027O90809
5679E69514J331182K96933j037318r12255L71685J102861O70335J94846O40093
5670C227876J382591J219087J67327n68386l50922K1243l44884r06732m67944
5661C379256P35630R78563n51603k412170k668501j057020J379773L681421M778068
$$ plain form
5724 -506674 -451712 1161407 4150273 6899884 8253777 8975020 9988867 10181217 8065361
5715 8065361 5082059 4528257 6814125 8445356 6868360 3950898 2887703 3637863 3825061
5706 3825061 2901799 2647493 3776892 4606363 3661428 1714912 416397 274237 795956
5697 795956 1490764 1845426 1158534 -675125 -2709123 -3995115 -4724321 -5756527 -7328884
5688 -7328884 -8699009 -8809907 -7046577 -3798848 -605694 850461 450732 -121295 569514
5679 569514 1900696 2197629 1160311 248056 619741 1722602 2392937 2587783 3227876
5670 3227876 4610467 5829554 5996881 5428495 5077573 5098816 4753932 3847200 3379256
5661 3379256 4114886 5093449 4541846 2129676 -538825 -1595845 -216072 3465349 8243417
5652H243417L096253j594824o337425p170723l569459R16534K798392J860574
5644a757261k4225j335011j307322K90399K419763L038362J399887q17303j708509
5635A98780j450161j311574j418234q69787O19009K425203L787603L907682K137115
5626H025636p76729k498997j551123O47277J438749O6796j955667k850786j774576
5617a229420R84778L525590L136745m83135l679038k749293J152102L408655J914864
5608E981848r68749k479131k568801k182892j180132M66735J442826Q48319j47692
5599g87669M8003J158449J690774J013516l60256j727707k354406j531397L14666
5590b536027J231370k36895k911794l985067k185607Q23019K338526J462634j51750
$$ plain form
5652 8243417 11339670 9744846 3407421 -3763302 -7332761 -6416227 -3617835 -1757261
5644 -1757261 -1781486 -3116497 -4423819 -4133420 -1713657 1324705 2724592 1907289 198780
5635 198780 -1251381 -2562955 -3981189 -4850976 -4231967 -1806764 1980839 5888521 8025636
5626 8025636 7248907 4749910 3198787 3846064 5284813 5351609 3395942 545156 -1229420
5617 -1229420 -244642 3280948 6417693 5934558 2255520 -493773 658329 4066984 5981848
5608 5981848 5013099 2533968 -34833 -2217725 -3397857 -2931122 -1488296 -639977 -787669
5599 -787669 -739666 418783 2109557 3123073 2762817 1035110 -1319296 -2850693 -2536027
5590 -2536027 -1304657 -1541552 -4453346 -8438413 -10624020 -9801001 -7462475 -5999841 -6151591
5581f151591l41071R79088J809419Q68472n92378p65343j14905m75174j807650
5572f591133k076553n47388J092497J688990K451495M370046N635896L700796
5564I724646r46771m911626n580607l387561n34118J386303K195140K249743J514818
5555A709967K0378j048687j92183J708383J399035k041395m344447j347458L936254
5546b00153M252925j457004n791630l210176K390526M143817J969676P60158J795064
5537D653203J961162K80407p92794p50871k085556m734720m643284j74021M369621
5528a916853M654218K391163K060588L960717M300588J158183l059830n092872
5520H455902m241903j996231j33158K82058p33930k097740k532533j594040K39189
$$ plain form
5581 -6151591 -6492662 -5513574 -3704155 -2835683 -3428061 -4193404 -4308309 -4783483 -6591133
5572 -6591133 -8667686 -9215074 -8122577 -6433587 -3982092 387954 6023850 9724646
5564 9724646 8777875 3866249 -1714358 -5101919 -5636037 -4249734 -2054594 195149 1709967
5555 1709967 1730345 681658 489475 2197858 3596893 1555498 -2788949 -4136407 -200153
5546 -200153 4052772 2595768 -3195862 -6406038 -4015512 128305 2097981 2858139 4653203
5537 4653203 6614365 6894772 6101978 5351107 3265551 -1469169 -6112453 -6286474 -1916853
5528 -1916853 2737365 5128528 7189116 11149833 15450421 16608604 13548774 8455902
5520 8455902 4213999 2217768 2084610 2366668 1632738 -465002 -2997535 -4591575 -4352386
5511d352386J930367K061754k75917l808923n208594k373249K698810N681330
5503c646808M602233J579938k05618P4347J066061J545049J339883N23946r22544
5494E956487k435255k861096j713451N4589R96440N94253n15798j287187r57976
5485b168994L63396J382186O90914j191686j889404l72610J096945O9405k013573
5476d033421j507157J864171M182327K834073j07536j421647r26808j42707P64038
5467A505333K111837K691056J464494r4380j74371Q9414j423913l552443l092585
5458d75558r1652J704968L08399j819428j669760L75703J929129J856050P19837
5449B837688n35893j173632j010530q30758j385486j832663o46130J831162L517648
$$ plain form
5511 -4352386 -2422019 -360265 -636182 -4445105 -9653699 -12026948 -9328138 -3646808
5503 -3646808 955425 2535363 2329745 2404092 3470153 5015202 6355085 6879031 5956487
5494 5956487 3521232 660136 -1053315 -998726 -2286 591967 76169 -1211018 -2168994
5485 -2168994 -1805598 -423412 267502 -924184 -2813588 -3186198 -2089253 -2019848 -4033421
5476 -4033421 -5540578 -3676407 505920 3339993 3232457 1810810 884002 741295 1505333
5467 1505333 3617170 6308226 7772720 7678340 7503969 7593383 6169470 2617027 -475558
5458 -475558 -567210 1137758 1446157 -373271 -2043031 -1667328 261801 2117851 2837688
5449 2837688 2301795 1128163 117633 -713125 -2098611 -3931274 -4577404 -2746242 771406
5440G71406L443283K513770J261744p93340k992153l308116j396093L78327J90744
5431F9572j048462j899642k423476k494117o17443L290681O000940M556019M57492
5422E891564k291936k356498j739792j964009k247355j554267k63068O79212Q23828
5413e022321K09080o37329p81946L2387P51054N02303J27871R17205K431337L133417
5403A663058K658501J702561J12145k702918n393469n175815j681610J714922
5395g102625J920099M4990m55408J327769K809275J841627l99142j403001q25184
5386b241600m48066j164925j730373q68343Q51097K128852K748651L006599K283778
5377D565670r232k406969k361090K81744K500632J750661q74913k268360j211273
$$ plain form
5440 771406 4214689 6728459 7990203 7196863 4204710 896594 -499499 -121172 69572
5431 69572 -978890 -2878532 -5302008 -7796125 -8413568 -5122887 878053 5434072 5891564
5422 5891564 3599628 1243130 -496662 -2460671 -4708026 -6262293 -6525361 -5846149 -5022321
5413 -5022321 -4813241 -5450570 -6232516 -6200129 -5449075 -4946772 -4818901 -3901696 -1470359 1663058
5403 1663058 4321559 6024120 6136265 3433347 -1960122 -7135937 -8817547 -7102625
5395 -7102625 -5182526 -5137536 -5592944 -4265175 -1455900 385727 -13415 -1416416 -2241600
5386 -2241600 -2689666 -3854591 -5584964 -6453307 -5602210 -3473358 -724707 2281892 4565670
5377 4565670 4556438 2149469 -211621 70123 2570755 4321416 3446503 1178143 -33130
5368c3130O38322J312749Q06125L80589L51804m39122k567515m254764l084036
5359f888978M51678K938414K462242J065552J115076J363023m49313k716320j828026
5350b486652J482894K295533r19229l353020r04242L607332M654581J701258j204044
5341D874411j913492k146050l228577l576656j490308J907625L908089L296750
5333A631792J265035k82159o92550o91021p57698k67801R73530J401502k66611
5324B314019k343421k055858Q8578Q44659o05533j543508o13212J32525k91704
5315d073455M37223L086173M068017J236415j512919j95111K162799K11332m396120
5306A024354n094732q71450K318769J168364o37641L42547J762938M65943j753978
$$ plain form
5368 -33130 605192 1917941 2724066 3104655 3456459 3017337 449822 -3804942 -6888978
5359 -6888978 -6437300 -3498886 -1036644 28908 1143984 2507007 2057694 -658626 -2486652
5350 -2486652 -1003758 1291775 372546 -2980474 -3884716 -277384 4377197 6078455 4874411
5341 4874411 2960919 814869 -2413708 -5990364 -7480672 -5573047 -1664958 1631792
5333 1631792 2896827 2614668 1922118 1231097 473399 205598 1179128 2580630 2314019
5324 2314019 -29402 -2085260 -1996682 -1152023 -1757556 -3301064 -3914276 -3781751 -4073455
5315 -4073455 -3636232 -550059 3517958 4754373 3241454 3046343 5209142 5420474 1024354
5306 1024354 -4070378 -4941828 -2623059 -1454695 -2092336 -1749789 13149 479092 -1274886
5297a274886j398465Q75944J596236j58176k072651k292664j195045J4809O20517
5288e284381O11388O26131J209095J735629J085593l85213r61425L2930J476112
5279A45859K312917K441813J577353o61027l069369l439855j539987L93312O46243
5270a192741m07462j882694l125008k762327K141K742588J928061j436371k190815
5261h324628J370579M466402L000900l04565o46111J435696J928912K67420n50789
5252B643816M72022J339519J137195Q13704J13388k038363l999257k646413J157141
5243a007248K682282K45706k222172j467133M00321L73245j61008J326963K853400
5234C024356N68005m221023n867115k462871J652398K655316K033966K357710
$$ plain form
5297 -1274886 -2673351 -1797407 -201171 -359347 -2431998 -4724662 -5919707 -5904898 -5284381
5288 -5284381 -4672993 -4046862 -2837767 -1102138 -16545 -401758 -1363183 -1330253 145859
5279 145859 2458776 4900589 6477942 5816915 2747546 -692309 -2232296 -1838984 -1192741
5270 -1192741 -1600203 -3482897 -6607905 -9370232 -9368091 -6625503 -4697442 -6133813 -8324628
5261 -8324628 -6954049 -2487647 513253 208688 -437423 998273 2927185 3194605 2643816
5252 2643816 3115838 4455357 5592552 6406256 6519644 4481281 482024 -2164389 -1007248
5243 -1007248 1675034 1920740 -301432 -1768565 -1368244 -994999 -1156007 170956 3024356
5234 3024356 3592361 -628662 -6495777 -8958648 -7306250 -4650934 -2616968 -259258
5226b59258K327898k90453l591181l719877q19372J376861J373624J254484K090625
5217b56649K176972Q03700j37283J40555l08815k126471k654037n51523J165718
5208a747833K4903j283652O79174L844538L688276O34502q78448K89347J003291
5199F254098r6991j015396j232401k637512m599418l635949J57015J772618r31382
5190e965318l276996j146474K374741K260408l62272o73843J799416L133051J806263
5181e1024K99062k3568q42203k783275l386118r09745K581586L811538K310084
5172A006337L03999l69545R8492N78614P42989J298323K535335L208791J736680
5163A1140015j531941m349528n114955m234876k671591o32846J558803K713811
$$ plain form
5226 -259258 2068640 1778187 -1812994 -5532871 -6352243 -4975382 -3601758 -2347274 -256649
5217 -256649 1920323 2724023 2586740 2727295 2418480 292009 -2362028 -2913551 -1747833
5208 -1747833 -1722930 -3006582 -2327408 1517130 5205406 5839908 4961460 5250807 6254098
5199 6254098 6157107 5141711 3909310 1271798 -3327620 -6963569 -6806554 -5033936 -5965318
5190 -5965318 -9242314 -10388788 -8014047 -5753639 -6115911 -6789754 -4990338 -1857287 -51024
5181 -51024 248038 224470 -617733 -3401008 -6787126 -7696871 -5115285 -1303747 1006337
5172 1006337 1310336 940791 1039283 1617897 2360886 3659209 6194544 9403335 11140015
5163 11140015 9608074 5258546 143591 -4091285 -6762876 -7395722 -5836919 -3123108
5155c123108K039737L23872r79830j198383n66799K83835P11985P00447R41018
5146h67226J427334Q29994j180326k249736m97120J836421J289946j173390j671734
5137b255837j07260j91439k332506k407413O20556J986495q69176l413438j388004
5128a0358022K206976K631816J268058J977583L360124J342669k918807m405300
5120d894903k191995R5900Q79984J748824K513607J044925j818689k616640r04528
5111f143515L86607L97279J090347K293686J336617j528966k550547n90972J075919
5102d233545N38728q2R37329J168966q93623l123321l308653k406405j829825
5093a3150431p73158J388680L008772K810043J997026J686805Q68424j036318
$$ plain form
5155 -3123108 -1083371 -759499 -1739329 -2937712 -3504511 -3220676 -2508691 -1808244 -867226
5146 -867226 560108 1390102 209776 -2039960 -2537080 -700659 589287 -584103 -2255837
5137 -2255837 -2363097 -2554536 -4887042 -7294455 -6673899 -4687404 -5556580 -8970018 -10358022
5128 -10358022 -8151046 -5519230 -4251172 -2273589 1086535 2429204 -489603 -4894903
5120 -4894903 -7086898 -6990998 -6111014 -4362190 -1848583 -803658 -2622347 -5238987 -6143515
5111 -6143515 -5756908 -5359629 -4269282 -1975596 -638979 -2167945 -4718492 -5309464 -4233545
5102 -4233545 -3694817 -3694899 -2757570 -1588604 -2482227 -5605548 -8914201 -11320606 -13150431
5093 -13150431 -13923589 -12534909 -9526137 -6716094 -4719068 -3032263 -2163839 -3200157
5085c200157k177185j057063R08972J646959J192428M13402q66485k503457k771156
5076h413742o10876K237756L150296J662422n52042j661535q97685R67984J958116
5067b159306J051269q8159O28958K129205J423770j718371m293633m357939k719928
5058a0104134k98953K651371M405105K875930l39759j169948O19202P92051k124369
5049b693504l880257j405812J962874J766488q69284j826052l60592J153847J648597
5040d503695J700688J078884o26061k129289j997086q27947K98570J742171L448900
5031a814865L463765J017785j146679o08700O93932l24668k580954k659351o77582
5022d637317o8229j788100k748515p33731K276292K968973Q81832j457705j554812
$$ plain form
5085 -3200157 -5377342 -6434405 -5525433 -3878474 -2686046 -2272644 -3139129 -5642586 -8413742
5076 -8413742 -9024618 -6786862 -3636566 -1974144 -2526186 -4187721 -5085406 -4117422 -2159306
5067 -2159306 -1108037 -1196196 -567238 1561967 2985737 1267366 -3026267 -7384206 -10104134
5058 -10104134 -10403087 -7751716 -3346611 -470681 -810440 -1980388 -1361186 -569135 -2693504
5049 -2693504 -6573761 -7979573 -6016699 -4250211 -5119495 -6945547 -7306139 -6152292 -4503695
5040 -4503695 -2803007 -1724123 -2350184 -4479473 -6476559 -7304506 -7005936 -5263765 -1814865
5031 -1814865 1648900 2666685 1520006 911306 1605238 1280570 -1300384 -3959735 -4637317
5022 -4637317 -4705546 -6493646 -9242161 -9975892 -7699600 -4730627 -3848795 -5306500 -6861312
5013f861312N84523K633325K486934N42869j179962j877964k391314k830719j953498
5004a0847118M53489K683268L442685L104046K075681L38846q14418M26059K857543
4995C720081K813376l05139k522179j276955O48809j67063k463766k880014j150497
4986c583347O20617J695532K466808K280259N41393j416008k091715k012134k138505
4977c637100j940458j002788m10562o03722k18966J113242J635429J024809J729160
4968b310956M406039N669637L261687j47897j467713j758140k827794l149779
4960A675084j232132N98535J13231o27027N93458J531087j29662j562243M77996
4951A438327L182085J984401j662131l061509k135710k033802k351445o34645
$$ plain form
5013 -6861312 -6276789 -3643464 -1156530 -613661 -1793623 -3671587 -6062901 -8893620 -10847118
5004 -10847118 -10393629 -7710361 -4267676 -1163630 912051 1250897 436479 862538 3720081
4995 3720081 6533457 6228318 3706139 2429184 3077993 2910930 447164 -2432850 -3583347
4986 -3583347 -2962730 -1267198 1199610 3479869 4021262 2605254 513539 -1498595 -3637100
4977 -3637100 -5577558 -6580346 -6990908 -7594630 -7813596 -6700354 -5064925 -4040116 -2310956
4968 -2310956 2095083 7764720 11026407 10878510 9410797 7652657 4824863 1675084
4960 1675084 442952 1041487 1154718 527691 1121149 2652236 2522574 960331 1438327
4951 1438327 4620412 6604813 4942682 1881173 -254537 -2288339 -4639784 -5274429
4943e274429J326678j09631l109215k615858R02800K088244l05488k052763j198503
4934a0348165l78525q40604n02194J106696J621874M09993o05696r25710j514501
4925a1976832j292855J308364L943734K872689p77572k573952j608220l91564
4917a0496208N34680K029385K269076l62075k400789k74750K300975k37174m990506
4908a1627386m729309k56865J230529j305732k306585q47029j297610k987840
4900b4127827o10586M581661N449180J615068r5427J461589N49383l069077l482317
4891a7728353j233674k802263o580508m394217J883075J881474l619829l227716
4883c5822011K743266J638419o524323p584098j810409n826037j8270584j7410860
$$ plain form
4943 -5274429 -3947751 -4057382 -7166597 -9782455 -8879655 -6791411 -7096899 -9149662 -10348165
4934 -10348165 -10726690 -11567294 -12069488 -10962792 -9340918 -8930925 -9536621 -10462331 -11976832
4925 -11976832 -13269687 -11961323 -8017589 -5144900 -5922472 -8496424 -10104644 -10496208
4917 -10496208 -9961528 -7932143 -5663067 -6025142 -8425931 -8700681 -6399706 -6636880 -11627386
4908 -11627386 -16356695 -16613560 -15383031 -16688763 -18995348 -19842377 -21139987 -24127827
4900 -24127827 -24738413 -20156752 -14707572 -13092504 -13187931 -11726342 -11176959 -14246036 -17728353
4891 -17728353 -18962027 -21764290 -28344798 -32739015 -30855940 -28974466 -32594295 -35822011
4883 -35822011 -33078745 -31440326 -37964649 -45548747 -47359156 -53185193 -71455777 -88866637
4875h8866637o294301j8657170n3172544m6829627L8242967J34936562J40610494
4868I9969744N2707387k9151097l7334662p612953l57709j3763517j3014802J424501
4860E2866892L278536p875850r797426N158L207888l903075o442562l18260K364241
4851C3385542k198733l753893J066885K866518k253428o390064n203251l925052
4843A3594524m701752k265741M022273O691654K793201j191514q03901K36228
4835A8374972j160525k066584o53328l7767j388829j030886K180357L905699J951661
4826B0074770r2692P5716m05471l064910m311807j963113L61222n85375k320406
4817G767934j571101M7450m13736j811538j334080N27958J400875J292228J885108
$$ plain form
4875 -88866637 -95160938 -113818108 -166990652 -213820279 -175577312 -40640750 99969744
4868 99969744 152677131 123526034 86191372 78578419 78220710 64457193 51442391 52866892
4860 52866892 56145428 48269578 38472152 38477310 41685198 37782123 31339561 31021301 33385542
4851 33385542 31186809 27432916 28499801 31366319 29112891 22722827 17519576 13594524
4843 13594524 8892772 6627031 10649304 17340958 20134159 18942645 18138744 18374972
4835 18374972 17214447 15147863 14494535 14456768 13067939 12037053 14217410 18123109 20074770
4826 20074770 19982078 20057794 19652323 16587413 12275606 10312493 10673715 10088340 7767934
4817 7767934 6196833 6244283 5830547 4019009 2684929 3212887 4613762 5905990 7791098
4808G791098L011013K857526R54983j203873k117907j633399p91956p51269j233527
4799F882689m19728K432152N092883M921100K430960J13397j191091j993051j488058
4790A6781253J143897L480560K056615k120202m353015l008022j342569j725293
4782A0913224k285664r49311J028680J665128J232588O64900j49057o91449N33200
4773A1962239K672679K050716k338076n820808l937608Q95518K549256j88086
4765G845830k328296k42388L311335L412021l04990l631517l542635j480948m25363
4756B613049p37967o65288J18654K2522j212949j432040M47157K153747J324722
4747B631607p76084j303088k23008J80246o57171j061125l79283J43706o4605
$$ plain form
4808 7791098 10802111 13659637 14614620 13410747 11292840 9659441 8867485 8116216 6882689
4799 6882689 6462961 8895113 13987996 18909096 21340056 21453453 20262362 18269311 16781253
4790 16781253 17925150 21405710 23462325 21342123 16989108 13981086 12638517 10913224
4782 10913224 8627560 7678249 8706929 10372057 11604645 12269545 12120488 11429039 11962239
4773 11962239 14634918 16685634 14347558 8526750 4589142 5484660 8033916 7845830
4765 7845830 5517534 5275146 8586481 11998502 11693512 8061995 4519360 3038412 2613049
4756 2613049 1875082 1209794 1328448 1350970 138021 -1294019 -846862 1306885 2631607
4747 2631607 1855523 552435 329427 509673 -147498 -1208623 -1587906 -1444200 -1508805
4738a508805l3070P23210J550375K214322K927429K848931R96285j318378j630191
4729F770108j17506N57966l77663o48877R61307K355169J412172j026728l008370
4720F877578m027171m202542l064780q61789P59426R75788J037958J932449K620471
4711B047388K084116J233737J058431O91255o97498j685675n57572J622816K155939
4702G952937L47033j884362k635698j699270j1563J172717R04593m58645j226537
4693B461205l29526J187885J518897L22564j269150k143929j818025m01629J027518
4684E55810Q93708q58197k021240p17328J919070L038111J625476o07400j657969
4675B170041j264383m81304l02668r27042j723027j791775r12166K24873R65105
$$ plain form
4738 -1508805 -1541875 -818665 731710 2946032 5873461 8722392 9718677 8400299 6770108
4729 6770108 6652602 7210568 6832905 6184028 7145335 9500504 10912676 9885948 6877578
4720 6877578 2850407 -1352135 -4416915 -5278704 -4519278 -3543490 -2505532 -573083 2047388
4711 2047388 4131504 5365241 6423672 7114927 6417429 4731754 4174182 5796998 7952937
4702 7952937 8299970 6415608 3779910 2080640 2069077 3241794 4146387 3687742 2461205
4693 2461205 2131679 3319564 4838461 5161025 3891875 1747946 -70079 -471708 555810
4684 555810 1449518 591321 -1429919 -2147247 -228177 2809934 4435410 3828010 2170041
4675 2170041 905658 424354 121686 -805356 -2528383 -4320158 -5232324 -5007451 -4042346
4666d042346J386964J647477J318495J86472p24484J4441K195429L477301J577846
4657G037595k898824o245208n052036o3326M242319M501697J840686n34333j601376
4648A227194k356002k595621r61591J858114L148960K214920J529089K607732
4640F672795L503717K172586j50418j133455q83758r45882j405135j382755j065354
4631E382341q76917J20401K500903M247870K996552j67693j912761j380453j024946
4622I885297k592999m689476m914876k678621N39785K505590J927787K663m08596
4613d23446J497098K827998J134721j366529q59105J884245K422970l62047k617372
4604D138533j806979k82716n96947j258624q3911J493905J018480m01741J44440
$$ plain form
4666 -4042346 -2655382 -1007905 310590 497062 -227422 -212981 1982448 5459749 7037595
4657 7037595 4138771 -2106437 -7158473 -7221799 -2979480 1522217 3362903 2828570 1227194
4648 1227194 -1128808 -3724429 -4686020 -2827906 321054 2535974 4065063 6672795
4640 6672795 10176512 12349098 12198680 11065225 10181467 9235585 7830450 6447695 5382341
4631 5382341 4505424 4625825 7126728 11374598 14371150 14203457 12290696 10910243 9885297
4622 9885297 7292298 2602822 -2312054 -4990675 -4450890 -1945300 -17513 -14850 -423446
4613 -423446 1073652 3901650 5036371 3669842 2810737 4694982 7117952 6755905 4138533
4604 4138533 2331554 2048838 1451891 193267 109356 1603261 2621741 2220000 2364440
4595B364440K395011L251585J402725j482352l693301m741394m113336j710524
4587f327146N88084O65663m69337Q4821K360565L152591J108701j086799j064361
4578i87218k66340r33976k094177j295905J224460K865002K316366N24930j387338
4569c4196k877407l048009j315240R02776J269259l49299j675215j306200l38323
4560h771854o9589J3538P57877J376338O03537r58967j276283M10198K488824
4551e426381K865768J269851o43154j166414k06130R64431J369208J268617J315429
4542A611225J494576J527045J660184K032599J731993j96828k982454m741220
4534B137120m815854m050691k820972o99270J620526K295655J156457M08388J179542
$$ plain form
4595 2364440 4759451 8011036 9413761 7931409 4238108 -503286 -4616622 -6327146
4587 -6327146 -5739062 -5073399 -5542736 -5457915 -3097350 55241 1163942 77143 -987218
4578 -987218 -1253558 -2187534 -4281711 -5577616 -4353156 -1488154 828212 1353142 -34196
4569 -34196 -2911603 -5959612 -7274852 -6372076 -5102817 -5452116 -7127331 -8433531 -8771854
4560 -8771854 -8841443 -8827905 -8070028 -6693690 -6090153 -7049120 -8325403 -7915205 -5426381
4551 -5426381 -2560613 -1290762 -1933916 -3100330 -3306460 -2342029 -972821 295796 1611225
4542 1611225 3105801 4632846 6293030 8325629 10057622 9860794 6878340 2137120
4534 2137120 -2678734 -6729425 -9550397 -10249667 -8629141 -6333486 -5177029 -4768641 -3589099
4525c589099J536783j16302j683513j69607L404076M918488K632534j033326l220941
4516B679093l490766k560864p89068J083399J729383R49499R1304p3638l23250
4507g04908j030421j010841M75218K165591K681634K586133K911259K817159P46646
4498A1637470k649835m742619m107244j923665p2763P52135P72806L34204N759
4489F248M82505J671796K493147K113840Q25588p22190k398964l994280m485420
4480d007730l073120o56263R82152J450759J837800K334917J617691m21945j283731
4471a219470P49916L244617K435061j204868l419526k352696p32721p76019o07808
4462c883514J836606M499825M158826J524293k28511n07617j119482k096716j763521
$$ plain form
4525 -3589099 -2052316 -2168618 -3852131 -4021738 -617662 4300826 6933360 5900034 2679093
4516 2679093 -811673 -3372537 -4161605 -3078206 -1348823 -399324 -308020 -381658 -704908
4507 -704908 -1735329 -2746170 -2270952 -105361 2576273 5162406 8073665 10890824 11637470
4498 11637470 8987635 4245016 137772 -1785893 -1858656 -1106521 -333715 489 6248
4489 6248 488753 2160549 4653696 6767536 7593124 6870934 4471970 477690 -4007730
4480 -4007730 -7080850 -7737113 -6754961 -5304202 -3466402 -1131485 486206 64261 -1219470
4471 -1219470 -469554 2775063 5210124 4005256 585730 -1766966 -2499687 -3275706 -3883514
4462 -3883514 -2046908 2452917 6611743 8136036 7907525 7399908 6280426 4183710 2420189
4453B420189n63589p08679j859652j274922J135501K121637O05390l98439Q18690
4444B296126J612870j0543j381747K36079K374084J033026k698381m349111l024462
4435c912059j931973k370748j864122R75107L729241L838370J981152K26003p97750
4426a26779j312241r65103L12630J378764J263101N19388J31962L1481l12624
4417I20579p21452p59341o84953j000378j493725j488206p31843M88954J796714
4408c673651K864677L389323L195070K187710L41503j764792k712102j592057
4400B235681L72324P97902q43254k364921j678148O93437K770657L541285K909917
4391H434880M82501l403589n957187m002702J474751N267103L990478K88870j061259
$$ plain form
4453 2420189 1856600 1147921 -711731 -1986653 -851152 1270485 1875875 1477436 2296126
4444 2296126 3908996 3898453 2516706 2752785 5126869 6159895 3461514 -887597 -3912059
4435 -3912059 -5844032 -8214780 -10078902 -9103795 -5374554 -1536184 444968 670971 -126779
4426 -126779 -1439020 -2404123 -2091493 -712729 550372 1069760 1201722 1233203 920579
4417 920579 199127 -560214 -1245167 -2245545 -3739270 -5227476 -5959319 -5470365 -3673651
4408 -3673651 -808974 2580349 5775419 7963129 8304632 6539840 3827738 2235681
4400 2235681 2608005 3405907 2562653 197732 -1480416 -786979 1983678 5524963 8434880
4391 8434880 8917381 5513792 -443395 -4446097 -2971346 2295757 6286235 6575105 5513846
4382E513846L83429J095083l73970j316976M09004K846500K941346O85958j836754
4373A0347466l599009m471948l588464o66203K043218J987535J0195q50424J26640
4364A339006Q52765L42427Q3283R84151J731963J092646m09886j825129k675635
4355A515591k183994j01512J356430n37645m337480n060949r83312L552306M167924
4346b612641K065081R11464J044573K82176j450727k015980p48836Q03194J441972
4337b79724J308075P95065L22279M15322M50744j346616m868033o771282m486306
4328a4460476m6966K611606K751353K481720K673382K387365J588723J372151
4320A358858J863713K422690L230170M181805L319757n98424m931856n894291
$$ plain form
4382 5513846 5897275 6992358 6618388 5301412 5710416 8556916 11498262 12184220 10347466
4373 10347466 6748457 2276509 -1311955 -1978158 65060 2052595 2062790 1212366 1339006
4364 1339006 2191771 2534198 2617481 3601632 5333595 6426241 6016355 4191226 1515591
4355 1515591 -668403 -769915 586515 48870 -4288610 -9349559 -10332871 -6780565 -2612641
4346 -2612641 -547560 363904 1408477 1690653 239926 -1776054 -2524890 -1721696 -279724
4337 -279724 1028351 1823416 2145695 2561017 3011761 1665145 -3202888 -9974170 -14460476
4328 -14460476 -14507442 -11895836 -9144483 -6662763 -3989381 -1602016 -13293 1358858
4320 1358858 3222571 5645261 8875431 13057236 16376993 15778569 10846713 4952422
4312D952422l736064j745884q60021O57216K457500J720610j580403l382852j293201
4303b810677J916014K630043J235163L43025M93735J11419j516009l172249l159685
4294c929221r78503J898724K953171J365897n68267k58377J636210K484292J703327
4285F307253Q97217O29890J25165k24131N49270J102210p01361l322994k884459
4276B478060M55626K135812M39071r16865L79367R91612j871944m617026k512355
4267c038642K379598L906220Q54442j857479o70493K407492L646372K097156p64784
4258H959882l246635m083099k660584J91321K429112K502382O45534j471269k210078
4249A056566j433117m81482j06447R75381L892854O525567N289701M57611l271396
$$ plain form
4312 4952422 1216358 -529526 -1389547 -732331 1725169 3445779 1865376 -1517476 -2810677
4303 -2810677 -894663 1735380 2970543 3313568 3807303 3918722 2402713 -769536 -3929221
4294 -3929221 -4907724 -3009000 -55829 1310068 741801 483424 2119634 4603926 6307253
4285 6307253 7204470 7834360 7959525 7735394 8284664 9386874 8685513 5362519 2478060
4276 2478060 2933686 5069498 5508569 4591704 4971071 5962683 4090739 -526287 -3038642
4267 -3038642 -659044 3247176 4101618 2244139 1573646 3981138 7627510 9724666 8959882
4258 8959882 5713247 1630148 -1030436 -839115 1589997 4092379 4737913 3266644 1056566
4249 1056566 -376551 -858033 -964480 10901 3903755 10429322 15719023 16176634 12905238
4240A2905238k834870o23722l04030j488440j337520M57880J521225P76355l48182
4231H723934o42998o98730j354903k196246k209875j150623J62805P75137P56182
4222B164683J026106J617854J090645j081732k729843j804802O260m71960k555691
4213b738480k381458P66403K941367J617180o59132o43585J076252K141354J885382
4204D005283N68473j797660l728397k615406Q76731K203081n76100l273897j778445
4195f116337J767032K911154J812260J585669K184288R84886j789578k951944
4187C87430j297217J107162K308472K030066L57217k212194l862343l178635j311837
4178e671879l76287n18046m29231L01288J067844J381573R81557K34107P42334
$$ plain form
4240 12905238 10070368 9446646 9142616 7654176 6316656 6774536 8295761 9072116 8723934
4231 8723934 8080936 7382206 6027303 3831057 1621182 470559 633364 1408501 2164683
4222 2164683 3190789 4808643 5899288 4817556 2087713 282911 289171 -182789 -2738480
4213 -2738480 -5119938 -4353535 -1412168 205012 -454120 -1097705 -21453 2119901 4005283
4204 4005283 4573756 2776096 -952301 -3567707 -2690976 -487895 -1063995 -4337892 -6116337
4195 -6116337 -4349305 -1438151 374109 1959778 4144066 5128952 3339374 387430
4187 387430 -909787 197375 2505847 4535913 4893130 2680936 -1181407 -4360042 -5671879
4178 -5671879 -6048166 -6566212 -6995443 -6694155 -5626311 -4244738 -3263181 -3029074 -2286740
4169b286740L127985M402319J513178k538620j754884K879448L517440k175097
4161F685029o652021m416801j57546M50316j50405J652322K583140m73452k825649
4152c305067k04807K719109J323360L06448L477403L841412l023995o200580L168493
4143B101776J2656890Q926263P258301L0127743N9580265M8460131j0834249o4149766
4135I4127354o2674366k3703699J593892k168144r501695m069244K458134l0449
4127c968217l245605L5050L060120K71833k167678Q27328L936525K246514k84081
4118G11789L33303J024625p51421j526581O66181J749913m16483j486842J077863
4109A382347K797427L21538k260155n52915K882351L597340K175719J188303J02756
$$ plain form
4169 -2286740 841245 5243564 6756742 4218122 2463238 5342686 8860126 6685029
4161 6685029 33008 -4383793 -4541339 -4091023 -4241428 -2589106 -5966 -479418 -3305067
4152 -3305067 -3509874 -790765 532595 839043 4316446 8157858 5133863 -1066717 2101776
4143 2101776 14758666 23684929 30943230 61070973 120651238 169111369 158277120 94127354
4135 94127354 31452988 7749289 9343181 7175037 -2326658 -6395902 -3937768 -3968217
4127 -3968217 -7213822 -7178772 -4118652 -3846819 -6014497 -5187169 -1250644 995870 711789
4118 711789 1045092 2069717 1318296 -208285 457896 2207809 1791326 304484 1382347
4109 1382347 4179774 4501312 2241157 1688242 4570593 8167933 10343652 11531955 11634711
4100A1634711k057274l204570j681034L50231N75572Q2687L21949L15556m06513
4091E931315r9379J388223J327807q61973j923995q03668j257269m894024o720120
4082g913083k282132M836141P629003M761177M12675k457259m063133m603791
4074c680402l351643n71587K210061L449798K179630r75289k930826j117436K175119
4065b612575K137587j178781k509536K78541K984676K548187J802307L180900
4057F631306L542101J46016l384631k765488l49540o49485k336047j278275J432628
4048I88585J460734p88548j103721P62646R93726j045084j853539k67567R94974
4039A42206P00188N26486O31880q10667k949113k492892L40473J362705p30610
$$ plain form
4100 11634711 9577437 6372867 4691833 5042064 5617636 5700323 6022272 6337828 5931315
4091 5931315 5831936 7220159 8547966 7685993 5761998 4958330 3701061 -1192963 -7913083
4082 -7913083 -10195215 -5359074 2269929 7031106 7443781 4986522 923389 -3680402
4074 -3680402 -7032045 -7603632 -5393571 -1943773 235857 -739432 -3670258 -4787694 -2612575
4065 -2612575 -474988 -1653769 -4163305 -3884764 -900088 1648099 3450406 6631306
4057 6631306 10173407 10319423 6934792 4169304 3819764 3170279 834232 -444043 988585
4048 988585 2449319 1660771 557050 1319696 2313422 1268338 -585201 -852768 142206
4039 142206 842394 1368880 2000760 1190093 -1759020 -4251912 -3911439 -2548734 -3279344
4030c279344k164432n04832J648176J572898M72946J74049o376n24236J96422
4021b414729K061388J811783j533787l580352q10919L351612L250269o42307k872626
4012a379668j139546J466492J976241R50354o5570q45957j353048j162956q68177
4003b421835j629100k705377j930948N94157J917363N54604j136820o67595P50517
3994f675034M27574j422265k259788j224481K70366J526200L167221M573085L803890
3985B186768J075556n98150J75354Q53142p33169k382313r83914K041608K656628
3976D291510M84996j005849l31475L66840Q151L65475J731603J272939j820902
3967E363288l640605j376256J658690R50005j979782k051485J243370L291600
$$ plain form
4030 -3279344 -5443776 -5948608 -4300432 -2727534 -2254588 -2080539 -2086915 -2611151 -2414729
4021 -2414729 -353341 1458442 -75345 -3655697 -4466616 -1115004 2135265 1492958 -1379668
4012 -1379668 -2519214 -1052722 923519 1873873 1808303 962346 -390702 -1553658 -2421835
4003 -2421835 -4050935 -6756312 -8687260 -8093103 -6175740 -5621136 -6757956 -7425551 -6675034
3994 -6675034 -6247460 -7669725 -9929513 -11153994 -10883628 -9357428 -6190207 -1617122 2186768
3985 2186768 3262324 2664174 2839528 3692670 2959501 577188 -406726 1634882 4291510
3976 4291510 4776506 3770657 3439182 3806022 3814173 4179648 5911251 7184190 5363288
3967 5363288 1722683 346427 2005117 2955122 975340 -1076145 167225 3458825
3959C458825J679667p11762p88954O17301J241648Q55883L79723k45036j471677
3950E015618k833867l544470l414102k410202m14533J888753K944483J937949
3942h30371j01584j234765l84482J637901K569509Q97103j854121k320303K11187
3933a409926K236987P50731k274488k784307o05244Q54385J41844p21307l66166
3924d177491o1438p28493j193210o08696J07552L89982J009616J848254J266988
3915b146936j046258k996138l058219k025609p94009R40030K640216K577833J049155
3906d859935Q57130K698805L341019Q49157j699124r80649J110493P55417j456653
3897F15660k042621q08857n62312j407918n40917J919596K000893j661205m888757
$$ plain form
3959 3458825 5138492 4426730 3637776 4255077 5496725 6352608 6732331 6487295 5015618
3950 5015618 2181751 -1362719 -4776821 -7187023 -7601556 -5712803 -2768320 -830371
3942 -830371 -931955 -2166720 -2551202 -913301 1656208 2553311 699190 -1621113 -1409926
3933 -1409926 827061 1577792 -696696 -3481003 -4086247 -3231862 -3090018 -3811325 -4177491
3924 -4177491 -4238929 -4967422 -6160632 -6769328 -6661776 -6271794 -5262178 -3413924 -2146936
3915 -2146936 -3193194 -6189332 -9247551 -11273160 -12067169 -11127139 -8486923 -5909090 -4859935
3906 -4859935 -4002805 -1304000 2037019 2886176 1187052 206403 1316896 2072313 615660
3897 615660 -1426961 -2235818 -2798130 -4206048 -4746965 -2827369 -826476 -2487681 -7376438
3888g376438l927131p60260N04646j82546K56138K459106L589930J801385j059478
3879d694648j983652l63097J798870K287565O06993j983534l746285l725740j982694
3870a3786222R35267M151972O182591N525987K300150j206007k512669j438113
3862A52956P2737N47701M67755P77931R84291n3243j875091k558514j414625j0337
3852b908439L26650M58032J413604J877729P8827k544033k469147Q45819L831733
3843I10775L670956J685971M43058l7643j069244k292486k430768j772198j430451
3834b322030j071083J78269J295145M49570j800969k941909k104504q25880j01273
3825i244664Q04503K120216K627444J906205J357069J784322J841212L16954j554887
$$ plain form
3888 -7376438 -11303569 -12063829 -11559183 -11741729 -11485591 -9026485 -5436555 -3635170 -4694648
3879 -4694648 -6678300 -7041397 -5242527 -2954962 -2347969 -4331503 -8077788 -11803528 -13786222
3870 -13786222 -12850955 -8698983 -2516392 3009595 5309745 4103738 1591069 152956
3862 152956 225693 773394 1241149 2019080 3003371 2950128 1075037 -1483477 -2898102 -2908439
3852 -2908439 -2581789 -2123757 -710153 1167576 1246403 -1297630 -3766777 -2920958 910775
3843 910775 4581731 6267702 6710760 6673117 5603873 3311387 880619 -891579 -2322030
3834 -2322030 -3393113 -3214844 -1919699 -1470129 -3271098 -6213007 -8317511 -9143391 -9244664
3825 -9244664 -8440161 -6319945 -3692501 -1786296 -429227 1355095 3196307 3513261 1958374
3816A958374j704720j61359J145472R80475n6233p45349o57730l15217l69407
3807G4306o63270k91603J030407K136955J847006P31495Q1489m54137k212806
3798B279842m462219m425659j255723K245137L280936K462016J785362J088314
3790B998006r68734l504003l881286j551821R89697J602207R16350N81268P06016
3781b112300K61260q51988j388067l40886J759922L355543L469635K582572J749247
3772H484938J111642q1923j954328l392949l402545k239142o23441J217552K812803
3763A932607K757749L07816k741121l421757j093848J666684K093488K21427j583589
3754A39456j388637M73101J973477J551004j66794r97469J76565J935209K082875
$$ plain form
3816 1958374 253654 92295 1237767 2218242 2162009 1416660 758930 443713 74306
3807 74306 -588964 -880567 149840 2286795 4133801 4865296 4946785 4492648 2279842
3798 2279842 -2182377 -6608036 -7863759 -5618622 -2337686 124330 1909692 2998006
3790 2998006 2029272 -1474731 -5356017 -6907838 -5918141 -4315934 -3399584 -2818316 -2112300
3781 -2112300 -1851040 -2703028 -4091095 -4431981 -2672059 683484 4153119 6735691 8484938
3772 8484938 9596580 9514657 7560329 4167380 764835 -1474307 -2097748 -880196 1932607
3763 1932607 4690356 4998172 2257051 -1164706 -2258554 -591870 1501618 1723045 139456
3754 139456 -1249181 -776080 1197397 2748401 2581607 1584138 1760703 3695912 5778787
3745E778787L22985j757762k878869k971917k152662l65947J597190K112300N35004
3736B19109j802510l016022k519822j132837l3157N3242o76461j053160L8301
3727i923317K260363L978929L987833K536708P03482m73904l75430O25510J047159
3718D367333L4587r26187J95618K369845K115761j351676m173008k976411K45436
3709i8702J120884p51276j739089L4275K230392K191950L89564j263670k255503
3700a41175k985181k983671j420175J234706L312766L528106J974636N824p16259
3691A809577J65419R76316j6829j909308k055824l196J529148O73953o46275K72899
3681G95880K531006K793589K42475k225472k055121j88435O73528m94227k346543
$$ plain form
3745 5778787 6101772 4344010 1465141 -1506776 -3659438 -4025385 -2428195 -315895 219109
3736 219109 -1583401 -4599423 -7119245 -8252082 -8285239 -8231997 -8908458 -9961618 -9923317
3727 -9923317 -7662954 -3684025 303808 2840516 3543998 3070094 2694664 3320174 4367333
3718 4367333 4401920 3475733 3671351 6041196 8156957 6805281 2632273 -344138 -98702
3709 -98702 1022182 270906 -1468183 -1433908 796484 2988434 3377998 2114328 -141175
3700 -141175 -3126356 -6110027 -7530202 -6295496 -2982730 545376 2520012 2525836 1809577
3691 1809577 1974996 2951312 2934483 1025175 -1030649 -1033845 495303 1169256 522981 795880
3681 795880 3326886 6120475 6362950 4137478 2082357 1893922 2567450 2073223 -273320
3672b73320l043075j891538M71016K759048L830281L180009J071379j474830l013001
3663A615969k771359j623557j137451j372822p85146J081212K341921J560179
3655a091054L35087R87505K602883K081597r25843k939217j386962J913837L434601
3646E012434K335495N58832k08231Q5217P72900J107828K73982j784486l522716
3637D631255l029390m75170J542437P29953k152774l912934k504148N09337J832601
3628b828833O13711o58699k0274J008256J32001j556096j107464J113844J450968
3619a852586j067801k482209K31350M172063M551235J572263m14298M26153J434812
3610F570982K40944j947525k856157k264085j193422O4939J531296K367048J638434
$$ plain form
3672 -273320 -3316395 -5207933 -4736917 -1977869 1852412 5032421 6103800 4628970 1615969
3663 1615969 -1155390 -2778947 -3916398 -5289220 -6074366 -4993154 -2651233 -1091054
3655 -1091054 -755967 231538 2834421 4916018 3990175 1050958 -336004 1577833 5012434
3646 5012434 7347929 7906761 7698530 7783747 8556647 9664475 9938457 8153971 4631255
3637 4631255 1601865 1126695 2669132 3399085 1246311 -2666623 -5170771 -4661434 -2828833
3628 -2828833 -2215122 -2873821 -2894095 -1885839 -1753838 -3309934 -4417398 -3303554 -1852586
3619 -1852586 -2920387 -5402596 -5171246 -999183 3552052 5124315 4710017 5136170 6570982
3610 6570982 6811926 4864401 2008244 -255841 -1449263 -1384324 146972 2514020 4152454
3601D152454j92886j503017j159141L41393J263936L79071j400364j799572k46202
3592a64328R38584k26842k095891j552179J164957K574388J111612p05258l38901
3583G06142J110914J086648m99285j605908j208329j48598O04594R25857R22981
3574A895016M90008n04172k017043l482301l615731j596255J264285K348294Q55165
3565d362734j177498j614216n35326R06957K160609K676245J535541p20092j663280
3556b793794k91750R67842j34339j784484q50938J732654K038845o14345k284212
3547d014521j43352L600871M979949K981195n09178l362014m201875k547213K93490
3538b922648J728819P58104p46543p54639L20179J024690J291863J677987J547673
$$ plain form
3601 4152454 3959568 2456551 1297410 1638803 2902739 3281810 1881446 81874 -164328
3592 -164328 774256 547414 -1548477 -3100656 -1935699 638689 1750301 1045043 706142
3583 706142 1817056 2903704 2404419 798511 -409818 -558416 46178 972035 1895016
3574 1895016 2385024 1880852 -136191 -3618492 -7234223 -8830478 -7566193 -5217899 -4362734
3565 -4362734 -5540232 -7154448 -7689774 -6782817 -4622208 -1945963 -410422 -1130514 -2793794
3556 -2793794 -3085544 -2117702 -2252041 -4036525 -4887463 -3154809 -1115964 -1730309 -4014521
3547 -4014521 -4157873 -557002 4422947 7404142 6894964 3532950 -668925 -3216138 -2922648
3538 -2922648 -1193829 -435725 -1182268 -1936907 -1616728 -592038 699825 2377812 3925485
3529C925485K22631r84687l04564J373087J454581k21247q44882R76683K780266
3520H377353J787135j065061k815042k913520l226467l915133k443616K029823
3512d184528N787577M596495n16664m258011l720597j373596p00200j473189j183787
3503g026500P01788K339142K512791J778613Q64597j07607q24229q99982p88867
3494a450254j053683j011916P7555Q48866p49772l813347m980583l177638r94908
3485a6305680j90891J070593M346943P077364N834264J758014p11891R2818J506795
3476D478329J108499j61145l50981L61970K77562j374609l687381n073084m418380
3467h839220j888661J008236K647839K745294K207448J757129J371296Q89433
$$ plain form
3529 3925485 4148116 3163429 2858865 4231952 5686533 5465286 4620404 5597087 8377353
3520 8377353 10164488 9099427 6284385 3370865 144398 -3770735 -6214351 -4184528
3512 -4184528 1603049 6199544 5682880 1424869 -2295728 -3669324 -4369524 -5842713 -7026500
3503 -7026500 -6324712 -3985570 -1472779 305834 1170431 1062824 238595 -661387 -1450254
3494 -1450254 -2503937 -3515853 -3438298 -2589432 -3339204 -7152551 -12133134 -15310772 -16305680
3485 -16305680 -16496571 -15425978 -11079035 -4001671 1832593 3590607 2878716 2971534 4478329
3476 4478329 5586828 5425683 5074702 5436672 5714234 4339625 652244 -4420840 -8839220
3467 -8839220 -10727881 -9719645 -7071806 -4326512 -2119064 -361935 1009361 1898794
3459A898794M00960L1809j59415k41256o20814j564821k177539r87605J666840
3450a753047L192735K001857r0105n07512K22031l92056k472108l303619j400721
3441d502545J324394K155166O50513j424999j970092j81725K473331L173181R88192
3432B685416j458766j383629R3948j11823j897170k206390k31638J518418J836754
3423a154880K341703L197150J725494k498845n349064l970730j201841o58253
3415g569266r29755R52865L278748K257247r30120j422091J413051K894635N33293
3406D78607k413239k460627o98586R9973j84370K7528J072882K127365K542002
3397E91535J754550l93056k315945j791683O11711J635058J15564r72548Q94505
$$ plain form
3459 1898794 2299754 2331563 2172148 1930892 1310078 -254743 -2432282 -3419887 -1753047
3450 -1753047 1439688 3441545 3351440 2843928 3065959 2673903 201795 -3101824 -4502545
3441 -4502545 -3178151 -1022985 -372472 -1797471 -3767563 -3949288 -1475957 1697224 2685416
3432 2685416 1226650 -156979 -63031 -174854 -2072024 -4278414 -4510052 -2991634 -1154880
3423 -1154880 1186823 4383973 6109467 3610622 -1738442 -5709172 -6911013 -7569266
3415 -7569266 -8499021 -7546156 -4267408 -2010161 -2940281 -4362372 -2949321 -54686 478607
3406 478607 -1934632 -4395259 -5093845 -4993872 -5178242 -5150714 -4077832 -1950467 591535
3397 591535 2346085 1953029 -362916 -2154599 -1542888 92170 207734 -764814 129691
3388A29691L679132L721522Q45979k137703l568474l782088k867540n98255J615709
3379b962027J476700r95504l059927k686436q18646M05688L51472k2553Q8658
3370h222575L94440J77149n31154o99600N10335K419815L347178K555057Q73494
3361H24139p57796k140120k740221j389012J647896L629895K236337j154801k912895
3352b756578j578673R09350K274568K265385J607430M56959j082014k128617j910154
3343a942344r23488l05606l11783j11217R29216K177758K141560O3350k798049
3334a080603l859897j745195J973518M120926L061393R8869k150483k240562q14332
3325b636366L22141n4266j262828j165755J424041M768193N521783K457682j830237
$$ plain form
3388 129691 3808823 7530345 8376324 6238621 2670147 -1111941 -3979481 -4577736 -2962027
3379 -2962027 -1485327 -2480831 -5540758 -8227194 -9045840 -8640152 -8288680 -8311233 -8222575
3370 -8222575 -7828135 -7650986 -8182140 -8881740 -8371405 -5951590 -2604412 -49355 824139
3361 824139 66343 -2073777 -4813998 -6203010 -4555114 -925219 1311118 156317 -2756578
3352 -2756578 -4335251 -3425901 -1151333 1114052 2721482 3178441 2096427 -32190 -1942344
3343 -1942344 -2865832 -3171438 -3483221 -3594438 -2665222 -487464 1654096 1717446 -1080603
3334 -1080603 -4940500 -6685695 -4712177 -591251 2470142 2569011 418528 -1822034 -2636366
3325 -2636366 -2314225 -2368491 -3631319 -4797074 -3373033 1395160 6916943 9374625 7544388
3316G544388l618686k065304J80310K65104j687769l020951j813573Q35492K061827
3307a319162N92060j675881j820511O70785L304537L532036J540012m89855j275271
3298C058750j416659j534789r43854Q50670K462655K134758N75356L17450J863450
3289G367787K532875M09758k358049k322635K03080J362140r95215m584322n837835
3280d222416l915110o62067J865736K677249J806519K93199l68461L41172J495188
3271f88991K068595J949376J225408k98976k050099k422220q83903N98758j73190
3262f75242k439672l176274r44553K387971M041947L213262J075383j001184k262990
3253B18648k206281p22789J079568J311219m14396j782346m09858K494798L237340
$$ plain form
3316 7544388 3925702 1860398 2040708 2305812 618043 -2402908 -4216481 -3380989 -1319162
3307 -1319162 -727102 -2402983 -4223494 -3552709 -248172 3283864 4823876 4334021 3058750
3298 3058750 1642091 107302 -836552 14118 2476773 4611531 5186887 5504337 7367787
3289 7367787 9900662 10310420 7952371 5629736 5832816 7194956 6199741 1615419 -4222416
3280 -4222416 -8137526 -8799593 -6933857 -4256608 -2450089 -2156890 -2525351 -2184179 -688991
3271 -688991 1379604 3328980 4554388 4255412 2205313 -216907 -1100810 -502052 -675242
3262 -675242 -3114914 -6291188 -7235741 -4847770 -805823 2407439 3482822 2481638 218648
3253 218648 -1987633 -2710422 -1630854 -319635 -734031 -2516377 -2926235 -431437 2805903
3244B805903R67438p93779K73238J131728j687536n271078l582010K974451O974020
3235C792375M279506n22017j616410J51687P61827J8447K8925j24942k485722
3226D283676m863375l223821J275980L253561J167069j035477j051694j469105
3218a663186m006576n623414l457480K53413J662670R06400P21853J493608J253541
3209h459171k88975q94830Q92394L664951M788064L063432l31170k999550l518083
3200d082938k548915j465811n00726O22303J017902l41601k256772k344458n12917
3191a2413933J111056J844948L043350M525301L921675R99238p89228P55074L058898
3182F056379K712899K92128j527263k270357k936113k963120j392810K88325j20125
$$ plain form
3244 2805903 3773341 2979562 3252800 4384528 2696992 -2574086 -6156096 -3181645 3792375
3235 3792375 8071881 7549864 5933454 6085141 6846968 6865415 6894340 6769398 4283676
3226 4283676 -579699 -3803520 -2527540 726021 1893090 857613 -194081 -1663186
3218 -1663186 -5669762 -11293176 -14750656 -14497243 -12834573 -11928173 -11206320 -9712712 -8459171
3209 -8459171 -8748146 -9642976 -8750582 -5085631 -297567 2765865 2434695 -564855 -4082938
3200 -4082938 -6631853 -8097664 -8598390 -7976087 -6958185 -7299786 -9556558 -11901016 -12413933
3191 -12413933 -11302877 -9457929 -6414579 -1889278 2032397 3031635 2242407 2997481 6056379
3182 6056379 8769278 9061406 7534143 5263786 2327673 -635447 -2028257 -1739932 -1860057
3173a860057j870523k532673k066730k249251k624263p73899L164189N809005
3165e004202N208998L117667J522714j38533k631003m320322l274503n40417R61668
3156e097933K80574o75834o1827J570230K306784J304673n43392j972583k489917
3147e379225k017177l87854J919912L251448K394120N46568J23188J486803K571467
3138D509250K084052J069350M72534o82090l102444m984105m012442o84301K106789
3129c223407K285365K68104j860174k029880m3535J697650Q00380j415391j192508
3120d713396J870512L487624J025850k161553j710576J406020L219183K954271
3112E377935K537914J831032o88094l403972k791086P72194K982025J831515l53687
$$ plain form
3173 -1860057 -3730580 -6263253 -8329983 -10579234 -13203497 -13977396 -10813207 -5004202
3165 -5004202 204796 3322463 4845177 4706644 2075641 -2244681 -5519184 -6059601 -5097933
3156 -5097933 -4817359 -5493193 -5555020 -3984790 -1678006 -373333 -916725 -2889308 -5379225
3147 -5379225 -7396402 -7784256 -5864344 -2612896 -218776 327792 450980 1937783 4509250
3138 4509250 6593302 7662652 8135186 7453096 4350652 -633453 -4645895 -5330196 -3223407
3129 -3223407 -938042 -669938 -2530112 -4559992 -4603527 -2905877 -2105497 -3520888 -4713396
3120 -4713396 -2842884 644740 1670590 -490963 -2201539 -795519 2423664 5377935
3112 5377935 7915849 9746881 9058787 5654815 2863729 3635923 6617948 8449463 8095776
3103H095776j562787k457013l231616k444018l83778L33361q29178r96324J282720
3094b192857L363971K652596K06916j820334l247490m181706l222812R4057L362403
3085d985256M153282K941944J452497J86937p82231q47301l51413p69531j955635
3076i56707j748429K71752J543497O02006p80016j166325j479980j502857J201223
3067d015836N889030O871882J438200m686994m995089j616417j053334l531895
3059e700453l723465m80736J717560J124483J318733L996308N543431L185852
3051F981713o84519k886483l630991l784939k217343J137375L181890J847537
3043e5760m04491k71150J543905K051671O56974o58548n97838K16541L99141j128022
$$ plain form
3103 8095776 6532989 4075976 844360 -1599658 -1983436 -1650075 -2479253 -3475577 -2192857
3094 -2192857 1171114 3823710 4030626 2210292 -1037198 -5218904 -8441716 -8347659 -4985256
3085 -4985256 -831974 2109970 3562467 3749404 2967173 2119872 1768459 998928 -956707
3076 -956707 -2705136 -2433384 -889887 -287881 -1067897 -2234222 -3714202 -5217059 -4015836
3067 -4015836 1873194 8745076 10183276 5496282 501193 -1115224 -2168558 -5700453
3059 -5700453 -9423918 -9904654 -8187094 -7062611 -5743878 -1747570 3795861 6981713
3051 6981713 6297194 3410711 -220280 -4005219 -6222562 -5085187 -1903297 -55760
3043 -55760 -460251 -731401 812504 2864175 3521149 2862601 2264763 2481304 2880445 1752423
3033A752423m012323n660799l536019Q54287K808819O37923j756419m61469K973133
3024f400444M192514J983280j157974k693410j710985J498911M963066N543417
3016F218375K464029r80368j571954m12831m18672j417531j132079K86983N08320
3007C544272p64030j454779q76324m54511o50276l78703L83855N87501P51936
2998F88941K204403L563778J915230j877754l308493j035726Q34345n29632k064439
2989C90653k43432K713674K446288m44701j754996n85780M8610r50618j141685
2980D78013N96265J802321N71853j312552j264176M19029J503234Q15246j077633
2971B531600k853563l122866j428584P28547J279355N10545P97358K713221L581573
$$ plain form
3033 1752423 -2259900 -7920699 -11456718 -10602431 -7793612 -7155689 -8912108 -9373577 -6400444
3024 -6400444 -2207930 -224650 -1382624 -4076034 -5787019 -4288108 674958 6218375
3016 6218375 8682404 7702036 6130082 5717251 5298579 3881048 2748969 3035952 3544272
3007 3544272 2780242 1325463 449139 -5372 -655648 -1034351 -650496 -62995 688941
2998 688941 2893344 6457122 8372352 6494598 3186105 2150379 2984724 2455092 390653
2989 390653 147221 2860895 5307183 4862482 3107486 2521706 2570316 1619698 478013
2980 478013 1074278 2876599 3448452 2135900 871724 1290753 2793987 3609233 2531600
2971 2531600 -321963 -3444829 -4873413 -4144866 -2865511 -2354966 -1557608 1155613 4737186
2962D737186J325437k129938l218643j284047J081959J502207L9239j527761j391281
2953h65642Q41795L426248L817691J548125j057228j759968q54883J09536N66968
2944E772642O15754k3304j087702j176279J02180P29941q54322k791431k279592
2935i92113m8868N80994j288669l071870k784184j349078k60436N01895J347754
2926g364575J955941K139020K165772J724853K38747j500443j795807l77427J453783
2917a360136K861726L627464K782045j15710k680066k115442P4724j40799k399860
2908E33946j785251K726762N098859J046496m726163n022921m31377K515689J345538
2899A301578j34481R17177K490747J982935k8325j644429k075352j125190J000404
$$ plain form
2962 4737186 6062623 3932685 714042 -570005 511954 2014161 2053400 525639 -865642
2953 -865642 -23847 3402401 7220092 8768217 7710989 5951021 5096138 5205674 5772642
2944 5772642 6388396 6365092 5277390 4101111 4203291 4933232 4078910 1287479 -992113
2935 -992113 -1040981 -459987 -1748656 -4820526 -7604710 -8953788 -9214224 -8712329 -7364575
2926 -7364575 -5408634 -3269614 -1103842 621011 859758 -640685 -2436492 -2813919 -1360136
2917 -1360136 1501590 5129054 7911099 7795389 5115323 2999881 3074605 2933806 533946
2908 533946 -1251305 1475457 6574316 7620812 2894649 -2128272 -2559649 -43960 1301578
2899 1301578 1167097 2084274 4575021 6557956 6529631 4885202 2809850 1684660 2685064
2890B685064K469147R59197k971467n736207m774447j072941K716610M874423
2882h50621N060009L970697K881122K145984M62796k797067n367657m540308j240495
2873b75540R75554O31303o51730j404663j527184n69168J734444L175032J064858
2864C152906l022230m409264k046409M5416o15636j346848M64935K788857K863664
2855b124609K087645L094694M644710L625470M26105j732883j833182j703074
2847F484876k177539k094812j092345l71669m12925m43957l89995r76090j580730
2838c055186l59564K665581M539122K635001j956730n313425m742768j495319
2830g083288P91392L71417o51334L73330K356414J934987r09983k118303K47631
$$ plain form
2890 2685064 5154211 6113408 3141941 -2594266 -7368713 -8441654 -5725044 -850621
2882 -850621 4209388 8180085 11061207 13207191 13669987 10872920 5505263 964955 -275540
2873 -275540 700014 1331317 679587 -725076 -2252260 -2821428 -1086984 2088048 3152906
2864 3152906 130676 -4278588 -6324997 -6279581 -6895217 -8242065 -7777130 -4988273 -2124609
2855 -2124609 -36964 3057730 7702440 11327910 11754015 10021132 8187950 6484876
2847 6484876 4307337 2212525 1120180 748511 335586 -108371 -498366 -1474456 -3055186
2838 -3055186 -3414750 -749169 3789953 6424954 4468224 -845201 -5587969 -7083288
2830 -7083288 -6291896 -5920479 -6571813 -6198483 -3842069 -1907082 -2817065 -4935368 -4687737
2821d687737K567034J131765j881043j698610J635452L451510J516312j212197
2813H22486j421684L93170J722240J398444p8869j733818k572353k085124q70931
2804d426439J04496O82566Q98311L8054j924376k831234o82411L009676M758278
2795c73079L667488J737635o726k257504m078849k797619J304609L723063J416551
2786B335569k918481m602693k781078r5397J495525J932890J476084M96643P8019
2777b582919P35427J248347M81773o39132p66383n41284j239989k113494j545022
2768f962676o8030L97159j86435j97284M58294M00696Q6007J651896M579851N008530
2758E168008J315656k631019k548661K28604J113170q21281k145994j026048R1084
$$ plain form
2821 -4687737 -2120703 -988938 -2869981 -4568591 -2933139 518371 2034683 822486
2813 822486 -599198 -206028 1516212 2914656 2835787 1101969 -1470384 -3555508 -4426439
2804 -4426439 -4321943 -3639377 -2741066 -2703012 -4627388 -7458622 -8141033 -5131357 -373079
2795 -373079 3294409 5032044 5025318 2767814 -1311035 -4108654 -2804045 919018 2335569
2786 2335569 -582912 -5185605 -7966683 -8062080 -6566555 -4633665 -3157581 -2660938 -2582919
2777 -2582919 -1847492 -599145 -117372 -756504 -1522887 -2064171 -3304160 -5417654 -6962676
2768 -6962676 -7030706 -6633547 -6819982 -7017266 -6558972 -6158276 -6072269 -4420373 159478 5168008
2758 5168008 6483664 3852645 1303984 1532588 2645758 1824477 -321517 -1347565 -1256481
2749a256481j117268l036518k824031o58066J192371K091011L168907M400943
2741A960868M224883K259985J46803r00644j449647k014344j766352k70920J116851
2732C307483J139486O62156J060213J567568L45373k193168l327425j618893J243368
2723B186161K768802K342862R20788n32487j361022j143696m12721o10480k234363
2714A923844l682721l081702p95147J038671J211788N67409N00049J391648K622503
2705A696342L218291K385023K78361j676495k150370j608553j485175j653418
2697i95994m99714J841286K475898k72978l616652l583962n16170J729479J633557
2688a805250J473396K376696J926746j203839l765247k405681Q53287J480280
$$ plain form
2749 -1256481 -2373749 -5410267 -8234298 -8892364 -7699993 -5608982 -2440075 1960868
2741 1960868 6185751 8445736 8592539 7691895 6242248 4227904 2461552 2190632 3307483
2732 3307483 4446969 5109125 6169338 7736906 8082279 5889111 2561686 942793 2186161
2723 2186161 4954963 7297825 8218613 7686126 6325104 5181408 4768687 4158207 1923844
2714 1923844 -1758877 -4840579 -5635726 -4597055 -3385267 -2817858 -2317809 -926161 1696342
2705 1696342 4914633 7299656 7578017 5901522 3751152 2142599 657424 -995994
2697 -995994 -1495708 345578 2821476 2548498 -1068154 -4652116 -5168286 -3438807 -1805250
2688 -1805250 -331854 2044842 3971588 2767749 -997498 -3403179 -2549892 -1069612
2680a069612q04923k265985j324171j13375J68784R87466K567957K498768L2252
2671F77161j905608j180329L87671P08265R80750K584681L442811J218727k130492
2662D783637l015741j799262j559964k415010j587680J093751K285337N04120
2654a710812j507313j122066P57997K139199K847956L215665K386357O8863j855273
2645E220573j579683j3593O25619n7734n46795J38797J328147J833646J223441
2636H172418j3139j082641j692670k209142k734168k455867o95641J795649L596781
2627B681580M262493M051123K620137k91263l190416l838723k091860K7012J154059
2618E384142J550870J197262o21868l094769l628963j184888J896996K770452
$$ plain form
2680 -1069612 -1874535 -4140520 -5464691 -5578066 -5409282 -4421816 -1853859 644909 677161
2671 677161 -1228447 -2408776 -2021105 -1312840 -332090 2252591 5695402 6914129 4783637
2662 4783637 1767896 -31366 -1591330 -4006340 -5594020 -4500269 -2214932 -1710812
2654 -1710812 -3218125 -4340191 -3582194 -1442995 1404961 4620626 7006983 7075846 5220573
2645 5220573 3640890 3627297 4252916 4195182 3648387 3787184 5115331 6948977 8172418
2636 8172418 8159279 7076638 5383968 3174826 440658 -2015209 -2710850 -915201 2681580
2627 2681580 6944073 10995196 13615333 13324070 10133654 6294931 4203071 4230083 5384142
2618 5384142 6935012 8132274 7510406 4415637 786674 -398214 1498782 4269234
2610D269234J402304j81232o93907m18531k05596o42435j523449j739298o67380
2601d00290L40953m67411k080628j471078J727146L881533K330775n82587p79376
2592B499037J762225L093943P27678l166587m305682r82273L950429N563286J880432
2583A1022488l511066m998631j237961L594901N035199K726356r90315m220040
2575G420931n682561m228191o11790J941388J421917j7201O92366K543925J799699
2566E280483k031372m800822l205561P76246K548328O66495j860464j876380q4553
2557d587600L53803j478216k953542k004544l59387n70676j536700k30683K966047
2548a0401498M561472L608911K795267L022294J534666k538056n282004l714978
$$ plain form
2610 4269234 5671538 5490306 4796399 4377868 4172272 3529837 2006388 267090 -400290
2601 -400290 -59337 -526748 -2607376 -4078454 -2351308 1530225 3861000 3278413 2499037
2592 2499037 4261262 7355205 8082883 4916296 610614 -371659 3578770 9142056 11022488
2583 11022488 7511422 2512791 1274830 4869731 9904930 12631286 11640971 7420931
2575 7420931 1738370 -2489821 -3101611 -1160223 261694 244493 936859 3480784 5280483
2566 5280483 3249111 -1551711 -4757272 -3981026 -1432698 -766203 -2626667 -4503047 -4587600
2557 -4587600 -4233797 -5712013 -8665555 -10670099 -11029486 -11600162 -13136862 -13367545 -10401498
2548 -10401498 -5840026 -2231115 564152 3586446 5121112 2583056 -2698948 -6413926
2540f413926n14599N19827J90596J032099J990480P88658r34337q3099K073492
2531a350809J926221J65379P26056L500509L922874M98643k685681k466560q31463
2522C405169o62065j365944j098229q8407N27114P15922O50389J9289n38562K90815
2512A855491J734931J101776k041914m489907l657112q57541J103956J426059
2504c824261J031596P97338J283636K462729K955134J439094q55144j442831n15466
2495C331825n30365j588717j037172J326172J870041j037190l783431k864385
2487d313222n8605Q97272q5283n50821J13997Q28271J579882K776854L175240
2478D363585J426177j303645k674010k049415j26363K603310M904138M399179
$$ plain form
2540 -6413926 -6928525 -6408698 -6218102 -5186003 -3195523 -2406865 -3341202 -3424301 -1350809
2531 -1350809 575412 740791 1466847 4967356 8890230 9388873 6703192 4236632 3405169
2522 3405169 2743104 1377160 278931 190524 717638 1433560 2083949 2103238 1564676 1855491
2512 1855491 3590422 4692198 2650284 -1839623 -5496735 -6354276 -5250320 -3824261
2504 -3824261 -2792665 -1995327 -711691 1751038 4706172 6145266 5290122 3847291 3331825
2495 3331825 2801460 1212743 175571 1501743 3371784 2334594 -1448837 -4313222
2487 -4313222 -4371827 -3474555 -3559838 -4110659 -3996662 -3168391 -1588509 1188345 4363585
2478 4363585 5789762 4486117 1812107 -237308 -363671 2239639 7143777 11542956
2470A1542956P91558k379477k025727J87040O81575p69665j884556k200850k807926
2461A134928k994417j096929J875114L049149J820359P1252j145294k037829k030812
2452a354479o71954K74892p54933j650329K80475K798002J458051k556563l307142
2443e483980M13088K799714M48460k163609l14163L332509L716512J716295J643235
2434F108061L226047K328976j534918m348029m256876l708067m096217l303412
2426i584435l45337J963369J604062R95882K805370M898472L384032q46352k811746
2417B063317n91560K046796J295453j522176k459492n33386J692215K106075J160012
2408E257254R0971q02821j560139j849713j650854j485000j266001j0809K457400
$$ plain form
2470 11542956 12334514 9955037 7929310 8116350 8797925 8028260 6143704 3942854 1134928
2461 1134928 -1859489 -2956418 -1081304 1967845 3788204 3859456 2714162 676333 -1354479
2452 -1354479 -2026433 -1751541 -2506474 -4156803 -3876328 -1078326 379725 -2176838 -5483980
2443 -5483980 -5070892 -2271178 -1822718 -3986327 -4300490 -967981 2748531 4464826 6108061
2434 6108061 9334108 11663084 10128166 5780137 1523261 -2184806 -6281023 -9584435
2426 -9584435 -9929772 -7966403 -6362341 -5366459 -2561089 2337383 5721415 4875063 2063317
2417 2063317 1471757 3518553 4814006 3291830 832338 298952 1991167 4097242 5257254
2408 5257254 5348225 4545404 2985265 1135552 -515302 -2000302 -3266303 -3277112 -819712
2399h19712M490373M373570K483520O58481j76255p81348k195913m346594n993370
2390b307248n612309k672330J443239M172961M036654J943037m7209p50748l71533
2381a65486J82778p7538j456852k772710k261411r0549J159626k35590k407332
2372h125064k082530J065803M025524M268450K321877L20725n77953p90177j198608
2363g71953j942776k028858l18652K679860M571397L474134K88089k272570k538311
2354A140360r67609J091717K614786L071789K357729O93318j608063l883351m761415
2345b50739l320687q32540L32194K8832M13592J884164J870685n11716j856454
2336b242669L79905L032046J755045j782346k291256P19091K449833P28572j138152
$$ plain form
2399 -819712 3670661 8044231 10527751 11186232 11009977 10228629 8032716 3686122 -2307248
2390 -2307248 -7919557 -10591887 -9148648 -4975687 -939033 1004004 956795 206047 -165486
2381 -165486 17292 -60246 -1517098 -4289808 -6551219 -6641768 -5482142 -5717732 -8125064
2372 -8125064 -10207594 -9141791 -5116267 -847817 1474060 1794785 1216832 426655 -771953
2363 -771953 -2714729 -4743587 -5062239 -2382379 2189018 5663152 5951241 3678671 1140360
2354 1140360 172751 1264468 3879254 6951043 9308772 10002090 8394027 4510676 -250739
2345 -250739 -3571426 -4403966 -4071772 -4042940 -3629348 -1745184 125501 -386215 -2242669
2336 -2242669 -1862764 1169282 2924327 1141981 -1149275 -430184 2019649 2748221 1610069
2327A610069m66350J072562J587707K006155K690967J540876j736449l579711
2319D725826j969288n6637q67786k004241R6198L561334L617777n0953l175389
2310C876841l216615j601352j49557Q45575J075636J76445o92105r4701J020322
2301A240489O19068q87891j272858k12041O13516P59349J212495J599170N37256
2292D208553j190999j213833L90112J020073J1643l33521R56050J678044K68154
2283E794276j673984k248666j913971j770618j719285j677986k112940k214693
2275i537867l94708K243333K305471m49104j867666J36561J993378O35734q16247
2266e751115J853089O447015P471140M578241J945063N39978k368576n981587
$$ plain form
2327 1610069 1143719 2216281 3803988 5810143 8501110 10041986 8305537 4725826
2319 4725826 2756538 2699901 1832115 -172126 -75928 3485406 7103183 7052230 3876841
2310 3876841 660226 -941126 -1090683 -245108 830528 1006973 314868 220167 1240489
2301 1240489 1859557 971666 -301192 -513233 100283 859632 2072127 3671297 4208553
2292 4208553 3017554 1803721 2193833 3213906 3225549 2892028 3848078 5526122 5794276
2283 5794276 4120292 1871626 -42345 -1812963 -3532248 -5210234 -7323174 -9537867
2275 -9537867 -9932575 -7689242 -5383771 -5832875 -7700541 -7563980 -5570602 -4934868 -5751115
2266 -5751115 -3898026 2548989 10020129 14598370 16543433 17083411 14714835 8733248
2258H733248n302559L35081M423644K348680j935236k450228l3033M27615j559357
2249D987855k109906K4551J984327K214229K401249L230393K623084j76489k430026
2240A2749267j998184p53154j428687l186389l070848o91570J221786O88536j192410
$$ plain form
2258 8733248 3430689 3765770 8189414 10538094 8602858 6152630 6119597 6547212 4987855
2249 4987855 2877949 2902500 4886827 7101056 9502305 12732698 15355782 15179293 12749267
2240 12749267 10751083 9997929 8569242 5382853 2312005 1620435 2842221 3530757 2338347
$$ [...]
##END NTUPLES=NMR SPECTRUM
##END=
