##TITLE=31P_LR_724-R2-CR17 
 64 sc cdcl3
 26.2.2025
##JCAMPDX= 6.0         $$ Bruker NMR JCAMP-DX V2.0
##DATA TYPE= NMR SPECTRUM
##DATA CLASS= NTUPLES
##ORIGIN= UXNMR, Bruker Analytische Messtechnik GmbH
##OWNER= root
$$ XWIN-NMR		Version 3.5
$$ Wed Feb 26 16:10:35 2025 Russian Standard Time (UT+4h)  new_Human@DPX200
##.OBSERVE FREQUENCY= 81.013821
##.OBSERVE NUCLEUS= ^31P
##.ACQUISITION MODE= SIMULTANEOUS
##.ACQUISITION SCHEME= undefined
##.AVERAGES= 64
##.DIGITISER RES= 17
##SPECTROMETER/DATA SYSTEM= spect
##.PULSE SEQUENCE= zgpg30
##.SOLVENT NAME= Acetone
##.SHIFT REFERENCE= (INTERNAL, Acetone, 0, 198.062)
##AUDIT TRAIL= $$ (NUMBER, WHEN, WHO, WHERE, WHAT)
$$ ##TITLE= Audit trail, XWIN-NMR		Version 3.5
$$ ##JCAMPDX= 5.01
$$ ##ORIGIN= Bruker BioSpin GmbH
$$ ##OWNER= new_Human
$$ C:/Bruker/XWIN-NMR/data/yarkov/nmr/P31/2/pdata/1/auditp.txt
$$ ##AUDIT TRAIL=  $$ (NUMBER, WHEN, WHO, WHERE, WHAT)
(   1,<2025-02-26 16:09:21.71 +0400>,<new_Human>,<DPX200>,
      <created by zg, POWCHK disabled, PULCHK disabled
       configuration hash MD5:
       00 E9 B6 7A A2 85 ED C7 34 08 36 98 17 FE 4E 26
       data hash MD5: 32K
       B6 8B 7C 94 1C DF 44 A8 0A 96 FD B5 37 07 EA 5A>)
(   2,<2025-02-26 16:09:26.14 +0400>,<new_Human>,<DPX200>,
      <Start of raw data processing
       efp BC_mod = 2 LB = 1.5 FT_mod = 6 PKNL = 1 PHC0 = 1809.089 PHC1 = 6.895418 SI = 64K 
       data hash MD5: 64K
       BF F0 C4 59 DD 8E BD 83 9D F9 09 91 73 20 8F 9C>)
(   3,<2025-02-26 16:09:46.40 +0400>,<new_Human>,<DPX200>,
      <pk PHC0 = -2.635623 PHC1 = 0 
       data hash MD5: 64K
       0D A0 3D FE 3C 72 20 A4 16 5A 82 8B AB 7C 29 FA>)
$$ ##END=
$$ 
$$ hash MD5
$$ 5C 16 8C 75 D0 26 3A 97 83 59 89 3D 4C D9 5D 8D
##$RELAX= 
##$RELAX= 
##$RELAX= 
##$RELAX= 
##$RELAX= 
##$RELAX= 
##$RELAX= 
##$RELAX= 
$$ Bruker specific parameters
$$ --------------------------
##$DU= <C:/Bruker/XWIN-NMR>
##$EXPNO= 2
##$NAME= <P31>
##$PROCNO= 1
##$TYPE= <nmr>
##$USER= <yarkov>
##$AMP= (0..31)
100 100 100 100 100 100 100 100 100 100 100 100 100 100 100 100 100 100 
100 100 100 100 100 100 100 100 100 100 100 100 100 100 
##$AQSEQ= 0
##$AQ_mod= 1
##$AUNM= <au_zg>
##$AUTOPOS= <>
##$BF1= 81.014009
##$BF2= 200.13
##$BF3= 200.13
##$BF4= 200.13
##$BF5= 200.13
##$BF6= 200.13
##$BF7= 200.13
##$BF8= 200.13
##$BYTORDA= 1
##$CFDGTYP= 0
##$CFRGTYP= 5
##$CHEMSTR= <none>
##$CNST= (0..31)
1 1 145 1 1 1 1 1 1 1 1 1 1 1 1 1 1 1 1 1 1 1 1 1 1 1 1 1 1 1 1 1 
##$CPDPRG= <waltz16>
##$CPDPRG1= <>
##$CPDPRG2= <waltz16>
##$CPDPRG3= <>
##$CPDPRG4= <mlev>
##$CPDPRG5= <mlev>
##$CPDPRG6= <mlev>
##$CPDPRG7= <mlev>
##$CPDPRG8= <mlev>
##$CPDPRGB= <>
##$CPDPRGT= <>
##$D= (0..31)
0 1 0 0 0 0 0 0 0 0.06 0 0.03 2e-05 3e-06 0 0 0.0002 0 0 0 0 0 0 0 0 0 
0 0 0 0 0 0 
##$DATE= 1740571761
##$DBL= (0..7)
120 120 120 11 120 120 24 19 
##$DBP= (0..7)
150 150 150 150 150 150 150 150 
##$DBP07= 0
##$DBPNAM0= <>
##$DBPNAM1= <>
##$DBPNAM2= <>
##$DBPNAM3= <>
##$DBPNAM4= <>
##$DBPNAM5= <>
##$DBPNAM6= <>
##$DBPNAM7= <>
##$DBPOAL= (0..7)
$$ [...]
##$SUBNAM2= <"">
##$SUBNAM3= <"">
##$SUBNAM4= <"">
##$SUBNAM5= <"">
##$SUBNAM6= <"">
##$SUBNAM7= <"">
##$SUBNAM8= <"">
##$SUBNAM9= <"">
##$SW= 400.765351723535
##$SWIBOX= (0..15)
0 1 3 0 0 0 0 0 0 0 0 0 0 0 0 0 
##$SW_h= 32467.5324675325
##$TD= 32768
##$TD0= 1
##$TE= 0
##$TE2= 300
##$TE3= 300
##$TEG= 300
##$TL= (0..7)
0 120 53 12 22 120 120 120 
##$TP= (0..7)
150 150 150 150 150 150 150 150 
##$TP07= 0
##$TPNAME0= <>
##$TPNAME1= <>
##$TPNAME2= <>
##$TPNAME3= <>
##$TPNAME4= <>
##$TPNAME5= <>
##$TPNAME6= <>
##$TPNAME7= <>
##$TPOAL= (0..7)
0.5 0.5 0.5 0.5 0.5 0.5 0.5 0.5 
##$TPOFFS= (0..7)
0 0 0 0 0 0 0 0 
##$TUNHIN= 0
##$TUNHOUT= 0
##$TUNXOUT= 0
##$USERA1= <user>
##$USERA2= <user>
##$USERA3= <user>
##$USERA4= <user>
##$USERA5= <user>
##$V9= 5
##$VALIST= <valist>
##$VCLIST= <CCCCCCCCCCCCCCC>
##$VD= 0
##$VDLIST= <DDDDDDDDDDDDDDD>
##$VPLIST= <PPPPPPPPPPPPPPP>
##$VTLIST= <TTTTTTTTTTTTTTT>
##$WBST= 1024
##$WBSW= 4
##$XGAIN= (0..3)
0 0 0 0 
##$XL= 0
##$YL= 0
##$YMAX_a= 30631
##$YMIN_a= -34926
##$ZGOPTNS= <>
##$ZL1= 120
##$ZL2= 120
##$ZL3= 120
##$ZL4= 120
##$ABSF1= 0
##$ABSF2= 0
##$ABSG= 0
##$ABSL= 0
##$ALPHA= 0
##$AQORDER= 0
##$ASSFAC= 0
##$ASSFACI= 0
##$ASSFACX= 0
##$ASSWID= 0
##$AUNMP= <proc_1d>
##$AZFE= 0.1
##$AZFW= 0.5
##$BCFW= 0
##$BC_mod= 2
##$BYTORDP= 0
##$COROFFS= 0
##$CY= -3
##$DATMOD= 1
##$DC= 0
##$DFILT= <>
##$DTYPP= 0
##$F1P= 0
##$F2P= 0
##$FCOR= 1
##$FTSIZE= 65536
##$FT_mod= 6
##$GAMMA= 0
##$GB= 0
##$INTBC= 1
##$INTSCL= 9.790993e-09
##$ISEN= 30
##$LB= 1.5
##$LEV0= 0
##$LPBIN= 0
##$MAXI= 10000
##$MC2= 0
##$MEAN= 0
##$ME_mod= 0
##$MI= 50
##$NCOEF= 0
##$NC_proc= -3
##$NLEV= 6
##$NOISF1= 182.463
##$NOISF2= 159.3651
##$NSP= 0
##$NTH_PI= 0
##$NZP= 0
##$OFFSET= 198.0616
##$PC= 4
##$PHC0= 1806.453
##$PHC1= 6.895418
##$PH_mod= 1
##$PKNL= yes
##$PPARMOD= 0
##$PSCAL= 0
##$PSIGN= 0
##$REVERSE= no
##$SF= 81.0140089999434
##$SI= 65536
##$SIGF1= 159.3651
##$SIGF2= -187.1042
##$SINO= 113.3802
##$SIOLD= 16384
##$SREGLST= <1H.CDCl3>
##$SSB= 0
##$STSI= 65536
##$STSR= 0
##$SW_p= 32467.5324675325
##$SYMM= 0
##$S_DEV= 0
##$TDeff= 32768
##$TDoff= 0
##$TI= <>
##$TILT= no
##$TM1= 0
##$TM2= 0
##$TOPLEV= 0
##$USERP1= <user>
##$USERP2= <user>
##$USERP3= <user>
##$USERP4= <user>
##$USERP5= <user>
##$WDW= 1
##$XDIM= 65536
##$YMAX_p= 281039924
##$YMIN_p= -4652247
$$ End of Bruker specific parameters
$$ ---------------------------------
##NTUPLES= NMR SPECTRUM
##VAR_NAME=  FREQUENCY,     SPECTRUM/REAL,   SPECTRUM/IMAG
##SYMBOL=    X,             R,               I
##VAR_TYPE=  INDEPENDENT,   DEPENDENT,       DEPENDENT
##VAR_FORM=  AFFN,          ASDF,            ASDF
##VAR_DIM=   65536,         65536,           65536
##UNITS=     HZ,            ARBITRARY UNITS, ARBITRARY UNITS
##FACTOR=    0.49542278885378, 1,            1
##FIRST=     16045.7642231865, 0,            0
##LAST=      -16421.768244346, 0,            0
##MIN=       -16421.768244346, -4652247,     0
##MAX=       16045.7642231865, 281039924,    0
$$ Real data points
##PAGE= N=1
##DATA TABLE= (X++(R..R)), XYDATA
$$ [...]
45934 1324 14725 101370 216411 270297 192821 20889 -105428 -83368 37948 130195 144755
45923 144755 137939 159039 189738 196682 172016 106327 -11796 -143683 -210269 -190636 -156854
45912 -156854 -165940 -167700 -83622 54988 125878 74589 -13151 -21605 62540 161324 210965 212046
45900 212046 196754 196958 240453 326745 394943 367363 252884 158157 152534 169138 107530 -2588
45888 -2588 -37323 28530 77835 34543 -20448 8394 65016 25603 -107148 -212039 -228346
45877 -228346 -210394 -203015 -176634 -113536 -60014 -49822 -55298 -57321 -88680 -157911 -200429 -168658
45865 -168658 -116069 -124436 -186521 -224838 -198349 -132081 -63782 -15852 -1678 -8652 9554 75695
45853 75695 137826 122501 29704 -67749 -110938 -101189 -68148 -32364 -1299 24880 44909 44986
45841 44986 13301 -27974 -40930 -32654 -45027 -64837 -19929 87928 131122 21067 -144719
45830 -144719 -205168 -150079 -90533 -58780 12297 118863 157595 102852 65506 112800 157217
45819 157217 103236 -3584 -58856 -37349 33451 142307 241317 216975 33112 -167493 -228514
45808 -228514 -189812 -200562 -271778 -270360 -144765 3235 93092 162640 241645 262523 176353
45797 176353 57132 2334 655 -17129 -48717 -25609 80750 225991 347853 404248 380461
45786 380461 308127 256700 260238 270925 225181 131308 46565 -6622 -45706 -67146 -45192 6710
45774 6710 32099 6380 -26943 -13654 48657 120033 162834 164246 138966 121704 135088 156115
45762 156115 139176 82047 39002 49986 86152 94366 72102 58925 65068 55107 11034 -31013
45750 -31013 -32809 -13320 -21310 -64039 -100490 -102277 -85407 -77178 -86979 -119369 -175336 -218138 -180597
45737 -180597 -48989 90319 140870 116014 110863 160860 196399 153493 63756 -246 -13575
45726 -13575 11957 77111 172575 241382 235141 193512 196000 235216 214882 95701 -30469 -59704
45714 -59704 -12866 11458 -13944 -21590 28055 78854 65381 9365 -19911 -5998 13319 29482
45702 29482 78979 160231 196921 128135 -2260 -94933 -110155 -83103 -43819 11373 66323
45691 66323 74300 29894 -5400 10703 35815 9607 -52247 -83752 -60638 -13542 27577 45545
45679 45545 12747 -79024 -176105 -218436 -232348 -291910 -384451 -404733 -311326 -199382 -165833
45668 -165833 -180706 -160395 -100060 -48250 -5079 51390 71046 -16640 -154073 -176294 -22297
45657 -22297 166182 217527 136751 72828 122564 236348 302656 266732 160706 54506 -8963
45646 -8963 -39682 -63409 -68873 -23338 55396 90216 38243 -44080 -69321 -25865 22738 19131
45634 19131 -51685 -179917 -321834 -383632 -288664 -83812 76451 88830 11427 -17898 50491
45623 50491 130425 116540 15134 -62149 -30548 64444 100119 28833 -61892 -64510 8412 42889
45611 42889 -36044 -190506 -327702 -380794 -332561 -214853 -101946 -59944 -80914 -97417 -69052
45600 -69052 -14853 42808 107685 162975 157006 74928 -24492 -86508 -130992 -199864 -276313 -310639
45588 -310639 -293605 -248991 -181047 -85878 7830 65680 95636 117990 116071 79418 65529 136359
45576 136359 248028 293505 257193 236696 294667 377905 413480 400204 362313 292646 199550
45565 199550 142041 149529 156722 86992 -37415 -132534 -164242 -155024 -112415 -33547 30814 3408
45553 3408 -110825 -210493 -220808 -179635 -166339 -184842 -166626 -79873 11884 24717 -32767 -63817
45541 -63817 -15944 31846 -36083 -209388 -351698 -367911 -296869 -213452 -124680 -22664 37633
45530 37633 9184 -43426 -15059 82054 131331 81730 5740 -26653 -32349 -38855 -18516 40923
45518 40923 74160 21411 -73089 -118275 -103878 -103292 -160913 -235428 -257264 -200785 -96234 793
45506 793 51587 65047 78354 96984 82625 22480 -30523 -31206 -17750 -47051 -78846 -14676
45494 -14676 136504 224319 139767 -35025 -128051 -84429 4489 51360 57671 41553 -20311
45483 -20311 -125853 -194548 -158225 -66794 -24440 -40640 -30790 35993 86349 70243 45895 73388
45471 73388 98023 29236 -108005 -197858 -192353 -151181 -124289 -93415 -53493 -55850 -115842 -150232
45459 -150232 -76684 67637 172961 195731 188684 205227 232286 225430 172075 107130 80091
45448 80091 102978 122773 67275 -62639 -172252 -173718 -85306 3903 46628 69951 106880
45437 106880 147147 165367 157932 133205 90903 31509 -25610 -49690 -27310 15340 22211 -45503
45425 -45503 -164345 -264260 -296344 -269101 -215939 -159281 -119218 -115906 -134502 -128412 -97086 -117134
45413 -117134 -235541 -365379 -367295 -225963 -66048 12199 29350 35685 11397 -82614 -212440
45402 -212440 -300046 -318425 -301310 -274943 -231268 -161158 -71179 28177 115008 145596 93196
45391 93196 -4152 -74705 -94623 -98941 -107410 -90857 -35636 7732 -9760 -48330 -19228 87024
45379 87024 169651 138678 23217 -76195 -109195 -102958 -90657 -72347 -48251 -34695 -29961 -10677
45367 -10677 19634 27828 21313 62232 165069 234810 178038 41541 -39665 -16272 37567 58037
45355 58037 68105 91863 81263 -9729 -133937 -201969 -196949 -179930 -193768 -212744 -191184 -127558
45343 -127558 -68457 -58432 -87148 -92619 -35903 36192 42563 -18443 -63903 -52558 -46405 -97794
45331 -97794 -139909 -71629 82045 183759 152493 38203 -75905 -159319 -195522 -142550 4404
45320 4404 160941 231372 214484 174670 130847 47498 -62557 -109290 -45608 38267 8970
45309 8970 -140421 -282779 -321243 -289683 -259918 -220117 -115780 28675 119428 123824 108612
45298 108612 125210 133559 86509 27703 38297 119287 192085 201418 159216 91727 1459 -104244
45286 -104244 -188258 -209744 -159685 -65574 25781 74801 76127 57066 42431 37200 49575 94141
45274 94141 148970 153353 89560 24242 12797 6802 -63052 -146042 -122990 1281 75407 9915
45262 9915 -98026 -113063 -44242 8195 19100 43809 93602 119548 120166 160676 254860 310708
45250 310708 242654 83954 -59621 -127774 -130993 -93063 -29605 23180 14314 -68761 -180121
45239 -180121 -258609 -269632 -204654 -79546 47387 97049 53126 1901 36470 128193 152028
45228 152028 50448 -89437 -153350 -136806 -112788 -108769 -90028 -49009 -35392 -82605 -155653
45217 -155653 -190307 -154766 -72051 -10448 -34022 -115486 -121687 39290 263922 338255 196269
45206 196269 -94 -78055 -55312 -57088 -118103 -166633 -155942 -109261 -55839 -13281 -22331 -111995
45194 -111995 -228853 -279743 -251521 -216187 -211793 -198001 -147658 -100018 -83762 -57034 21621
45183 21621 111003 132924 73718 -6355 -49595 -50984 -41491 -46086 -53799 -25943 45477 92710
45171 92710 33281 -109963 -206102 -169968 -69546 -28733 -64009 -85414 -37860 35351 74329
45160 74329 77786 71814 59283 38022 31211 56312 83609 65984 3074 -57464 -80271 -71676
45148 -71676 -45191 6933 86492 157906 176192 141438 97485 72211 44954 -11702 -76558 -91599
45136 -91599 -29938 63731 108963 65093 -29437 -95246 -93681 -65584 -77824 -138011 -185674 -169694
45124 -169694 -104083 -33527 24023 72914 104979 108498 98515 97768 91440 41144 -50459 -124502
45112 -124502 -127904 -64610 25394 113190 192727 263618 316872 330829 279400 156373 -7085
45101 -7085 -158972 -258093 -285670 -246861 -181012 -148164 -172591 -213887 -223721 -207672 -190496 -152125
45089 -152125 -65230 21857 23756 -55472 -118571 -116506 -107241 -139644 -167505 -135184 -70785 -25286
45077 -25286 12523 61075 67333 -21543 -149021 -210237 -196051 -178148 -170839 -119976 -33245 -5223
45065 -5223 -75151 -155596 -156567 -106877 -92590 -130008 -160929 -137447 -56814 60613 175460 227787
45053 227787 183798 89344 43066 100648 213162 266127 184708 6208 -158245 -239446 -267968
45042 -267968 -303575 -344595 -348926 -311729 -258829 -183215 -65881 44340 59419 -21815 -99013
45031 -99013 -108121 -89654 -85375 -63603 -8196 12840 -42511 -90666 -45289 17657 -49014 -230320
45019 -230320 -347371 -305985 -214645 -200358 -220463 -151669 779 93651 40093 -70886 -83542
45008 -83542 34594 152642 126187 -42434 -218713 -295583 -291107 -278050 -280135 -287707 -322415
44997 -322415 -402764 -466709 -419263 -264074 -107513 -17584 39632 98498 117377 54127 -55320
44986 -55320 -153404 -232708 -288676 -268679 -156820 -57634 -84539 -184089 -185489 -36522 117553
44975 117553 129478 31894 -37590 -23799 9951 -6487 -79423 -179237 -272730 -323975 -315153 -277916
44963 -277916 -265460 -285283 -295921 -276189 -252588 -240680 -207887 -130595 -46784 -155 37318
44952 37318 119403 216311 235295 165923 116557 156412 200840 136415 2465 -61108 -22029
44941 -22029 11689 -19897 -33291 51024 175181 243313 267496 305219 311614 187262 -40148
44930 -40148 -210084 -229354 -174185 -156034 -179927 -190596 -179378 -172353 -164747 -140263 -124172 -152400
44918 -152400 -207620 -240136 -233637 -202000 -146356 -72297 -25607 -40956 -66563 -16007 102475
44907 102475 186984 187901 170247 194718 219934 189360 149405 188781 291122 343710 292952 204843
44895 204843 151613 117584 57368 -19003 -76991 -126583 -191618 -233899 -180518 -29889 129009
44884 129009 216993 234483 214985 163587 79873 2290 -21386 6481 43497 66500 82311
44873 82311 86752 56686 -10672 -86070 -143898 -176339 -164485 -76525 82729 253446 377689
44862 377689 445326 457423 385484 222623 54318 6836 107657 246841 302177 264556 211801
44851 211801 195785 200410 193134 167794 129727 75535 6151 -59462 -100007 -111222 -98754 -60156
44839 -60156 13835 120530 232823 307158 310032 247326 167382 122335 121462 132504 131016 131197
44827 131197 157802 205487 245718 261932 254168 218772 158083 112239 139400 239337 326758 317035
44815 317035 223497 132120 88040 53135 -15583 -93694 -127269 -110448 -81471 -55407 -9642
44804 -9642 55820 87638 38712 -63640 -141563 -151438 -115862 -73194 -31375 11762 34529 14467
44792 14467 -26874 -42777 -27900 -25666 -54465 -69185 -30944 19027 7650 -62352 -110844 -90680
44780 -90680 -44079 -29577 -44580 -55474 -63321 -92280 -136529 -167347 -184140 -214834 -264825 -302738
44768 -302738 -305227 -288419 -283302 -294572 -290623 -231265 -114622 -244 40249 12435 5453 75912
44756 75912 160720 160244 83701 39453 82214 144115 136109 52201 -54172 -135510 -155936 -90142
44744 -90142 33654 131405 148666 111220 55303 -35569 -166211 -259974 -242158 -163852 -148688
44733 -148688 -223472 -292838 -288489 -250040 -230688 -211719 -160859 -104465 -79070 -61202 -9002 61927
44721 61927 105996 123706 146365 162133 127189 53099 17069 60881 126887 126493 42844 -64197
44709 -64197 -133661 -150941 -129751 -83817 -29683 5051 2076 -20482 -23896 -2950 -5713 -76156
44697 -76156 -185969 -253501 -234230 -164325 -104829 -72052 -42984 -4475 32432 55934 66881
44686 66881 74528 93492 131854 167226 156416 94116 39323 46549 88735 96699 66939 70062
44674 70062 138914 209281 210860 172651 183037 264824 345640 353754 294384 214816 136737 59771
44662 59771 8857 27406 112563 196371 223463 226544 281552 390592 460656 420853 315346
44651 315346 240173 225709 236435 254233 281066 269605 154731 -12282 -59992 96500 312521
44640 312521 371318 246114 105677 75620 103733 80997 -5527 -92406 -139893 -151273 -137250
44629 -137250 -114097 -105686 -107191 -82306 -34709 -36406 -129727 -239729 -252107 -157126 -50856 -8874
44617 -8874 -25825 -68349 -110528 -113245 -48284 35852 44986 -33568 -103233 -95445 -63929 -83541
44605 -83541 -117203 -67427 69746 187391 201518 130973 36340 -52701 -123112 -148027 -116355
44594 -116355 -67909 -60201 -106681 -171587 -219102 -242851 -245248 -213136 -134398 -31673 43926 61541
44582 61541 35949 -8090 -74798 -172051 -262062 -279163 -201314 -72809 42970 97754 56058
44571 56058 -76843 -211203 -227712 -115067 5135 33455 11724 32027 90205 110208 67936
44560 67936 -45 -79902 -175770 -240580 -216318 -144395 -134867 -212378 -288992 -307439 -306872 -312258
44548 -312258 -266069 -131480 25200 125976 182610 235907 261160 215849 131055 73056 48263
44537 48263 18043 -25382 -67944 -125479 -212009 -282049 -280782 -236336 -229794 -279593 -318065 -279289
44525 -279289 -160904 -12293 91354 87275 -8328 -97500 -117481 -122144 -182258 -256520 -257435 -203399
44513 -203399 -183986 -193602 -137874 -17045 39141 -35160 -142692 -183973 -201477 -275086 -369219
44502 -369219 -388452 -319008 -212672 -81098 88129 243355 305767 288529 285056 332090 367962
44491 367962 342876 292923 271262 266326 232711 165727 99885 48872 -13464 -106650 -201253 -241782
44479 -241782 -212617 -165866 -167341 -220606 -265831 -252986 -189646 -111787 -39507 20846 56393 53655
44467 53655 15015 -40702 -83777 -84507 -45347 -19385 -59422 -144298 -196181 -177244 -124173 -81370
44455 -81370 -57822 -62628 -110739 -162190 -133689 -24923 38770 -36362 -170199 -208203 -120294
44444 -120294 -10176 42875 53502 55436 58458 88094 173970 271360 273353 141340 -31854
44433 -31854 -125145 -115747 -76674 -82069 -137676 -183795 -159100 -76371 -17631 -26207 -40361 8495
44421 8495 68819 29510 -106457 -210683 -201785 -129277 -62903 -4332 48134 53103 11844 7477
44409 7477 76904 126861 74850 1482 42865 177099 250176 202227 135704 136281 148133 86668
44397 86668 -15860 -59598 -25270 6297 -24454 -73546 -51987 58434 173628 199233 138985
44386 138985 79725 65429 38020 -58176 -163431 -169052 -73916 15600 47331 88038 187704
44375 187704 268775 225113 72978 -81203 -187944 -276741 -343597 -321877 -201276 -95106
44365 -95106 -122631 -260746 -372725 -370499 -296119 -241155 -233259 -225775 -173628 -89535 -25073 -11767
44353 -11767 -29545 -32348 1764 52973 88326 94000 76216 48280 29124 38208 71954 95898
44341 95898 81086 38776 -3082 -44044 -98015 -144635 -138860 -75707 -2116 50060 99790 164583
44329 164583 217651 231101 223472 223155 215351 170189 100024 45102 22815 31452 76564 145350
44317 145350 186047 174536 172936 245302 335665 323773 200747 86794 54105 38456 -27448
44306 -27448 -94956 -88340 -32826 -6191 -18992 -30345 -37632 -58853 -61331 -9781 32664 -37472
44294 -37472 -192968 -267549 -161962 19484 94410 14823 -99217 -108568 10416 168358 262190
44283 262190 264822 226168 192336 146332 55475 -43409 -64535 8842 81424 56386 -47171
44272 -47171 -129591 -141734 -132381 -164239 -226009 -253369 -218962 -169650 -165548 -201966 -214351 -155129
44260 -155129 -40324 80299 165809 186714 128837 27750 -37081 -30647 -20394 -91233 -218804
44249 -218804 -290965 -252675 -162448 -95980 -65657 -61923 -101403 -180351 -232116 -194760 -94372
44238 -94372 -8146 31617 42217 21104 -58491 -177673 -260275 -258122 -208729 -181025 -191468 -202085
44226 -202085 -183293 -147822 -126093 -133588 -169447 -227374 -288382 -309186 -246444 -110611 20859
44215 20859 71376 41888 -4902 -27697 -33658 -25062 17851 70712 44300 -105165 -281194 -337595
44203 -337595 -248790 -114058 -1694 111868 224971 244207 113650 -66091 -149690 -135548
44193 -135548 -134437 -171568 -148548 -27329 73060 37159 -80615 -144556 -131139 -126690 -164306
44182 -164306 -180749 -142616 -107884 -125207 -158164 -159461 -150598 -170081 -200691 -214788 -244178 -323989
44170 -323989 -393577 -343287 -167194 4376 48128 -30404 -140151 -215237 -243893 -227918 -170518
44159 -170518 -100378 -63814 -74708 -92822 -74808 -41646 -64132 -159495 -228957 -153362 42681
44148 42681 186348 157422 38877 -1182 62214 99508 40530 -13618 54081 196648 267137
44137 267137 219519 150766 147874 181492 180566 143657 120777 121168 103343 54446 23875 55276
44125 55276 122196 164491 166814 163667 178547 200758 221425 244991 252834 205300 109066 40121
44113 40121 61023 148997 245214 335239 423491 463528 397130 258835 159353 143853 135606 53741
44101 53741 -71755 -148483 -143053 -101510 -68532 -36428 20720 93275 135261 117515 72712 67517
44089 67517 118995 162635 129294 32357 -54129 -79057 -34009 76866 217530 290840 218078
44078 218078 57761 -35243 11815 125710 213776 260355 266291 199184 72967 -10304 14903
44067 14903 73881 58473 -14902 -44936 -3535 40467 34802 -6486 -56853 -101968 -112298 -58819
44055 -58819 39605 132304 191589 213305 194727 164413 194189 311525 433922 465551 423925
44044 423925 386773 353750 269209 155692 99106 102749 81661 15709 -18996 -63 -10430
44033 -10430 -89351 -152565 -127318 -57185 1101 75115 177809 214732 113527 -24730 -35675
44022 -35675 83917 183589 171041 99380 45121 12487 -16619 -30338 -24904 -32603 -76357 -137208
44010 -137208 -184684 -199679 -159648 -52413 76342 136825 87455 -14605 -79347 -80071 -66007
43999 -66007 -96120 -176760 -256769 -276765 -228268 -161388 -126300 -118158 -97475 -55276 -31227 -61827
43987 -61827 -127376 -162161 -120664 -34542 10227 -26596 -76096 -37140 87377 188113 195401
43976 195401 158757 144463 128423 61374 -17211 -26850 16384 7524 -97334 -221430 -274572
43965 -274572 -250960 -199881 -160476 -150039 -165271 -171601 -134052 -72238 -38148 -30997 7764 99164
43953 99164 189427 232856 248959 263967 258970 221410 191713 206118 239243 253155 256083 258907
43941 258907 224699 128683 22927 -35785 -82883 -180515 -284431 -284182 -174460 -77388 -70230
43930 -70230 -90409 -52623 30626 102332 154715 196113 186311 92865 -19790 -39855 61689
43919 61689 210315 322566 361230 313621 191672 61255 3970 26562 53516 22275 -58376
43908 -58376 -149218 -221601 -242591 -183763 -79247 -19889 -46479 -94710 -91364 -58945 -67685 -123697
43896 -123697 -175906 -208932 -248713 -281374 -251468 -163143 -110514 -164546 -277323 -342011 -314921
43885 -314921 -237442 -163273 -110594 -77991 -66152 -73488 -89922 -102094 -97282 -65844 -11156 43158
43873 43158 64262 32660 -42542 -126739 -182827 -199420 -193153 -179985 -160282 -143303 -158626 -211021
43861 -211021 -248102 -223157 -177726 -197335 -279005 -314403 -234302 -102187 -14967 28853 89857
43850 89857 157466 149226 37263 -103412 -191342 -220701 -220612 -188833 -112042 -20409 28855 19264
43838 19264 -7689 -8022 15774 31440 24648 9053 -8416 -46948 -119340 -196492 -233620 -228426
43826 -228426 -220342 -226810 -219085 -181199 -154489 -184159 -243058 -253114 -180539 -76334 -18849 -39827
43814 -39827 -108816 -169967 -190051 -182329 -184203 -209510 -236048 -243266 -236176 -220091 -186330 -148072
43802 -148072 -152743 -216002 -271782 -241195 -137975 -54998 -52463 -106045 -158929 -175353 -146244 -94834
43790 -94834 -78042 -128032 -187293 -159290 -34957 91059 148664 172935 223618 284518 294783
43779 294783 239841 157666 79226 11505 -33996 -37940 4783 83867 183648 275115 316833 288573
43767 288573 210746 115108 18830 -56961 -78726 -43018 1047 8860 -2300 11547 53150 94326
43755 94326 132471 182592 219915 186796 70317 -66798 -149723 -161540 -141629 -136772 -160104
43744 -160104 -179529 -144105 -39294 84112 151138 128776 42459 -51655 -89397 -25902 111651
43733 111651 215206 196593 97334 45513 100191 195455 247018 245882 218563 165316 93107
43722 93107 56958 98071 167477 176104 105214 6894 -89759 -199116 -302261 -329023 -253738
43711 -253738 -155758 -139684 -223205 -335124 -396887 -375554 -283814 -166952 -77570 -33334 -8862
43700 -8862 12805 5855 -50485 -113787 -112060 -28419 83717 163428 187625 165542 128305 116571
43688 116571 136655 135601 64955 -39961 -101107 -112792 -144578 -219943 -272462 -253273 -202989
43677 -202989 -169041 -127528 -53323 458 -21402 -70850 -62111 -9708 -1491 -51433 -83502 -64102
43665 -64102 -48539 -76058 -112346 -126272 -135898 -139553 -87642 21127 89952 40117 -74608 -135489
43653 -135489 -101120 -22970 42479 72586 59048 16325 -5933 23771 66912 69215 48301 64522
43641 64522 115268 130431 81963 28345 20973 23859 -26813 -117591 -165249 -122425 -32475 31137
43629 31137 48519 53921 72119 89659 93119 102076 141527 202336 252749 270052 237043 138297
43617 138297 4417 -68668 -12502 109712 164654 120123 77405 114399 180119 184619 116464
43606 116464 18922 -79284 -148885 -145256 -82416 -59523 -128778 -191520 -122748 43785 160374
43595 160374 163382 112127 50666 -36714 -121467 -116640 -14710 69212 51695 -10725 -27471 -2560
43583 -2560 15820 38683 97923 155031 144381 85209 63574 107392 154020 147160 99573 44942
43571 44942 -13334 -77551 -124545 -134869 -126921 -126526 -115084 -44263 92125 229475 294947 282803
43559 282803 242762 204516 154159 93185 71485 122947 200750 227233 191636 147301 124413
43548 124413 106847 93960 112784 147619 128398 32975 -56290 -55797 897 14538 -34097 -64818
43536 -64818 -26603 24642 6995 -76658 -150669 -165806 -144498 -131174 -134007 -129389 -102322 -63202
43524 -63202 -32986 -26330 -43429 -66080 -71165 -63841 -81800 -136865 -166895 -96267 51153 156763
43512 156763 149348 88206 66579 86231 85619 48936 11875 -18923 -72791 -141853 -171714 -138911
43500 -138911 -83050 -48474 -39119 -40150 -43899 -49897 -72684 -136970 -222866 -243984 -148547 -20353
43488 -20353 9689 -54794 -84608 -25011 28954 -3773 -66279 -74190 -51760 -63359 -82018 -34508
43476 -34508 61601 109625 71439 8131 -18103 -11438 -1191 9379 30271 51421 42920 -11736
43464 -11736 -79274 -87439 -7697 80771 70674 -20357 -53696 39526 155089 165369 97000 71230
43452 71230 120534 166468 156100 121799 103765 93907 70011 26996 -34299 -103603 -148429 -147646
43440 -147646 -126662 -113131 -75956 31536 174880 247038 183917 30494 -109545 -156423 -98386
43429 -98386 2977 54593 14008 -70987 -117036 -74407 63969 258607 396029 348179 131688
43418 131688 -63760 -96832 -57106 -114911 -253636 -304408 -220614 -145151 -177922 -234633 -203060
43407 -203060 -114448 -74412 -109434 -162530 -185572 -174453 -152152 -151956 -177706 -172802 -90085 10777
43395 10777 26189 -26967 -25519 57221 97956 31055 -28055 36142 154264 189633 145345 116959
43383 116959 111363 64986 1359 12088 83712 90502 -11425 -106782 -85860 10911 70010 53059
43371 53059 7480 -21432 -28336 -18092 16238 82682 170792 241778 245753 166329 42681 -68613
43359 -68613 -140896 -169615 -145537 -74111 -1530 27063 29879 64739 143431 211223 216510 165283
43347 165283 100689 59433 53112 64589 58227 16957 -29970 -36967 3940 58050 84716 55889
43335 55889 -40424 -173482 -258479 -224203 -101672 -5111 -9752 -78003 -117534 -81947 2273
43324 2273 81786 123103 122027 88359 33229 -24423 -47800 -4873 84822 148548 131277 56409
43312 56409 -7288 -25996 -20335 -15587 -7650 18091 61389 110010 152121 178992 183377 158609
43300 158609 101724 27279 -25878 -25460 12489 40967 47503 64042 97694 102220 53539 6497
43288 6497 24119 84166 113908 93167 61021 37380 5865 -29204 -35922 -12707 7716 24096
43276 24096 74784 157388 198848 143558 27933 -74342 -147536 -225220 -304199 -323217 -242680
43265 -242680 -109913 -13509 17553 35889 86541 130964 99591 2116 -72505 -71388 -30067
43254 -30067 12769 79775 179546 231971 158512 19485 -30622 71032 226251 300641 254700
43243 254700 140264 29839 -26901 -24557 -5247 -11824 -32946 -27452 5495 30553 45373 84887
43231 84887 150187 194891 197603 190910 201701 218399 232584 251173 247209 167326 22341 -93949
43219 -93949 -118775 -95128 -87895 -86248 -50097 -2490 -404 -39883 -60136 -31578 18098 58905
43207 58905 85726 89696 50875 -27098 -103754 -133608 -99180 -18333 66549 117145 132405 141775
43195 141775 155798 147048 98057 42068 28318 63704 113155 143149 144708 129811 122547 134582
43183 134582 136388 83471 -9396 -59465 -17347 56741 64954 -3108 -70492 -88691 -96862 -151235
43171 -151235 -236143 -274120 -213398 -85727 29789 95700 149582 230888 296807 258781 103608
43160 103608 -75582 -186656 -224429 -224450 -191448 -123528 -60036 -41508 -47285 -29896 8351 28501
43148 28501 28039 41978 76695 96512 76914 25112 -51046 -147520 -233678 -262560 -224559 -161419
43136 -161419 -120679 -118240 -140576 -158732 -150806 -137478 -175309 -277034 -360664 -330958 -201685
43125 -201685 -82541 -48241 -76838 -119692 -169219 -234899 -300928 -338227 -333828 -296103 -253907
43114 -253907 -247066 -282613 -307779 -274344 -224916 -251926 -360027 -437783 -396806 -278487 -180179
43103 -180179 -128354 -81775 -25238 5785 -10206 -40116 -32686 24285 87979 98470 42783 -20524
43091 -20524 -24823 17724 31668 -12548 -58238 -57308 -47235 -81093 -128252 -119493 -67432 -56553
43079 -56553 -107903 -138098 -87814 -18142 -15131 -44886 12101 187667 366904 429801 388428
43068 388428 333590 293027 218291 98308 2366 -14191 19370 52115 88065 144870 182931
43057 182931 152214 90471 95265 190899 288968 297264 211669 85072 -31345 -85949 -31252
43046 -31252 109751 218200 184450 31412 -114025 -170644 -179705 -221714 -296480 -323392 -256364
43035 -256364 -161138 -144650 -215519 -263711 -205905 -106351 -94444 -184838 -255478 -211383 -95380
43024 -95380 -7021 20082 11080 -25025 -96685 -181135 -233174 -236068 -204501 -148700 -73674 -4816
43012 -4816 21766 -7768 -81439 -174354 -244723 -247648 -190197 -145682 -165618 -197274 -144145 -905
43000 -905 128584 154456 94419 33385 30437 79630 129945 130457 79641 34653 48948 106881
42988 106881 151983 168684 188601 220798 236484 232826 245363 269217 235758 119869 16973
42977 16973 43046 184112 310824 328804 252267 139848 34091 -22074 13877 120317 197900
42966 197900 172855 86261 33615 40600 55612 51806 64244 107929 126869 75036 5359 11407
42954 11407 92301 143401 97416 15317 -3547 40234 56691 -925 -81862 -131541 -174400 -250387
42942 -250387 -307880 -240300 -40403 151034 195004 109973 23462 -2170 -20250 -75239 -112436
42931 -112436 -60960 46863 106030 70655 -2954 -43601 -44375 -41100 -50049 -52586 -29399 4683
42919 4683 3761 -61833 -158886 -215266 -203772 -172741 -172840 -193947 -210895 -242779 -303084 -331118 -258599
42906 -258599 -122402 -17037 51736 154079 273885 295006 194645 117326 171166 261421
42896 261421 233356 90982 -47389 -140400 -234310 -327237 -364844 -356874 -365948 -379703 -318337
42885 -318337 -178813 -49543 35962 134808 252526 293681 212522 100431 52422 44027 17144
42874 17144 -2731 33905 95308 116609 100642 85227 58216 -8441 -81405 -110400 -117952 -160880
42862 -160880 -229818 -268164 -264127 -241806 -189603 -89513 5133 23257 -1824 31879 134840
42851 134840 207612 196385 157427 135819 89549 -11702 -108219 -139336 -133652 -139126 -131240 -69998
42839 -69998 5564 23616 -15807 -58748 -89529 -130028 -171238 -180595 -161013 -133582 -83076 1785
42827 1785 56008 5532 -93604 -92212 45382 172098 148844 17627 -86021 -118150 -130969
42816 -130969 -143685 -121498 -75508 -77717 -147672 -204323 -176482 -106633 -93909 -165420 -250447 -265864
42804 -265864 -190235 -66212 34507 55480 1161 -57511 -50333 14066 60152 38476 -21085
42793 -21085 -59647 -63441 -62648 -74813 -83115 -71207 -52136 -50636 -71266 -96007 -106511 -99440 -81488
42780 -81488 -53825 -3230 84848 195747 273891 261303 157041 27853 -48879 -47573 -1048
42769 -1048 37276 30247 -22994 -83972 -102764 -67151 -16115 9094 12028 19657 33825 36609 30234
42756 30234 31284 31907 12315 -9270 7095 47222 42171 -33089 -118996 -162162 -183422 -206049
42744 -206049 -183775 -80174 30358 40889 -32094 -73555 -43618 -17379 -38492 -48104 -1879
42733 -1879 47729 50484 51225 108786 195216 252444 280198 285614 220684 76946 -23173 36094
42721 36094 173497 204113 107913 44657 85030 102259 1114 -106095 -70941 63055 142731
42710 142731 132804 110555 82868 -26205 -201662 -300756 -236750 -90582 14840 64169 113819
42699 113819 180975 242870 299207 357242 374485 287700 105983 -74168 -163820 -165675 -152458
42688 -152458 -180307 -236275 -264207 -231568 -164383 -114683 -103066 -106712 -98482 -76786 -53508 -32370
42676 -32370 -7943 27643 80975 144022 182897 163605 97156 35443 11043 5695 -7631 -20543
42664 -20543 -10916 17663 50667 96152 162599 212818 186193 76080 -49986 -121006 -125593 -91904
42652 -91904 -37651 29874 83001 83453 32501 -13199 2004 63738 95378 48542 -26743 -31592
42640 -31592 56493 143359 132546 51413 11002 47021 65596 -25528 -184547 -283882 -262184
42629 -262184 -174598 -103030 -72149 -63436 -63898 -71873 -79176 -75154 -62367 -55349 -67011 -96596 -121891
42616 -121891 -109241 -50491 14057 34297 9367 -23079 -55060 -119583 -217974 -284480 -259330
42605 -259330 -161522 -49388 57321 165133 244836 250163 194989 146376 127513 86474 -12643
42594 -12643 -117656 -145696 -83097 4640 43924 13998 -40808 -44640 34216 125744 116871 -5964
42582 -5964 -119224 -110332 -20323 21136 -30747 -105130 -144988 -177828 -234921 -276051 -243048 -145930
42570 -145930 -53889 -25977 -76319 -176608 -265534 -286407 -245113 -205250 -204956 -216502 -214424 -230213
42558 -230213 -286588 -324018 -268503 -149609 -72208 -78460 -117266 -151342 -203243 -270151 -284459
42547 -284459 -213597 -127876 -103836 -116104 -96484 -53634 -50486 -92195 -126692 -146615 -198192 -276890
42535 -276890 -302157 -230827 -124804 -60483 -26496 35587 127978 190194 177717 102689 6840
42524 6840 -69870 -100834 -85671 -53893 -39093 -51342 -79667 -105380 -106446 -74333 -39411 -49219
42512 -49219 -101229 -129213 -84840 -2727 50774 66019 83743 119156 140841 121708 71767 20024
42500 20024 -7237 2517 28540 20524 -41245 -101045 -88187 -18457 15090 -37190 -115099 -124890
42488 -124890 -51855 26784 27689 -52816 -133069 -127728 -40399 42531 62728 60193 97692 151446
42476 151446 141093 55059 -24767 -31917 13821 61886 100057 140630 181971 212701 225511 214011
42464 214011 187286 187022 241142 297537 268318 158884 85764 131316 241341 310155 311612 292064
42452 292064 277617 248820 184614 85281 -31064 -126214 -165144 -167149 -194042 -258702 -294242
42441 -294242 -250965 -169833 -113429 -82411 -58184 -63979 -101698 -85069 54635 221906 232639
42430 232639 47240 -169719 -250166 -203724 -164055 -218170 -331567 -403767 -362936 -225681 -82251
42419 -82251 -13244 -24563 -75358 -141442 -217301 -285788 -335428 -384830 -438512 -445311 -362196 -234457
42407 -234457 -142973 -95689 -50201 -19097 -52894 -126904 -156467 -137834 -162171 -257916 -327005
42396 -327005 -286841 -179570 -83870 -7986 63912 101350 80110 40558 22911 5629 -24684
42385 -24684 -13320 66915 124561 58417 -84387 -166813 -153458 -134296 -163933 -188488 -153625
42374 -153625 -88577 -41175 -3272 48158 86001 62510 -20101 -110014 -167712 -198857 -226160
42363 -226160 -249101 -244582 -206257 -166714 -160994 -176319 -169977 -137829 -123372 -146408 -170380 -167169
42351 -167169 -166881 -203331 -251489 -267915 -259895 -260677 -261448 -224914 -152458 -86569 -55792 -59736 -92768
42338 -92768 -136986 -148679 -101697 -30662 17128 54036 118912 187660 186549 96783 -17613 -95434
42326 -95434 -134414 -150525 -138989 -99566 -58628 -44590 -69090 -135175 -226907 -291686 -281161 -218504
42314 -218504 -180380 -202685 -247397 -269167 -264714 -244015 -205076 -158495 -129673 -111810 -59158 46215
42302 46215 156628 210851 192352 122314 36577 -14540 5042 59509 61198 -14813 -84011 -68458
42290 -68458 -16802 -43989 -173744 -309037 -357725 -324996 -265648 -200381 -117725 -27544 35017
42279 35017 57080 61061 55637 6301 -108862 -229682 -253607 -160467 -50202 -22384 -57654
42268 -57654 -66560 -23859 11907 2766 -13988 10403 70916 127838 152928 141947 113866 105020
42256 105020 131584 158713 145303 110876 104132 110946 65407 -36274 -110500 -105548 -74158 -82968
42244 -82968 -112791 -104070 -53170 -7012 3431 -23497 -81274 -146962 -182408 -180042 -175475 -188132
42232 -188132 -195609 -193204 -212262 -237362 -186307 -44228 59118 4508 -142571 -223782 -209195
42221 -209195 -200099 -237023 -250489 -214675 -205959 -258588 -284361 -208496 -90962 -33679 -40342 -49132
42209 -49132 -47784 -72810 -128472 -177844 -192533 -159539 -69973 48956 129616 146775 159244 201993
42197 201993 191423 40627 -163514 -226232 -98040 61219 110414 98900 136268 197813 178396
42186 178396 79621 11300 19464 32551 -7056 -65605 -105603 -152655 -220679 -253922 -213880 -158717
42174 -158717 -157507 -176627 -138017 -53313 -6425 -24090 -60578 -102021 -181939 -283550 -333112
42163 -333112 -320900 -327516 -383705 -401638 -309465 -163533 -46374 61251 199810 290800 215387
42152 215387 15584 -113781 -54555 114097 247429 290426 263958 188456 88307 13377
42142 13377 -11757 -27354 -74330 -121088 -110419 -58638 -46055 -108225 -192225 -239413 -266332 -324925
42130 -324925 -403757 -417040 -305215 -116955 33386 76865 38348 -10553 -17644 19164 49463
42119 49463 3651 -127661 -247657 -239136 -105516 30484 82098 82659 89270 89683 64689 62798
42107 62798 123997 185032 156115 51963 -48636 -134938 -244635 -336651 -310380 -162041 -11640
42096 -11640 45726 20017 -50906 -147858 -216454 -181142 -57313 47910 84539 106367 131820
42085 131820 83800 -62322 -191498 -205484 -164893 -170588 -198193 -173718 -133070 -160324 -215065
42074 -215065 -172995 -27597 84925 73790 -6096 -57450 -44220 24790 121197 182184 154553
42063 154553 79321 58034 113593 158765 124921 44605 -24638 -83073 -152390 -220625 -272722
42052 -272722 -326535 -389646 -418680 -369091 -260260 -152434 -78979 -34395 -12079 -18613 -50498
42041 -50498 -77300 -58956 14168 100042 145659 160106 212976 329952 428531 410938 292993
42030 292993 175082 103094 35538 -52502 -115525 -110478 -57900 -3931 26087 19007 -22896 -49079
42018 -49079 9178 145723 266004 292520 237417 151837 60158 -27971 -95674 -143338 -190410
42007 -190410 -227658 -215933 -154586 -98205 -85106 -107244 -163973 -264561 -351326 -320080 -174687
41996 -174687 -68466 -115019 -240145 -307867 -309495 -314253 -302320 -193763 -21486 68733 13028
41985 13028 -85022 -93827 7074 152974 277586 334368 299108 193723 73619 -25898 -99674
41974 -99674 -135290 -117772 -74125 -60460 -96976 -157794 -218006 -259085 -242265 -148708 -44652
41963 -44652 -28597 -101770 -166012 -166462 -156561 -192481 -242568 -249826 -222161 -207033 -219587 -241695
41951 -241695 -259381 -265964 -256755 -242304 -232766 -198294 -96252 44673 128293 110546 61101 71106
41939 71106 148981 237753 280724 238903 108059 -37726 -82916 -4104 89143 98082 57071
41928 57071 52505 87697 110300 119167 148947 182806 173910 133508 112695 114550 107398 106020 148207
41915 148207 200860 185415 99304 18789 -27808 -91161 -180795 -212974 -131416 -6609 46315
41904 46315 4962 -51264 -35939 72717 220766 311834 284079 176702 90635 72452 76552
41893 76552 51310 10260 -5215 13624 48003 78565 83500 47597 -4922 -22507 11280 63447
41881 63447 108574 152496 187170 177981 118158 45245 -12943 -50923 -32464 94036 293056
41870 293056 436878 454408 411617 390990 373779 313649 244042 215275 190682 113639 27907
41859 27907 16854 59460 65385 26968 11877 21894 -3317 -41672 560 102319 105743 -49879
41847 -49879 -208009 -206538 -99631 -52658 -99162 -133965 -102604 -66338 -84911 -143221 -208211
41836 -208211 -275071 -337634 -375347 -384259 -370852 -310756 -167090 40868 232513 335517 324573
41825 324573 205762 22597 -127646 -159112 -98687 -58198 -83530 -101151 -49856 11092 -6813
41814 -6813 -78339 -100401 -46389 4214 -8984 -58429 -110112 -193925 -333328 -454494 -443534
41803 -443534 -289511 -107988 -5911 27333 62086 102999 84038 -12040 -95407 -74745 15645
41792 15645 57068 6418 -55611 -55125 -27765 -33573 -32737 55280 190254 223120 98235 -54132
41780 -54132 -86095 -15193 38570 38938 55651 124109 186344 186294 143590 105835 88143 86216 99002
41767 99002 114562 116813 121573 157708 200520 184991 108086 51895 68608 107087 101794 72232
41755 72232 71135 87354 76881 55068 78691 153079 226799 269069 292968 313005 333157 358093
41743 358093 362406 282272 112427 -20280 20286 190964 307974 286622 238418 295655 434917
41732 434917 528020 494405 349367 162082 16649 -37005 -37589 -71251 -147480 -179214 -117700
41721 -117700 -26193 30641 83055 167589 224208 181517 84336 28452 12636 -30344 -88012
41710 -88012 -82064 -21299 -8759 -71773 -104989 -30559 86184 142044 135036 132022 163892 222451
41698 222451 306754 395796 412836 298241 106350 -36263 -66846 -29248 10903 33795 42341
41687 42341 30180 -1518 -34687 -67156 -121787 -194013 -221607 -152572 -32525 24868 -32914
41676 -32914 -135727 -179670 -143849 -85416 -47164 -22313 -2986 -5179 -29904 -47162 -41319 -30698
41664 -30698 -18693 26281 105832 155576 127305 67948 53555 75699 66821 17134 -20123 -37210
41652 -37210 -92957 -203867 -299025 -320624 -294854 -260476 -204784 -132563 -124889 -236353 -375952
41641 -375952 -391652 -263641 -122275 -68617 -67124 -43343 -3450 612 -30869 -50155 -39820
41630 -39820 -26214 -24639 -24798 -32910 -76547 -148895 -191553 -167070 -121717 -133945 -209361 -269908
41618 -269908 -254747 -192056 -148272 -139037 -128367 -97842 -67935 -46439 -3242 75408 138248 114923
41606 114923 3524 -122106 -196160 -220920 -230408 -225694 -180869 -101193 -32955 -4541 5885
41595 5885 19407 5727 -72484 -180426 -230082 -183715 -88781 4270 103377 220196 306068
41584 306068 301525 223840 147151 107937 84872 63593 58773 65502 51840 24859 52050 177936
41572 177936 348613 452652 421934 276919 99244 -20060 -36033 10456 20313 -67281 -207718
41561 -207718 -294227 -260710 -132488 9132 95967 117250 111758 115278 116062 74461 -16838 -116914
41549 -116914 -184599 -213849 -212177 -176784 -112810 -48186 -4071 32248 84518 155086 231962 303774
41537 303774 344683 311309 190171 33004 -89218 -156343 -189898 -187741 -117511 14523 131764
41526 131764 156798 96049 26958 4250 4960 -22745 -77261 -99888 -53618 27166 84234 105417
41514 105417 118510 140773 175158 234233 309737 328531 212817 134 -165462 -191425 -124906
41503 -124906 -55610 -8543 13912 -33996 -169683 -292065 -269702 -108319 58063 136439 146647
41492 146647 126612 70890 -5236 -33339 20444 98118 131598 128687 128038 122011 88046 56600
41480 56600 73256 109422 82492 -28951 -147259 -190920 -167600 -151393 -193577 -275533 -335197
41469 -335197 -325273 -253264 -174870 -147774 -189682 -276439 -366015 -416705 -401327 -328211 -243048 -187362
41457 -187362 -154910 -109354 -46340 -13708 -57340 -162134 -261023 -294911 -254322 -172149 -90662
41446 -90662 -33030 5634 42146 77343 91625 76423 56680 59189 65306 29863 -43605 -84429
41434 -84429 -40495 45902 88009 62564 20332 -2657 -25441 -62503 -84798 -75694 -77952 -134885
41422 -134885 -212684 -232070 -163973 -51410 49669 105169 90139 -948 -122218 -203163 -225079
41411 -225079 -234061 -264854 -293109 -284063 -247294 -210299 -170424 -113353 -57747 -37607 -48819 -53411
41399 -53411 -35051 -11462 11761 56761 123415 159254 112094 -4317 -124178 -193192 -189473
41388 -189473 -102023 58821 225246 301368 260323 177979 139337 143021 133159 89307 30092
41377 30092 -46400 -154066 -253245 -266468 -178389 -60071 27159 92059 152828 184552 172103
41366 172103 154429 157849 135403 38019 -94713 -184267 -218549 -233565 -223725 -160955 -84310 -68348
41354 -68348 -97435 -71908 38478 144123 174522 171381 186741 180143 102977 16097 16501 79013
41342 79013 77289 -38821 -180926 -254282 -268518 -279629 -289469 -257691 -175332 -77282 -4644 7278
41330 7278 -67900 -207421 -322460 -339914 -296187 -290403 -342958 -372921 -336067 -299213 -318249 -320089
41318 -320089 -205614 -26814 55896 -13024 -127404 -187943 -206567 -204473 -136828 -5217 63035
41307 63035 -31008 -189652 -227193 -108915 35407 109776 136563 142737 88274 -52768 -229361
41296 -229361 -371868 -451731 -465467 -426017 -383921 -386393 -400683 -350612 -242490 -173230 -191249
41285 -191249 -233681 -234439 -211616 -203557 -193915 -153949 -100419 -63420 -44705 -40239 -51449 -53819 -22880
41272 -22880 -9526 -98806 -260856 -347439 -293104 -213307 -223720 -264771 -210952 -71096 39863
41261 39863 69734 52072 7812 -56717 -88675 -46240 4618 -32407 -125858 -155753 -104002 -77883
41249 -77883 -128822 -174732 -146451 -103311 -136913 -231997 -288270 -242934 -128819 -32285 -10130
41238 -10130 -30893 -10098 69599 113880 51395 -34149 -3287 135338 235828 222770 160943
41227 160943 104038 14864 -113012 -187961 -158830 -113188 -140885 -188707 -158619 -80510 -65772
41216 -65772 -126642 -158783 -95673 15155 90928 89443 6131 -128546 -239404 -259095 -203264
41205 -203264 -144040 -110809 -76630 -40815 -46986 -94506 -104851 -25757 81495 117967 81372
41194 81372 61123 104478 150902 124784 46527 2394 21304 38636 -4104 -74906 -104810 -89299
41182 -89299 -81454 -103351 -129500 -155139 -204025 -247077 -196220 -36120 104407 94404 -25165
41171 -25165 -99643 -73186 -39813 -71874 -107978 -67905 9797 34568 15781 43570 130276 175192
41159 175192 115138 25653 18454 95007 163864 167330 125405 72921 20639 -20573 -37202 -47231
41147 -47231 -86695 -147254 -174645 -147780 -111844 -107136 -111079 -85648 -42767 -21361 -29480 -50572
41135 -50572 -83721 -136979 -196529 -235357 -237898 -195742 -110186 -24685 -9262 -67401 -101637 -32556
41123 -32556 81229 111125 25453 -80909 -108722 -36782 102477 248321 314455 252465 130587
41112 130587 76489 122082 173406 151908 88576 46916 28694 4919 -19955 -29685 -40946 -80179
41100 -80179 -146293 -226029 -307721 -354032 -311999 -188677 -70914 -28598 -40067 -52639 -68539
41089 -68539 -118796 -191724 -242871 -246298 -189098 -54896 126255 246306 213874 70558 -52455
41078 -52455 -88196 -82005 -90852 -108476 -110111 -106967 -116625 -120080 -90813 -45715 -29264 -52865 -79422
41065 -79422 -72299 -38978 -15181 -17826 -29839 -28654 -11103 14563 39584 44727 5014 -69380
41053 -69380 -120322 -108799 -78670 -104145 -178167 -207674 -130514 10677 124647 156555 106298
41042 106298 16926 -32526 21099 141439 204034 133230 -4791 -83814 -63340 -15663 -32076
41031 -32076 -136543 -272327 -346150 -306326 -199431 -124867 -116969 -108635 -32064 91755 197295
41020 197295 260392 294394 301026 277951 246697 224125 191262 134441 85737 71628 54541 -11326
41008 -11326 -91223 -110584 -75750 -76972 -157310 -245144 -248660 -171831 -100290 -97905 -151229 -207334
40996 -207334 -236597 -245228 -238511 -201004 -132271 -79225 -88779 -129390 -109426 8794 156206 241471
40984 241471 249474 230436 229800 259098 301064 312490 254831 151606 81793 87766 126462 140550
40972 140550 134817 144656 169567 180647 162102 111065 33732 -25425 2696 125601 256827
40961 256827 309672 281256 208953 101366 -36018 -159604 -229612 -250414 -225599 -132970 3855
40950 3855 89683 72744 20186 8231 12146 -9987 -9550 59489 110951 32219 -119484 -169952
40938 -169952 -63132 88085 180131 218124 229909 205132 146725 86595 32095 -23455 -44440
40927 -44440 1381 57441 44444 -5307 1246 48741 33940 -45674 -76373 -23417 11534 -29033
40915 -29033 -68153 -43726 -9550 -14778 -9450 48407 106141 121625 147375 217391 247947 155270
40903 155270 -1690 -94545 -87056 -43430 -27071 -59954 -130647 -182388 -146428 -36017 55359
40892 55359 88371 123759 183492 172282 24298 -161046 -232923 -176323 -92737 -51450 -53260
40881 -53260 -92396 -157765 -200773 -178520 -105696 -14012 93607 200236 250196 225482 179715
40870 179715 137687 43428 -120449 -256067 -289115 -294655 -368281 -451713 -423182 -303006 -222803
40859 -222803 -222940 -223333 -181107 -141054 -128974 -121010 -128846 -197840 -301295 -341802 -281744 -182532
40847 -182532 -98304 -22066 43674 56013 5924 -51327 -74263 -83896 -108403 -134195 -138350 -126853
40835 -126853 -118962 -120503 -117748 -80954 4365 86977 77796 -26167 -101028 -46533 76607 141166
40823 141166 127300 97203 49966 -60507 -187211 -222107 -177551 -188232 -293992 -359032 -272626
40812 -272626 -112872 -27042 -37566 -55442 -25719 23762 43704 8148 -81147 -192570 -285382
40801 -285382 -351782 -406591 -429366 -375625 -267625 -208433 -262895 -374086 -439140 -422850 -355288
40790 -355288 -263807 -161803 -75098 -25412 1409 33365 69088 86824 86053 91305 116705 145536
40778 145536 145779 99416 20805 -51954 -90724 -101435 -108369 -121265 -126592 -102112 -33685 66268
40766 66268 151201 175898 147068 107379 66184 -1282 -71708 -62755 54299 198552 288042
40755 288042 333590 361701 328591 208625 95723 93647 155484 163868 129348 152855 206265
40744 206265 130183 -108027 -313587 -301815 -120042 49197 111989 104688 84897 71818 62001
40733 62001 41956 2187 -37310 -47459 -39442 -37440 -3755 122705 295138 365396 269009 115437
40721 115437 33793 9713 -47118 -137859 -171597 -102386 10653 82129 88063 64630 45609
40710 45609 18209 -46824 -121980 -125032 -34134 48096 20508 -63850 -70233 13540 64028 16190
40698 16190 -56255 -80571 -78177 -72207 -26235 57372 89914 28967 -35352 -8928 76372 141138
40686 141138 179924 215515 217428 172086 163099 263632 396749 419284 315760 202168 158740
40675 158740 164880 189950 239453 292438 281925 176150 29215 -75760 -104509 -85499 -76262
40664 -76262 -122821 -230702 -365842 -479796 -522793 -450581 -267274 -62516 55262 83964
40654 83964 130669 264143 419990 482596 408490 239925 53009 -74805 -101765 -63470 -34624
40643 -34624 -34317 -26463 -14929 -46698 -102719 -94445 -10403 43575 5561 -51882 -57922 -53891 -85109
40630 -85109 -100798 -65132 -54129 -118394 -154716 -59567 77716 96745 15670 -11123 57163
40619 57163 115173 112037 108959 120920 63851 -92164 -242783 -274250 -175732 2074 204351
40608 204351 356764 386759 305676 203467 134770 75481 8997 -22671 11891 76228 115870
40597 115870 122882 123613 134490 148854 148905 129108 117362 147412 194147 185832 115882 79020 135968
40584 135968 206242 179126 77928 16145 30029 59370 67812 74985 83529 79286 97986 188630
40572 188630 307873 349939 294424 236466 253956 321042 368164 362593 318590 278245 276890 284790
40560 284790 214846 42774 -128572 -196385 -192001 -198749 -203081 -149465 -87829 -116797 -205455 -222703
40548 -222703 -138162 -48621 -4979 36748 81804 72239 28219 61676 196837 311390 314301
40537 314301 261573 237387 233463 207783 162186 103412 16089 -79698 -129940 -135332 -142725 -130741
40525 -130741 -24973 144585 239240 214662 189428 245125 298908 264121 205541 221373 275983
40514 275983 268347 186556 85469 -18533 -124589 -178954 -132088 -22969 73537 137695 175878
40503 175878 162306 89688 24505 31621 86690 129789 155124 181905 193590 179209 181146 226038
40491 226038 257939 216871 139157 105169 129178 171686 215210 250736 231912 130052 10677
40480 10677 -24185 40770 128647 170918 159250 118205 81992 84113 124948 164963 183520 216006
40468 216006 294974 386537 429980 416772 389250 378189 373828 345302 270892 166023 84515
40457 84515 64323 79300 86105 101738 169715 263060 305770 288651 268564 248037 168353 45057
40445 45057 -13422 27799 61527 2803 -84514 -102860 -66769 -47261 -51354 -44783 -28170 -10089
40433 -10089 34387 104171 132207 76718 -6108 -45867 -51101 -54861 -38840 12483 47215 16796
40421 16796 -40554 -59496 -41700 -26693 -20624 -13972 -17243 -25675 -6468 32307 30256 -20601 -41254
40408 -41254 10359 69978 82818 92313 139110 169769 136626 100028 132181 194122 205319 170466
40396 170466 148343 157397 191116 258092 332657 344327 291368 276333 348362 407902 360247 263719
40384 263719 222126 227975 223579 221837 247829 252574 207857 196007 277023 357512 330150 255768
40372 255768 255817 300733 266570 145810 44607 10699 7208 20343 60131 92549 95666 138054
40360 138054 277371 430871 474755 426320 404036 453701 531516 604128 645964 596429 440514
40349 440514 273770 178561 112685 28963 -1550 76266 153424 103868 -16772 -82189 -102988
40338 -102988 -148388 -167061 -82537 29542 64700 93848 226291 369056 370943 320049 421130
40327 421130 633620 724040 655551 628367 722453 795776 788558 853039 1092550 1396050 1613046
40316 1613046 1699430 1633772 1389850 1059837 823583 731535 673026 588029 536296 530632 488720
40305 488720 393154 329574 330548 339271 342551 376407 401376 350875 295191 362481 504213 547639
40293 547639 477607 445195 493600 510212 469649 485586 583225 645566 624959 593642 558112
40282 558112 446526 305483 278440 358745 392452 347742 342845 389726 368830 287440 295895
40271 295895 404693 452455 405375 423960 577343 750523 887701 1072333 1321690 1553614
40261 1553614 1775079 2031764 2174568 1995417 1607362 1348084 1283620 1172336 948392 831345
40251 831345 886426 900296 802433 789871 903977 908590 743432 673111 806495 889571 775421
40240 775421 682706 766791 841720 763886 695826 745945 735754 575180 487655 611537 754020
40229 754020 781376 861589 1072450 1175147 1043633 920319 981706 1052194 1002196 1005390 1144816
40218 1144816 1209572 1139684 1197762 1437892 1521988 1347900 1303785 1580509 1815951 1772884
40208 1772884 1755596 1963980 2076315 1910626 1846473 2117925 2352846 2303769 2336182 2676080
40198 2676080 2922208 2860650 2962246 3470313 3858880 3853991 4053241 4801787 5481510 5742449
40188 5742449 6318320 7678076 9098636 10164122 11837980 14792243 18173722 21490587
40180 21490587 25998477 32447602 39518794 46869832 57492113 74072584 95801052 123058484
40172 123058484 161539309 213048890 261987266 281039924 256612701 203820369 151150088
40165 151150088 114407432 90752700 72886019 59290374 50491383 44006974 37146663
40158 37146663 30560988 25854411 22440821 19086491 16224901 14603011 13446699 11803834
40150 11803834 10207283 9434202 8954439 8019574 7064027 6704728 6461590 5717314 4939036
40141 4939036 4762261 4773568 4324906 3722551 3541000 3526797 3203569 2850164 2898919 3026739
40131 3026739 2775643 2443631 2471513 2573844 2352585 2147102 2390612 2730801 2683276 2567612
40121 2567612 2887557 3361170 3500789 3591149 4124712 4829618 5289975 5978906 7563359
40112 7563359 9754467 12143191 15598382 21049403 26889149 29445423 26772060 20783989
40104 20783989 14984952 11119844 8753432 7070474 5868958 5123543 4604176 4098894
40096 4098894 3570332 3039071 2551970 2210129 2045232 1944375 1806717 1657459 1536849
40087 1536849 1428305 1352008 1363972 1421343 1420696 1391248 1464850 1643573 1791946 1861937 1920701
40076 1920701 1956619 1872422 1676597 1477250 1292029 1066642 855668 762721 726653 600364
40066 600364 419426 352667 406974 429141 383923 375489 405860 376087 322483 380077 505613
40055 505613 514333 409655 392871 510980 580415 513671 439272 427704 379437 278059 280589
40044 280589 433069 544141 481636 378462 399125 491230 514905 459013 390938 325403 264350
40033 264350 251613 287194 292741 241735 218151 280326 376457 458551 577654 805830 1138955
40022 1138955 1496172 1738177 1717600 1439174 1136687 1030555 1037275 906891 623220 432744
40012 432744 458324 536976 511491 443232 426646 408174 328733 272433 329470 443608 517434
40001 517434 550314 569274 543520 465834 401232 363194 263864 83062 -36535 27157 200493
39990 200493 327496 367748 382774 406068 421303 410367 355449 251240 153622 139729 194422
39979 194422 233042 253673 338913 475281 519777 407059 249207 160062 120530 94823 131465
39968 131465 244795 327630 297703 224040 202896 211946 189927 156077 140922 95350 -17651
39957 -17651 -124115 -139786 -95087 -63014 -39080 12942 71332 102470 122713 136074 96779
39946 96779 11795 -20573 37774 85431 54210 38698 123867 201752 124534 -46876 -123587
39935 -123587 -61022 23838 70317 129593 206785 218225 138599 54717 30931 29367 4111 -19241
39923 -19241 -5840 16141 -6053 -76006 -140626 -135443 -34476 121032 247422 290435 261682
39912 261682 201246 143202 127671 186687 286660 340363 309089 238072 169677 101254 59203
39901 59203 108767 225887 264397 144334 -12612 -35895 80394 217509 307484 350982 329411
39890 329411 235435 147500 142128 164277 111891 16045 -2356 65624 106883 75930 43179 34642
39878 34642 -23975 -152950 -244276 -215196 -129180 -86697 -84595 -66245 -37874 -42645 -64429 -46173
39866 -46173 14525 60322 58662 33586 12879 -4799 -18695 -6683 35097 62173 31432 -27235
39854 -27235 -36936 13092 32899 -42106 -133438 -105521 49097 203827 281447 336077 417670
39843 417670 467961 424778 334518 267019 198787 91173 16409 69037 187185 208682 107535
39832 107535 36127 100906 220948 265777 228376 183134 149294 90155 11900 -23869 14086
39821 14086 88145 148756 185383 203083 185632 121442 54227 56609 130416 177484 118821 10518
39809 10518 -31231 -4417 -23632 -132810 -223721 -196905 -106905 -63336 -66694 -47491 -11591 -24714
39797 -24714 -75486 -73293 10300 97541 119845 94544 68009 59214 84862 169875 294453 378870
39785 378870 357142 241138 98643 -4599 -36795 -7285 47124 96811 131397 129431 58401
39774 58401 -59511 -129670 -92915 -13876 6593 -28092 -38736 -10624 -7307 -51409 -89901 -88195
39762 -88195 -70601 -54465 -30725 -23621 -75485 -147833 -137205 -31914 44409 8640 -49403 5140
39750 5140 153429 246638 199693 76950 -7509 -3989 64216 146963 197815 190067 128779 47308
39738 47308 -11026 -16166 22736 49808 6300 -101925 -198969 -216446 -161030 -91114 -43972 -7195
39726 -7195 44924 106241 136344 100952 12366 -76607 -122388 -124666 -105736 -73834 -24304 35782
39714 35782 86341 114470 122608 121130 119314 113801 86254 33732 -1912 24721 82512 74910 -39911
39701 -39911 -180611 -226539 -136962 33346 188586 236788 145182 -2775 -64202 103 81453
39690 81453 91215 86867 149699 225075 203568 99970 21307 -2674 -25880 -57254 -66828 -94477
39678 -94477 -195286 -284683 -212839 -17790 72907 -48475 -222860 -266413 -205255 -163219 -153397
39667 -153397 -117085 -70707 -68998 -79428 -23774 85812 160058 161536 131737 107428 86235 60305
39655 60305 23188 -36938 -103113 -123241 -85584 -55469 -84422 -135761 -159562 -177551 -214600 -209586
39643 -209586 -100275 43754 89508 30960 4923 110092 300803 471801 564381 570102 507196
39632 507196 424413 371253 338076 269411 150299 34532 -22457 -12971 46039 132044 200424
39621 200424 203390 149365 100856 92824 95972 83483 86788 144413 226059 254298 195808 99972
39609 99972 46872 75323 158004 228536 233097 171919 95848 54956 51771 57699 72901 138306
39597 138306 262510 362517 333401 185192 53768 43723 111073 149276 140638 147203 185316
39586 185316 205205 190812 182309 182239 134378 31033 -49385 -63811 -79811 -160550 -245681 -232229
39574 -232229 -125982 -24445 21182 41282 61181 64792 49995 46207 54426 24074 -78572
39563 -78572 -207136 -268302 -215339 -99452 -19834 -14725 -19728 34310 103711 80440 -38721
39552 -38721 -120705 -76115 12569 14651 -61684 -96917 -36344 57197 114077 132040 130015 100232
39540 100232 31728 -59848 -141884 -184044 -177311 -156602 -177357 -233438 -232085 -104668 82645
39529 82645 190635 166876 86302 41855 54989 96402 139856 177510 209524 226923 202627
39518 202627 127028 58364 76926 157712 166444 46009 -74762 -57348 32663 21917 -103452
39507 -103452 -184766 -142971 -80462 -89896 -111939 -61924 22986 61502 64720 91940 129493 113331
39495 113331 39350 -33060 -66638 -66513 -36856 14295 41260 -391 -80534 -115154 -66801 17551
39483 17551 72781 80794 62266 37957 14518 -10214 -41522 -80982 -120403 -143058 -127952 -57520
39471 -57520 60652 176088 225355 199881 166719 195353 271173 311233 270826 202912 184791
39460 184791 204666 169907 41182 -94267 -132032 -94943 -89988 -134329 -128260 -32064 39430
39449 39430 -19175 -127990 -124875 -3282 76336 12514 -110954 -153472 -87156 674 16017
39438 16017 -60581 -156900 -160570 -36005 106300 116327 -13518 -137767 -137114 -34265 85489
39427 85489 185025 266416 323139 353740 373772 373507 311821 187454 65384 -2064 -25721 -17956
39415 -17956 50848 180558 287007 286484 192514 71135 -52763 -178073 -262541 -259987 -201382
39404 -201382 -160377 -146454 -102923 -8541 85915 127653 108826 37170 -78647 -195303 -242004
39393 -242004 -197023 -124854 -105088 -143370 -181063 -183494 -188617 -254426 -369128 -439625 -388985 -253183
39381 -253183 -148630 -141620 -186652 -206635 -190797 -178724 -180465 -163481 -112518 -59797 -46849 -81930
39369 -81930 -142664 -200863 -233397 -219304 -143149 -13447 122454 201282 200170 158310 121794
39358 121794 85260 23915 -35223 -34480 16894 31038 -42102 -136720 -148791 -56763 71081 158611
39346 158611 175336 137690 99123 120041 206809 288413 285521 199188 109040 87310 129046 162947
39334 162947 126752 40240 -3954 57659 180809 270043 291463 270816 200249 43848 -147424
39323 -147424 -232398 -148941 -3169 75688 88471 93811 68225 -37896 -154068 -145006 -16190
39312 -16190 64865 -10215 -151993 -208089 -152321 -71766 -26890 -6422 4648 -7905 -42047
39301 -42047 -57006 -25022 23616 36388 3319 -45371 -96995 -166915 -241057 -260392 -201342 -129115
39289 -129115 -116895 -147127 -158464 -153437 -167106 -154939 -35789 145805 235016 185193 128526
39278 128526 164084 210184 164300 81894 64974 78328 30935 -39857 -35005 10914 -17179 -93791
39266 -93791 -75043 52863 137650 111440 92952 165822 222476 139262 -23023 -119889 -132727
39255 -132727 -149568 -192693 -188741 -96578 26236 90432 59111 -29898 -97224 -93179 -46333 -9416
39243 -9416 34400 139083 264458 281769 158447 38202 57518 159859 185270 87800 -35713
39232 -35713 -98182 -104473 -92211 -75705 -56851 -35461 -4587 30573 44942 34113 28820 35016
39220 35016 9703 -56021 -92630 -62704 -53375 -158846 -315790 -373426 -306675 -236046 -235865 -251577
39208 -251577 -232446 -217941 -236352 -229412 -155406 -79334 -74833 -106201 -98587 -68696 -84321 -130278
39196 -130278 -123808 -55822 -13864 -48568 -106946 -129265 -133543 -157205 -178021 -153130 -97857 -67492
39184 -67492 -83012 -125294 -183685 -255028 -303071 -277724 -184554 -87427 -27872 14783 66364 108611
39172 108611 118484 116800 135077 160848 162198 150867 173420 242912 319190 356180 333817 250423
39160 250423 129532 34748 24203 74493 99075 63768 30530 49814 65005 -8447 -138209
39149 -138209 -190722 -98611 56167 151272 156872 119533 66420 -4983 -62479 -45060 45747
39138 45747 120123 102817 19947 -56939 -112659 -176922 -240940 -261060 -239570 -221711 -199884 -107851
39126 -107851 51089 155520 115370 5998 -31158 23926 74929 69816 48111 33280 -8031
39115 -8031 -72337 -87218 -23008 46113 52319 36472 72036 143030 176321 157147 128050 91538
39103 91538 2286 -133709 -228206 -211136 -112144 -9598 62232 116585 153420 146304 90879
39092 90879 25185 -17571 -51015 -105048 -170234 -208196 -214342 -228179 -266224 -285518 -245517 -173048
39080 -173048 -121990 -91553 -37749 42805 96419 86314 35626 -15200 -51865 -72978 -72149 -51647
39068 -51647 -25191 3822 38920 63348 53513 22693 7274 3871 -26741 -78494 -82519 -2749
39056 -2749 102114 152025 139232 107877 79540 48878 27208 39017 82544 128127 149298 135276
39044 135276 90566 44189 38049 80522 128288 135360 104652 77871 94475 165692 256533 289572
39032 289572 215331 93399 46563 107185 169227 132526 34471 -15644 20431 96164 163615
39021 163615 198576 176034 96640 21630 17262 77835 154804 231157 302063 317227 231485 99074
39009 99074 27529 36890 50642 31832 33228 86005 131054 113096 72380 79397 124450 135455
38997 135455 82826 13955 -10077 24058 83278 128879 152274 172293 193790 185241 125079 57577
38985 57577 55757 121665 170322 135604 56127 27172 90214 195519 259055 237037 156701 89465
38973 89465 85535 126088 147383 111596 37941 -35615 -97051 -155718 -210101 -236884 -214317 -156070
38961 -156070 -115394 -136142 -195607 -225086 -200689 -173344 -177731 -158739 -48301 117730 236451
38950 236451 278078 305663 352432 372768 344325 326519 356980 363348 260860 94212 -7266
38939 -7266 -3377 9079 -67611 -212938 -326524 -335447 -238967 -92139 18638 18222 -89386 -205183
38927 -205183 -228998 -168240 -114143 -109131 -92307 -3334 112830 161572 126825 72629 28228
38916 28228 -44310 -148919 -205828 -156483 -59306 -16312 -41709 -67200 -50616 -11086 31998
38905 31998 88410 159900 224008 262511 269485 234789 159145 78923 31511 643 -56897 -132601
38893 -132601 -164631 -119064 -25122 76009 167892 234273 250071 221214 195596 209764 249556
38882 249556 276711 268488 223157 157076 107079 106854 148760 190917 205431 194624 162403 106910
38870 106910 49398 34406 82301 161837 222806 243829 242562 245299 244746 194389 72887 -46985
38858 -46985 -49298 79807 218364 261237 235972 203234 127276 -39827 -205202 -216110 -81127
38847 -81127 36081 55517 63942 122120 144249 53363 -70618 -107678 -71314 -52309 -55287 -9476
38835 -9476 91757 170645 177308 138878 96672 61308 33749 17378 2564 -23255 -48017 -44754
38823 -44754 -7523 39049 59909 35056 -17361 -47415 -35652 -41469 -136767 -289629 -377974 -333646
38811 -333646 -210260 -95459 -31697 -41970 -136047 -240926 -218049 -26818 195497 290906
38801 290906 259668 210855 194303 169051 100059 3359 -83602 -116161 -58467 59167 139335
38790 139335 130222 90996 85300 71635 -19283 -154497 -241344 -255873 -231098 -160462 -28319
38779 -28319 88985 79220 -42071 -133932 -113550 -40541 2868 20597 54121 102703 138698
38768 138698 152441 146801 121506 81818 34793 -23192 -81745 -91428 -10451 130194 250180
38757 250180 293797 242334 93734 -100240 -213679 -162368 -33111 -1048 -110292 -229334
38747 -229334 -239266 -167882 -101263 -55203 4774 82045 154133 219526 281703 309741 263035 147418
38735 147418 15187 -88330 -159788 -219402 -268873 -282391 -253567 -233209 -271053 -318446 -264145
38724 -264145 -103184 11623 -41017 -179719 -235897 -188934 -168334 -243449 -334194 -342876 -271516
38713 -271516 -183126 -126341 -118757 -140905 -141882 -109356 -112881 -199979 -283341 -242808 -118887 -71419
38701 -71419 -143892 -212750 -195263 -155875 -150324 -110296 27900 197307 300442 341952 367807
38690 367807 356679 271197 150120 53693 -28232 -126214 -202132 -199510 -141384 -93993 -66591
38679 -66591 -22886 40796 100260 153916 200704 202411 138858 68700 62172 99899 111528 91782
38667 91782 100503 158493 219266 248559 268192 307379 357113 386943 375726 316833 214970 86374
38655 86374 -42490 -133959 -147646 -76537 30577 116923 180385 244675 284227 249140 163678
38644 163678 115934 133882 156233 145623 134676 129509 76036 -25819 -82125 -46426 2896
38633 2896 2570 10631 75820 113185 39150 -61265 -49140 55833 131910 168687 250522 351365
38621 351365 329875 151411 -45805 -151249 -211792 -306106 -411438 -466278 -470250 -449430 -396952
38610 -396952 -316923 -267957 -295545 -360529 -389462 -365755 -326347 -293615 -251167 -173708 -55023
38599 -55023 81809 187353 215048 163148 81067 29249 34134 72770 96723 87547 89088 152454
38587 152454 248756 292991 269617 260213 308375 340383 285581 195807 157443 156286 135012 120327
38575 120327 164869 208833 145267 5450 -67860 -35809 -8538 -56698 -120686 -142553 -146127
38564 -146127 -131152 -27473 161954 291789 250306 116421 41836 51298 65284 63129 104578
38553 104578 204288 283191 259089 130799 -31745 -144152 -160685 -102446 -29553 22702 56505
38542 56505 60826 2856 -104917 -182573 -168867 -91166 -13337 47416 112654 187235 254693 303461
38530 303461 322970 296820 229406 156532 106239 75519 64407 95875 172561 245967 263130
38519 263130 226469 186309 189176 238389 280926 239149 97876 -45300 -73278 7067 82016
38508 82016 94571 103719 158967 216363 232212 247060 299262 331331 274965 175966 138497 176749
38496 176749 209512 179830 98906 -8273 -114922 -159791 -92525 34295 91835 19536 -105328
38485 -105328 -158788 -91969 43278 148552 153391 76769 21436 71563 193331 272065 244570
38474 244570 151139 57849 -15195 -67320 -71056 1617 124305 224726 252474 223345 192539
38463 192539 189889 188956 147842 75612 33841 58773 106375 105365 54492 32769 108208 261936
38451 261936 411823 491628 494711 454267 399701 335786 256991 172614 108604 80983 74120 55782
38439 55782 16683 -12583 5054 62403 106509 100602 71787 71181 99427 115415 119956 172329
38427 172329 294702 412275 436125 369033 280595 213535 173101 175315 228385 278795 254396
38416 254396 167087 105145 113413 143903 138022 94174 30430 -61772 -187551 -303723 -338136
38405 -338136 -253590 -96264 17504 1263 -86618 -80393 85778 263784 267092 110850 -30186
38394 -30186 -67098 -69628 -104658 -145943 -170448 -212569 -275486 -298927 -260320 -206750 -152110 -57923
38382 -57923 42188 30399 -113653 -240979 -228097 -135122 -79913 -63673 -32192 -16067 -77730
38371 -77730 -175055 -201490 -135140 -51563 -11436 -14587 -39955 -59473 -32668 56226 174205 281819
38359 281819 360470 381654 320235 227140 203628 260243 290025 231106 159497 157977 189256 174867
38347 174867 115825 61135 31953 38141 90326 145139 129748 65685 64984 164417 282241 369697
38335 369697 458484 525773 491865 401704 410697 532599 623251 672786 842293 1125054 1290749
38324 1290749 1298138 1413478 1749814 2083491 2346463 2843620 3680605 4496066 5183270 6311473
38314 6311473 8281697 10739129 13641394 18102606 24641279 30813504 32449953 27996994
38306 27996994 20419403 14007565 10333107 8208614 6458610 5139760 4420530 3854573
38298 3854573 3116688 2478079 2172299 1959992 1621826 1332037 1259634 1242426 1108065 950295
38288 950295 872222 779859 619105 523331 554239 564587 469693 395954 415168 387780 227275
38277 227275 83367 95085 168607 164145 120535 135724 184313 202441 213059 232907 187065
38266 187065 44473 -78749 -70976 18580 73075 63916 31548 1233 -12481 2130 16777
38255 16777 4568 25590 151213 305176 335074 249361 203676 233452 209156 101989 61591
38244 61591 139502 165285 29457 -118038 -107978 -8522 25364 -2665 -11937 -29251 -105885
38233 -105885 -166587 -124863 -53436 -66358 -119249 -98705 -30697 -25434 -80613 -110870 -118014 -163511
38221 -163511 -216133 -192930 -120092 -95734 -118094 -102170 -45337 -24523 -39999 -10666 73073
38210 73073 129706 130738 141430 203815 285969 355069 402589 398897 320811 217828 155114 108164
38198 108164 19129 -66970 -50593 45910 86786 21794 -52628 -55956 -22206 581 28965 68659
38186 68659 65518 -3462 -71938 -77045 -42763 -18774 -764 33121 59650 40745 -17084 -75523
38174 -75523 -111920 -126824 -126239 -111309 -67897 26760 157784 254051 264632 231949 225536 225566 157774
38161 157774 37834 -18039 50736 166800 219587 181169 90629 -5525 -65134 -66979 -45355
38150 -45355 -49578 -54689 8987 116184 135475 10326 -138719 -166302 -86362 -27316 -64990
38139 -64990 -184292 -352439 -526917 -617231 -546455 -361961 -205599 -157144 -169477 -169484 -153797
38128 -153797 -153858 -164078 -155356 -133527 -138776 -191400 -267588 -328587 -349877 -318668 -230491 -109528
38116 -109528 -15887 1010 -40347 -72442 -63323 -47166 -52559 -47146 460 42644 8564 -75603
38104 -75603 -103263 -36974 37601 43231 23868 62806 138920 150542 76222 33228 140340 361215
38092 361215 528377 521017 387944 275401 252328 251275 194580 124476 147385 271752 380115
38081 380115 378238 302666 242751 214904 173483 109625 66500 58090 34073 -51266 -170065 -246703
38069 -246703 -236772 -160833 -69894 -1284 27760 8934 -46481 -93468 -87172 -42578 -24826 -60121
38057 -60121 -98867 -103043 -119062 -194837 -262905 -206515 -39241 89320 96981 74314 129129 220887
38045 220887 238516 170721 88910 5119 -125702 -265859 -287119 -150503 1077 850 -146535
38034 -146535 -296063 -352403 -352752 -364521 -374717 -321990 -206591 -116848 -132322 -226454 -293952
38023 -293952 -272009 -205002 -175713 -199463 -217845 -186183 -128735 -97310 -104220 -118205 -113677 -101168
38011 -101168 -107860 -143876 -197147 -253981 -309412 -352757 -358403 -309876 -230451 -170516 -158925 -179784
37999 -179784 -198668 -192959 -151081 -66544 47585 151160 203427 195165 148731 96608 65736
37988 65736 66292 82566 86634 71840 60197 67614 78108 64063 16835 -50192 -107473 -112632 -43808
37975 -43808 52739 90616 51231 19616 62720 115161 64045 -73468 -153025 -97749 1797
37964 1797 26661 -9518 -9028 52501 103215 93204 55273 37574 40719 47061 62383 92952 114129
37951 114129 100513 70058 62482 80903 87940 61550 25007 11406 23560 46704 81226 135937
37939 135937 196320 228871 222604 201933 186953 164426 119987 82660 106669 209028 347894
37928 347894 464135 523407 517572 455109 365704 293994 270438 296770 363447 459306 556083
37917 556083 614801 628945 634478 655748 678190 707643 809766 1029748 1310727 1571190 1832666
37906 1832666 2169449 2559636 2937932 3412681 4247640 5559675 7250544 9374946 12266235
37897 12266235 15866588 19021480 20006670 18082592 14301874 10533061 7862452 6159808
37889 6159808 4905422 3913163 3212168 2703075 2232431 1814745 1549497 1414655 1304987
37880 1304987 1189664 1082549 926206 657993 355773 180734 182551 264170 326523 352661
37870 352661 361397 372158 413666 486793 525067 468992 368623 331105 376064 429498 455954
37859 455954 502716 603689 729126 847680 956365 1036290 1068210 1109765 1259839 1521468
37849 1521468 1814218 2168120 2761608 3637298 4464446 4751340 4313730 3441793 2594752
37840 2594752 2012726 1642226 1341227 1064600 855751 727896 618113 473368 335993
37831 335993 286454 315305 324954 269793 211507 196270 164518 59174 -47062 -38954 62351
37820 62351 120628 79693 27702 45901 94240 94466 47250 4625 -20528 -53306 -94567 -114716
37808 -114716 -96795 -47950 19772 89310 132796 138057 136808 180720 282681 388548 412437
37797 412437 316278 171288 118433 224390 383828 417682 274146 75758 -43741 -77579
37787 -77579 -89043 -94905 -75083 -48121 -57610 -104738 -158115 -210459 -265657 -294933 -276765 -260719
37775 -260719 -310518 -391159 -399922 -317726 -241090 -238490 -258675 -222995 -137826 -65978 -43325 -71162
37763 -71162 -139612 -210869 -228101 -190497 -173653 -225882 -292582 -298710 -255250 -214801 -167142 -64362
37751 -64362 74573 168490 176172 126624 60859 10156 11017 61816 80429 -6012 -138335 -189678
37739 -189678 -149292 -128694 -170399 -179484 -93462 5359 26107 8807 28919 55932 26791 -10098
37727 -10098 39194 142307 172813 104462 41286 43158 50361 17901 5114 67372 152510 180988
37715 180988 159398 136917 104173 19748 -97602 -188053 -245962 -314014 -380975 -367677 -246771
37704 -246771 -114935 -93746 -185468 -274022 -262119 -167864 -78321 -41759 -32665 -8615 32333
37693 32333 59901 55328 31351 19654 48310 115917 174512 158909 58282 -57453 -113502
37682 -113502 -117275 -127807 -149330 -119174 -20187 60386 38833 -36647 -34881 85940 217909
37671 217909 234051 131691 15740 -24510 18486 102653 179285 202403 150238 66500 42483
37660 42483 116407 210978 215187 117414 8952 -41276 -55963 -78948 -101032 -99885 -103358 -150678
37648 -150678 -216350 -234961 -192094 -134038 -89766 -39493 30884 94082 116779 95167 47353
37637 47353 5576 15145 91450 169752 154196 40897 -58073 -45869 46674 115549 112444 75964
37625 75964 58617 64093 49162 -31445 -164903 -258020 -216569 -67566 47584 37711 -31717
37614 -31717 -45249 4023 34686 12521 -27916 -79365 -176192 -298498 -357123 -314784 -248458
37603 -248458 -241875 -274101 -270071 -217120 -168416 -151425 -128409 -47546 96591 247559 316962
37592 316962 254077 107151 -14629 -65415 -108196 -197526 -268809 -220792 -80837 7556 -29041
37581 -29041 -109629 -131802 -105238 -95330 -102176 -77051 -22167 11342 14125 29348 68814 91204
37569 91204 80614 77093 96935 85431 -989 -109868 -146383 -87631 6072 76249 113805 131301
37557 131301 135321 130245 118496 99072 87862 118698 187134 217717 145701 22757 -24411 49776
37545 49776 156180 191384 151544 97314 63608 49688 55536 75989 84587 69053 63467 103152
37533 103152 163383 183988 144712 78778 19574 -29003 -71036 -101298 -116110 -120933 -123081 -127454
37521 -127454 -135334 -139796 -132111 -116971 -104651 -87887 -56100 -34212 -61504 -118221 -129387 -72267
37509 -72267 -20698 -35781 -73504 -69561 -61834 -135120 -273437 -369246 -376299 -357482 -369323 -390819
37497 -390819 -393134 -394664 -404915 -383565 -304149 -205773 -136524 -89986 -41887 -13561 -54744 -180909
37485 -180909 -350473 -484719 -506661 -399039 -231076 -86067 34734 178635 322798 383031
37475 383031 355613 338195 361736 318511 141830 -48535 -98388 -38096 -15949 -67059 -96968
37464 -96968 -71312 -65249 -109196 -129298 -83460 -32742 -22249 -1156 71246 136196 131282 97367
37452 97367 105908 142971 153339 149405 182071 236756 255611 249837 293482 394114 453363 388386
37440 388386 234722 94761 25556 9236 1352 -29882 -99435 -205178 -319455 -391394 -376960
37429 -376960 -285881 -195569 -186159 -244206 -262287 -167680 -26595 27358 -40633 -124088 -107076
37418 -107076 8795 131102 191283 196170 181898 154492 89261 -20362 -129475 -177500 -164508
37407 -164508 -163904 -227685 -301579 -288175 -190522 -124324 -160843 -224016 -200480 -103186 -45487 -71096
37395 -71096 -100141 -62672 -3531 -2647 -49337 -69016 -48727 -54301 -111901 -146811 -88089 9379
37383 9379 13026 -120836 -284496 -343513 -283103 -195987 -154521 -149700 -154913 -187004 -264812 -345050
37371 -345050 -356961 -295601 -230033 -208675 -202164 -162129 -94709 -39492 -7942 10426 2010 -53882
37359 -53882 -126370 -151091 -121018 -104811 -148128 -206679 -217148 -191413 -184865 -199363 -184698 -132100
37347 -132100 -100775 -133591 -197791 -237270 -245059 -250884 -263214 -259229 -222104 -162195 -104320 -66425
37335 -66425 -42039 2248 92118 197615 246352 205719 127442 83220 79830 73901 50352 37653
37323 37653 50543 67046 70153 69255 69926 66820 80933 149703 245326 255650 110891 -94807
37311 -94807 -180112 -80758 82043 155006 118103 59304 30971 -2330 -77762 -157015 -167495
37300 -167495 -95718 -6370 30778 11097 -15832 -13101 5335 3914 -24570 -52679 -54056 -27440
37288 -27440 12160 42736 30841 -51151 -179293 -272798 -272719 -218547 -205233 -259779 -305946 -272369
37276 -272369 -191159 -146834 -157604 -164286 -128574 -81432 -59536 -48340 -21999 -545 -24237 -92944
37264 -92944 -171090 -236103 -280026 -278430 -214704 -138839 -140792 -235811 -322631 -296697 -172909 -51718
37252 -51718 10581 42564 82077 126011 167943 224629 290828 314641 264908 192475 171054 193240
37240 193240 182794 109721 33674 14277 31883 33840 19468 30893 80436 135741 170462 186012
37228 186012 182688 151435 102508 63836 38399 563 -48472 -62593 -18512 33949 33126 -3723
37216 -3723 966 80961 184834 243611 242747 216744 202587 210060 214530 173066 72927 -35019
37204 -35019 -86745 -92875 -126678 -204527 -236525 -146225 4747 82457 51588 3693 12173 41058
37192 41058 32235 11622 42311 110157 130637 66042 -25652 -72113 -67642 -49438 -32499 -4510
37180 -4510 34451 63581 69241 55207 26734 -10886 -35548 -16398 47174 109318 113535 37649
37168 37649 -97860 -243933 -333661 -309415 -177500 -28457 34468 -7034 -88274 -160162 -240738
37157 -240738 -348612 -432671 -418666 -307134 -174569 -79490 -14659 38099 53893 -925 -104777
37146 -104777 -187418 -199213 -153447 -98059 -60212 -28338 12231 37567 999 -97724 -182137
37135 -182137 -171831 -79201 5478 31031 45487 120983 259255 402348 499697 520678 434148
37124 434148 244011 41283 -49791 -4079 75714 92426 68856 84402 140842 165507 138761
37113 138761 134777 200128 254630 178976 -21069 -201436 -234055 -124523 31962 155098 209403
37102 209403 181639 88819 -6923 -45303 -33220 -27608 -57484 -104544 -158474 -235826 -324252 -357941
37090 -357941 -287406 -147085 -20516 43360 53951 42139 32402 38298 54624 57396 29136 -24548
37078 -24548 -93667 -176565 -256355 -292629 -265951 -209603 -169350 -156766 -174897 -256960 -422736
37067 -422736 -606933 -686401 -589384 -351929 -79088 116274 164458 91942 16080 25091 67229
37056 67229 25969 -99810 -182010 -150909 -96792 -124690 -190949 -172894 -50797 75386 130425
37045 130425 135135 133326 130158 123570 128534 136567 104349 24294 -33870 -4126 73927 92788 21609
37032 21609 -45210 -20947 36104 -9564 -169900 -288416 -244920 -131894 -132902 -261193 -339086
37021 -339086 -250715 -94783 -26577 -48809 -52680 2423 62445 99851 148698 215598 250624
37010 250624 227998 181773 140153 91797 40580 25737 51454 55615 -4166 -76019 -74575 8537
36998 8537 95520 108458 35736 -71822 -146356 -155852 -126022 -96979 -62206 10520 92875 91136
36986 91136 -35528 -200815 -286045 -273721 -232612 -202284 -162927 -107976 -73119 -81481 -117355
36975 -117355 -166183 -224306 -254840 -200222 -74741 13796 -12662 -100092 -140565 -116216 -93446
36964 -93446 -95718 -72911 -12023 6946 -84267 -235562 -332901 -329143 -271161 -219591 -192360 -175052
36952 -175052 -137889 -46880 95922 223117 257347 201807 135955 116964 129009 138485 149344
36941 149344 179634 223639 265822 300633 312363 267172 157837 34718 -38592 -48897 -34989
36930 -34989 -41343 -82761 -135890 -157037 -129538 -91966 -86212 -87154 -41435 26549 30074 -37413 -69502
36917 -69502 -5813 69382 59597 -2459 -39829 -71146 -140532 -177153 -81632 77560 119052 5258
36905 5258 -114258 -142477 -156719 -233353 -307721 -307938 -300338 -374748 -470510 -449989 -303019 -162467
36893 -162467 -133078 -196876 -279736 -332415 -340383 -308628 -247069 -154104 -36690 43820 4995
36882 4995 -140607 -264492 -271042 -210459 -183346 -193494 -174593 -114356 -60870 -32219 -2799 37163
36870 37163 77026 116488 136376 77469 -71479 -203582 -208209 -127697 -95549 -137725 -152823
36859 -152823 -90862 -30483 -50101 -125339 -189870 -210229 -171154 -76998 -1257 -42901 -188613
36848 -188613 -299564 -277805 -167614 -58344 13629 15171 -115674 -356117 -540606 -530287
36838 -530287 -386656 -271188 -220667 -141348 1596 122406 157970 158454 189633 226318 198900
36827 198900 99023 -8711 -58906 -43457 -12334 -23130 -72171 -86581 -19966 59343 36164
36816 36164 -90465 -183527 -136925 -6712 77687 83221 79709 99133 77369 -39660 -199692
36805 -199692 -302997 -318097 -284574 -224597 -118900 24603 143756 195158 205079 206316 169075
36794 169075 56810 -77777 -134951 -111014 -116349 -212378 -299811 -239279 -49727 92157 56436
36783 56436 -97584 -208519 -196555 -117836 -61133 -48881 -53390 -60951 -74277 -73281 -30910 25157
36771 25157 20327 -70379 -176353 -217174 -196480 -167134 -140273 -89375 -20389 32856 75641 142677
36759 142677 215130 217971 121679 -11868 -107068 -144024 -132243 -79231 -18435 -9250 -65630 -130657
36747 -130657 -158002 -165374 -164750 -103754 50719 213250 250925 144756 8277 -58657 -71847
36736 -71847 -102726 -169390 -222611 -218940 -175110 -140747 -128318 -96761 -23279 38185 22759 -32644
36724 -32644 -16666 99191 207961 212202 147950 105290 94777 74494 55900 81865 125241
36713 125241 112409 48373 25864 92243 183799 215415 170023 74927 -46909 -163861 -220574
36702 -220574 -179224 -57001 97352 242331 346632 383158 345664 262585 180314 129524 101254
36691 101254 57050 -15788 -57103 15416 186676 324271 319571 205740 88973 13610 -39503
36680 -39503 -73299 -85833 -127052 -237058 -338496 -300798 -123230 48312 109311 104505 119235
36669 119235 162136 202877 237377 254541 209837 97139 -6458 -26030 22266 71776 89944
36658 89944 81109 51543 16058 1916 13521 31956 64997 134911 196272 151419 -6190 -149124
36646 -149124 -179139 -151481 -159480 -177416 -124706 -27996 3810 -54824 -116712 -118282 -90934 -85270
36634 -85270 -102780 -120785 -126984 -116256 -95269 -87686 -95891 -75153 7317 109999 165416 163177
36622 163177 126780 45092 -91218 -209507 -207103 -84491 56549 152305 234006 336698 432069
36611 432069 473843 446014 351985 215760 98117 44892 17290 -53810 -146051 -165620 -95425
36600 -95425 -24678 -8731 -1061 37185 58472 12453 -76410 -164935 -240569 -267257 -181354 -8695
36588 -8695 113415 114614 94224 145634 180659 71171 -109065 -157261 -32582 95638 106040
36577 106040 74667 117752 218759 285280 278904 213500 102543 -17399 -73437 -41116 2926
36566 2926 -21700 -89371 -117069 -81837 -21901 43508 114739 150027 89967 -45639 -156377
36555 -156377 -179389 -153553 -142902 -151612 -151334 -143611 -139400 -104728 6885 166004 270874 265823
36543 265823 214330 215987 276423 305117 231962 75719 -107773 -287246 -432349 -476931 -370047
36532 -370047 -155998 48033 160250 183104 149247 76943 -1583 -26698 24264 91008 98398
36521 98398 51703 15229 10773 -3042 -48106 -87155 -91544 -93545 -129082 -170484 -171695 -154395
36509 -154395 -181494 -244847 -247186 -126074 49797 146900 102827 -37099 -191448 -303831 -345146
36498 -345146 -311319 -237457 -180089 -163505 -163286 -155303 -154328 -181194 -213837 -204857 -141730 -58990 11119
36485 11119 69756 121140 138774 90510 -11397 -113180 -175373 -200493 -195206 -136220 -9306
36474 -9306 130561 186943 127473 25925 -28414 -32599 -41911 -66603 -61323 -22352 -26693 -130876
36462 -130876 -272393 -328736 -261232 -146896 -63745 1145 96779 196741 198842 47983 -176436
36451 -176436 -327889 -337950 -264347 -196017 -153239 -107286 -58897 -38227 -34339 10852 114635
36440 114635 208513 218178 155181 89235 54279 26372 -20316 -82499 -148972 -208414 -230589 -179859
36428 -179859 -63249 61314 137367 152168 125256 82628 49233 37973 31773 -1126 -61933
36417 -61933 -114122 -134882 -149035 -189855 -243730 -260624 -216854 -149123 -120191 -152087 -193491 -163365
36405 -163365 -41373 94176 143267 95946 37512 40359 86852 112604 91015 50997 35645
36394 35645 65952 126379 169173 152070 82610 1580 -78577 -174817 -265845 -289821 -242930 -209408
36382 -209408 -234876 -238437 -137304 -2449 25725 -49444 -82025 -6188 72062 46410 -45907
36371 -45907 -118336 -168842 -229317 -260713 -203884 -90270 -7365 16744 13094 -9635 -56676 -84369
36359 -84369 -45213 14229 -366 -83642 -126792 -76176 942 36608 51368 77060 80700 34597
36347 34597 -5185 30745 116926 165624 139818 71899 -5925 -85682 -148966 -165976 -131540 -64785
36335 -64785 19548 104805 152935 134871 72923 13878 -31162 -79956 -123731 -129258 -96264 -60861
36323 -60861 -29126 44428 183854 328955 379396 293827 127758 -21087 -93378 -98613 -78330
36312 -78330 -53594 -22063 1508 -20687 -91948 -144895 -102276 30710 163758 209648 155413
36301 155413 57883 -1170 36978 165883 308385 375555 340466 243124 129097 5124 -144593
36290 -144593 -315861 -460538 -503152 -403864 -221996 -86938 -68569 -95335 -42420 112488
36280 112488 267704 323673 279053 197412 129764 89075 63347 29116 -29326 -100573 -155166
36269 -155166 -170869 -139156 -67637 1709 8617 -49402 -86915 -31787 69399 114828 95241
36258 95241 95049 152717 212586 227372 216903 200707 161774 110969 99825 128098 125375 71065
36246 71065 40090 69051 73196 -20789 -146399 -201562 -207788 -250228 -311970 -292592 -167919 -18903
36234 -18903 85435 131336 101466 -15488 -151790 -200045 -143134 -63340 -18803 1799 3309
36223 3309 -31657 -66811 -28290 69656 115129 58203 -14065 -14872 19730 10893 -39918 -85193
36211 -85193 -124601 -178004 -207679 -153618 -30241 79233 117395 94839 55178 44267 96086
36200 96086 199500 286257 291838 223907 143986 96559 84390 93511 105704 96975 56721 5592
36188 5592 -25218 -24898 -3045 22251 25920 -7229 -52057 -59410 -19276 26668 53650 91669 165373
36175 165373 240213 271036 269592 276983 295118 292297 258753 213818 170176 124997 74446 14559
36163 14559 -49060 -76059 -21724 75558 95014 -20504 -169148 -214499 -163874 -131075 -146786
36152 -146786 -117328 14914 173692 255896 259212 247814 246593 232751 203303 189217 200565
36141 200565 196370 125887 -8037 -135691 -179882 -132716 -59116 -15806 6451 36844 53790
36130 53790 8031 -97924 -202776 -255556 -249646 -195743 -111771 -39704 -20061 -40532 -53390
36119 -53390 -45370 -39141 -24137 46837 169436 258320 244404 158051 81300 55974 70405 96288
36107 96288 99958 51108 -37748 -103609 -100282 -53737 -21819 -22838 -34051 -35391 -20141 15648
36095 15648 57575 64125 10934 -66914 -109737 -102429 -80657 -76426 -84331 -75979 -26501 64899 161992
36082 161992 211189 193894 147750 121198 126390 153194 198845 251084 267145 213075 114987 35285
36070 35285 3365 -1861 -12797 -48704 -116164 -194521 -229839 -185838 -97852 -34024 -4193 44475
36058 44475 133394 205407 196248 114569 22852 -30721 -33252 9724 72615 107144 82080 25521
36046 25521 -2695 17249 47627 49823 27352 -99 -34021 -80450 -117023 -114397 -83671 -62036
36034 -62036 -48765 -3502 72950 109397 61339 -4520 10749 96089 143757 103720 41255 17363
36022 17363 -3473 -71819 -147762 -154461 -99744 -63726 -76996 -85714 -48087 -5373 -28425 -123545
36010 -123545 -214930 -216323 -120839 -19649 -8644 -70153 -89230 -8790 89318 107180 75358
35999 75358 93479 167520 208718 181006 141394 123936 92788 43432 45477 127093 205354 202505
35987 202505 159889 159906 195662 202644 171604 137997 92252 -619 -102853 -122113 -42684 37567
35975 37567 24406 -73648 -177215 -215749 -166655 -69496 -13398 -56961 -148058 -178219 -128640
35964 -128640 -94888 -139609 -192333 -147490 -6075 142907 241535 294460 306444 263393 177541
35953 177541 92610 32777 -11965 -47271 -66450 -85188 -133812 -200180 -229833 -208433 -197535
35942 -197535 -249162 -320001 -319387 -224847 -102463 -17809 28898 72216 121062 143335 96081 -25267
35930 -25267 -148997 -159117 -14630 164903 193479 22701 -197480 -292101 -244086 -160738 -112801
35919 -112801 -83104 -46910 -12879 23684 91530 183519 247185 260093 257093 256317 222082 142543
35907 142543 81380 91725 126621 103010 18998 -63495 -122064 -177445 -211534 -174405 -79411
35896 -79411 -4245 21761 46821 84254 63100 -48262 -145254 -100092 67510 213290 241697
35885 241697 182715 107229 43660 -8721 -48664 -84992 -139473 -210370 -257479 -243463 -176046
35874 -176046 -100035 -57153 -50055 -33770 41140 153556 202707 115217 -54877 -182635 -215735
35863 -215735 -199951 -170289 -104695 -11354 27755 -36054 -128456 -140765 -67790 11459 54542
35852 54542 77211 75844 17832 -82594 -153209 -148121 -89041 -14973 47700 56097 -32091 -178942
35840 -178942 -269038 -237238 -143990 -81952 -60276 -33463 4906 26961 38997 73317 123075
35829 123075 149183 149219 160709 192341 206926 184684 155877 152626 165227 165377 146697 126505 122178
35816 122178 130020 118121 54069 -42097 -98576 -79690 -45274 -73423 -149821 -197516 -195749 -187330
35804 -187330 -174135 -102475 26037 121772 124669 73908 20870 -38402 -90960 -66830 42384
35793 42384 110786 35867 -92478 -104451 7366 90514 61624 -5149 -31083 -38710 -62129
35782 -62129 -71647 -53375 -67661 -152971 -245878 -271793 -254349 -258831 -278016 -255297 -187943 -130370
35770 -130370 -113275 -124225 -152690 -195789 -233359 -250020 -264412 -285180 -264614 -162865 -39031
35759 -39031 804 -54398 -108183 -98095 -72980 -99168 -155823 -168378 -102018 16986 135221
35748 135221 190809 136971 -5048 -138918 -182628 -151291 -115920 -100291 -66715 4130 74040
35737 74040 102441 99276 98786 108708 112600 104278 90249 65794 19170 -35352 -53827 -7813 78504
35724 78504 150034 172564 151517 108156 57449 12430 -7718 10277 54771 91753 93758 66645
35712 66645 39034 18624 -24590 -104074 -156211 -88794 86427 224591 205382 82644 9723
35701 9723 44074 112404 157923 211768 289391 323079 263846 172264 134722 149852 167290 177409
35689 177409 183411 143790 36668 -65499 -83451 -50733 -42153 -30367 55956 165104 171264
35678 171264 91032 87122 222624 368936 414699 415809 461356 533014 593086 684252 840319
35667 840319 1021594 1243918 1637599 2260724 3014384 3895241 5114208 6658195 7866227
35658 7866227 7865787 6525448 4672687 3241577 2457917 1990876 1595542 1303138 1139359
35649 1139359 999848 824421 670961 573136 481270 377035 310963 286686 223708 82731
35639 82731 -63807 -132689 -128415 -100247 -64378 -12413 47037 91574 105157 84636 54175 63567
35627 63567 125192 164957 101294 -30196 -107095 -83303 -36858 -31091 -23038 33955 81715 40152
35615 40152 -50777 -69026 20811 118390 118978 33717 -43331 -48873 -5647 19533 -4368 -38497
35603 -38497 -25919 28247 57831 26323 -21390 -25243 7287 24751 10720 -8034 -14367 -13629
35591 -13629 -7143 -2178 -34812 -124078 -210758 -213120 -154230 -159154 -292349 -461315 -527018 -458361
35579 -458361 -327440 -200383 -99108 -40736 -40520 -76575 -104567 -107277 -91022 -51078 5537
35568 5537 22076 -47458 -139358 -126765 8623 132981 137675 88326 123644 255220 357958
35557 357958 344441 263109 210757 217984 252058 283536 309100 329167 331620 292680 188789 25220
35545 25220 -141824 -234935 -222454 -144851 -68363 -24738 1535 44427 121602 214734 279553
35534 279553 285216 242345 183067 125338 75236 46959 47227 51751 39260 42001 107487 201540
35522 201540 211635 81985 -100906 -202504 -190071 -143188 -135092 -154289 -146303 -94830 -43155
35511 -43155 -45245 -104547 -166758 -180172 -153288 -131883 -130161 -120805 -87667 -38861 35606 155590
35499 155590 278056 300413 181572 5247 -124530 -193797 -228083 -198649 -72335 83968
35489 83968 153565 118438 67344 54599 39762 -17553 -86600 -119097 -110216 -80613 -51745 -54781
35477 -54781 -106837 -165350 -167828 -129499 -132251 -198941 -254379 -239467 -189277 -162596 -167214 -193570
35465 -193570 -245321 -289585 -256094 -143915 -52214 -40694 -41300 12169 53954 -3848 -101866 -109420
35453 -109420 -32458 -4097 -74211 -145772 -140777 -103129 -93709 -91964 -60773 -23628 -13505 -8690
35441 -8690 21292 54622 52301 13871 -40288 -98366 -134333 -108497 -36679 -10627 -94412 -236051
35429 -236051 -334542 -361696 -359796 -345877 -289603 -186847 -95595 -77061 -130913 -202454 -235919
35418 -235919 -215624 -171677 -153859 -193143 -279953 -368476 -395847 -318888 -163349 -24577 24424
35407 24424 23637 74878 196324 291194 283034 214844 171504 165415 158217 145806 150863 165435 174303
35394 174303 210613 310015 421327 442882 352798 234196 165308 152960 180399 239256 288358
35383 288358 261501 164049 97089 128660 192814 180085 87454 5261 -22467 -45204 -107672
35372 -107672 -171519 -164411 -70928 50590 123842 116162 61135 25654 41315 73159 74894 60337
35360 60337 80412 132214 143135 66364 -51913 -132506 -152396 -133234 -77839 16974 98236
35349 98236 84627 -21795 -113395 -104503 -34519 1051 -18245 -36231 -25811 -24415 -60314 -108419
35337 -108419 -141358 -172765 -219361 -260573 -270444 -259469 -249930 -232432 -179800 -87137 28388 146082
35325 146082 232795 244667 179235 103924 84254 97270 68442 -12214 -69679 -46473 32094
35314 32094 113919 184598 239763 238697 139960 -29087 -177126 -223722 -155608 -26789 74722
35303 74722 79533 -9535 -117272 -168688 -157048 -127682 -113668 -114246 -120825 -125325 -104385 -36765
35291 -36765 47981 71241 -14842 -161810 -264754 -266719 -205269 -153580 -134816 -109699 -40429
35280 -40429 54384 118114 119145 82487 59469 74503 102641 95879 34677 -44547 -84261 -75500
35268 -75500 -74366 -128754 -208012 -242877 -225186 -214809 -237540 -237549 -172308 -104215 -127534 -221264 -251369
35255 -251369 -139178 31554 115255 74246 -3259 -41367 -73641 -174690 -329518 -423732 -373970
35244 -373970 -227857 -100072 -33343 24876 110277 172806 154460 82556 25436 -15349 -97477
35233 -97477 -226155 -321266 -319470 -255391 -207401 -199236 -189343 -133784 -32625 66314 92147 9615
35221 9615 -122283 -183525 -120243 -12010 24961 -27737 -101697 -158393 -221599 -293194 -312810
35210 -312810 -234111 -90243 51606 159391 223248 214944 117355 -19849 -105623 -92963 -7679
35199 -7679 102804 211105 298943 347116 356185 351646 350592 340406 301309 229697 128311 -487
35187 -487 -131104 -208505 -197653 -129649 -70793 -51488 -51922 -50808 -52162 -57979 -50023 -18665 13767
35174 13767 19784 290 -28427 -65657 -119439 -176529 -202957 -174566 -93147 20116 129424
35163 129424 193366 196749 170682 153126 131457 60318 -55853 -140438 -131882 -61907 -11137 -8218
35151 -8218 -14088 4993 35851 55423 68089 88147 113681 135936 151754 150153 111010 39296
35139 39296 -21297 -37300 -32271 -52855 -98559 -122242 -99692 -60297 -38526 -30327 -15767 7254
35127 7254 37968 92287 169785 219838 186740 85708 -11495 -74295 -149017 -272908 -395340
35116 -395340 -428153 -352695 -233725 -138747 -86915 -71084 -77689 -72847 -18045 72599 128418 108658
35104 108658 62316 63109 110145 141175 129492 110048 104745 79620 4418 -86102 -127840 -103026
35092 -103026 -48555 -4739 11821 -5194 -53475 -102673 -103902 -39807 47021 96129 100107 116035
35080 116035 192257 291770 314006 205095 25944 -111954 -161752 -161033 -153716 -146912 -152009 -206107
35068 -206107 -313927 -410615 -427616 -367541 -275409 -173882 -81660 -56697 -135518 -239700 -235806
35057 -235806 -107363 17469 42569 22515 48826 99001 89392 26413 -4469 12438 -6100
35046 -6100 -99824 -186411 -175635 -95808 -43380 -46178 -43003 14427 98688 153196 158273 133607
35034 133607 104196 88438 107889 181034 293343 381223 368869 240292 68864 -46139 -73427
35023 -73427 -58438 -39320 5097 98640 196262 221133 165452 103985 96402 118531 111468 62172
35011 62172 4071 -34444 -43062 -9796 63814 128349 113910 8561 -122979 -214625 -259883
35000 -259883 -277329 -255615 -179790 -93649 -79022 -159867 -263816 -298280 -242215 -147846 -74568
34989 -74568 -44537 -52093 -90172 -157149 -243651 -323920 -374296 -404597 -451537 -520481 -550306 -472311
34977 -472311 -302556 -137919 -52029 -31188 -25699 -21147 -27360 -30323 -189 61603 115164 120457
34965 120457 68075 -14602 -73609 -66817 -11823 29294 33700 51143 121076 196732 203461 140534
34953 140534 62560 -13479 -104473 -178751 -172908 -107857 -96219 -189627 -290677 -271885 -130334
34942 -130334 25930 97672 51435 -90593 -251353 -326638 -283063 -209031 -209032 -271103 -302780 -270728
34930 -270728 -220634 -170190 -81908 35913 93567 37221 -61809 -92790 -39154 25972 45827
34919 45827 28496 8227 6614 25354 42863 26874 -21866 -55521 -39563 -5001 -1090 -21149
34907 -21149 -30152 -45885 -117195 -220709 -266421 -236360 -231226 -317912 -405472 -364894 -224776 -137213
34895 -137213 -164161 -215621 -216322 -211597 -251147 -277442 -225696 -159668 -193893 -318586 -413838 -423194
34883 -423194 -402936 -394485 -359374 -273184 -186694 -143955 -118041 -81594 -70745 -116854 -173381 -177951
34871 -177951 -140930 -104921 -55690 53390 211962 354235 434319 445509 388230 278748 167287
34860 167287 83599 -13978 -165642 -308766 -336329 -252243 -177029 -184251 -219248 -209796 -172846
34849 -172846 -160833 -169434 -161499 -139297 -131702 -133257 -108854 -51128 3662 15612 -20952 -71721
34837 -71721 -86195 -42358 29024 84686 128186 194758 280657 334717 325398 264712 158249 -1683
34825 -1683 -167543 -233590 -155203 -20306 54449 57775 57937 83710 101972 92017 69438 38245
34813 38245 -17773 -86354 -119637 -91721 -29676 22899 45277 35918 -2653 -59616 -106464 -101864
34801 -101864 -15892 132488 263137 290330 203572 69706 -46296 -121910 -138814 -76345 24239
34790 24239 62417 3699 -59656 -41448 8533 -1873 -41112 -5773 86128 94964 -25594 -142214
34778 -142214 -126431 -23460 35944 16489 -9509 16333 81401 144799 176984 164680 117081
34767 117081 64720 35832 48350 124937 271271 425133 483958 420116 322173 279754 272480
34756 272480 224587 128404 45507 6100 -21297 -57406 -71209 -32439 36918 92923 131752
34745 131752 192246 291902 378062 369079 252158 109253 15898 -51601 -149131 -230973 -179442
34734 -179442 14572 198547 237539 166728 103578 85902 78752 72645 71315 31356 -71251
34723 -71251 -147339 -93980 23163 23661 -130713 -265474 -229038 -78220 43821 106680 168823
34712 168823 234151 254797 246318 288649 405161 518287 539519 452822 307112 173605 110704
34701 110704 125257 163108 169560 151514 146584 151399 133588 104053 113601 169273 212409 201985
34689 201985 174392 194441 277260 374652 411640 334617 166902 24369 21269 137005 228020
34678 228020 201721 123686 110579 174581 238595 260284 258749 242004 198277 160234 189948 275240
34666 275240 313417 234052 84127 -37812 -78415 -35325 64222 143890 104934 -56414 -205083
34655 -205083 -216000 -130166 -81413 -101690 -103977 -51185 -23239 -80094 -158837 -169210 -116836 -60903
34643 -60903 -7048 75510 161988 179377 101920 -20861 -128200 -186805 -173267 -84876 16185
34632 16185 28397 -82577 -234470 -316979 -310345 -289696 -324867 -401575 -439523 -371398 -203297
34621 -203297 -9905 124651 167986 153030 138994 158426 195171 209139 182155 136171 103964
34610 103964 92171 83864 64951 28944 -29474 -94027 -112654 -50902 41337 72644 32255 7824
34598 7824 55412 120681 137313 136101 183338 264021 315427 340452 386274 427040 378162 239232
34586 239232 121448 105276 160813 238693 341149 451366 487700 408411 295087 250360 264080
34575 264080 260263 227900 212604 211357 176737 117126 97086 129306 152549 137508 136741 198900
34563 198900 302090 411084 541020 718700 933284 1182830 1527834 2017610 2559642 2925360
34553 2925360 2923208 2555716 2001769 1468069 1069265 819820 686290 618065 552100 439564
34543 439564 289825 164895 110721 111819 128649 149574 174227 174190 121168 44145 6841 27466
34531 27466 69582 113686 177500 248344 259536 174512 46470 -51121 -114223 -180543 -249583
34520 -249583 -289993 -301212 -303221 -280678 -207245 -120442 -94876 -127716 -127699 -48322 40687 59748
34508 59748 28236 3802 -25278 -98338 -170718 -148879 -34880 62131 76713 57328 53740 30322
34496 30322 -44778 -106511 -82081 -22669 -41961 -141131 -197036 -135091 -23893 32099 19393
34485 19393 -7874 -19853 -26190 -31841 -25505 -1531 31769 55239 44617 484 -24051 29365
34473 29365 132590 177138 105080 -10353 -56114 -14642 36254 26707 -50331 -161985 -261459
34462 -261459 -304538 -283463 -235241 -188829 -131752 -63078 -36608 -92763 -181142 -220701 -212789 -216796
34450 -216796 -230507 -186855 -76059 18872 35204 5668 -7758 10226 45011 79193 75124
34439 75124 -1097 -104684 -131737 -55259 29289 43148 33051 74245 137547 144003 100577 78819
$$ [...]
##END NTUPLES=NMR SPECTRUM
##END=
