##TITLE=31P_DE-80H_X3
 64 sc D2O
 26.2.2025
##JCAMPDX= 6.0         $$ Bruker NMR JCAMP-DX V2.0
##DATA TYPE= NMR SPECTRUM
##DATA CLASS= NTUPLES
##ORIGIN= UXNMR, Bruker Analytische Messtechnik GmbH
##OWNER= root
$$ XWIN-NMR		Version 3.5
$$ Thu Apr 10 14:07:35 2025 Russian Standard Time (UT+4h)  Yarkov@DPX200
##.OBSERVE FREQUENCY= 81.013821
##.OBSERVE NUCLEUS= ^31P
##.ACQUISITION MODE= SIMULTANEOUS
##.ACQUISITION SCHEME= undefined
##.AVERAGES= 64
##.DIGITISER RES= 17
##SPECTROMETER/DATA SYSTEM= spect
##.PULSE SEQUENCE= zgpg30
##.SOLVENT NAME= CDCl3
##.SHIFT REFERENCE= (INTERNAL, CDCl3, 0, 198.062)
##AUDIT TRAIL= $$ (NUMBER, WHEN, WHO, WHERE, WHAT)
$$ ##TITLE= Audit trail, XWIN-NMR		Version 3.5
$$ ##JCAMPDX= 5.01
$$ ##ORIGIN= Bruker BioSpin GmbH
$$ ##OWNER= Yarkov
$$ C:/Bruker/XWIN-NMR/data/yarkov2/nmr/P31/2/pdata/1/auditp.txt
$$ ##AUDIT TRAIL=  $$ (NUMBER, WHEN, WHO, WHERE, WHAT)
(   1,<2025-04-10 14:06:27.06 +0400>,<Yarkov>,<DPX200>,
      <created by zg, POWCHK disabled, PULCHK disabled
       configuration hash MD5:
       00 E9 B6 7A A2 85 ED C7 34 08 36 98 17 FE 4E 26
       data hash MD5: 32K
       B3 3F 94 F4 E2 96 F5 E2 6B F1 CC D7 A1 3B 14 4D>)
(   2,<2025-04-10 14:06:33.03 +0400>,<Yarkov>,<DPX200>,
      <Start of raw data processing
       efp BC_mod = 2 LB = 1.5 FT_mod = 6 PKNL = 1 PHC0 = 1791.473 PHC1 = 24.89541 SI = 64K 
       data hash MD5: 64K
       73 81 B1 C7 52 39 13 FC D5 3A 14 10 A0 54 47 17>)
(   3,<2025-04-10 14:06:39.43 +0400>,<Yarkov>,<DPX200>,
      <abs ABSG = 5 
       data hash MD5: 64K
       F0 96 32 77 00 00 A4 90 13 F2 EE D7 0A 36 90 6C>)
(   4,<2025-04-10 14:07:04.78 +0400>,<Yarkov>,<DPX200>,
      <pk PHC0 = 5.186422 PHC1 = 5.200001 
       data hash MD5: 64K
       C9 D4 66 F0 16 4B 0B E5 DE CC A4 45 42 C4 2A 17>)
$$ ##END=
$$ 
$$ hash MD5
$$ B4 05 43 5B 8C F0 46 4F 09 6E 19 05 11 FD 78 B4
##$RELAX= 
##$RELAX= 
##$RELAX= 
##$RELAX= 
##$RELAX= 
##$RELAX= 
##$RELAX= 
##$RELAX= 
$$ Bruker specific parameters
$$ --------------------------
##$DU= <C:/Bruker/XWIN-NMR>
##$EXPNO= 2
##$NAME= <P31>
##$PROCNO= 1
##$TYPE= <nmr>
##$USER= <yarkov2>
##$AMP= (0..31)
100 100 100 100 100 100 100 100 100 100 100 100 100 100 100 100 100 100 
100 100 100 100 100 100 100 100 100 100 100 100 100 100 
##$AQSEQ= 0
##$AQ_mod= 1
##$AUNM= <au_zg>
##$AUTOPOS= <>
##$BF1= 81.014009
##$BF2= 200.13
##$BF3= 200.13
##$BF4= 200.13
##$BF5= 200.13
##$BF6= 200.13
##$BF7= 200.13
##$BF8= 200.13
##$BYTORDA= 1
##$CFDGTYP= 0
##$CFRGTYP= 5
##$CHEMSTR= <none>
##$CNST= (0..31)
1 1 145 1 1 1 1 1 1 1 1 1 1 1 1 1 1 1 1 1 1 1 1 1 1 1 1 1 1 1 1 1 
##$CPDPRG= <waltz16>
##$CPDPRG1= <>
##$CPDPRG2= <waltz16>
##$CPDPRG3= <>
##$CPDPRG4= <mlev>
##$CPDPRG5= <mlev>
##$CPDPRG6= <mlev>
##$CPDPRG7= <mlev>
##$CPDPRG8= <mlev>
##$CPDPRGB= <>
##$CPDPRGT= <>
##$D= (0..31)
0 1 0 0 0 0 0 0 0 0.06 0 0.03 2e-05 3e-06 0 0 0.0002 0 0 0 0 0 0 0 0 0 
0 0 0 0 0 0 
##$DATE= 1744279586
##$DBL= (0..7)
120 120 120 11 120 120 24 19 
##$DBP= (0..7)
150 150 150 150 150 150 150 150 
##$DBP07= 0
$$ [...]
##$SUBNAM3= <"">
##$SUBNAM4= <"">
##$SUBNAM5= <"">
##$SUBNAM6= <"">
##$SUBNAM7= <"">
##$SUBNAM8= <"">
##$SUBNAM9= <"">
##$SW= 400.765351723535
##$SWIBOX= (0..15)
0 1 3 0 0 0 0 0 0 0 0 0 0 0 0 0 
##$SW_h= 32467.5324675325
##$TD= 32768
##$TD0= 1
##$TE= 0
##$TE2= 300
##$TE3= 300
##$TEG= 300
##$TL= (0..7)
0 120 53 12 22 120 120 120 
##$TP= (0..7)
150 150 150 150 150 150 150 150 
##$TP07= 0
##$TPNAME0= <>
##$TPNAME1= <>
##$TPNAME2= <>
##$TPNAME3= <>
##$TPNAME4= <>
##$TPNAME5= <>
##$TPNAME6= <>
##$TPNAME7= <>
##$TPOAL= (0..7)
0.5 0.5 0.5 0.5 0.5 0.5 0.5 0.5 
##$TPOFFS= (0..7)
0 0 0 0 0 0 0 0 
##$TUNHIN= 0
##$TUNHOUT= 0
##$TUNXOUT= 0
##$USERA1= <user>
##$USERA2= <user>
##$USERA3= <user>
##$USERA4= <user>
##$USERA5= <user>
##$V9= 5
##$VALIST= <valist>
##$VCLIST= <CCCCCCCCCCCCCCC>
##$VD= 0
##$VDLIST= <DDDDDDDDDDDDDDD>
##$VPLIST= <PPPPPPPPPPPPPPP>
##$VTLIST= <TTTTTTTTTTTTTTT>
##$WBST= 1024
##$WBSW= 4
##$XGAIN= (0..3)
0 0 0 0 
##$XL= 0
##$YL= 0
##$YMAX_a= 10577
##$YMIN_a= -3668
##$ZGOPTNS= <>
##$ZL1= 120
##$ZL2= 120
##$ZL3= 120
##$ZL4= 120
##$ABSF1= 198.0616
##$ABSF2= -202.7028
##$ABSG= 5
##$ABSL= 3
##$ALPHA= 0
##$AQORDER= 0
##$ASSFAC= 0
##$ASSFACI= 0
##$ASSFACX= 0
##$ASSWID= 0
##$AUNMP= <proc_1d>
##$AZFE= 0.1
##$AZFW= 0.5
##$BCFW= 0
##$BC_mod= 2
##$BYTORDP= 0
##$COROFFS= 0
##$CY= -3
##$DATMOD= 1
##$DC= 0
##$DFILT= <>
##$DTYPP= 0
##$F1P= 0
##$F2P= 0
##$FCOR= 1
##$FTSIZE= 65536
##$FT_mod= 6
##$GAMMA= 0
##$GB= 0
##$INTBC= 1
##$INTSCL= 9.790993e-09
##$ISEN= 30
##$LB= 1.5
##$LEV0= 0
##$LPBIN= 0
##$MAXI= 10000
##$MC2= 0
##$MEAN= 0
##$ME_mod= 0
##$MI= 50
##$NCOEF= 0
##$NC_proc= -8
##$NLEV= 6
##$NOISF1= 182.463
##$NOISF2= 159.3651
##$NSP= 0
##$NTH_PI= 0
##$NZP= 0
##$OFFSET= 198.0616
##$PC= 4
##$PHC0= 1796.659
##$PHC1= 30.09541
##$PH_mod= 1
##$PKNL= yes
##$PPARMOD= 0
##$PSCAL= 0
##$PSIGN= 0
##$REVERSE= no
##$SF= 81.0140089999434
##$SI= 65536
##$SIGF1= 159.3651
##$SIGF2= -187.1042
##$SINO= 113.3802
##$SIOLD= 16384
##$SREGLST= <1H.CDCl3>
##$SSB= 0
##$STSI= 65536
##$STSR= 0
##$SW_p= 32467.5324675325
##$SYMM= 0
##$S_DEV= 0
##$TDeff= 32768
##$TDoff= 0
##$TI= <>
##$TILT= no
##$TM1= 0
##$TM2= 0
##$TOPLEV= 0
##$USERP1= <user>
##$USERP2= <user>
##$USERP3= <user>
##$USERP4= <user>
##$USERP5= <user>
##$WDW= 1
##$XDIM= 65536
##$YMAX_p= 218284647
##$YMIN_p= -350435804
$$ End of Bruker specific parameters
$$ ---------------------------------
##NTUPLES= NMR SPECTRUM
##VAR_NAME=  FREQUENCY,     SPECTRUM/REAL,   SPECTRUM/IMAG
##SYMBOL=    X,             R,               I
##VAR_TYPE=  INDEPENDENT,   DEPENDENT,       DEPENDENT
##VAR_FORM=  AFFN,          ASDF,            ASDF
##VAR_DIM=   65536,         65536,           65536
##UNITS=     HZ,            ARBITRARY UNITS, ARBITRARY UNITS
##FACTOR=    0.49542278885378, 1,            1
##FIRST=     16045.7642231865, 0,            0
##LAST=      -16421.768244346, 0,            0
##MIN=       -16421.768244346, -350435804,   0
##MAX=       16045.7642231865, 218284647,    0
$$ Real data points
##PAGE= N=1
##DATA TABLE= (X++(R..R)), XYDATA
$$ [...]
##PAGE= N=2
##DATA TABLE= (X++(I..I)), XYDATA
7490a2709911l393312J486214M524132M138899J611982m69457j12657J880677
7482c043433K332461M6029j913689p64044J250804K77556k610431k775132O82931
7473f516948L634150L340055J817424J613545K015596J205308p37476k692582
7465C679072m086576m286024k479911O56860K981001L355113K380901N11460k122355
7456E89541l766036k088190J826335L718212J944473p4586P48168K412454J435117
7447F745488j256021j763195O48335K562848J531670q97950j954088j172051j49296
7438D295740j93977j190024k152566k340918j999469j959065k329060k044688
7430i914027j57873K852053N443055O209042M589988J364898j211653j066854
$$ plain form
7490 -12709911 -16103223 -14617009 -10092877 -5953978 -4341996 -4811453 -4924110 -3043433
7482 -3043433 -710972 -664943 -2578632 -3342676 -2091872 -1814316 -4424747 -7199879 -6516948
7473 -6516948 -2882798 457257 2274681 3888226 5903822 7109130 6371654 3679072
7465 3679072 -407504 -4693528 -7173439 -6516579 -3535578 -180465 2200436 2711896 589541
7456 589541 -3176495 -5264685 -3438350 279862 2224335 2149749 2897917 5310371 6745488
7447 6745488 5489467 3726272 4374607 6937455 8469125 7571175 5617087 4445036 4295740
7438 4295740 4101763 2911739 759173 -1581745 -3581214 -5540279 -7869339 -9914027
7430 -9914027 -10071900 -7219847 -1776792 4432250 9022238 10387136 9175483 8108629
7422H108629J088899K060630Q6876k828853l817664l030505k723965l407908l222434
7413g686295j009377K057820M174310M590756L385297J131124r03084j689831
7405D050720j858534k705043l652834k641665L83338K547765J898772K20373J24737
7396a632371R26619l6876k710918l767710j172217K935598M917755L661533Q92168
7387D013581j318551k121243j679829o19432M06195J214330K009075K583292K244102
7378F731520R93385Q836J50123O04125M528j492789k315172j522662K03320J594313
7368D959527J944315J234627K0863o85278k76960N00475K31445j331475k859246
7359C738293l109642k255102j270738p38059o22317n65130R517J474528L245869
$$ plain form
7422 8108629 9197528 11258158 11345034 8516181 4698517 1668012 -1055953 -4463861 -7686295
7413 -7686295 -8695672 -6637852 -2463542 2127214 5512511 6643635 5740551 4050720
7405 4050720 2192186 -512857 -4165691 -6807356 -6424018 -3876253 -1977481 -1757108 -1632371
7396 -1632371 -705752 -742628 -3453546 -7221256 -8393473 -5457875 -540120 3121413 4013581
7387 4013581 2695030 573787 -1106042 -1725474 -1319279 -104949 1904126 4487418 6731520
7378 6731520 7724905 7733741 7883864 8487989 8492517 6999728 4684556 3161894 3365214 4959527
7368 4959527 6903842 8138469 8159332 7474054 7197094 7697569 7929014 6597539 3738293
7359 3738293 628651 -1626451 -2897189 -3635248 -4257565 -4822695 -4813178 -3338650 -92781
7350i2781L954899K803433M12124j860408k971326k493617o50925J518343K627597
7341C247339K107995O74483n28327q80729l89417N63146J398084J691762J352779
7332I237115J78183k154221m826927n438425k464963K128096M574866L647593
7324D881317J444689j56135j393572k435317k106608l14531O86594n11960j957430
7315a862953j233709P78465J519171Q58186Q75070K164130K905318J554313j438414
7306F119577m404202n440153l304167R12243L774784L118646R00691M07920J644096
7297C729435K107530J298352J174909K223360K429555P80340j209657k327454
7289A0206370l194283l923514l083710n39724J202381M01430j225509j239330
$$ plain form
7350 -92781 3862118 6665551 7077675 5217267 2245941 -247676 -898601 619742 3247339
7341 3247339 5355334 6029817 5501490 4620761 4231344 4794490 6192574 7884336 9237115
7332 9237115 9415298 7261077 2434150 -3004275 -5469238 -3341142 1233724 4881317
7324 4881317 6326006 6169871 4776299 2340982 234374 -80157 606437 94477 -1862953
7315 -1862953 -3096662 -2318197 -799026 59160 934230 3098360 6003678 7557991 6119577
7306 6119577 1715375 -3724778 -7028945 -6116702 -2341918 776728 1677419 2085339 3729435
7297 3729435 5836965 7135317 8310226 10533586 12963141 13743481 12533824 10206370
7289 10206370 7012087 3088573 4863 -534861 667520 1068950 -156559 -1395889
7281a395889j72771k35349j549454k085109r36990L91970J97855j278692k296867
7272i361296j527964O98367K782454L405134K591659J136867m55228j834449k300295
7263d864751j560301m88188J16776R01721K538259L702364K681846N32965n9081
7254C501610R08833N97119j884048l659466k492704j70327N16119j54018p8787
7245b915669J115591K168794K590023K683978K021352L2432k268651k921155j292186
7236A214509J364421L243395L119577R87286j487883k073204n66146O07821n51731
7227E858045k896774l650455j908345N63799J593932P73337m00328k07194J159120
7218H85137J543562j31126j677078n60981J721124J353377j649867k837324n2987
$$ plain form
7281 -1395889 -1568660 -1804009 -3353463 -5438572 -6375562 -5983592 -5785737 -7064429 -9361296
7272 -9361296 -10889260 -10190893 -7408439 -4003305 -1411646 -274779 -730007 -2564456 -4864751
7263 -4864751 -6425052 -6913240 -6796464 -5894743 -3356484 345880 3027726 3560691 3501610
7254 3501610 4410443 5007562 3123514 -535952 -3028656 -3198983 -2682864 -2836882 -2915669
7245 -2915669 -1800078 368716 2958739 5642717 7664069 7696501 5427850 2506695 1214509
7236 1214509 2578930 5822325 8941902 9929188 8441305 6368101 5801955 6409776 5858045
7227 5858045 2961271 -689184 -2597529 -2033730 -439798 333539 -66789 -273983 885137
7218 885137 2428699 2297573 620495 59514 1780638 3134015 1484148 -1353176 -1406163
7209a406163L109689K745339n5026k148732l251582m323836l892262l50660L829833
7200e743400M629193K344150Q21210J337088J400779j70574j042740N68385K747086
7191F891177K471604m88229l533794m069045j813136J034965K016759J208455
7183C718756Q49800J676224J600856n76679k539484j910390j83734j92600j432903
7174A009846j337888J11618O54846k30650j012206j095325r10239P7050K126729
7165f06219L169774J635482l8594J084969K909485J354700k211152k598315M28648
7156E128778J587725q75531k330805L5268K615859J976719K13413J40209L61522
7147H853157r36604k012967j462252j594712l638861m002510j93377L663234K730920
$$ plain form
7209 -1406163 1703526 4448865 4393839 2245107 -1006475 -5330311 -9222573 -9573233 -5743400
7200 -5743400 -1114207 1229943 2051153 3388241 4789020 4618446 3575706 4144091 6891177
7191 6891177 9362781 8874552 5340758 1271713 -541423 493542 2510301 3718756
7183 3718756 4568556 6244780 7845636 7268957 4729473 2819083 2635349 2442749 1009846
7174 1009846 -328042 -216424 438422 207772 -804434 -1899759 -2809998 -2732948 -606219
7165 -606219 2563555 4199037 4160443 5245412 8154897 9509597 7298445 4700130 5128778
7156 5128778 6716503 5840972 3510167 3545435 6161294 8138013 8351426 8491635 8853157
7147 8853157 7916553 5903586 4441334 2846622 -792239 -4794749 -4988126 -1324892 1406028
7138A406028p03490j304626M47129J36984j981598j554742J388640J808165j648551
7129b006061l950361j714496J724640K114972N83963P06231K487813K870515O26730
7120C443946k104382k614466l59755K640365L446713J070120j977980k163790
7112A380771Q06539L593964L392589R35388j235539k013960k222471k703850k982497
7103a049066j970945J89437J519748M04559j716054j636351J018952K722591J071843
7094E54714j454207j262870P89105R49229j389387k845482j190937J895781L665565
7085b88489L230453J226689j062212j886176n80474Q52653q309k129758k020675
7076b666298J096288L874537L305286Q0168l201875m687165l435075L21309L974271
$$ plain form
7138 1406028 702538 -602088 -154959 -17975 -1999573 -3554315 -2165675 -357510 -2006061
7129 -2006061 -5956422 -7670918 -5946278 -3831306 -3247343 -2541112 -53299 2817216 3443946
7120 3443946 1339564 -1274902 -1634657 1005708 4452421 5522541 3544561 1380771
7112 1380771 2187310 5781274 9173863 10109251 8873712 6859752 4637281 1933431 -1049066
7103 -1049066 -3020011 -2830574 -1310826 -906267 -2622321 -4258672 -3239720 -517129 554714
7094 554714 -899493 -2162363 -1373258 -424029 -1813416 -4658898 -5849835 -3954054 -288489
7085 -288489 2941964 4168653 3106441 1220265 639791 1492444 1484135 -645623 -2666298
7076 -2666298 -1570010 2304527 5609813 5689981 2488106 -2199059 -5634134 -5312825 -1338554
7067a338554M183332J047993j665332j621489o61352j026618j692765p25543J061698
7058b438630J533976P55012M59878J019721J240938M78577r55253k713437m027135
7049d646353l407989o44931J880079J943249O23118L96941R90254N8140k226969
7040e034461k592586L86665L616970L510800O31703j713288k032200j424898o08077
7031e259372J080265L308098L843134J507055j492426k055857k85976Q75127m7150
7022A472898j224538o32675R11545J169671l41791k116110k763473j891309L97061
7013e018721L232265M646601L264725K97763j640099j659046j069644q89342p24832
7004D39670l96956p38882j961332k803412k324728j289951p39017k97027Q82031
$$ plain form
7067 -1338554 2844778 3892771 2227439 605950 -55402 -1082020 -2774785 -3500328 -2438630
7058 -2438630 -904654 -149642 310236 1329957 2570895 3049472 2094219 -619218 -4646353
7049 -4646353 -8054342 -8699273 -6819194 -4875945 -4252827 -3855886 -2865632 -2807492 -5034461
7040 -5034461 -7627047 -7240382 -3623412 -112612 519091 -1194197 -3226397 -4651295 -5259372
7031 -5259372 -4179107 -871009 2972125 4479180 2986754 930897 644921 1520048 1472898
7022 1472898 248360 -384315 527230 1696901 1355110 -761000 -3524473 -5415782 -5018721
7013 -5018721 -1786456 2860145 6124870 6422633 4782534 3123488 2053844 1164502 439670
7004 439670 42714 -696168 -2657500 -5460912 -7785640 -9075591 -9814608 -10111635 -9229604
6995i229604K326424K780580K183488J812959K297771K518970J135779j284344
6987D542023k568626j567424L62985J223906R23172O13561J26609j710135m104664
6978b158593m361906j876166P15475J850753L302841N684577N271173m91522p028886
6969I07746p541371k455713J679218K079378K190879L781571L486276l04215l390175
6960D33594k396439k50586o82236j830375l90192J713503O32302k096891j716996
6951f584316J665044L196810J170784q84121n76264R3175p70549j702516j058641
6942e450594J95768R44524K131095M338368N635407M120421Q55672j741419l040623
6933G988619l877444m197301k970737j62503K586531L398090J820246p69690k275996
$$ plain form
6995 -9229604 -6903180 -4122600 -1939112 -126153 2171618 4690588 5826367 4542023
6987 4542023 1973397 405973 768958 1992864 2916036 3529597 3656206 1946071 -2158593
6978 -2158593 -6520499 -8396665 -7681190 -5830437 -2527596 3156981 8428154 7936632 907746
6969 907746 -6633625 -9089338 -7410120 -5330742 -3139863 641708 4127984 3823769 433594
6960 433594 -1962845 -2213431 -2895667 -4726042 -5116234 -3402731 -2770429 -4867320 -6584316
6951 -6584316 -4919272 -1722462 -551678 -1435799 -2012063 -1918888 -2689437 -4391953 -5450594
6942 -5450594 -5254826 -4310302 -2179207 2159161 7794568 11914989 12770661 11029242 7988619
6933 7988619 4111175 -86126 -3056863 -3219366 -632835 2765255 4585501 3815811 1539815
6924A539815j786002l83145L19594J00625j17173O1633J76024l6520m22071j075713
6914a622933k058529k546903j424568J172315L680501M385956K507329j093925
6906B999243l601398k193296K168070M515507J762982k588287k715745J426890
6898A773966M083645J914943j826206k741198j203951k76948m57194K00024K020379
6889C487460K969289J936049L41798j50160P0190n11180k093374l071049k081367
6880H97656J29210J548964J373997O23493J71020l92558j218317j208405l9318
6871A885742L79717j416904l510743k859135K60402K740075L071080K397208J411216
6862D358658n28431k799008l233307j353872Q19625J925828K455523K227770L5648
$$ plain form
6924 1539815 -246187 -629332 -309738 -209113 -326286 -264653 -88629 -125149 -547220 -1622933
6914 -1622933 -3681462 -6228365 -7652933 -6480618 -2800117 1585839 4093168 2999243
6906 2999243 -602155 -2795451 -627381 3888126 5651108 3062821 347076 1773966
6898 1773966 5857611 7772554 5946348 3205150 2001199 1724251 1267057 1467081 3487460
6889 3487460 6456749 8392798 8734596 8584436 8654626 8143446 6050072 2979023 897656
6880 897656 1026866 2575830 3949827 4573320 4744340 4351782 3133465 1925060 1885742
6871 1885742 2265459 848555 -2662188 -5521323 -5260921 -2520846 550234 2947442 4358658
6862 4358658 3830227 1031219 -2202088 -3555960 -2736335 -810507 1645016 3872786 3908434
6853C908434l067615l675786j016522J267289M26805j505437j570142m31819q8697
6844e753490N4006J347687K562996K064092J251932K014978K639601N14427k570796
6835D125433k524740M25836K062858J002957K09161J009425O89128k064075l841027
6826A094956j571842K425307L686468J660945n10336p60670J71728Q70264O25832
6817G692652q26890k868865l537847j382825K128796L611516J607819j601222
6809D823134k595899o88122J428534R50801j593434k895561r41719K492501M145148
6800E125383L033177O95959j312744k323181j627829R09704L265197K738973l12951
6791A0191688k455636j787100l82511q21717k331810k284485j41483K083012K585041
$$ plain form
6853 3908434 840819 -2834967 -3851489 -2584200 -2157395 -3662832 -5232974 -5664793 -5753490
6844 -5753490 -5699484 -4351797 -1788801 275291 1527223 3542201 6181802 6696229 4125433
6835 4125433 1600693 2026529 4089387 5092344 5301505 6310930 7000058 4935983 1094956
6826 1094956 -476886 1948421 5634889 7295834 6785498 6024828 6196556 7066820 7692652
6817 7692652 6865762 3996897 459050 -923775 1205021 4816537 6424356 4823134
6809 4823134 2227235 1539113 2967647 3918448 2325014 -570547 -1512266 980235 5125383
6800 5125383 8158560 8854519 7541775 5218594 3590765 4500469 7765666 10504639 10191688
6791 10191688 7736052 5948952 5566441 4744724 2412914 128429 -13054 2069958 4654999
6782D654999J414797j76617q79613k82735N58108K25074r42185j139764o0804
6773C371260L92031m93389m42902K101190M579191L548993r9813k449882k205478
6764H301201j481470j307614l45800J304668J062362j695716l639288k230649
6756c2306M52472J245574N95879N94417O28963j046953k865768j604268J752324
6747b79666K431170q55608l391682j327903K643332L570054J394114J7334Q16942
6738E018087J210345m85286k437991k384087n68549J411545K466483J797935q91739
6729E136743l705603l279172R35133M782518L920946q46628m738270m655851j691881
6720d142065J358744K789084K429031J309793J052871K051385K429484N11989
$$ plain form
6782 4654999 6069796 5893179 5013566 4730831 5288939 5514013 4571828 3432064 3371260
6773 3371260 3763291 3269902 2827000 4928190 9507381 13056374 12956561 10506679 8301201
6764 8301201 6819731 5512117 5166317 6470985 7533347 5837631 2198343 -32306
6756 -32306 420166 1665740 2261619 2856036 3484999 2438046 -427722 -2031990 -279666
6747 -279666 2151504 1295896 -2095786 -3423689 -780357 2789697 4183811 4201145 5018087
6738 5018087 6228432 5743146 3305155 921068 352519 1764064 4230547 6028482 5136743
6729 5136743 1431140 -1848032 -912899 3869619 7790565 6943937 2205667 -2450184 -4142065
6720 -4142065 -2783321 5763 2434794 3744587 4797458 6848843 9278327 9790316
6712I790316k101266k298979k07597P59427p55404j911866n21826J130171R2950
6703C975926k175650k198726l14969J39345j058971m14287K865517M400299J093309
6694F311793l564289m193897j146779O50634p10784k056699r20015P11071J24598
6685d794367j690162j720169P87320L880240N503374M704600J501182k401704
6677E770314l854010j614887J238912Q04259k215811l506227j542713M69372J0244
6668d440547j011442r7323J420589R95649m01213j9592J502907R16188j912044
6659c046828l238439j235452J304838J619210Q42957R95103J174094k21726j769897
6650c576140j013152J180346J800024O29043M51125K197160L318834J942290l35917
$$ plain form
6712 9790316 7689050 5390071 5182474 5941901 5186497 3274631 2752805 3882976 3975926
6703 3975926 1800276 -398450 -713419 -574074 -1633045 -2047332 818185 5218484 6311793
6694 6311793 2747504 -1446393 -2593172 -1942538 -2653322 -4710021 -5630036 -4918965 -4794367
6685 -4794367 -6484529 -8204698 -7417378 -3537138 1966236 6670836 8172018 5770314
6677 5770314 1916304 301417 1540329 2344588 128777 -3377450 -4920163 -4450791 -4440547
6668 -4440547 -5451989 -5549312 -4128723 -3133074 -3534287 -3553879 -2050972 -1134784 -3046828
6659 -3046828 -6285267 -7520719 -6215881 -4596671 -3753714 -2758611 -1584517 -1806243 -3576140
6650 -3576140 -4589292 -3408946 -1608922 -979879 -528754 1668406 4987240 6929530 6593613
6641F593613j265406j073956r91285p13696M58941J403322M99472j528804k343933
6632A038268j348574k71409k79669m55516K23637J022066O51815o45562j340562
6623a405506n20780J234337K614113K623519J145484r30962k236915k047560q86457
6614d10727J83664O02724L54943n42224j838654k535770j541416Q45435K825475
6605b056550K931926J440702m22494j910232k636694j854261O73163L199805L060735
6596B426100j06870l404067l853605j667717O01262J302811Q32491J73978j91991
6587c887608r9704K05167j75069j631401k769317j856014M32509J591621R59566
6578g230250O32508J844017K820784J904613N26127N59413N80597j852265n135864
$$ plain form
6641 6593613 5328207 4254251 3262966 2549270 3008211 4411533 4911005 3382201 1038268
6632 1038268 -310306 -581715 -861384 -1316900 -1093263 -71197 580618 -64944 -1405506
6623 -1405506 -1926286 -691949 1922164 4545683 5691167 4760205 2523290 475730 -410727
6614 -410727 -227063 375661 730604 188380 -1650274 -4186044 -5727460 -4882025 -2056550
6605 -2056550 875376 2316078 1893584 -16648 -2653342 -4507603 -3834440 -634635 2426100
6596 2426100 2319230 -1084837 -4938442 -6606159 -6004897 -4702086 -3869595 -3695617 -3887608
6587 -3887608 -3987312 -3782145 -3957214 -5588615 -8357932 -10213946 -9781437 -8189816 -7230250
6578 -7230250 -6597742 -4753725 -1932941 -28328 497799 1057212 1637809 -214456 -5350320
6569e350320m779904m7617M233693L979478R79482l12678J243241L186069L541173
6560F672617K512416P88759j389757l383482m082915l024946p81228J511524K440255
6551A263243J100395j395274k342210p76654Q36465N1129j719929j359152Q34973
6542c507014J373592j013026l417251l101944r23744R97228K450628M008177M711090
6533A577736L238561L76358j628370j663875m37247P40049Q35338l30623j508954
6524A198973j183842m1800m68518k480830k656462O83694L730559K062562k489516
6515a645180m138813j610058M78430o83687j926784J15503L194084K952552m01623
6506c665576k735311j891501N61365K734963M175175M299708K324364o00507j908412
$$ plain form
6569 -5350320 -10130224 -10177841 -5944148 -1964670 -985188 -1297866 -54625 3131444 6672617
6560 6672617 9185033 9973792 8584035 5200553 1117638 -1907308 -2688536 -1177012 1263243
6551 1263243 2363638 968364 -1373846 -2150500 -1314035 -1262906 -2982835 -4341987 -3507014
6542 -3507014 -2133422 -3146448 -6563699 -9665643 -10589387 -9592159 -7141531 -3133354 1577736
6533 1577736 4816297 5192655 3564285 1900410 1463163 2203212 3038550 2707927 1198973
6524 1198973 15131 -26669 -495187 -2976017 -5632479 -4948785 -1218226 844336 -1645180
6515 -1645180 -5783993 -7394051 -6915621 -7599308 -9526092 -9410589 -6216505 -3263953 -3665576
6506 -3665576 -6400887 -8292388 -7731023 -4996060 -820885 3478823 5803187 5202680 3294268
6497C294268j232488j091796k769221l880514j925599J658908L440854K792071
6489B86483K002790K043870J233409j203749l006738k002279N79903J987953J791306
6480C712948J480845J152336m63000k645862k573080K04597J968501k58795m000374
6471a421884m305803l97100L580183M225422K466241R28328K69574n01684j711764
6462C131513k555011k243827p79425Q54507J008648j077142l707534m018803j412518
6453a0799592J578722K496066J594403M43006m73197j339572j558519n16703R65713
6444g609673J602036J502962J595103J792593J374627O82117O35461Q02373j83589
6435B194010k211571l508041l171985k197314j481708m91619J268556K898262
$$ plain form
6497 3294268 2061780 969984 -1799237 -5679751 -7605350 -5946442 -2505588 286483
6489 286483 2289273 4333143 5566552 4362803 1356065 -646214 -66311 1921642 3712948
6480 3712948 5193793 6346129 5883129 3237267 664187 868784 2837285 2578490 -1421884
6471 -1421884 -5727687 -6124787 -2544604 1680818 4147059 5075387 5344961 4843277 3131513
6462 3131513 576502 -1667325 -2446750 -1592243 -583595 -1660737 -5368271 -9387074 -10799592
6453 -10799592 -9220870 -6724804 -5130401 -4687395 -5160592 -6500164 -8058683 -8575386 -7609673
6444 -7609673 -6007637 -4504675 -2909572 -1116979 257648 939765 1575226 2377599 2194010
6435 2194010 -17561 -3525602 -6697587 -8894901 -10376609 -10868228 -9599672 -6701410
6427f701410L284505K612558J675812N32891j048709k382548k251488m54075J770598
6418b961866K948839K666424J681710R33017M93932k56407j310292j569533m37085
6409B188739Q27199O47132m08031m33821O06158O35679r81678j932779m00803
6400G47795J982329K648098J983746K163874L052214K285000n09493k559049k084311
6391I710203j144024k529016n422655o379497m050148q04873O86864Q04048J795922
6382g333176M118736N480236L870450M14511j886005j808031r07073p22968o27874
6373E98806N50819K170671K677250J968029R70481m82749k975633m855549l210669
6364b588544J480837M429455K309082k040511l206963k04931K955912L158596
$$ plain form
6427 -6701410 -3416905 -804347 871465 1404356 355647 -2026901 -4278389 -4732464 -2961866
6418 -2961866 -13027 2653397 4335107 5268124 5762056 5505649 4195357 2625824 2188739
6409 2188739 3015938 3663070 3255039 2821218 3427376 4063055 3081377 1148598 747795
6400 747795 2730124 5378222 7361968 9525842 12578056 14863056 14353563 11794514 9710203
6391 9710203 8566179 6037163 614508 -5764989 -9815137 -10620010 -9933146 -9129098 -7333176
6382 -7333176 -3214440 2265796 6136246 6550757 4664752 2856721 1949648 1226680 598806
6373 598806 1149625 3320296 5997546 7965575 8936056 8453307 5477674 622125 -2588544
6364 -2588544 -1107707 3321748 5630830 3590319 383356 178425 3134337 6292933
6356F292933J572627O51523N02119k13217j518096k088601j221706N47151K332213
6347F856946L219892K059305j644114o214632q205559n389395N45952M975200
6339c796405M663726J026215j570354p63627J532112K227492J082393K19204N02387
6330E123143N10113p69578k218449k407241j630294j009071o46372R8313J158638
6321a790798J760140J589620J087307P21094N89273O16632P36093R71951J383872
6312G665184J622853Q74412q89088j991566r54318P25362j35892l629313n666065
6303b378431l300542R83769K651300J156021k32942L22492J305084J068503M5382
6294A620636q24289j457661j697227j016713K10151R33140J251590K028605K514748
$$ plain form
6356 6292933 7865560 8517083 9019202 8805985 7287889 5199288 3977582 4524733 6856946
6347 6856946 10076838 12136143 10492029 4277397 -3928162 -9317557 -8771605 -3796405
6339 -3796405 867321 1893536 323182 -440445 1091667 3319159 4401552 4620756 5123143
6330 5123143 5633256 4863678 2645229 237988 -1392306 -2401377 -3047749 -2949436 -1790798
6321 -1790798 -30658 1558962 2646269 3367363 3956636 4573268 5309361 6281312 7665184
6312 7665184 9288037 10162449 9273361 7281795 6327477 7052839 6916947 3287634 -2378431
6303 -2378431 -5678973 -4695204 -2043904 -887883 -1120825 -798333 506751 1575254 1620636
6294 1620636 796347 -661314 -2358541 -3375254 -3165103 -2231963 -980373 1048232 3562980
6285C562980R60200j782047k250596O13960L315260K696479L82748k68408O26271
6276G856847N87355m89517m19903J031926J624257N42397m80962o40839j507026
6267H104535l655244m644422k442274J055142K234480M13638j850293k513500
6259c297938k018903j481535p91728O38810K306288K825264J516258p83748k509067
6250c596299k671764j403728M09809J740712J912216J064494K40409M46341J326493
6241e31317J335448k93496k320839k930183j883201l76183P72589J551801J594812
6232c080569K24160j847537k367244k22538K682095L537789K093566O28831O43199
6223B291752J110594M73418j021201k044947k326352k611021k814022j889800
$$ plain form
6285 3562980 4523180 2741133 490537 1104497 4419757 7116236 7498984 7230576 7856847
6276 7856847 8444202 7954685 7534782 8566708 10190965 10733362 10252400 9611561 8104535
6267 8104535 4449291 -195131 -2637405 -1582263 652217 1065855 -784438 -3297938
6259 -3297938 -5316841 -6798376 -7590104 -6951294 -4645006 -1819742 -303484 -1087232 -3596299
6250 -3596299 -6268063 -7671791 -7261982 -5521270 -3609054 -2544560 -2304151 -1857810 -531317
6241 -531317 804131 510635 -1810204 -4740387 -6623588 -6999771 -6227182 -4675381 -3080569
6232 -3080569 -2856409 -4703946 -7071190 -7293728 -4611633 -1073844 1019722 1648553 2291752
6223 2291752 3402346 3875764 2854563 809616 -1516736 -4127757 -6941779 -8831579
6215h831579K4749R02172n66902k688433k626569r7133K391087K908035K042075
6206f542498J158961M90034j28262j32925P43726J349026N41813q52135j029376
6197d401636J57791J040990N85805l73539n79566J19061J005631J321091N98725
6188e25647r07288j889044j074456R88553K243203J702234O34862M39856N14364
6179B126637l90100j508196p49877J818672L203642J324960j871449k910541j502084
6170d58336m69084j106343j388501J28811J391404K48509j309792J90100L706520
6161I33288M359324N63463l458204l896277k486814k764766m117180l191549L86905
6152a3671810L422694L769117K354489O74774q65077j866072j755547j127238
$$ plain form
6215 -8831579 -8806830 -7904658 -8471560 -11159993 -13786562 -13883695 -11492608 -8584573 -6542498
6206 -6542498 -5383537 -4893503 -5021765 -5154690 -4410964 -3061938 -2520125 -3372260 -4401636
6197 -4401636 -4243845 -3202855 -2617050 -2990589 -3570155 -3451094 -2445463 -1124372 -525647
6188 -525647 -1432935 -3321979 -4396435 -3407882 -1164679 537555 1172417 1612273 2126637
6179 2126637 1736537 228341 -521536 1297136 4500778 5825738 3954289 1043748 -458336
6170 -458336 -927420 -2033763 -3422264 -3293453 -1902049 -1653540 -2963332 -2773232 933288
6161 933288 5292612 5856075 2397871 -1498406 -3985220 -6749986 -10867166 -14058715 -13671810
6152 -13671810 -10249116 -6479999 -4125510 -3450736 -4315813 -6181885 -7937432 -9064670
6144i064670j063795q73386J129924M171429M948426K087803j566742k540823
6136b771834q45117R80096J474500J179435P88723J19048r96894j802136j136037
6127c010216J058044K960899K441860j60927j939440j104411N09466K30024j516382
6118e31083k369630j952947j614488j069240R87692L068184J996247j321617j774303
6109d581185K243627N295200K342335l739068o155419l379659J1526M80542p68511
6100h250612j170838k06658J367926L051736M335533M507960L405731J512047
6092H552825o02564k213250k542392j874200j524241j641430n84573J998344L403697
6083B972216J570123j175447j167344R79594J370275r84764k760677j603944O27963
$$ plain form
6144 -9064670 -10128465 -11001851 -9871927 -5700498 -752072 1335731 -231011 -2771834
6136 -2771834 -3616951 -2636855 -1162355 17080 805803 924851 -72043 -1874179 -3010216
6127 -3010216 -1952172 1008727 3450587 3289660 1350220 245809 755275 985299 -531083
6118 -531083 -2900713 -4853660 -6468148 -7537388 -6549696 -3481512 -1485265 -2806882 -4581185
6109 -4581185 -2337558 2957642 5299977 1560909 -4594510 -7974169 -7962643 -7482101 -8250612
6100 -8250612 -9421450 -9628108 -8260182 -5208446 -872913 3635047 7040778 8552825
6092 8552825 7950261 5737011 3194619 1320419 -203822 -1845252 -2429825 -431481 2972216
6083 2972216 4542339 3366892 2199548 3179142 4549417 3564653 803976 -799968 -172005
6074a72005J151222M350j016119j077001m71625M02926R80052N81664n97040j546925
6064a760501j884059k056047j967565r35693P09653J636381J544636J584322K315427
6055h13446K877362K607102J805815N46107j366038k816615k063248J30203M41212
6046A348454k432275n266535m349592m14034K590210K499758N28926j404859k624735
6037i524682k925401j833910N85874L137867M323499L530383J414365n85784j287901
6028c165690p10986P3143J70662k44506l01323O20876K298903L661913L492634
6019E895626J570611j001380k908931l639053l094738j204042J224109K372158
6011g85640J521307L22840L93574P52179k97780j860712j757328l90475j34362
$$ plain form
6074 -172005 979217 983567 -32552 -1109553 -1581178 -1178252 -198200 383464 -213576 -1760501
6064 -1760501 -3644560 -5700607 -7668172 -8603865 -7894212 -6257831 -4713195 -3128873 -813446
6055 -813446 2063916 4671018 6476833 7022940 5656902 2840287 777039 907242 1348454
6046 1348454 -1083821 -6350356 -10699948 -11113982 -8523772 -6024014 -5495088 -6899947 -9524682
6037 -9524682 -12450083 -14283993 -13698119 -10560252 -6236753 -2706370 -1292005 -1877789 -3165690
6028 -3165690 -3876676 -3803533 -3632871 -3877377 -4178700 -3557824 -1258921 2402992 5895626
6019 5895626 7466237 6464857 3555926 -83127 -3177865 -4381907 -3157798 -785640
6011 -785640 735667 1058507 1452081 2204260 1906480 45768 -1711560 -2102035 -2236397
6002b236397j175717j447275p86113j270208k748043k260371O08341K119122M55268
5993h741393p80339J576637M629768L807983M894k250578j747917r61183p33246
5984e195374M71886K296578K168533j58510j764422j179035l18265p56501j328216
5975e763326p96157n5053j35460l68471q544L68523M49016J203667K828306L356110
5965A078611J051783k796067m873957l217229R72266M309979M024582P52144j676133
5956c74021n36054K202275K517724O1056j580698n50498O20790o52374k925590
5947a217390l082352p39001J838632K798004J899068m6125j363713m91586J786708
5938A382245K614785J033376k74814Q22903K145745N41360k724561l614568j576984
$$ plain form
6002 -2236397 -3412114 -4859389 -5645502 -6915710 -9663753 -11924124 -11315783 -9196661 -8741393
5993 -8741393 -9521732 -7945095 -3315327 492656 497550 -1753028 -3500945 -4462128 -5195374
5984 -5195374 -4723488 -2426910 -258377 -416887 -2181309 -3360344 -3678609 -4435110 -5763326
5975 -5763326 -6559483 -6614536 -6749996 -7118467 -7127011 -6758488 -6309472 -5105805 -2277499 1078611
5965 1078611 2130394 -665673 -5539630 -8756859 -7784593 -3474614 549968 1302112 -374021
5956 -374021 -910075 1292200 3809924 3870980 2290282 1739784 2360574 1708200 -1217390
5947 -1217390 -4299742 -5038743 -3200111 -402107 1496961 1450836 87123 -404463 1382245
5938 1382245 3997030 5030406 4755592 5578495 7724240 8265600 5541039 1926471 349487
5929C49487j29130q97451j109412J428604M286550L902842Q21959j474039j695076
5920E484334j682521k495634k541965o10157J480760J171181r71738j826219j40589
5911b132548J699705J312083m0061N32926K784183L306946O57626k224376k309541
5902C586943r72011j651130m356477n635843l850640j327930l70698N6258J856421
5893a2665107M150333M518519K734610P72382m46272j823854l436932l584470
5885i780791j537983O93579R37473o1707R3731J820503L089556K523517J161663
5876a060459O06004Q35475P85178J90826j71091K75733J164181J562840P78692
5867D967379r24758k228514j898722k87839R01516O31394m11957j068180j038627
$$ plain form
5929 349487 220357 -677094 -1786506 -357902 3928648 7831490 8653449 7179410 5484334
5920 5484334 3801813 1306179 -1235786 -1845943 -365183 805998 -165740 -1991959 -2132548
5911 -2132548 -432843 879240 839179 1372105 4156288 7463234 8120860 5896484 3586943
5902 3586943 2614932 963802 -3392675 -9028518 -12879158 -14207088 -14577786 -14521528 -12665107
5893 -12665107 -8514774 -3996255 -1261645 -489263 -935535 -2759389 -6196321 -9780791
5885 -9780791 -11318774 -10625195 -9687722 -9749429 -9655698 -7835195 -4745639 -2222122 -1060459
5876 -1060459 -454455 381020 1166198 1357024 1185933 1461666 2625847 4188687 4967379
5867 4967379 4042621 1814107 -84615 -372454 529062 1160456 748499 -319681 -1358308
5858a358308m57774P08168J947923K032328P19110m85237o55147j219370l327642
5849b095949m616554j695338M197645P324755M417621j112324l602746j717501
5841A099609J298060K247806O26097k321191m830846n177981k928822J54638J686132
5832h146498J157702M57m43079R4499J368998K751822K962814J159696j489849
5823e83438k591644j311992N95042J038001J04485k84276J126842L316561M003141
5814E412722K181575o34307k057684j438129q4585Q16709J106411M15922j892870
5805C825764m529135m184478K40931M835119M733030K35777l759560m051723k039816
5796d694091l18678N09012P48526K38891l84535N72183L006991L894314J164729
$$ plain form
5858 -1358308 -1816082 -1107914 840009 2872337 3591447 3106210 2451063 1231693 -2095949
5849 -2095949 -6712503 -8407841 -4210196 3114559 7532180 6419856 2817110 1099609
5841 1099609 2397669 4645475 5271572 2950381 -1880465 -7058446 -9987268 -9832630 -8146498
5832 -8146498 -6988796 -6988339 -7431418 -7336919 -5967921 -3216099 -253285 906411 -583438
5823 -583438 -3175082 -4487074 -3892032 -2854031 -2749546 -3033822 -1906980 1409581 5412722
5814 5412722 7594297 6959990 4902306 3464177 3379592 4196301 5302712 5718634 3825764
5805 3825764 -703371 -4887849 -4646918 188201 4921231 5157008 1397448 -2654275 -4694091
5796 -4694091 -5012769 -4503757 -3755231 -3516340 -3900875 -3328692 -321701 3572613 4737342
5787D737342k820021m039618k059565m8568j8365n70490K48037J975387K726891
5778A31030J981791J162269J622470K800609K803367Q65932j321144j509877J59924
5769H696371J334869O44114p78527j395391j175436o02901L30917R12646m43681
5760G522981l295684m238579j461059J694905J132757j556859j408468J745888
5752A35882K569280j281126n037628l835297L69047K469135J588102O55452Q25638
5743a541515P68056M09272J052241K003658J035798j511206k696383j577832l60547
5734b418458j73994O44098K620803L123244O02771k139524j828108M31372J342829
5725B205033P66587J302619L270604L751076J133655k250374l151971j183248
$$ plain form
5787 4737342 1917321 -2122297 -4181862 -4230430 -4248795 -4819285 -4571248 -2595861 131030
5778 131030 2112821 3275090 4897560 7698169 10501536 11367468 10046324 8536447 8696371
5769 8696371 10031240 10675354 9896827 8501436 7326000 6723099 7054016 7966662 7522981
5760 7522981 4227297 -11282 -1472341 222564 1355321 -201538 -1610006 135882
5752 135882 2705162 1424036 -3613592 -7448889 -7079842 -4610707 -3022605 -2367153 -1541515
5743 -1541515 -773459 -364187 688054 2691712 3727510 2216304 -480079 -2057911 -2418458
5734 -2418458 -2592452 -1948354 672449 3795693 4398464 2258940 430832 862204 2205033
5725 2205033 2971620 4274239 7544843 11295919 12429574 10179200 7027229 5843981
5717E843981J430103K549890J753494J94328n81201k53671j76354j466059l084173
5708F210338l186445k112415k143826l918971m992316l012649J036753L989077
5700h130454M018493J996983N8772k05655J316703L175704L497189J863331k69893
5691G321173j451697j864286k378026k651587j316900J924383N190986N832229
5683A0606275K983682j248343l470143k397297k54338R5693j036059r06449J103019
5674E476040K101304N3725k775180k987074j031831j88249j376330k116411p86905
5665c630911J088360J718005J607473J805747J692145L24151j456330k064882
5657A083758j387107m85254q192k43182j636288l575282l687907m92100L799338
$$ plain form
5717 5843981 7274084 9823974 11577468 11771796 11190595 10936924 10760570 9294511 6210338
5708 6210338 3023893 911478 -1232348 -5151319 -10143635 -13156284 -12119531 -8130454
5700 -8130454 -4111961 -2114978 -2056206 -2261861 -945158 2230546 5727735 7591066 7321173
5691 7321173 5869476 4005190 1627164 -1024423 -2341323 -416940 4774046 10606275
5683 10606275 13589957 12341614 8871471 6474174 6219836 6315529 5279470 4373021 5476040
5674 5476040 7577344 7631069 4855889 1868815 836984 648735 -727595 -2844006 -3630911
5665 -3630911 -2542551 -824546 782927 2588674 4280819 4604970 3148640 1083758
5657 1083758 -303349 -788603 -796795 -1039977 -2676265 -6251547 -9939454 -10431554 -6632216
5648f632216N362718L531402J273584P63318Q77830r4859j515105j705841p14736
5639A146095r2158o82746j917206k733459k258142k57505K194015L232930K265776
5630H97600P21561J1525o0202J30798J337114L447950L791155L06714m328475
5621F255740n061265j190532K486911K200471k38693j080277M1986R72491J077279
5612E464111J358312J691105R93718k47639l71871N18788N12165r22710k037632
5603F958347j701763j056547j375753k097890k063495j269722m19207K1868m17654
5594c421816j921398l077990j718681J642734L159083N21952l064904k562960
5586a0443980J948458N089196L322019o25350j896295J46091J886939P39589j807331
$$ plain form
5648 -6632216 -1269498 2261904 3535488 4298806 5176636 5081777 3566672 1860831 1146095
5639 1146095 1053937 371191 -1546015 -4279474 -6537616 -6795121 -4601106 -1368176 897600
5630 897600 1619161 1630686 1570484 1701282 3038396 6486346 10277501 10584215 6255740
5621 6255740 1194475 3943 2490854 4691325 4452632 3372355 3414341 4386832 5464111
5612 5464111 6822423 8513528 9507246 9259607 8887736 9406524 9918689 8995979 6958347
5603 6958347 5256584 4200037 2824284 726394 -1337101 -2606823 -3026030 -3004162 -3421816
5594 -3421816 -5343214 -8421204 -10139885 -8497151 -5338068 -4816116 -7881020 -10443980
5586 -10443980 -8495522 -3406326 -84307 -709657 -2605952 -2459861 -572922 166667 -1640664
5577a640664k598267p17004J770405K374242Q44318p86810o61327P69678J567169
5568I21740J031991M73526Q37992R89198k82472j638070p58797J769005K708655
5559F052768Q94398r69973o87538q9733j635769l709634k964233j37061P98982
5550b447793p74763j045755J534221L155331P92565k704222l214018j589780j028673
5541g322887j020556J001325L810225L715686R37785q63290j127022k537542m290646
5532g696922j979238L851149N913513P49026m968544l803094J776637M171160
5524a986313K219584J040414K556206L385919J701344l62618j628457l359646
5516C566433m898726l354109Q34908L104448J486559n12578P5943J280969M72577
$$ plain form
5577 -1640664 -4238931 -4955935 -3185530 -811288 33030 -753780 -1415107 -645429 921740
5568 921740 1953731 2427257 3265249 4254447 3971975 2333905 1575108 3344113 6052768
5559 6052768 6947166 5977193 5289655 5199922 3564153 -145481 -3109714 -3246775 -2447793
5550 -2447793 -3222556 -4268311 -2734090 421241 1213806 -1490416 -4704434 -6294214 -7322887
5541 -7322887 -8343443 -7342118 -3531893 183793 1121578 258288 -868734 -3406276 -7696922
5532 -7696922 -9676160 -5825011 88502 837528 -4131016 -7934110 -6157473 -1986313
5524 -1986313 233271 1273685 3829891 7215810 8917154 8554536 6926079 3566433
5516 3566433 -1332293 -4686402 -3851494 -747046 739513 226935 302878 1583847 2056424
5507B056424j093773j201479o18633p71280n60977J017634J861440Q5798j987452
5498a212298j049844J903421L408782K962194K465004J685200j007299l975803
5490E179357l365835O14920K978403Q39518k846002m062837k759206j050795M58839
5481d013638J910632K092790J04373k153146j851012Q82570L042766K522910K04497
5472B742742j611790j553879P552J439242J118549r64317k849955k478703K6796
5463d123763K382614K565111J018942K14106J707035L793793L103513r24849m482709
5454E253793l779071R5986K845236K757959J944124J820003Q85823j705597l645121
5445F473135k880174j057402q64093j855374j837850q82374p48112j301462q63452
$$ plain form
5507 2056424 962651 -238828 -857461 -1628741 -2189718 -1172084 689356 775154 -1212298
5498 -1212298 -2262142 -358721 3050061 6012255 8477259 10162459 9155160 5179357
5490 5179357 1813522 2428442 5406845 6246363 3400361 -662476 -3421682 -4472477 -4013638
5481 -4013638 -2103006 -10216 94157 -2058989 -3910001 -3027431 15335 2538245 2742742
5472 2742742 1130952 -422927 -415375 1023867 2142416 1178099 -1671856 -4150559 -4123763
5463 -4123763 -1741149 823962 1842904 2057010 3764045 7557838 10661351 9736502 5253793
5454 5253793 1474722 1570708 4415944 7173903 9118027 10938030 11823853 10118256 6473135
5445 6473135 3592961 2535559 1671466 -183908 -2021758 -2904132 -3652244 -4953706 -5817158
5436e817158L46152M98044j63017O04440K782310L373393J080701j461066j728924
5427d85125p39019m85480n41202L43123J260135M62644j602806k979147k948885
5418g715762k017289k58638K063369L260584K132007L88041N79777K154255K350073
5409B936417P29233k73236M17171R06836j32357j295334j212458p73077q03506
5400D99689r4818J895114K637305o7503l763722l977025o95071J470151J40094
5391a955786j453322K33720L435541L792993Q87681j611772j923902k346775m313403
5382e255025m950676j522660L163203L846638M53101j716915L1520K053472O33476
5373c263866k074405j896495N60914J401663L5571m84659Q06081J467813N23216
$$ plain form
5436 -5817158 -5471006 -4972962 -5135979 -4531539 -1749229 1624164 2704865 1243799 -485125
5427 -485125 -1224144 -1709624 -2250826 -1907703 -647568 -184924 -1787730 -4766877 -7715762
5418 -7715762 -9733051 -9991689 -7928320 -4667736 -2535729 -2147688 -1567911 586344 2936417
5409 2936417 3665650 3392414 3809585 4716421 4584064 3288730 2076272 1303195 499689
5400 499689 404871 2299985 4937290 4869787 1106065 -2870960 -3566031 -2095880 -1955786
5391 -1955786 -3409108 -3175388 260153 4053146 4940827 3329055 1405153 -941622 -5255025
5382 -5255025 -10205701 -11728361 -8565158 -4718520 -4265419 -5982334 -5950814 -3897342 -3263866
5373 -3263866 -5338271 -7234766 -6673852 -5272189 -5236618 -5721277 -4915196 -3447383 -2924167
5364b924167J54100J350906K018193J089328O18372J707125K164198P61320L9609
5355F978984J657300K559822j32609l519539l044384P9245R11575j197669k364706
5346A928019j397538j204563k391879j653343J469107K145969j936377n361606
5338h402211k338158M272230O691877L078708q63745p73919J095775P94727j336030
5329B219254k150207p02309R80675J185024L71091k01484k15371k32645o26367
5320F27661j045658q12683K80197J541241J819139N48544j564688k970428k510049
5311d086724l55973K131906L396310K744128R17243k81890L85182J845456J406711
5302H102349j734507m422897k794750K550558O754785O476608L181026j40048
$$ plain form
5364 -2924167 -2770067 -1419161 599032 1688360 2306732 4013857 6178055 6939375 6978984
5355 6978984 8636284 11196106 11063497 7543958 4499574 4578819 5490394 4292725 1928019
5346 1928019 530481 -674082 -3065961 -4719304 -3250197 -1104228 -3040605 -8402211
5338 -8402211 -10740369 -6468139 223738 3302446 2438701 1664782 2760557 3555284 2219254
5329 2219254 69047 -633262 347413 1532437 1903528 1702044 1486673 1254028 627661
5320 627661 -417997 -1230680 -950483 590758 2409897 2958441 1393753 -1576675 -4086724
5311 -4086724 -4442697 -2310791 1085519 3829647 4746890 4465000 4850182 6695638 8102349
5302 8102349 6367842 1944945 -849805 1700753 8455538 14932146 18113172 17973124
5294A7973124k781434n025145n630057l526368l88867J423624K225725L312044
5286G582646L286818o2181m795503n947111k170743K400592L784062K277444J10796
5277F466820j502726j715662O9846K044866J050354k427639l776524r36999K081090
5268A353426J294378j173993j022515J096420J128390j350470k621752j015604
5260b311720Q91955Q73735O4834J91693O95101P5643j748146l482042l648112
5251h397059j457259K179351M552897L629697O47112j191339m57329J471399K649562
5242C627032K132111j53003l057356m131739k139028N96446P87639r99220j005687
5233d342805J840826L896274K073774j590631k849329r17470J151243Q74448j031539
$$ plain form
5294 17973124 15191690 10166545 4536488 1010120 621253 2044877 4270602 7582646
5286 7582646 10869464 10807283 6011780 64669 -2106074 294518 4078580 6356024 6466820
5277 6466820 4964094 3248432 3318278 5363144 6413498 3985859 209335 -727664 1353426
5268 1353426 2647804 1473811 451296 1547716 2676106 1325636 -1296116 -2311720
5260 -2311720 -1419765 -546030 -481196 -289503 405598 481241 -1266905 -4748947 -8397059
5251 -8397059 -9854318 -7674967 -3122070 507627 1154739 -36600 -493929 977470 3627032
5242 3627032 5759143 5606140 2548784 -1582955 -3721983 -3125537 -2337898 -3337118 -4342805
5233 -4342805 -2501979 1394295 3468069 1877438 -971891 -1889361 -738118 136330 -895209
5224h95209k280749j630795M11591K437021L193989K274150K92761j418675j615810
5215G68274l56716N08522q37110l324211l451750O8437L644215L072520n55461
5206d63280k249967k08289J999196J238602p11145o91193O66445M76571j344190
5197a287250k066560p48949M50832M3125o23687j94407R3753j394868l417937
5188i145948l060955K46506L850800N039684L550980Q76716j274138j475394O41417
5179g50332L182647L139486K4073k952870k781009m47638R36571N68881J47718
5170A067527M39975M33493j97583n12056m84874j169032k224504j982488o53324
5161e282866n74533k151825k545002j06641K631851K545570J17687k187351l521980
$$ plain form
5224 -895209 -3175958 -4806753 -4395162 -1958141 1235848 3509998 3802759 2384084 768274
5215 768274 411558 920080 82970 -3241241 -6692991 -6624554 -2980339 92181 -463280
5206 -463280 -2713247 -2921536 -922340 316262 -394883 -1086076 -419631 56940 -1287250
5197 -1287250 -3353810 -4102759 -3651927 -3608802 -4232489 -4426896 -4333143 -5728011 -9145948
5188 -9145948 -12206903 -11960397 -8109597 -3069913 481067 1357783 83645 -1391749 -750332
5179 -750332 2432315 5571801 5595874 2643004 -138005 -585643 350928 919809 1067527
5170 1067527 1507502 1940995 1743412 1231356 746482 -422550 -2647054 -4629542 -5282866
5161 -5282866 -5857399 -8009224 -10554226 -10660867 -8029016 -5483446 -5365759 -7553110 -11075090
5152a1075090m119338l170178j40762L088295M060652K845440J254669J54484
5144g101828m53662r7915J231486K143255J873019J707740K384078K073331n72012
5135C187492l457734m000252k988378k383877j500099Q77831K651832J140447
5127f472738j833111k254754k65788O63062J58464J222627M036885M928665K589197
5118B772509M01010R05930K203488J759060J47743r98837j773856k808694l541374
5109i33021l066775j163600J750696M028264L126077q64116l510480j488895J919997
5100b01853J465091j581608j663575J220987J320786k512184m114068j88484M105788
5091b149120L534032L71963q10148l48741n90044n92393J096176K222049M14745
$$ plain form
5152 -11075090 -15194428 -18364606 -18505368 -15417073 -11356421 -8510981 -7256312 -7101828
5144 -7101828 -7555490 -7653405 -6421919 -4278664 -2405645 -697905 1686173 3759504 3187492
5135 3187492 -270242 -4270494 -7258872 -9642749 -11142848 -10265017 -7613185 -6472738
5127 -6472738 -8305849 -10560603 -10826391 -10163329 -10004865 -8782238 -4745353 183312 2772509
5118 2772509 3173519 4079449 6282937 8041997 8189740 7190903 5417047 2608353 -933021
5109 -933021 -3999796 -5163396 -3412700 615564 3741641 2877525 -632955 -2121850 -201853
5100 -201853 1263238 -318370 -1981945 -760958 559828 -1952356 -6066424 -6254908 -2149120
5091 -2149120 1384912 1756875 946727 597986 7942 -584451 511725 2733774 3148519
5082C148519k148202k233595p97853m65479o99246J49371P06428r97424l203602
5073f541083k835100m26140J164769J257947J212680J554472K114922L001730
5065E04197L091607L86934l827712m923764j800791N86705r18797k282542N19409
5056h664754L887519K413005j700287k051221J792864M465033L359427N75999
5048D077585k186487m420846l880407P49105N200847L953324j365062l929086
5040a801027j566381J390116J770143R11822J52272j093107k115158j097331R31776
5031b516875J166537P1260M24073J672565O98794j984030k581521o67251L75792
5022c340656j99299K95456J848273J222911j363410j479502J891869M098880K291306
$$ plain form
5082 3148519 1000317 -1233278 -2031131 -2496610 -3195856 -3046485 -2340057 -3337481 -6541083
5073 -6541083 -9376183 -9802323 -8637554 -7379607 -6166927 -4612455 -2497533 504197
5065 504197 3595804 3982738 155026 -4768738 -6569529 -5982824 -6901621 -9184163 -8664754
5056 -8664754 -4777235 -2364230 -4064517 -6115738 -4322874 142159 3501586 4077585
5048 4077585 1891098 -2529748 -6410155 -5661050 -460203 3493121 2128059 -1801027
5040 -1801027 -3367408 -1977292 -207149 704673 856945 -236162 -2351320 -3448651 -2516875
5031 -2516875 -1350338 -1279078 -855005 817560 1516354 -467676 -3049197 -3716448 -3340656
5022 -3340656 -3539955 -3244499 -1396226 -173315 -1536725 -3016227 -1124358 2974522 5265828
5013E265828o40338j867298k687069m088943l651658k07553K821809K067391j208714
5004d196545l657033l797149j686567J928683M595865L746343N76640j018295
4996c508058J9668J242465J607130K324938K647289L01442l239514l771608j540286
4987c916534j133796l058876k482104J596902L465640L28653k468729k89866L299477
4978d659233L032402J91875j161567j309171k540675l700071k552934m43734K23184
4969a2919924K52737J234681J980169J374751J465341L602851M809968K258853
4961D059427j639110k776297j223379K69385Q53743J011198K30005j245404j216113
4952a676545O75596J127130j624168m258446l433846p91790O16352J122850J879117
$$ plain form
5013 5265828 4625490 2758192 71123 -4017820 -7669478 -7877031 -5055222 -2987831 -4196545
5004 -4196545 -7853578 -11650727 -13337294 -11408611 -6812746 -3066403 -2489763 -3508058
4996 -3508058 -3488390 -2245925 -638795 1686143 4333432 4634874 1395360 -2376248 -3916534
4987 -3916534 -5050330 -8109206 -10591310 -8994408 -5528768 -5200115 -7668844 -7958710 -4659233
4978 -4659233 -1626831 -1434956 -2596523 -3905694 -6446369 -10146440 -12699374 -13143108 -12919924
4969 -12919924 -12667187 -11432506 -9452337 -8077586 -6612245 -3009394 1800574 4059427
4961 4059427 2420317 -355980 -1579359 -1309974 -456231 554967 784972 -460432 -1676545
4952 -1676545 -1000949 126181 -1497987 -5756433 -9190279 -9982069 -9365717 -8242867 -6363750
4943f363750J381514j205247k830857j039947J572232J591149K30006K96850R00822
4934e467228l55599k616822l430127k811999k026114p11971J542662L211019L084418
4925i581761J976965M74783j648160k755484p70850J803077K56066l782104l468041
4916a7495509J755796M289547R20006k054098l36347J508751k2597o66584J944455
4907a0156580K043021l261417o599545k362926L376149L551137J016878M0192
4899a2353091k480131p591081p538952M19790N207454p34352p436378m265617
4891c6772358K094342J702188l15040L134539M024122m747652j0866113k970435
4883d4716407N478800j322336j1021927n631910K070604q123992k0451496r537711
$$ plain form
4943 -6363750 -4982236 -6187483 -9018340 -10058287 -8486055 -6894906 -6664900 -6368050 -5467228
4934 -5467228 -5822827 -8439649 -11869776 -14681775 -16707889 -17419860 -15877198 -12666179 -9581761
4925 -9581761 -7604796 -7130013 -8778173 -11533657 -12304507 -10501430 -10245364 -14027468 -17495509
4916 -17495509 -15739713 -11450166 -10530160 -12584258 -12920605 -11411854 -11434451 -12101035 -10156580
4907 -10156580 -8113559 -11374976 -17974521 -20337447 -16961298 -13410161 -12393283 -12353091
4899 -12353091 -14833222 -22424303 -29963255 -29543465 -24336011 -25070363 -32506741 -36772358
4891 -36772358 -34678016 -32975828 -33290868 -30156329 -26132207 -30879859 -41745972 -44716407
4883 -44716407 -39237607 -40559943 -51581870 -57213780 -55143176 -63267168 -83718664 -93256375
4875i3256375L816674j6669043m0359758O939436J17442029J75862747J06000051
4868B59775761j9038731p3951354m1555046n178041j2444067k8240451j8385540
4861F0982531k637440n300814j2201539m788753N005313J272438o035391k516708
4853C3779637M241165J830880l671361j618873K921263Q49684l404263k124779
4845C2803353N87783j605601m259165j846414N62312k329374m611571j40830N026260
4836B4186753L039080j992402k149687O75236L84199j691433j363154q22127l281138
4827A6985327m989328k081106J122719k05181k125719L95908L326994R43810k916182
4818A0457242j408016K834210K374799k038771l525888j006847O16288q9631k65159
$$ plain form
4875 -93256375 -89439701 -106108744 -146468502 -139529066 -22087037 153775710 259775761
4868 259775761 240737030 166785676 125230630 120052589 107608522 79368071 60982531
4861 60982531 58345091 53044277 40842738 36053985 41059298 42331736 36296345 33779637
4853 33779637 38020802 39851682 36180321 34561448 37482711 38332395 34928132 32803353
4845 32803353 33391136 31785535 27526370 25679956 26242268 23912894 19301323 19160493 24186753
4836 24186753 27225833 25233431 23083744 23758980 24143179 22451746 21088592 20266465 16985327
4827 16985327 11995999 9914893 11037612 10832431 8706712 9102620 12429614 13373424 10457242
4818 10457242 9049226 11883436 14258235 12219464 8693576 7686729 8303017 8213386 7948227
4809G948227M85457L07931J43316J647789K519443L90856j754148n95077R22313
4800A2016107r02513k676207K47896M097564K159842l088642l288511K046532
4792A0612068N078068K534965n71045p86607p39742k184534k618190j127803o86470
4783I510710k259161k634943l27760J739712J436471M37098K91947j0788r83790
4774G199496j251286n11825j50410j49304Q21485J916192R03954j241220j065493
4765F471589J447403K346698J47746j757333o67332J540133J938193N87181p29992
4756A1324286j148413q14389m91083j480179l720964m418630j482630K413466
4748A81464K885588L27580r62704J45116L75009j567951k500551k72028K716769
$$ plain form
4809 7948227 8433684 8741615 8884931 10532720 13052163 13443019 11688871 11093794 12016107
4800 12016107 11113594 8437387 8685283 12782847 14942689 11854047 8565536 10612068
4792 10612068 15690136 18225101 17654056 16867449 16127707 13943173 11324983 10197180 9510710
4783 9510710 7251549 4616606 4288846 6028558 7465029 7902127 8194074 8183286 7199496
4774 7199496 5948210 5436385 5285975 5136671 5958156 7874348 8778302 7537082 6471589
4765 6471589 7918992 10265690 10413436 8656103 7988771 9528904 11467097 12054278 11324286
4756 11324286 10175873 9361484 8870401 7390222 3669258 -749372 -2232002 181464
4748 181464 3067052 3394632 2431928 2577044 2952053 1384102 -1116449 -1388477 1328292
4739A328292L570315K727458J773628Q29887K3421M34121J772538J977638O13330
4730A5050628k92625j14303j016490l848739o002393n379257l401931j937925
4722f943035k46543K570577M831973M726093L309170K459236J766142K2903j886550
4713A0609966k247390j429792j068946j209503n54264R24594J609568M42743j788820
4704E288156l382210l256491j747404j18838J016207K358978M120621M450168
4696H729187J651434k469313m010721j981898N59517Q99095k26808o41694M96675
4687C005474K761058N037608N301149K272080j795865k611052O04521L542116
4679A8117089K231108k246153n866506o195249l369264J030364M341298M194716
$$ plain form
4739 1328292 4898607 7626065 9399693 10229580 10253001 10687122 12459660 14437298 15050628
4730 15050628 14758003 14643700 13627210 9778471 3776078 -1603179 -5005110 -6943035
4722 -6943035 -7189578 -4619001 212972 4939065 8248235 10707471 12473613 12496516 10609966
4713 10609966 8362576 6932784 5863838 4654335 4100071 5024665 6634233 7076976 5288156
4704 5288156 1905946 -1350545 -3097949 -3216787 -2200580 158398 4279019 8729187
4696 8729187 10380621 7911308 3900587 1918689 2478206 3377301 3150493 2508799 3005474
4687 3005474 5766532 10804140 16105289 18377369 16581504 13970452 14574973 18117089
4679 18117089 20348197 18102044 12235538 6040289 2671025 3701389 8042687 12237403
4671A2237403J246669j298436j973906k366218l102374k041770J388447L645689
4663G735504K007022j030313j873948j479305k555101l606464j135727L358268
4655A419936M263114J14254m127359m321232k119334p20750K39109K507999M822646
4646B078383M339017J290837q96693j24766J949073K460719Q53642r83964j469889
4637I496359j243623j906148l340108l477306j207085J692847K728770J893863
4629D637569J079735Q92236J59530j335580j930971q17337K24021o35796k248812
4620B4595j856490R82455L582609L474066J190261r24568j730938k085588k899822
4611b43420l479115k349072O01885L366436L455836L75432l490528m731240k152726
$$ plain form
4671 12237403 13484072 12185636 10211730 7845512 4743138 2701368 4089815 7735504
4663 7735504 9742526 8712213 6838265 5358960 2803859 -802605 -1938332 1419936
4655 1419936 5683050 5797304 1669945 -2651287 -4770621 -5491371 -5252262 -2744263 2078383
4646 2078383 6417400 7708237 6811544 6686778 8635851 11096570 11950212 10966248 9496359
4637 9496359 8252736 6346588 3006480 -470826 -1677911 14936 2743706 4637569
4629 4637569 5717304 6609540 6769070 5433490 3502519 2685182 2909203 2273407 24595
4620 24595 -1831895 -849440 2733169 6207235 7397496 6472928 4741990 2656402 -243420
4611 -243420 -3722535 -6071607 -5469722 -2103286 1352550 1727982 -1762546 -6493786 -8646512
4602h646512J795660L414738J729525o60742j008466L62784J155208M71573l65996
4593a752228l2894J200507K174942K064697Q51947n39233q09390O2851K71364
4584C492563j356964k971615j724712K021763M726330M160425J696846l63418
4576I681218j454271j863678j450613o02384o44613j852973k525683j301397R61847
4567a052547K659264L283660K850680J257595o66756j318762o75803m63313q54682
4558E019336L15152L280192M304981P49243m344062o084161m161986j879977n76348
4549c377630Q02115J770222O27336j445846j099647J786863L468730K003092k58586
4540D276649j006047j035714j374932r61858O14592J238789l00493j698884p49349
$$ plain form
4602 -8646512 -6850852 -3436114 -1706589 -2367331 -3375797 -3013013 -1857805 -1386232 -1752228
4593 -1752228 -1785122 -584615 1590327 3655024 4506971 3967738 3158348 3221199 3492563
4584 3492563 2135599 -836016 -2560728 -538965 4187365 8347790 10044636 9681218
4576 9681218 8226947 6363269 4912656 4310272 3665659 1812686 -712997 -2014394 -1052547
4567 -1052547 1606717 4890377 7741057 8998652 8331896 7013134 6337331 5874018 5019336
4558 5019336 5334488 8614680 12919661 13668904 9324842 3240681 -921305 -2801282 -3377630
4549 -3377630 -2575515 -805293 -177957 -1623803 -2723450 -936587 2532143 4535235 4276649
4540 4276649 3270602 2234888 859956 -101902 512690 1751479 1450986 -247898 -997247
4531i97247P50951j45947k513293k806482k40014K440704L365858L535444L864614
4522G254588L121832L05303k860625l703836k038194j43044M64052O46729J584933
4513D631738K488426J681565p03632k782782l610135l931426l778011j602916
4505g607173K635418N590785M240531K34794k190191j827104j011527r52964j16474
4496a003905K117539L592760K720515R99591L64823J30975j436815l956718n160242
4487a631477l548197J66387L492992L847780J256143o89752J194572M725078M487238
4478A3300764m01304m457705l521368l87359J21118j817263k779192k109074j643308
4469c694691j192013R39911L650554L775159J112053j298014k071803k737256
$$ plain form
4531 -997247 -246296 -392243 -2905536 -5712018 -5952032 -3511328 -145470 3389974 7254588
4522 7254588 10376420 10681723 7821098 4117262 2079068 1936024 2400076 3046805 4631738
4513 4631738 7120164 8801729 8098097 5315315 1705180 -2226246 -6004257 -7607173
4505 -7607173 -4971755 619030 4859561 5094355 2904164 1077060 65533 -887431 -1003905
4496 -1003905 1113634 4706394 7426909 8426500 8791323 8922298 7485483 3528765 -1631477
4487 -1631477 -5179674 -5013287 -1520295 2327485 3583628 2893876 4088448 8813526 13300764
4478 13300764 12899460 8441755 4920387 4533028 4654146 2836883 57691 -2051383 -3694691
4469 -3694691 -4886704 -3946793 -296239 3478920 4590973 3292959 1221156 -1516100
4461a516100l700022l050795n11924J206009O57532L0748J361357L195648L165668
4452H38121J606718M48602L20170P61345J716787K812384K461228k82992l809215
4443F873148n537242m759687k653952l71608J492199K290777J677867L21438o46941
4434a314001o12859M30784J877071K188060L975l459451m500474r34634M758942
4425a562587P686968N538355L72349l954045n035717l107144k71410J316143J109033
4416B091945J67389l68057k24692M63537J495816K245930K044290J235401Q11138
4407I962697Q79857Q33920J008434K202665L253867J619644k525415n301300l989281
4398G945088o79131J005873P03293K73194j40056j760421l928192m487519l145525
$$ plain form
4461 -1516100 -5216122 -8266917 -8778841 -7572832 -6915300 -6884552 -5523195 -2327547 838121
4452 838121 2444839 2893441 3213611 3974956 5691743 8504127 10965355 10682363 6873148
4443 6873148 1335906 -3423781 -6077733 -6449341 -4957142 -2666365 -988498 -667060 -1314001
4434 -1314001 -1926860 -1496076 380995 2569055 2573030 -886421 -5386895 -6321529 -1562587
4425 -1562587 6124381 11662736 12035085 8081040 3045323 -61821 -333231 982912 2091945
4416 2091945 2259334 1891277 1666585 2130122 3625938 5871868 7916158 9151559 9962697
4407 9962697 10842554 11676474 12684908 14887573 18141440 19761084 17235669 11934369 7945088
4398 7945088 7265957 8271830 8975123 9248317 9108261 7347840 3419648 -1067871 -4213396
4389d213396j599729m88844R90910K452026K239859M77748m92875N14539K070513
4380A950751K789890L084515L289261K391968M6818k109304k714999k644258l154395
4371B930247l538977k373238Q810K056936L227755L920677L775372J965013p98955
4362A1173640k336067j708564o33372j259676l209108l915286j922094J089985
4354b720542K185976O13254j512456j889490m15678J377628K219194J770354L54678
4345A982918j056584j309939m40558J29792l34836n61457P42874K522156K614919
4336D289285P31142j458789k659395k691284j523620M66751J731924J135427q8270
4327f6829j13178L57411n07694j693700m33037K460138K589932j146944l845246
$$ plain form
4389 -4213396 -5813125 -6301969 -5311059 -2859033 -619174 -141426 -634301 -119762 1950751
4380 1950751 4740641 7825156 11114417 13506385 13553203 11443899 8728900 6084642 2930247
4371 2930247 -608730 -2981968 -2973158 -916222 2311533 6232210 10007582 11972595 11173640
4362 11173640 8837573 7129009 6495637 5235961 2026853 -1888433 -3810527 -2720542
4354 -2720542 -534566 78688 -1433768 -3323258 -3738936 -2361308 -142114 1628240 1982918
4345 1982918 926334 -383605 -824163 -694371 -1029207 -1590664 -847790 1674366 4289285
4336 4289285 5020427 3561638 902243 -1789041 -3312661 -2845910 -1113986 21441 -66829
4327 -66829 -180007 177404 -330290 -2023990 -2457027 3111 2593043 1446099 -2399147
4318b399147j540440K679750L328366O80022l56375J687340K895447O89891j949079
4309E715775j157887J943393K964407L70617k949306l978405k876642j291595
4301a259643L64615K081829K215572p33427m381120l909914J217846N121063K913543
4292C630364k274948l654632m40970J917721Q63218K64050L094862N965195M469033
4283A3833893K0905k811538l052700l102538l614625k948976r38860O64078J245160
4274g05201J568149J325606k84067j798201q24133J666617J981541n52141k072860
4265C05310l5330K674052K044505r96738k078743Q4136K029130Q92945j362733
4256C556534q83422K384384M324490K056194k350506m650378l456748r03645P26414
$$ plain form
4318 -2399147 -3939587 -1259837 2068529 2748551 2392176 4079516 6974963 7664854 5715775
4309 5715775 4557888 6501281 9465688 9836305 6886999 2908594 31952 -1259643
4301 -1259643 -895028 1186801 3402373 2668946 -1712174 -5622088 -4404242 716821 3630364
4292 3630364 1355416 -2299216 -2740186 -822465 40753 304803 3399665 9364860 13833893
4283 13833893 13854798 11043260 7990560 4888022 1273397 -1675579 -2614439 -1950361 -705201
4274 -705201 862948 2188554 1904487 106286 -717847 948770 2930311 2378170 305310
4265 305310 269980 2944032 4988537 3991799 1913056 1997192 4026322 4919267 3556534
4256 3556534 2673112 5057496 9381986 11438180 9087674 4437296 980548 76903 803317
4247H03317R80554K31358j053352j768274q97691P37110J263575O52917P92169
4238A741683K167752K801344J439009m61996j194721j193063j573295k140636
4230A586077k252949k049414j644799o81578M86685R72219J223545K425268L650866
4221C715920K585480k96992j758042q95973l16926j101600j187231l53183j442086
4212a050633m089378l195146K492625O276383L168741j955996k126925R40327
4204D59998J221809p72498l7529K891469K802569o12200k433258j307605p27116
4195A485639j619509j212940N19753O26882k77907J448807M850832M673615L04069
4186A0799241k767974j710712K99137P37150Q95728J069326n82967k904615k128817
$$ plain form
4247 803317 1783871 2015229 961877 -806397 -1704088 -966978 296597 949514 1741683
4238 1741683 3909435 6710779 8149788 7687792 6493071 5300008 3726713 1586077
4230 1586077 -666872 -2716286 -4361085 -5042663 -4555978 -3583759 -2360214 65054 3715920
4221 3715920 6301400 6004408 4246366 3350393 3033467 1931867 744636 391453 -1050633
4212 -1050633 -5140011 -8335157 -5842532 433851 3602592 1646596 -480329 459998
4204 459998 1681807 909309 871780 3763249 6565818 5953618 3520360 2212755 1485639
4195 1485639 -133870 -1346810 -827057 -200175 -478082 970725 5821557 10495172 10799241
4186 10799241 8031267 6320555 6619692 7356842 8252570 9321896 8738929 5834314 3705497
4177C705497J286295K784772J534474J129107J944690O61731j820064o58594L344218
4168A3912126L496062j411057m625577k716027o1029M43451J495150L428877K220542
4159A6182518j498416j812743J161707O03207l458316k704709L686901O040159
4151A8200308J718013J49034M387657M749910j559274l203416L417763N760576
4143C3620571L65506K759265J6465154J9922680P617207J3012200N3237593P8221449
4135B25221625K8161423o9497131j19205745p9622649j1760193J2709556j103984
4128a5097098o835073M780776Q366196j479863m978917K759172N525855j648795
4120h607747n336976k61812L101561J89627o89362L484901M704175K60979k050820
$$ plain form
4177 3705497 4991792 7776564 9311038 10440145 12384835 13046566 11226502 10567908 13912126
4168 13912126 17408188 15997131 11371554 8655527 8594498 9037949 10533099 13961976 16182518
4159 16182518 14684102 12871359 14033066 14636273 11177957 8473248 12160149 18200308
4151 18200308 19918321 20067355 24455012 29204922 27645648 24442232 27859995 33620571
4143 33620571 33986077 36745342 53210496 73133176 80750383 93762583 147000176 225221625
4135 225221625 253383048 183885917 64680172 -14942477 -26702670 -13993114 -15097098
4128 -15097098 -21932171 -17151395 -8785199 -10265062 -15243979 -12484807 -6958952 -8607747
4120 -8607747 -13944723 -14206535 -11104974 -10915347 -11604709 -8119808 -3415633 -3154654 -5205474
4111e205474J055671L102913J123554L53748K239757R29294m420816o160883j346519
4102h328755K719622P31903k818035k628045l76846Q28884J655347K215216J53779
4093e846930l351482l090359J292141L331317J60999k597580l76253L195267L403999
4084c878881K019317K328887K315760j233574n928414o769017l297287P92652
4076a3650557L041768L504761K572298P63081o39241r09032n38682L58721K088712
4067c408171L224931J556819j841658k965759o52152J553982R33936o31736n01201
4058b731009N77755O94559K01355J98127r074j257804k231155j354204L69214
4049e542236O34311r27900k452398k141186J60965K982983M237845L037821P47267
$$ plain form
4111 -5205474 -4149803 -1046890 76664 430412 2670169 3599463 -821353 -6982236 -8328755
4102 -8328755 -5609133 -4877230 -7695265 -10323310 -10700156 -9871272 -8215925 -6000709 -5846930
4093 -5846930 -9198412 -12288771 -10996630 -7665313 -7504314 -10101894 -10478147 -7282880 -3878881
4084 -3878881 -1859564 469323 2785083 1551509 -4376905 -11145922 -14443209 -13650557
4076 -13650557 -10608789 -7104028 -4531730 -3768649 -4407890 -5316922 -5855604 -5496883 -3408171
4067 -3408171 -183240 1373579 -468079 -3433838 -4085990 -2532008 -1598072 -2229808 -2731009
4058 -2731009 -2153254 -1458695 -1257340 -1059213 -1068287 -2326091 -4557246 -5911450 -5542236
4049 -5542236 -4907925 -5835825 -8288223 -10429409 -10268444 -7285461 -3047616 -9795 737472
4040G37472o24215p92827p59641o40949K30344J441105J750137J093500N95298
4031C030224P86315J274583J572997R15786j462830m269109m312797r76298J747852
4022a693277O16462j933286j916370k98906n66125j894066n40061K974260M156334
4013a095035J995123K36622O49815P77674m56909m84896J760878L401122K392659
4004I177053M76808n08949j253439k193347j951757k19853J230396J569086J584938
3995G910936R44425j225595k894085j086748K352736K368210j226293l145837
3987C997749j244143O41821J81222P8521J517048J050750k329074l754149n74182
3978d34437K405479Q76270j693173n31068K008698J011139k306249l208726j503053
$$ plain form
4040 737472 113257 -679570 -1439211 -2080160 -1849816 -408711 1341426 2434926 3030224
4031 3030224 3816539 5091122 6664119 7579905 6117075 1847966 -2464831 -3441129 -1693277
4022 -1693277 -1076815 -3010101 -4926471 -5225377 -5791502 -7685568 -8225629 -5251369 -1095035
4013 -1095035 900088 1136710 1786525 2564199 2107290 1622394 3383272 6784394 9177053
4004 9177053 9653861 9144912 7891473 5698126 3746369 3526516 4756912 6325998 7910936
3995 7910936 8855361 7629766 4735681 3648933 6001669 8369879 7143586 3997749
3987 3997749 2753606 3395427 3576649 3655170 5172218 6222968 3893894 139745 -434437
3978 -434437 1971042 2847312 1154139 623071 2631769 3642908 1336659 -1872067 -3375120
3969c375120n22832o55356K1727Q60329J70929m40204J165563K654585O85148
3960E64769k566132k308523R25461K288729N81656p55098j18939N28489L57238
3951e02350P15689J314520L91805j119637m94849J480761J104937j795383l034117
3942a938624q04985J479907P77463j268444j607992q5483J509384K158670J791780
3933B011676P27009m3245K59992O61340l54093k158033k713888j773979q42526
3924d225747j85843J255104K921391K663835L08572j556575j274297l38023r22926
3915a354509k882443m096206k876588J95369K325245J184899j773306k372464
3907a1650003O13344L161211J661069j559143j724242J247171L080058J638922
$$ plain form
3969 -3375120 -3897952 -4553308 -4531581 -3671252 -3500323 -3940527 -2774964 -120379 564769
3960 564769 -2001363 -4309886 -3384425 -1095696 -514040 -1269138 -1388077 -859588 -502350
3951 -502350 213339 1527859 1919664 800027 305178 1785939 2890876 1095493 -1938624
3942 -1938624 -2743609 -1263702 -486239 -1754683 -3362675 -3448158 -1938774 219896 2011676
3933 2011676 2738685 2695440 2955432 3616772 3262679 1104646 -1609242 -3383221 -4225747
3924 -4225747 -4411590 -3156486 -235095 2428740 2737312 1180737 -93560 -431583 -1354509
3915 -1354509 -4236952 -8333158 -11209746 -11014377 -8689132 -7504233 -9277539 -11650003
3907 -11650003 -11036659 -7875448 -6214379 -7773522 -9497764 -8250593 -5170535 -3531613
3899c531613q46396j712662n38483J907859M270700M491169K036335l24489J26591
3890E879011J885412J622819m40813j352872o37355m97495j377803j577925j031176
3881B471803j306653k045843j536911n31664j133057k241983q87068K102969K941645
3872b166762J485618J370811K984978K393530j234935l218528p85590K645637
3864C474759L396785K520577J826604R9600l002818m014685r16709K602147K482281
3855H468541M88328O76782K637153K827211M55334k227650l781413l957701k007925
3846C578660J637007L585560J168662l230095m920176k925085j61420J168594
3838i8293J121538J0010j814384k766709j540598O65892J849303K196870K882450
$$ plain form
3899 -3531613 -4378009 -6090671 -6629154 -4721295 -450595 4040574 6076909 5752420 5879011
3890 5879011 7764423 9387242 8946429 7593557 6956202 6458707 5080904 3502979 2471803
3881 2471803 1165150 -880693 -2417604 -2949268 -4082325 -6324308 -7211376 -5108407 -2166762
3872 -2166762 -681144 689667 3674645 6068175 4833240 1614712 829122 3474759
3864 3474759 6871544 9392121 11218725 11318325 8315507 4300822 3384113 5986260 8468541
3855 8468541 8956869 9633651 12270804 15098015 15553349 13325699 9544286 5586585 3578660
3846 3578660 5215667 8801227 9969889 6739794 1819618 -1105467 -1266887 -98293
3838 -98293 1023245 1033255 -781129 -3547838 -5088436 -4422544 -2573241 -376371 2506079
3829B506079L109422J395180j097863j743117m86690L80714J18868j3357r5430
3820D073806j803220m638410n266326k218738J375931J868920Q6845k00067K015311
3811d705948L457838J372216k243765l073912l20659K263338J601745q57475k037501
3802d544123j759200j773808j890293n09055J623984J874466R4559r96405l53489
3793h233364K7032q23397j077893J72242R97436K66455j19982J272389K770745
3784d748337K651503J878480J572784P85414q10873j131906P08448K077700J067731
3775D050944m4070J092950K410076R61122j727234k181852p57545m24766j344719
3766B034906j085752P52767K228791K609310K566075J756909j76561j283030K41325
$$ plain form
3829 2506079 5615501 7010681 5912818 4169701 3683011 4063725 4182593 4169236 4073806
3820 4073806 2270586 -2367824 -7634150 -9852888 -8476957 -6608037 -6521192 -6721259 -4705948
3811 -4705948 -1248110 124106 -2119659 -5193571 -5514230 -3250892 -1649147 -2506622 -4544123
3802 -4544123 -6303323 -8077131 -9967424 -10476479 -8852495 -6978029 -6883470 -7879875 -8233364
3793 -8233364 -8206332 -9029729 -10107622 -9935380 -8937944 -8671489 -8791471 -7519082 -4748337
3784 -4748337 -2096834 -218354 1354430 2139844 1328971 197065 905513 2983213 4050944
3775 4050944 4006874 5099824 7509900 8471022 6743788 4561936 3804391 3379625 2034906
3766 2034906 949154 1701921 3930712 6540022 9106097 10863006 10686445 9403415 9644740
3757I644740K318437J623275j067137k270089j556794j398135j913173o91322
3749D689802K056190L005859J147305o29434l49550N81048P32058P26761Q30050
3740A2790089q0959j936557k904246k321189j379606m98636Q30398J415285o77303
3731E237276m074142m991888k906818j163391j028484J45760L145336M209168
3723a427183J024745k758839k558093P28439K808463K065552K81138p99325p19689
3714a354792L11525R73144n43815l451689m005073m35105L944320M998453K989630
3705C426598R24262j29384r83128j380033m84084P56453P88721K05451O30624
3696C755480J731960J975750J447243J217569Q18395p29977k126320j204821J190837
$$ plain form
3757 9644740 11963177 13586452 12519315 10249226 8692432 7294297 5381124 4689802
3749 4689802 6745992 9751851 10899156 10269722 9920172 10501220 11233278 11960039 12790089
3740 12790089 12709130 10772573 7868327 5547138 4167532 3668896 4499294 5914579 5237276
3731 5237276 1163134 -3828754 -6735572 -7898963 -8927447 -8781687 -5636351 -1427183
3723 -1427183 -402438 -3161277 -5719370 -4990931 -2182468 -116916 164222 -635103 -1354792
3714 -1354792 -1043267 -70123 -613938 -4065627 -8070700 -8505805 -4561485 436968 3426598
3705 3426598 4350860 4221476 3238348 1858315 1374231 2130684 2919405 3124856 3755480
3696 3755480 5487440 7463190 8910433 10128002 10946397 10216420 8090100 6885279 8076116
3687H076116J933999K26058j659638k496602l625599n440693n604979k607032
3679a1198370J323131K971806K186774J167139R29945N89485m10301j301721j311939
3670e054051n73331N03918J661289K296639J573013l42199j852465j563981J5850
3661c335318J268582J749235K501537L773363L754985Q28095l573507n823240
3653A143732l952400L07884L436589L334477P70153j448150q57493K055187L734642
3644H524621J278368l733363o585180m829480p61267J958137K325512J607262
3636b15390O81862l96164j111470p37433K24752L84729n19774j114128l37947
3627c140963R70333J127443j76395j476728j418674l75612K94377J05433l28086
$$ plain form
3687 8076116 10010115 10236173 8576535 6079933 2454334 -2986359 -8591338 -11198370
3679 -11198370 -9875239 -6903433 -4716659 -3549520 -2619575 -2030090 -2440391 -3742112 -5054051
3670 -5054051 -5627382 -5123464 -3462175 -1165536 407477 65278 -1787187 -3351168 -3335318
3661 -3335318 -2066736 -317501 2184036 5957399 9712384 10540479 6966972 1143732
3653 1143732 -2808668 -2500784 935805 4270282 5040435 3592285 2734792 4789979 8524621
3644 8524621 9802989 6069626 -515554 -5345034 -6106301 -4148164 -1822652 -215390
3636 -215390 466472 70308 -1041162 -1778595 -1553843 -1169114 -1688888 -2803016 -3140963
3627 -3140963 -2170630 -1043187 -1219582 -2696310 -4114984 -4490596 -4196219 -4090786 -4418872
3618d418872o84452j281451j808951j180714O28012K011801J979321J470815J233055
3609b051436K49117j771300k264045Q45780M909413N203699J480797j682478j364526
3600C555021L98736O92694k52049p18193m92548l67225n44949r24984j381129
3591c4626j028468Q33745K622191J845692r02892k361491j731925j747534l313903
3582e819211l307915j47262K598206J627801o89676m87280J143604P12159j028526
3573e398100m46670K212099K993397R84922l94672M90893J063384l24282j259755
3564g8784M48706K835418K667539j47795l227520m830586m438414k028020J299039
3555g500417L305588K930271J585047R22401N99674l71015j375832j098713J08666
$$ plain form
3618 -4418872 -5103324 -6384775 -8193726 -9374440 -8746428 -6734627 -4755306 -3284491 -2051436
3609 -2051436 -1802319 -3573619 -5837664 -4991884 -82471 5121228 6602025 4919547 3555021
3600 3555021 3953757 4646451 4394402 3676209 3183661 2816436 2271487 1346503 -34626
3591 -34626 -1063094 -229349 2392842 4238534 3335642 974151 -757774 -2505308 -5819211
3582 -5819211 -9127126 -9274388 -6676182 -5048381 -5738057 -6225337 -5081733 -4369574 -5398100
3573 -5398100 -5844770 -3632671 -639274 345648 -49024 441869 1505253 1180971 -78784
3564 -78784 369922 3205340 5872879 5725084 2497564 -2333022 -6771436 -8799456 -7500417
3555 -7500417 -4194829 -1264558 320489 1242890 1842564 1471549 95717 -1002996 -894330
3546h94330N64885k18603q75531l13008O08898J95753j703633l161995k294704
3537h092268M97611L048631L961575L548406K213160l44968l374409m361068k021515
3528d924845J196748J877797J52805r89621m27153m3410q93472j237862L70592
3519d918421K456627K775999J420159J10174l71735m81255n76939p44215j279416
3510a609022k080783k162249r89972K70919J84540o60089k67536J827211L722948
3501a764033L767130K699420K145614J948342O86955j327989j685877M51837K121106
3492I042505J43502m006244n652668l251769l39182k29212j683768j728041k11012
3483g915889J100636K017166L314819L841980J732141j782283l062856r50460
$$ plain form
3546 -894330 -329445 -548048 -1423579 -1736587 -1127689 -931936 -2635569 -5797564 -8092268
3537 -8092268 -7594657 -4546026 -584451 2963955 5177115 4832147 1457738 -2903330 -4924845
3528 -4924845 -3728097 -1850300 -1697495 -2687116 -3114269 -3157679 -4051151 -5289013 -4918421
3519 -4918421 -2461794 314205 1734364 1844538 1472803 991548 414609 -329606 -1609022
3510 -1609022 -3689805 -5852054 -6842026 -6571107 -6386567 -7046656 -7314192 -5486981 -1764033
3501 -1764033 2003097 4702517 6848131 8796473 9483428 8155439 6469562 6921399 9042505
3492 9042505 9186007 5179763 -472905 -3724674 -4063856 -4293068 -5976836 -7704877 -7915889
3483 -7915889 -6815253 -4798087 -1483268 2358712 4090853 2308570 -754286 -1704746
3475a704746J823979K621665J708906M69608o27499j261606o66610R96172K307354
3466E667223K436598J792861N36734j514322l181025k692915q93955q44325l021177
3457a714303l976082j655905J070542J002015j06453J308622M094345L654312
3449C677093o22705l810334k437503Q04932J439810n75591j726452l69347J598764
3440b021333K070951J275948N53411L37256K44246J52000K41047M10075L93178
3431C656779K55005J95389M1837m52195r09947o45218K67360R81016J111917J147883
3421E649826J265097O87413j044307k934045l560386k701826j136715N17834J809511
3412a447598K018783J014071N1641L44387J172566Q49677p26621k106187k700869
$$ plain form
3475 -1704746 119233 2740898 4449804 4919412 4291913 3030307 2363697 3359869 5667223
3466 5667223 8103821 9896682 10433416 8919094 5738069 3045154 2151199 1306874 -1714303
3457 -1714303 -5690385 -7346290 -6275748 -5273733 -5380186 -4071564 22781 3677093
3449 3677093 3054388 -755946 -3193449 -2388517 -948707 -1524298 -3250750 -3620097 -2021333
3440 -2021333 49618 1325566 1878977 2216233 2460479 2612479 2853526 3263601 3656779
3431 3656779 3911784 4107173 4149010 3696815 2786868 2141650 2409010 3390026 4501943 5649826
3421 5649826 6914923 7602336 6558029 3623984 63598 -2638228 -3774943 -3257109 -1447598
3412 -1447598 571185 1585256 1636897 1981284 3153850 4003527 3276906 1170719 -1530150
3403a530150l275229l804399k869637m6504K748256L429107K093521J84668j602785
3394d673152l322151m355371l365980J19176M550254O992340N368972P55782k890935
3385h21065k464457Q06348K827040J639965o73969j542176j367589k017755l316878
3376f930536l159637p87952J908703K791366J924229R36293P09844O48324Q0980
3367a878386n90948o61678l38034k43907r8506P90232J753758J186230p62701
3358h43940j795355p88741M59481L48426K28120J685427K984624J465179j654114
3349B089107k539429n13356J094346K10878j359972j429008l31936Q01367J826923
3340a51080K420193J745788L73812q1916o3862j684020m210203l712973Q24453
$$ plain form
3403 -1530150 -4805379 -8609778 -11479415 -11525919 -8777663 -5348556 -3255035 -3070367 -4673152
3394 -4673152 -7995303 -12350674 -15716654 -15597478 -11047224 -4054884 1314088 2069870 -821065
3385 -821065 -3285522 -2479174 347866 1987831 1313862 -228314 -1595903 -3613658 -6930536
3376 -6930536 -10090173 -10878125 -8969422 -6178056 -4253827 -3317534 -2607690 -1959366 -1878386
3367 -1878386 -2469334 -3131012 -3469046 -3712953 -3811459 -3021227 -1267469 -81239 -843940
3358 -843940 -2639295 -3428036 -2968555 -2620129 -2392009 -706582 2278042 3743221 2089107
3349 2089107 -450322 -963678 130668 341546 -1018426 -2447434 -2779370 -1978003 -151080
3340 -151080 2269113 4014901 4388713 4306797 4242935 2558915 -1651288 -5364261 -4539808
3331d539808M778134M030980N35193j459379j608516k010340k175378j62877K700236
3322H8245L013445Q75152q4451J420369K400697O06816j876232j781678Q03039
3313E465402K803441J942956j012807l306361l008450r53699M21711K38710l3533
3304B557370N75007Q32363j96377j033362l33116L54903q31740k293619j182455
3295a551026J552709K089854m27953k672993k263913o42183K00553O27827J388873
3286a698252J502605J92409j047448m88450R84536J048415p25615k421072k430146
3277e083018j189509o8897N15575J204106K128917K159371N10051j467936j681091
3268b972431n16818n76345k411522k981911j72029L416438L870069J507502q2786
$$ plain form
3331 -4539808 238326 4269306 4804499 3345120 1736604 -273736 -2449114 -2611991 88245
3322 88245 3101690 3976842 3892391 5312760 7713457 8320273 6444041 4662363 5465402
3313 5465402 8268843 10211799 9198992 5892631 2884181 1930482 2352193 2590903 2557370
3304 2557370 3132377 3964740 3768363 2735001 2401885 2756788 1925048 -368571 -1551026
3295 -1551026 1683 2091537 1663584 -1009409 -3273322 -3915505 -3714952 -3087125 -1698252
3286 -1698252 -195647 -3238 -1050686 -1539136 -554600 493815 -231800 -2652872 -5083018
3277 -5083018 -6272527 -6341424 -5825849 -4621743 -2492826 -333455 176596 -1291340 -2972431
3268 -2972431 -3489249 -4065594 -6477116 -9459027 -9631056 -6214618 -2344549 -837047 -919833
3259i19833N32720J501278J461331J048847N69271o06035j853097j451752M05763
3250F88493J418302O39322l97551n96295p21216j227435j325793r73101j072391
3241c567665r20181J411303M898195N174698N03258m805519n701640k795371l68758
3232f171680J82830J216437L746698N239373L551946N14748k90297J710243L338736
3223A3039034J865383j399493k875834j470127K80153J16488j112253j814979
3215F628372k497205l854492m103566j614618J163734M59198k661079l189952
3207i669608M99691M538314N533290M280538K276926p89752l906521l659261N35089
3198c61294L911018K545561j201062k939041k609429k429020j574015J859489
$$ plain form
3259 -919833 -387113 1114165 2575496 3624343 4193614 3587579 1734482 282730 688493
3250 688493 2106795 2746117 2348566 1752271 1031055 -196380 -1522173 -2495274 -3567665
3241 -3567665 -4487846 -3076543 1821652 6996350 7499608 2694089 -3007551 -5802922 -6171680
3232 -6171680 -5988850 -4772413 -1025715 4213658 7765604 8280352 7990055 9700298 13039034
3223 13039034 14904417 13504924 10629090 9158963 9439116 9555604 8443351 6628372
3215 6628372 4131167 276675 -3826891 -5441509 -4277775 -3818577 -6479656 -9669608
3207 -9669608 -9169917 -4631603 901687 5182225 7459151 6669399 2762878 -896383 -361294
3198 -361294 3549724 6095285 4894223 1955182 -654247 -3083267 -4657282 -2797793
3190b797793N493055M850984M07138k627741j809093j26678m18623j511295j505573
3181d5619j144326j602756j638005M73871L633972M778663K552187j254047l770929
3172A983011l851642k851978k766018l595848l165362m6645M114877O167349M855826
3163H43570J822429k77041J9747J919025K897343J252488j425338j861565K72572
3154E463230J628133K68347j335210o30862N68249o01920k605102j756855J324419
3145B322429K346069L52644o89688J571364M031373K902905r22029l723833l947562
3136D243672l004424k449522k334511j788911j31134K200293L597228K948705
3128C281396J137738l01568j394409k735915l037036n06772L319006M320264J225191
$$ plain form
3190 -2797793 2695262 7546246 7953384 5325643 3516550 3389872 2971249 1459954 -45619
3181 -45619 -1189945 -2792701 -4430706 -3956835 -322863 4455800 7007987 5753940 1983011
3172 1983011 -1868631 -4720609 -7486627 -11082475 -14247837 -14294482 -10179605 -4012256 843570
3163 843570 2665999 2388958 2408705 4327730 7225073 8477561 7052223 5190658 5463230
3154 5463230 7091363 7359710 6024500 5393638 5961887 5359967 2754865 998010 2322429
3145 2322429 4668498 5021142 4331454 5902818 9934191 12837096 11915067 8191234 4243672
3136 4243672 1239248 -1210274 -3544785 -5333696 -5464830 -3264537 332691 3281396
3128 3281396 4419134 4117566 2723157 -12758 -3049794 -3556566 -237560 4082704 5307895
3119E307895k543902l568855k255534o71128N66178J350281O51826j548324k847762
3110e559325j431372R82112J548641L78396j62761Q13372K124824K940627L333319
3101D967833K761296M69334k364072l033948o29916K465214L170149R85058j795871
3092F995077k578392q49110J635175K856964K570717J907081J246107k16461k430406
3083A1136752l624079k644407r14069n39325j363893j573057n93166M59169R56266
3074A300191J473331K142423K081365J052298J91234K47901K87540q43645k598898
3065E333740l371478k628080j423554r13083j131437j291249p12578O39505K113354
3056c384860K796767K356111J477952J071364J031506L83736j151275k410297
$$ plain form
3119 5307895 2763993 -804862 -3060396 -3731524 -3165346 -1815065 -1163239 -2711563 -5559325
3110 -5559325 -6990697 -6008585 -4459944 -4081548 -4244309 -3430937 -1306113 1634514 4967833
3101 4967833 7729129 8198463 5834391 2800443 2170527 4635741 7805890 8790948 6995077
3092 6995077 4416685 3567575 5202750 8059714 10630431 12537512 13783619 13567158 11136752
3083 11136752 7512673 4868266 3954197 3414872 2050979 477922 -115244 343925 1300191
3074 1300191 2773522 4915945 6997310 8049608 8240842 8488743 8776283 7932638 5333740
3065 5333740 1962262 -665818 -2089372 -3002455 -4133892 -5425141 -6137719 -5498214 -3384860
3056 -3384860 -588093 1768018 3245970 4317334 5348840 5732576 4581301 2171004
3048B171004k109229m23181J307394J981738J250221p14762k930843l623781j961684
3039e053123L73407Q71102m56872j061771M70362K568313L257645K750304K240615
3030E959982J745404O89306n89110j435468j974096k307489j783680l73509N68835
3021E00175L57978K25706Q51113N20612j956961m302132l600651o67738J481592
3012f590306K198498K801144K830428Q21782j738358j590477J062354K708138
3004B503203K148335J509624J239140p42282l639402l145297J248636L680779
2996D802736L61096m161201l756690K29612K026206N86306k08768J082375J765068
2987B726740M61812r13028j170627j426180j833940p26162J774187K756619P00477
$$ plain form
3048 2171004 61775 -361406 945988 2927726 4177947 3463185 532342 -3091439 -5053123
3039 -5053123 -4679716 -3808614 -4265486 -5327257 -4856895 -2288582 969063 3719367 5959982
3030 5959982 7705386 8394692 7805582 6370114 4396018 2088529 304849 -68660 500175
3021 500175 858153 1083859 1934972 2455584 498623 -3803509 -7404160 -8071898 -6590306
3012 -6590306 -4391808 -1590664 1239764 2061546 323188 -1267289 -204935 2503203
3004 2503203 4651538 6161162 7400302 6658020 3018618 -126679 1121957 4802736
2996 4802736 5163832 1002631 -2754059 -2524447 -498241 88065 -120703 961672 2726740
2987 2726740 3188552 2275524 1104897 -321283 -2155223 -2881385 -1107198 1649421 2349898
2978B349898k104966k837015j561489M3137J368549K667742L526220L034903R49340
2969G436319j928178l976793l484576l36384K981357L394743N50147k909539m365115
2960b638019l397676j146664R95149J867588J138198j03697k79593Q61306K030299
2951f73109J960055N18371j446747k663669k321242j160608r86495k229668k982335
2942a1985447j633630O47870J625544J187779J019249J868363K988871L599574
2934f81827L081444O12890l242131n423400l406255J056820L731336L203700J887913
2925H20490J888859K555497K427515J149545r89963l296452m244423k938136r67846
2916c594914m88788o78682J029775M191525N193018K538621r90799k572833k601250
$$ plain form
2978 2349898 244932 -2592083 -4153572 -4110435 -2741886 -74144 3452076 6486979 7436319
2969 7436319 5508141 1531348 -1953228 -2289612 691745 4086488 4636635 1727096 -2638019
2960 -2638019 -6035695 -7182359 -6187210 -4319622 -3181424 -3285121 -3564714 -2703408 -673109
2951 -673109 1286946 1805317 358570 -2305099 -4626341 -5786949 -6773444 -9003112 -11985447
2942 -11985447 -13619077 -12971207 -11345663 -10157884 -9138635 -7270272 -4281401 -681827
2934 -681827 2399617 3012507 -229624 -5653024 -9059279 -8002459 -4271123 -1067423 820490
2925 820490 2709349 5264846 7692361 8841906 7851943 4555491 311068 -2627068 -3594914
2916 -3594914 -4083702 -4762384 -3732609 458916 5651934 8190555 7199756 4626923 2025673
2907B025673k338072j453783J76343R89446K60749j83199J028254K197990J320927
2898D024328l69213k38846J553091K242514L42766k640476m206212l289151r54759
2889c535958N67640J3207j447048j693103n08658N57467J014654J852075K892327
2880b87397K410719K06504j613501j918283j835645j687501O2518L117010M065629
2871B520053J245540k220907k925315j689185p13993M76594K603125L301708P24916
2862C322536k055207j167064J543447J439271r88094j094961J559378K159359
2854D718665j254561m555882m197864j827677K4174J901761M125966M070398N73395
2845C578375k441104j014041K599841L026068l95104l168909k592141j055101
$$ plain form
2907 2025673 -312399 -1766182 -1589839 -600393 -339644 -522843 505411 2703401 4024328
2898 4024328 3655115 3416269 4969360 7211874 7554640 4914164 707952 -2581199 -3535958
2889 -3535958 -2968318 -2955111 -4402159 -6095262 -6603920 -6046453 -5031799 -3179724 -287397
2880 -287397 2123322 2329826 716325 -1201958 -3037603 -4725104 -4662586 -1545576 2520053
2871 2520053 3765593 1544686 -1380629 -3069814 -3783807 -3307213 -704088 2597620 3322536
2862 3322536 1267329 100265 1643712 3082983 2094889 999928 2559306 4718665
2854 4718665 3464104 -1091778 -5289642 -7117319 -7093145 -5191384 -1065418 3004980 3578375
2845 3578375 1137271 123230 2723071 5749139 5354035 2185126 -407015 -1462116
2837a462116j554486l117804k639218L22044K705171J983959l70351p01483J796155
2828c038129L654305J867485j629523k568617m66609R58023n03146k712785k981612
2819g420608j626609k07118J079622K343669K692910K019903J977352L074706
2811C933827K974784J60575k757814k372256N13731K406287K336009K007539J659147
2802A0861829j33093k498418k358770L73266J515028j372796m800916l986676
2794b400546M28496L431127K399605k40304j135669j26946O75296J32427r42306
2785B221180j229159k48764J378444K265417J212685j324539k976826j781250
2777d82812J133814K498303J129315k98134Q58226K914308K015874j801666l906279
$$ plain form
2837 -1462116 -3016602 -6134406 -8773624 -8451580 -5746409 -3762450 -4132801 -4834284 -3038129
2828 -3038129 616176 2483661 854138 -1714479 -2181088 -1223065 -1726211 -4438996 -7420608
2819 -7420608 -9047217 -9254335 -8174713 -5831044 -3138134 -1118231 859121 3933827
2811 3933827 6908611 7069186 4311372 1939116 2452847 4859134 7195143 9202682 10861829
2802 10861829 10728736 8230318 5871548 6244814 7759842 6387046 1586130 -2400546
2794 -2400546 -1972050 1459077 3858682 3618378 2482709 2355763 3031059 3163486 2221180
2785 2221180 992021 743257 2121701 4387118 5599803 4275264 1298438 -482812
2777 -482812 651002 3149305 4278620 3980486 4838712 7753020 9768894 7967228 4060949
2768D060949j471077K403602L221936J405759Q57049K520848L263387J365775
2760A7628228o19688j13260J290187L43528k855690n098783m619376k885151j732470
2751A337525r59680L39209J648866J591515o6990k042016k876478j960831L41190
2742b647690K669375L114519R62966j827139k155368N68132L329950K960110k01074
2733F773781l151204l878655k681717n08949J961728L543958K969632Q27573o32208
2724E223939m52641j01560p92760j556624j283885p64956q72866n38595J118359
2715b1589K290102J079642o84309J04609K196343J190051l051115m905806j112529
2706b914601L802476L785919j25082j884839N64410L202123K650110L86013r25296
$$ plain form
2768 4060949 2589872 4993474 8215410 9621169 10478218 12999066 16262453 17628228
2760 17628228 17008540 16895280 18185467 18528995 15673305 10574522 5955146 3069995 1337525
2751 1337525 377845 717054 2365920 3957435 3890445 1848429 -1028049 -2988880 -2647690
2742 -2647690 21685 3136204 4099170 2272031 116663 684795 4014745 6974855 6773781
2733 6773781 3622577 -256078 -2937795 -3446744 -1485016 2058942 5028574 5856147 5223939
2724 5223939 4771298 4669738 3876978 2320354 1036469 271513 -601353 -1139948 -21589
2715 -21589 2268513 3348155 2663846 2768455 4964798 6154849 3103734 -1802072 -2914601
2706 -2914601 887875 4673794 4548712 2663873 3228283 6430406 9080516 9466529 8541233
2697H541233j434983k314792k834101j870805n55270p68295j952738j832591P4150
2688d948192J816438J926092J099477N82574M43308J20483m52754r94304j344404
2679a751282j222115k42162J260963K121848J704951P76458L29248J48947n25773
2670B601083j375304j246661q304J065554J152990J038051J671447K460236K103115
2661I462207O96890k49534K7628N41910J65180p64321j292282j627114k858994
2652D101570m893211n749504l611025P27249M024618L495542l52343l901609l847318
2643a0006031n35742K660622L454383L019302L390747L861747K157596j290206
2635F712418l127199j893168k41562o27973j421216p8197J947935J327748j185919
$$ plain form
2697 8541233 7106250 4791458 1957357 86552 -468718 -1237013 -3189751 -5022342 -4948192
2688 -4948192 -3131754 -1205662 -106185 476389 919697 1040180 587426 -406878 -1751282
2679 -1751282 -2973397 -3215559 -1954596 167252 1872203 2648661 2977909 3126856 2601083
2670 2601083 1225779 -20882 -29186 1036368 2189358 3227409 4898856 7359092 9462207
2661 9462207 10159097 9909563 9937191 10479101 10644281 9879960 8587678 6960564 4101570
2652 4101570 -791641 -6541145 -10152170 -9424921 -5400303 -1904761 -2257104 -6158713 -10006031
2643 -10006031 -10541773 -7881151 -4426768 -1407466 1983281 5845028 8002624 6712418
2635 6712418 3585219 1692051 1450489 822516 -598700 -676897 1271038 2598786 1412867
2626A412867j448050J123665J999848j255276m580934l425676K58854J226929
2618d687773j024476k146818r0403K355570K707447K219433K587945K687077R26642
2609E534644j458422j899793J3597K386512L389207K408601n5797k267207k107918
2600E943424M71287K745314K327039J06268j303402j104219o22553p84038j173779
2591F605341j421767j808939k329645k461016k016973j198156J02820J881845
2583b646490L044332K269449Q5387j234119l47276J609309K641133K105537P01177
2574H228439q57123k223094k922388k469964j153966j25322k94558j252466j629196
2565d699638o32253J087138K333106K664762K213985P35580j952799m654854n393560
$$ plain form
2626 1412867 -35183 1088482 3088330 1833054 -2747880 -6173556 -5914702 -4687773
2618 -4687773 -5712249 -7859067 -7949470 -5593900 -2886453 -667020 1920925 4608002 5534644
2609 5534644 4076222 2176429 2190026 4576538 7965745 10374346 10318549 8051342 5943424
2600 5943424 6414711 9160025 11487064 11593332 10289930 9185711 8563158 7779120 6605341
2591 6605341 5183574 3374635 1044990 -1416026 -3432999 -4631155 -4528335 -2646490
2583 -2646490 397842 2667291 2752678 1518559 1171283 2780592 5421725 7527262 8228439
2574 8228439 7371316 5148222 2225834 -244130 -1398096 -1523418 -1817976 -3070442 -4699638
2565 -4699638 -5331891 -4244753 -1911647 753115 2967100 3702680 1749881 -2904973 -8298533
2556h298533l802185j578063P9657J954266M650836O517536N542107K420429j45936
2547G340114p60742k39528M28227J199855K010511K245872J481225k17033k541661
2538A0946840m549643m709839k770534q25754p10520j130648K44440K472965K270716
2529A238023o05405k372778p47269J813278K235078J221743R62247R39707o48037
2520D036587k760756k400523O29026K927809J946022j052348l026510k353605
2512b054298M45629L470928M396690K214641j289617l034585k132993o13940k11703
2503A190752j39158Q07930J555776K24481k411712l313377j385766Q53047R90364
2494a627663K51252J209370L156302K790627l25527k305978n50298K086016J543540
$$ plain form
2556 -8298533 -12100718 -13678781 -13599124 -11644858 -6994022 -476486 5065621 7486050 7340114
2547 7340114 6579372 6339844 6768071 7967926 9978437 12224309 13705534 13488501 10946840
2538 10946840 6397197 1687358 -1083176 -1908930 -2619450 -3750098 -3505658 -1032693 1238023
2529 1238023 632618 -1740160 -2487429 -674151 1560927 2782670 3744917 4684624 4036587
2520 4036587 1275831 -1124692 -495666 2432143 4378165 3325817 299307 -2054298
2512 -2054298 -1608669 1862259 6258949 8473590 7183973 4149388 2016395 1402455 1190752
2503 1190752 1051594 1859524 3415300 3639781 1228069 -2085308 -3471074 -2618027 -1627663
2494 -1627663 -1376411 -167041 2989261 5779888 5454361 3148383 2598085 4684101 6227641
2485F227641j160356j681584O41841J892115N9091j901652j188969M28308O66
2476C317101j637863j518710N77740K019137J251270p31559k284202k414761q21039
2467b242886J556075K718620J880061N14799j88451j108241k602858k543361J95783
2458a820459K577622J497084q75813l27919K300287K563060K24817m78189J192851
2449F853341R02194k451927l619725J50523L371194P14554l934734l377767J488985
2440I6638L477514N51944k039567j071312M20626j50707l72906J953530M100121
2431F965881K703248p71990k591098k196582j584447j264181l73162N47015L10404
2422A745088j62786R65448K914773K975719P10239j424187j921876j821142j772973
$$ plain form
2485 6227641 5067285 3385701 4027542 5919657 5978748 4077096 2888127 3316435 3317101
2476 3317101 1679238 160528 738268 2757405 4008675 3277116 992914 -1421847 -2242886
2467 -2242886 -686811 2031809 3911870 4426669 4238218 3129977 527119 -2016242 -1820459
2458 -1820459 757163 2254247 1378434 1050515 3350802 5913862 6138679 5660490 6853341
2449 6853341 7755535 5303608 1683883 1834406 5205600 5920154 1985420 -1392347 96638
2440 96638 3574152 4126096 2086529 1015217 1435843 1285136 912230 2865760 6965881
2431 6965881 9669129 8897139 6306041 4109459 2525012 1260831 887669 1434684 1745088
2422 1745088 1582302 2547750 5462523 8438242 9148481 7724294 5802418 3981276 2208303
2413B208303n03719K262172L921233K315272q01698k126680j526902j656911l245735
2404H45335l700486j156802K458603L834929K188169o69167k938263l882771l122036
2395f142489p90470J657904K337578R29372j142734k469461k552797j188476J474793
2386g886780L952041M093388J655927q86144j101376N90507J826577J404417L77716
2377D026273K27902R20846J139524J15818j182792j103323L75160J198448n8766
2368E659090j864858j680463K24273J074084j15973j076209j04315J180116P06963
2359D002708o29544q60596m83286j133331j862799j85643L312420M786683K349492
2350I296104j273194k470758r67149Q94019J247706j42717k290400l382628k137491
$$ plain form
2413 2208303 1704584 3966756 7887989 10203261 9401563 7274883 5747981 4091070 845335
2404 845335 -2855151 -4011953 -1553350 2281579 4469748 3800581 862318 -3020453 -6142489
2395 -6142489 -6932959 -5275055 -2937477 -2008105 -3150839 -5620300 -8173097 -9361573 -7886780
2386 -7886780 -3934739 158649 1814576 928432 -172944 417563 2244140 3648557 4026273
2377 4026273 4254175 5175021 6314545 6430363 5247571 4144248 4519408 5717856 5659090
2368 5659090 3794232 2113769 2338042 3412126 3296153 2219944 2115629 3295745 4002708
2359 4002708 3373164 2512568 2029282 895951 -966848 -1152491 2159929 6946612 9296104
2350 9296104 8022910 5552152 4585003 5479022 6726728 6584011 4293611 910983 -1226508
2341a226508K44949R31764p53062k056364o45858J981354K842479J863544J522081
2332D704379K665426L178171J245227j914542l520860k519143o04756k17384j873057
2323A143461l632662l432584j640628l48470j90339M15402K072259K480878k58419
2314c391102l795733l814735N2213L395746K798382k7178j215946J24392J729052
2305d144909J940487J425999J273331J245425N53502p32497j807106k170492j955770
2296d372030j392314l91030J210281L096824M320435L916833J872971o00632k027175
2287E634163j968063j201849o03957k53927M6204j47233j422815l064330l205701
2278f187508j144837J338452K020520R69151n2642l83209q13398j197145n9058
$$ plain form
2341 -1226508 -981559 -49795 -802857 -2859221 -3505079 -1523725 1318754 3182298 4704379
2332 4704379 7369805 10547976 11793203 9878661 6357801 3838658 3233902 3016518 1143461
2323 1143461 -2489201 -5921785 -7562413 -7910883 -8101222 -7685820 -5613561 -3132683 -3391102
2314 -3391102 -7186835 -11001570 -10949357 -7553611 -4755229 -4782407 -5998353 -5873961 -4144909
2305 -4144909 -2204422 -778423 494908 1740333 2293835 1561338 -245768 -2416260 -4372030
2296 -4372030 -5764344 -6155374 -4945093 -1848269 2472166 6388999 8261970 7661338 5634163
2287 5634163 3666100 2464251 1860294 1606367 1652571 1505338 82523 -2981807 -6187508
2278 -6187508 -7332345 -5993893 -3973373 -3004222 -3056864 -3440073 -4253471 -5450616 -5509674
2269e509674K478227L580848J337511k032882k769919m38419K000771K427771
2261A074234J541930O93903O2380n43517r80845j440481k195072k331728n62023
2252d681219K265216L526123K447848J224637J471518J883996J011510L6535M81762
2243I667926J062255l34118k814374l680994k709511k056480k201153j397481
$$ plain form
2269 -5509674 -3031447 549401 1886912 -145970 -2915889 -3354308 -1353537 1074234
2261 1074234 2616164 3310067 3372447 2828930 1848085 407604 -1787468 -4119196 -4681219
2252 -4681219 -2416003 1110120 3557968 4782605 6254123 8138119 9149629 9186164 9667926
2243 9667926 10730181 10396063 7581689 3900695 1191184 -865296 -3066449 -4463930
$$ [...]
##END NTUPLES=NMR SPECTRUM
##END=
