##TITLE=31P_DE-80H_X3
 64 sc D2O
 26.2.2025
##JCAMPDX= 6.0         $$ Bruker NMR JCAMP-DX V2.0
##DATA TYPE= NMR SPECTRUM
##DATA CLASS= NTUPLES
##ORIGIN= UXNMR, Bruker Analytische Messtechnik GmbH
##OWNER= root
$$ XWIN-NMR		Version 3.5
$$ Thu Apr 10 14:20:07 2025 Russian Standard Time (UT+4h)  Yarkov@DPX200
##.OBSERVE FREQUENCY= 81.013821
##.OBSERVE NUCLEUS= ^31P
##.ACQUISITION MODE= SIMULTANEOUS
##.ACQUISITION SCHEME= undefined
##.AVERAGES= 64
##.DIGITISER RES= 17
##SPECTROMETER/DATA SYSTEM= spect
##.PULSE SEQUENCE= zgpg30
##.SOLVENT NAME= CDCl3
##.SHIFT REFERENCE= (INTERNAL, CDCl3, 0, 198.062)
##AUDIT TRAIL= $$ (NUMBER, WHEN, WHO, WHERE, WHAT)
$$ ##TITLE= Audit trail, XWIN-NMR		Version 3.5
$$ ##JCAMPDX= 5.01
$$ ##ORIGIN= Bruker BioSpin GmbH
$$ ##OWNER= Yarkov
$$ C:/Bruker/XWIN-NMR/data/yarkov2/nmr/P31/2/pdata/1/auditp.txt
$$ ##AUDIT TRAIL=  $$ (NUMBER, WHEN, WHO, WHERE, WHAT)
(   1,<2025-04-10 14:18:54.39 +0400>,<Yarkov>,<DPX200>,
      <created by zg, POWCHK disabled, PULCHK disabled
       configuration hash MD5:
       00 E9 B6 7A A2 85 ED C7 34 08 36 98 17 FE 4E 26
       data hash MD5: 32K
       F4 2E F7 2B 52 F4 60 49 89 24 E0 02 38 BA D0 4B>)
(   2,<2025-04-10 14:19:00.10 +0400>,<Yarkov>,<DPX200>,
      <Start of raw data processing
       efp BC_mod = 2 LB = 1.5 FT_mod = 6 PKNL = 1 PHC0 = 1796.659 PHC1 = 30.09541 SI = 64K 
       data hash MD5: 64K
       EF 8C ED B6 F8 55 E1 3C DC 2D B6 65 03 BF F3 59>)
(   3,<2025-04-10 14:19:20.59 +0400>,<Yarkov>,<DPX200>,
      <abs ABSG = 5 
       data hash MD5: 64K
       49 E0 BC F3 61 C1 1C 37 7E 8F 6E 31 B9 D3 C3 36>)
$$ ##END=
$$ 
$$ hash MD5
$$ 33 18 F8 33 AF 62 5F E5 22 A5 7B 24 CC 03 E7 E3
##$RELAX= 
##$RELAX= 
##$RELAX= 
##$RELAX= 
##$RELAX= 
##$RELAX= 
##$RELAX= 
##$RELAX= 
$$ Bruker specific parameters
$$ --------------------------
##$DU= <C:/Bruker/XWIN-NMR>
##$EXPNO= 2
##$NAME= <P31>
##$PROCNO= 1
##$TYPE= <nmr>
##$USER= <yarkov2>
##$AMP= (0..31)
100 100 100 100 100 100 100 100 100 100 100 100 100 100 100 100 100 100 
100 100 100 100 100 100 100 100 100 100 100 100 100 100 
##$AQSEQ= 0
##$AQ_mod= 1
##$AUNM= <au_zg>
##$AUTOPOS= <>
##$BF1= 81.014009
##$BF2= 200.13
##$BF3= 200.13
##$BF4= 200.13
##$BF5= 200.13
##$BF6= 200.13
##$BF7= 200.13
##$BF8= 200.13
##$BYTORDA= 1
##$CFDGTYP= 0
##$CFRGTYP= 5
##$CHEMSTR= <none>
##$CNST= (0..31)
1 1 145 1 1 1 1 1 1 1 1 1 1 1 1 1 1 1 1 1 1 1 1 1 1 1 1 1 1 1 1 1 
##$CPDPRG= <waltz16>
##$CPDPRG1= <>
##$CPDPRG2= <waltz16>
##$CPDPRG3= <>
##$CPDPRG4= <mlev>
##$CPDPRG5= <mlev>
##$CPDPRG6= <mlev>
##$CPDPRG7= <mlev>
##$CPDPRG8= <mlev>
##$CPDPRGB= <>
##$CPDPRGT= <>
##$D= (0..31)
0 1 0 0 0 0 0 0 0 0.06 0 0.03 2e-05 3e-06 0 0 0.0002 0 0 0 0 0 0 0 0 0 
0 0 0 0 0 0 
##$DATE= 1744280333
##$DBL= (0..7)
120 120 120 11 120 120 24 19 
##$DBP= (0..7)
150 150 150 150 150 150 150 150 
##$DBP07= 0
##$DBPNAM0= <>
##$DBPNAM1= <>
##$DBPNAM2= <>
##$DBPNAM3= <>
##$DBPNAM4= <>
##$DBPNAM5= <>
##$DBPNAM6= <>
##$DBPNAM7= <>
##$DBPOAL= (0..7)
0.5 0.5 0.5 0.5 0.5 0.5 0.5 0.5 
$$ [...]
##$SUBNAM3= <"">
##$SUBNAM4= <"">
##$SUBNAM5= <"">
##$SUBNAM6= <"">
##$SUBNAM7= <"">
##$SUBNAM8= <"">
##$SUBNAM9= <"">
##$SW= 400.765351723535
##$SWIBOX= (0..15)
0 1 3 0 0 0 0 0 0 0 0 0 0 0 0 0 
##$SW_h= 32467.5324675325
##$TD= 32768
##$TD0= 1
##$TE= 0
##$TE2= 300
##$TE3= 300
##$TEG= 300
##$TL= (0..7)
0 120 53 12 22 120 120 120 
##$TP= (0..7)
150 150 150 150 150 150 150 150 
##$TP07= 0
##$TPNAME0= <>
##$TPNAME1= <>
##$TPNAME2= <>
##$TPNAME3= <>
##$TPNAME4= <>
##$TPNAME5= <>
##$TPNAME6= <>
##$TPNAME7= <>
##$TPOAL= (0..7)
0.5 0.5 0.5 0.5 0.5 0.5 0.5 0.5 
##$TPOFFS= (0..7)
0 0 0 0 0 0 0 0 
##$TUNHIN= 0
##$TUNHOUT= 0
##$TUNXOUT= 0
##$USERA1= <user>
##$USERA2= <user>
##$USERA3= <user>
##$USERA4= <user>
##$USERA5= <user>
##$V9= 5
##$VALIST= <valist>
##$VCLIST= <CCCCCCCCCCCCCCC>
##$VD= 0
##$VDLIST= <DDDDDDDDDDDDDDD>
##$VPLIST= <PPPPPPPPPPPPPPP>
##$VTLIST= <TTTTTTTTTTTTTTT>
##$WBST= 1024
##$WBSW= 4
##$XGAIN= (0..3)
0 0 0 0 
##$XL= 0
##$YL= 0
##$YMAX_a= 3268
##$YMIN_a= -31140
##$ZGOPTNS= <>
##$ZL1= 120
##$ZL2= 120
##$ZL3= 120
##$ZL4= 120
##$ABSF1= 198.0616
##$ABSF2= -202.7028
##$ABSG= 5
##$ABSL= 3
##$ALPHA= 0
##$AQORDER= 0
##$ASSFAC= 0
##$ASSFACI= 0
##$ASSFACX= 0
##$ASSWID= 0
##$AUNMP= <proc_1d>
##$AZFE= 0.1
##$AZFW= 0.5
##$BCFW= 0
##$BC_mod= 2
##$BYTORDP= 0
##$COROFFS= 0
##$CY= -3
##$DATMOD= 1
##$DC= 0
##$DFILT= <>
##$DTYPP= 0
##$F1P= 0
##$F2P= 0
##$FCOR= 1
##$FTSIZE= 65536
##$FT_mod= 6
##$GAMMA= 0
##$GB= 0
##$INTBC= 1
##$INTSCL= 9.790993e-09
##$ISEN= 30
##$LB= 1.5
##$LEV0= 0
##$LPBIN= 0
##$MAXI= 10000
##$MC2= 0
##$MEAN= 0
##$ME_mod= 0
##$MI= 50
##$NCOEF= 0
##$NC_proc= -8
##$NLEV= 6
##$NOISF1= 182.463
##$NOISF2= 159.3651
##$NSP= 0
##$NTH_PI= 0
##$NZP= 0
##$OFFSET= 198.0616
##$PC= 4
##$PHC0= 1796.659
##$PHC1= 30.09541
##$PH_mod= 1
##$PKNL= yes
##$PPARMOD= 0
##$PSCAL= 0
##$PSIGN= 0
##$REVERSE= no
##$SF= 81.0140089999434
##$SI= 65536
##$SIGF1= 159.3651
##$SIGF2= -187.1042
##$SINO= 113.3802
##$SIOLD= 16384
##$SREGLST= <1H.CDCl3>
##$SSB= 0
##$STSI= 65536
##$STSR= 0
##$SW_p= 32467.5324675325
##$SYMM= 0
##$S_DEV= 0
##$TDeff= 32768
##$TDoff= 0
##$TI= <>
##$TILT= no
##$TM1= 0
##$TM2= 0
##$TOPLEV= 0
##$USERP1= <user>
##$USERP2= <user>
##$USERP3= <user>
##$USERP4= <user>
##$USERP5= <user>
##$WDW= 1
##$XDIM= 65536
##$YMAX_p= 363138751
##$YMIN_p= -200650003
$$ End of Bruker specific parameters
$$ ---------------------------------
##NTUPLES= NMR SPECTRUM
##VAR_NAME=  FREQUENCY,     SPECTRUM/REAL,   SPECTRUM/IMAG
##SYMBOL=    X,             R,               I
##VAR_TYPE=  INDEPENDENT,   DEPENDENT,       DEPENDENT
##VAR_FORM=  AFFN,          ASDF,            ASDF
##VAR_DIM=   65536,         65536,           65536
##UNITS=     HZ,            ARBITRARY UNITS, ARBITRARY UNITS
##FACTOR=    0.49542278885378, 1,            1
##FIRST=     16045.7642231865, 0,            0
##LAST=      -16421.768244346, 0,            0
##MIN=       -16421.768244346, -200650003,   0
##MAX=       16045.7642231865, 363138751,    0
$$ Real data points
##PAGE= N=1
##DATA TABLE= (X++(R..R)), XYDATA
$$ [...]
$$ plain form
42806 -12274214 -10245420 -7594262 -6275980 -6191283 -5031498 -1642219 2155563 4050653
42798 4050653 4034538 3614141 3666690 4377370 5922803 7565689 7281975 4341630 1424805
42789 1424805 1795110 4672371 5966498 3905191 1297319 1142193 2445248 2317957 420631
42780 420631 -1196251 -1784004 -2779877 -4970241 -7099558 -7924469 -7732458 -6930974 -4898497
42771 -4898497 -1630378 792333 118459 -3245902 -6693647 -8221413 -7555867 -5239594
42763 -5239594 -2431761 -1338354 -3675483 -8084060 -10683328 -8999655 -4245288 644798
42755 644798 3724335 4285583 2384968 -486290 -1752098 -493434 1041735 118846 -3154919
42746 -3154919 -6581513 -8896184 -10209990 -10244922 -8352856 -5210660 -2609997 -1355409
$$ packed form
42806a2274214K028794K651158J318282Q4697J159785L389279L797782J895090
42798D050653j6115m20397N2549P10680J545433J642886k83714k940345k916825
42789A424805L70305K877261J294127k061307k607872j55126J303055j27291j897326
42780D20631j616882n87753r95873k190364k129317q24911J92011Q01484K032477
42771d898497L268119K422711o73874l364361l447745j527766O65546K316273
42763e239594K807833J093407k337129m408577k599268J683673M754367M890086
42755F44798L079537N61248j900615k871258j265808J258664J535169r22889l273765
42746c154919l426594k314671j313806l4932J892066L142196K600663J254588
$$ plain form
42738 -1355409 -726035 132339 1679189 4405431 8001534 10397672 9631702 6597797 3943299
42729 3943299 2408482 662552 -1213890 -1062963 1682021 4468184 5156947 4646153 4410106
42720 4410106 3836045 2068268 487656 954137 2901744 4306069 4442563 3827705 2644068
42711 2644068 1174789 617665 1427623 1954052 775417 -806732 -876924 -288372 -1229196
42702 -1229196 -3278681 -3837425 -2107093 189156 1836389 3005910 3195289 1420258
42694 1420258 -1137275 -1767257 -350611 63883 -2089044 -4458907 -4472244 -2892397 -1875106
42685 -1875106 -1667007 -1273784 -658203 -218499 527516 1812049 2424637 1537835 529051
42676 529051 930890 1572412 97183 -3110976 -4805550 -2909230 1012215 3668929 3263663
$$ packed form
42738a355409O29374Q58374J546850K726242L596103K396138p65970l033905k654498
42729C943299j534817j745930j876442J50927K744984K786163O88763n10794k36047
42720D410106n74061j767777j580612M66481J947607J404325J36494o14858j183637
42711B644068j469279n57124Q09958N26429j178635j582149p0192N88552r40824
42702a229196k049485n58744J730332K296249J647233J169521J89379j775031
42694A420258k557533o29982J416646M14494k152927k369863j3337J579847J017291
42685a875106K08099L93223O15581M39704P46015J284533O12588q86802j008784
42676E29051M01839O41522j475229l208159j694574J896320L921445K656714m05266
$$ plain form
42667 3263663 586749 -2114836 -3124960 -2702106 -2531010 -3502321 -4713198 -5174088 -5397430
42658 -5397430 -6159393 -6702021 -5797675 -3967224 -2788669 -2251199 -803721 1704483 3129202
42649 3129202 1993806 -180034 -761965 728212 2549462 3352549 3439993 3397147 2804964
42640 2804964 1095224 -979111 -1755862 -600398 1344196 2653323 3152098 3350646 3045242
42631 3045242 1633542 -330790 -1141539 94084 2270067 3369503 2156959 -1123378
42623 -1123378 -4756990 -6326104 -4851129 -2425219 -2178296 -4139952 -4947661 -2573571
42615 -2573571 717334 1761696 928048 762159 1600694 1516116 119495 -673753 12982
42606 12982 756197 785088 1595029 4151880 6612754 6725980 5039651 3779410 3561673
$$ packed form
42667C263663k676914k701585j010124M22854J71096r71311j210877m60890k23342
42658e397430p61963n42628R04346J830451J178555N37470J447478K508204J424719
42649C129202j135396k173840n81931J490177J821250Q03087Q7444m2846n92183
42640B804964j709740k074335p76751J155464J944594J309127M98775J98548l05404
42631C045242j411700j964332q10749J235623K175983J099436j212544l280337
42623a123378l633612j569114J474975K425910K46923j961656q07709K374090
42615b573571L290905J044362q33648j65889Q38535q4578j396621p93248O86735
42606A2982P43215K8891Q09941K556851K460874J13226j686329j260241k17737
$$ plain form
42597 3561673 3247945 2486564 2264669 2816058 2828562 1390025 -566460 -1532517 -1218105
42588 -1218105 -279344 995442 2653623 3995131 3674256 1336212 -1458423 -2577950
42580 -2577950 -1522565 70105 160560 -1629357 -3700082 -4107136 -2475063 -208006 1321128
42571 1321128 2481011 4603958 7569827 9422136 9143843 8545370 9764723 11661631
42563 11661631 10954097 7043752 3365272 3055641 5379938 7792751 9509146 10942618
42555 10942618 11175911 8821269 4970358 2634176 2874016 3578769 2667959 680997 -637602
42546 -637602 -748020 -185557 854869 2522160 4351894 5304883 4822625 3552628 3082193
42537 3082193 4759757 8229923 11241812 11644956 9603000 7118516 5456944 4048127
$$ packed form
42597C561673l13728p61381k21895N51389J2504j438537j956485r66057L14412
42588a218105R38761J274786J658181J341508l20875k338044k794635j119527
42580b577950J055385J592670R0455j789917k070725m07054J632073K267057J529134
42571A321128J159883K122947K965869J852309k78293n98473J219353J896908
42563A1661631p07534l910345l678480l09631K324297K412813J716395J433472
42555A0942618K33293k354642l850911k336182K39840P04753r10810j986962j318599
42546f37602j10418N62463J040426J667291J829734R52989m82258j269997m70435
42537C082193J677564L470166L011889M03144k041956k484484j661572j408817
$$ plain form
42529 4048127 2059474 -134068 -1648363 -2359929 -2686421 -2616701 -1743415 -141159 1341113
42520 1341113 1847954 1479152 1301464 2117986 3281803 3347870 2087775 972657 1084364
42511 1084364 1492416 617753 -1666994 -4366235 -6795616 -8309870 -7738056 -5135141 -3274382
42502 -3274382 -4827931 -8265034 -9233859 -6273368 -2416369 -501771 138309 971915 1125193
42493 1125193 -758392 -3460604 -4448295 -3138742 -998840 658624 1316497 742734 -459097
42484 -459097 -782308 31190 -129561 -2831165 -6123942 -6695056 -4265279 -1536564 -219485
42475 -219485 469137 1453263 2423417 3249077 4585040 6268519 6809353 5337586 2791462
42466 2791462 505699 -1267393 -2905747 -4542615 -6099428 -7237131 -6976534 -4391850
$$ packed form
42529D048127j988653k193542j514295p11566l26492O9720Q73286J602256J482272
42520A341113N06841l68802j77688Q16522J163817O6067j260095j115118J11707
42511A084364M08052q74663k284747k699241k429381j514254N71814K602915J860759
42502c274382j553549l437103r68825K960491L856999J914598O40080Q33606J53278
42493A125193j883585k702212r87691J309553K139902J657464O57873n73763j201831
42484d59097l23211Q13498j60751k701604l292777n71114K429777K728715J317079
42475b19485O88622R84126R70154Q25660J335963J683479N40834j471767k546124
42466B791462k285763j773092j638354j636868j556813j137703K60597K584684
$$ plain form
42458 -4391850 8079 4528629 8028556 10357866 11198479 10111319 8019405 6788546
42450 6788546 6519809 5047967 1444092 -1551723 -494669 4186179 8449457 9154175
42442 9154175 6594981 2746205 -856172 -2791882 -1452909 2922968 6814534 6379880
42434 6379880 2251260 -545607 1513849 6239083 8932810 8336324 6906940 5962565
42426 5962565 3905300 -40962 -3539010 -4385819 -3478488 -2313764 58670 4544041
42418 4544041 8336220 7578822 2986843 -914095 -2017635 -2348161 -3277405 -3210603 -1421194
42409 -1421194 -262879 -1220084 -2006435 -437594 1480906 607218 -2203340 -3598729 -3163279
42400 -3163279 -3686790 -6275614 -8470134 -7655723 -3893849 903619 4389409 4317082 221269
$$ packed form
42458d391850M399929M520550L499927K329310Q40613j087160k091914j230859
42450F788546k68737j471842l603875k995815J057054M680848M263278P04718
42442I154175k559194l848776l602377j935710J338973M375877L891566m34654
42434F379880m128620k796867K059456M725234K693727n96486j429384r44375
42426E962565k057265l946262l498048q46809R07331J164724K372434M485371
42418D544041L792179p57398m591979l900938j103540l30526r29244O6802J789409
42409a421194J158315r57205p86351J568841J918500q73688k810558j395389M35450
42400c163279n23511k588824k194520Q14411L761874M797468L485790p2327m095813
$$ plain form
42391 221269 -4878679 -6746748 -4668638 -1993524 -1463957 -2287539 -2602553 -2226753 -1415510
42382 -1415510 717264 4287139 6846548 5960864 2537692 -639429 -2666983 -4253173
42374 -4253173 -4546351 -1623343 3436293 6242322 4479826 1193776 620355 2492067
42366 2492067 2985133 411152 -2721867 -3443271 -1852176 -135567 320040 -249820 -1099176
42357 -1099176 -1850874 -2578895 -3510901 -4365557 -3978552 -1417213 2278168 4453462 3530622
42348 3530622 580082 -2214770 -3589793 -3053739 -186776 4333788 7917840 8255888
42340 8255888 6224432 4902483 5522675 5982193 3844919 -532371 -4515649 -5800941
42332 -5800941 -3999132 -693210 1420819 410864 -2992911 -5866486 -6010804 -3993682
$$ packed form
42391B21269n099948j868069K078110K675114N29567q23582l15014L75800Q11243
42382a415510K132774L569875K559409q85684l423172l177121k027554j586190
42374d253173k93178K923008N059636K806029j762496l286050n73421J871712
42366B492067M93066k573981l133019p21404J591095J716609M55607n69860q49356
42357a099176p51698p28021r32006q54656L87005K561339L695381K175294r22840
42348C530622k950540k794852j375023N36054K866963M520564L584052L38048
42340H255888k031456j321949O20192M59518k137274m377290l983278j285292
42332e800941J801809L305922K114029j009955l403775k873575j44318K017122
$$ plain form
42324 -3993682 -2077610 -1797151 -2834580 -3570087 -2607605 -559575 -132483 -3036771 -6868512
42315 -6868512 -7129001 -2942441 1522091 2523958 1176417 392417 -124714 -2585745 -6372530
42306 -6372530 -8507088 -8438574 -8361409 -8371878 -5598080 179489 4162203 2954385 257870
42297 257870 1975086 7347229 9738459 6237040 1798230 2060697 5769008 7417384
42289 7417384 5211109 2757416 3357244 5943054 7492248 6994722 5528091 3995287
42281 3995287 2589131 1781110 2164770 3391946 4474315 5083654 5387116 4640340 1473525
42272 1473525 -3807148 -8482010 -10043471 -8823665 -6998705 -5570678 -3561638 -52559
42264 -52559 4139795 7130452 7660837 5960466 3426640 1514165 495903 -646149 -2694789
$$ packed form
42324c993682J916072K80459j037429p35507R62482K048030M27092k904288l831741
42315f868512k60489M186560M464532J001867j347541p84000n17131k461031l786785
42306f372530k134558O8514P7165j0469K773798N777569L982714j207818k696515
42297B57870J717216N372143K391230l501419m438810K62467L708311J648376
42289G417384k206275k453693N99828K585810J549194m97526j466631j532804
42281C995287j406156q08021L83660J227176J082369O09339L03462p46776l166815
42272A473525n280673m674862j561461J219806J824960J428027K009040L509079
42264e2559M192354K990657N30385j700371k533826j912475j018262j142052k048640
$$ plain form
42255 -2694789 -4835140 -5493615 -4291378 -2232108 -53805 2374237 4710713 5552616
42247 5552616 4159420 1918799 954797 1681375 2762417 3200114 3260095 3238301 2535858
42238 2535858 621559 -1827131 -3518564 -3928766 -3429064 -2297939 -423829 1889986
42230 1889986 3537019 3493851 1816045 -559065 -2746578 -4350651 -5272499 -5576661 -5492939
42221 -5492939 -5231074 -4947990 -5170580 -6698764 -9205357 -10315075 -7629085 -2165445 1692184
42212 1692184 916120 -2457147 -3869736 -1902167 514761 571353 -893006 -1330901 -142752
42203 -142752 1408512 2838487 4667819 6095970 4872984 619146 -3427986 -3699335
42195 -3699335 -519259 2570826 3191486 2022856 547359 -809287 -1612683 -804978 1176690
$$ packed form
42255b694789k140351o58475J202237K059270K178303K428042K336476Q41903
42247E552616j393196k240621r64002P26578J081042M37697N9981k1794p02443
42238B535858j914299k448690j691433m10202M99702J131125J874110K313815
42230A889986J647033m3168j677806k375110k187513j604073r21848l04162Q3722
42221e492939K61865K83084k22590j528184k506593j109718K685990N463640L857629
42212A692184p76064l373267j412589J967569K416928N6592j464359m37895J188149
42203a42752J551264J429975J829332J428151j222986m253838m047132k71349
42195c699335L180076L090085O20660j168630j475497j356646q03396Q07705J981668
$$ plain form
42186 1176690 1424594 -1982340 -6516192 -7665006 -4446133 36041 3345604 6016115
42178 6016115 8523750 9310222 7744093 6348885 7376036 8999864 7912971 4517223
42170 4517223 2249790 2128107 1364232 -1930553 -5605705 -6486781 -4465120 -1887828 -114661
42161 -114661 1666836 4530702 7707325 8579487 5067442 -1432337 -6203140 -5802395 -2188272
42152 -2188272 -430004 -2434882 -5305624 -6259381 -6206790 -6924997 -7455458 -6014301 -3726168
42143 -3726168 -3321735 -4783990 -5276129 -3528190 -1607091 -1503042 -2144181 -1224548 1321462
42134 1321462 3211614 2754241 749842 -651989 -395819 489187 244920 -1561242 -3621680
42125 -3621680 -4338515 -3116215 -320291 3050902 5359574 5158642 2809451 377016
$$ packed form
42186A176690K47904l406934m533852j148814L218873M482174L309563K670511
42178F016115K507635P86472j566129j395208J027151J623828j086893l395748
42170D517223k267433j21683p63875l294785l675152q81076K021661K577292J773167
42161a14661J781497K863866L176623Q72162l512045o499779m770803M00745L614123
42152b188272J758268k004878k870742r53757N2591p18207n30461J441157K288133
42143c726168M04433j462255m92139J747939J921099J04049o41139R19633K546010
42134A321462J890152m57373k004399j401831K56170Q85006k44267j806162k060438
42125c621680p16835J222300K795924L371193K308672k00932k349191k432435
$$ plain form
42117 377016 -774170 -1112411 -828323 1579758 6546789 10684382 9936740 5443850 3117575
42108 3117575 6322767 11617683 13518446 11414230 9349976 10089845 12081359 12402220
42100 12402220 10552397 8399855 7571072 7926778 8179878 7244637 4961613 1907411 -1247032
42091 -1247032 -4099401 -6293063 -7210490 -6223427 -3363856 351475 3410466 4728744
42083 4728744 4136215 2057834 -903119 -3700678 -4601492 -2329411 2131999 5809146
42075 5809146 6616085 5394282 4368679 4280976 4065340 2761541 519338 -1855325 -3061142
42066 -3061142 -1559361 2566033 6272296 6239249 3219550 1571846 3712682 7139663
42058 7139663 8094465 6090011 3197031 823868 -577869 -198821 1967089 3503860
$$ packed form
42117C77016j151186l38241K84088K408081M967031M137593p47642m492890k326275
42108C117575L205192N294916J900763k104216k064254P39869J991514L20861
42100A2402220j849823k152542q28783L55706K53100r35241k283024l054202l154443
42091a247032k852369k193662r17427R87063K859571L715331L058991J318278
42083D728744n92529k078381k960953k797559r00814K272081M461410L677147
42075E809146Q06939j221803j025603q7703k15636j303799k242203k374663j205817
42066c061142J501781M125394L706263l3047l019699j647704K140836L426981
42058G139663R54802k004454k892980k373163j401737L79048K165910J536771
$$ plain form
42050 3503860 2013917 -1037866 -1800740 341688 1627404 -430305 -2975830 -1606614
42042 -1606614 3424722 7311746 6478394 2155636 -1904940 -3550364 -3433490 -3248985 -3709044
42033 -3709044 -4035011 -2982364 -340389 2562267 3999604 3516221 2307941 1923900 2710201
42024 2710201 3565417 3153869 1279505 -999478 -2547648 -3166846 -3316992 -3262196 -3073462
42015 -3073462 -3352123 -5170674 -8837845 -13009436 -15443280 -14714353 -11218296 -6739430
42007 -6739430 -3229852 -1852282 -2731096 -5035625 -7056378 -6832179 -3791817 56396
41999 56396 1604195 -111453 -3007111 -4938293 -6426347 -9109824 -12450129 -13977559
41991 -13977559 -12697878 -10369299 -9026947 -8827597 -8845524 -8540852 -7829236 -7018428 -7229391
$$ packed form
42050C503860j489943l051783p62874K142428J285716k057709k545525J369216
42042a606614N031336L887024q33352m322758m060576j645424J16874J84505m60059
42033c709044l25967J052647K641975K902656J437337m83383j208280l84041P86301
42024B710201Q55216m11548j874364k278983j548170o19198j50146N4796J88734
42015c073462k78661j818551l667171m171591k433844P28927L496057M478866
42007f739430L509578J377570q78814k304529k020753K24199L040362L848213
41999E6396J547799j715648k895658j931182j488054k683477l340305j527430
41991a3977559J279681K328579J342352J99350j7927L04672P11616Q10808k10963
$$ plain form
41982 -7229391 -9463052 -12602777 -13855732 -12008686 -8758943 -5996888 -3592481 -1105158
41974 -1105158 314326 -298848 -1553550 -1456367 -214976 696935 1002795 920091 -575034
41965 -575034 -3895422 -6402067 -5313478 -2544358 -2830164 -6860320 -10215483 -9905394 -7839884
41956 -7839884 -6231940 -3792797 661491 4394301 4363542 2375143 2736665 6064581 9016154
41947 9016154 9406825 8178070 6594814 4749434 3084052 2565431 2771628 2036518 -1419
41938 -1419 -1801893 -2059284 -798381 1392227 3309403 2861332 -607647 -3925984 -2880763
41929 -2880763 2364023 7418912 9454182 9582813 8934953 6414669 2293180 188925
41921 188925 2190154 4724879 3051195 -1807146 -4457370 -2703352 37335 41611 -2331294
$$ packed form
41982g229391k233661l139725j252955J847046L249743K762055K404407K487323
41974a105158J419484o13174j254702R7183J241391R11911L05860q2704j495125
41965e75034l320388k506645J088589K769120k85806m030156l355163L10089K065510
41956g839884J607944K439143M454288L732810l0759j988399L61522L327916K951573
41947I016154L90671j228755j583256j845380j665382n18621K06197p35110k037937
41938a419j800474k57391J260903K190608J917176m48071l468979l318337J045221
41929b880763N244786N054889K035270J28631o47860k520284m121489k104255
41921A88925K001229K534725j673684m858341k650224J754018K740687M276k372905
$$ plain form
41912 -2331294 -4506051 -5350460 -5557377 -5957971 -6684595 -7164542 -6332897 -3640428 -149825
41903 -149825 2217609 2683589 2004321 965470 -268796 -1189259 -770677 1113320 3192820
41894 3192820 4391791 5023396 5717784 6004507 4947228 2854774 1481412 2337677 5064878
41885 5064878 7548683 7668481 5107259 1462521 -1454634 -3112782 -3838309 -3522683 -1669407
41876 -1669407 1293845 3601273 3479709 681569 -3297874 -6204775 -6366792 -3657975
41868 -3657975 573694 4619938 7449280 8795848 8894656 8536537 8754448 9699377 10140493
41859 10140493 8756392 5684427 2247854 -443699 -1965218 -2139151 -1021144 895210
41851 895210 3081488 5138488 6032908 4241899 -69326 -3965448 -4652768 -2920732 -1666991
$$ packed form
41912b331294k174757q44409k06917m00594p26624m79947Q31645K692469L490603
41903a49825K367434M65980o79268j038851j234266r20463M18582J883997K079500
41894C192820J198971O31605O94388K86723j057279k092454j373362Q56265K727201
41885E064878K483805J19798k561222l644738k917155j658148p25527L15626J853276
41876a669407K963252K307428j21564k798140l979443k906901j62017K708817
41868c657975M231669M046244K829342J346568R8808l58119K17911R44929M41116
41859A0140493j384101l071965l436573k691553j521519j73933J118007J916354
41851H95210K186278K057000Q94420j791009m311225l896122o87320J732036J253741
$$ plain form
41842 -1666991 -1445826 -172931 2463369 3458942 1018669 -1965760 -1634750 1085025 1462420
41833 1462420 -2479841 -7118585 -7870019 -4839278 -2382587 -3810947 -7929386 -10956238
41825 -10956238 -10902700 -9274707 -8655778 -9614929 -10692023 -10806056 -10395202 -10065655 -9447682
41816 -9447682 -8228987 -7428550 -8377566 -10530825 -11339957 -8808369 -3835060 372696 1228669
41807 1228669 -1044653 -4119932 -6043246 -6575729 -6429553 -6251644 -6626383 -7845051 -8847645
41798 -8847645 -7621020 -4017658 -1090365 -1645856 -4123071 -4348671 -1412562 888120
41790 888120 -624277 -4132498 -5398531 -3032489 622363 2819816 2884720 1828062 843158
41781 843158 133465 -1240647 -3826136 -6000974 -5123661 -1075722 2930999 4161963 3441775
$$ packed form
41842a666991K21165J272895K636300R95573k440273k984429L31010K719775L77395
41833A462420l942261m638744p51434L030741K456691j428360m118439l026852
41825a0956238N3538J627993O18929r59151j077094j14033M10854L29547O17973
41816i447682J218695Q00437r49016k153259q09132K531588M973309M207756Q55973
41807A228669k273322l075279j923314n32483J46176J77909l74739j218668j002594
41798h847645J226625L603362K927293n55491k477215k25600K936109K300682
41790H88120j512397l508221j266033K366042L654852K197453O4904j056658r84904
41781H43158p09693j374112k585489k174838Q77313M047939M006721J230964p20188
$$ plain form
41772 3441775 3074891 3279340 2663666 1148601 143661 172924 258352 -335521 -1179283
41763 -1179283 -1451444 -588003 1464994 3712021 4587322 4073910 4278489 6443629 8613486
41754 8613486 8235412 5986338 4623829 4882869 5293435 5581827 7009153 9016849 8790671
41745 8790671 5380436 1647306 586724 1712324 2546016 1955298 478058 -1260359
41737 -1260359 -2886801 -3946816 -4429643 -4916392 -5459219 -5218081 -3864083 -2378194 -1883652
41728 -1883652 -2611659 -4290710 -6382201 -7842364 -8196227 -8851061 -11272717 -13756511 -12847543
41719 -12847543 -8787936 -6306754 -8140720 -10847287 -9838772 -6058153 -4173915 -5799562
41711 -5799562 -8281879 -9476603 -9971454 -10385135 -9782643 -7721979 -5511102 -4494280 -4728942
$$ packed form
41772C441775l66884K04449o15674j515065j004940K9263Q5428n93873q43762
41763a179283k72161Q63441K052997K247027Q75301n13412K04579K165140K169857
41754H613486l78074k249074j362509K59040M10566K88392J427326K007696k26178
41745H790671l410235l733130j060582J125600Q33692n90718j477240j738417
41737a260359j626442j060015m82827m86749n42827K41138J353998J485889M94542
41728a883652p28007j679051k091491j460163l53863o54834k421656k483794R08968
41719a2847543M059607K481182j833966k706567J008515L780619J884238j625647
41711e799562k482317j194724m94851m13681O02492K060664K210877J016822k34662
$$ plain form
41702 -4728942 -5793759 -7311118 -8420414 -8337121 -7623836 -7390235 -7257913 -5782342 -2836514
41693 -2836514 143628 2095967 2661794 1089418 -2638533 -5780303 -5020574 -1170770
41685 -1170770 1394494 820241 -24520 1214652 2541175 1439466 -705137 -1362456 -1510873
41676 -1510873 -3540348 -6102829 -5511095 -1951569 42104 -1765461 -3841508 -1837281
41668 -1837281 3578387 7878625 8106848 5369478 2850283 2800839 5070891 7641384 8671227
41659 8671227 8139774 7075847 5628864 3169191 119051 -2017702 -2756088 -3080022 -3318335
41650 -3318335 -2420672 -203436 1552858 1528859 724373 423593 -30422 -1517852 -2667989
41641 -2667989 -1545750 1030233 2384476 1854441 1337662 2078951 3405964 4858965 6929728
$$ packed form
41702d728942j064817j517359j109296Q3293P13285K33601J32322J475571K945828
41693b836514K980142J952339N65827j572376l727951l141770P59729L849804
41685a170770K565264n74253q44761J239172J326523j101709k144603o57319j48417
41676a510873k029475k562481N91734L559526J993673j807565k076047K004227
41668a837281N415668M300238K28223k737370k519195m9444K270052K570493J029843
41659H671227n31453j063927j446983k459673l050140k136753p38386l23934k38313
41650c318335Q97663K217236J756294k3999q04486l00780m54015j487430j150137
41641b667989J122239K575983J354243n30035n16779P41289J327013J453001K070763
$$ plain form
41632 6929728 8956229 8862640 6265019 3623343 2890194 3169038 3324494 4466417 7269306
41623 7269306 8945034 6519395 2153256 1177637 4513388 6886052 4002571 -1843376
41615 -1843376 -5654066 -6551002 -7499758 -9634566 -10480282 -8094629 -4121568 -1552844 -1246912
41606 -1246912 -1897521 -2200997 -1721553 -359766 1614442 3063087 2610387 193995 -2429694
41597 -2429694 -3000402 -523994 4059638 8559150 10926789 10557754 8639816 7107586
41589 7107586 6961347 7556739 7581160 6564293 5228148 4478439 4391229 4238462 3191487
41580 3191487 869378 -2451996 -5839127 -8098901 -8574956 -7615495 -6162693 -5041533
41572 -5041533 -4754821 -5532860 -7078255 -8515584 -9185533 -9301813 -9144413 -7901080 -4548372
$$ packed form
41632F929728K026501r3589k597621k641676p33149K78844J55456J141923K802889
41623G269306J675728k425639m366139r75619L335751K372664k883481n845947
41615a843376l810690q96936r48756k134808q45716K385653L973061K568724L05932
41606a246912o50609l03476M79444J361787J974208J448645m52700k416392k623689
41597b429694n70708K476408M583632M499512K367639l69035j917938j532230
41589G107586j46239N95392K4421j016867j336145p49709q7210j52767j046975
41580C191487k322109l321374l387131k259774m76055R59461J452802J121160
41572e041533K86712p78039j545395j437329o69949j16280J57400J243333L352708
$$ plain form
41563 -4548372 -93232 2574225 2121481 920595 2152632 5378433 6993934 5223617
41555 5223617 2498727 1799990 2521225 1952445 -233833 -1505192 -407166 1522992 2547236
41546 2547236 3118952 3966482 3831790 1571676 -735990 143815 3553336 5067970 2576350
41537 2576350 -568244 -200410 3171850 5960015 6964294 8268384 11148548 13946263
41529 13946263 14528602 12787692 10037702 7554604 6267216 6353579 6522107 5103811 2412707
41520 2412707 508770 12509 -995730 -3722208 -6065225 -5127209 -1260201 2324035
41512 2324035 3473885 2919917 2502204 3236858 5017831 6572686 5638390 1021346 -4859897
41503 -4859897 -7152440 -3625121 2313437 4945315 2201336 -2820627 -5968566 -6173210
$$ packed form
41563d548372M455140K667457m52744j200886J232037L225801J615501j770317
41555E223617k724890o98737P21235n68780k186278j271359J098026J930158J024244
41546B547236N71716Q47530j34692k260114k307666Q79805L409521J514634k491620
41537B576350l144594L67834L372260K788165J004279J304090K880164K797715
41529A3946263N82339j740910k749990k483098j287388Q6363J68528j418296k691104
41520B412707j903937m96261j008239k726478k343017R38016L867008L584236
41512B324035J149850n53968m17713P34654J780973J554855r34296m617044n881243
41503d859897k292543L527319N938558K631878k743979n021963l147939k04644
$$ plain form
41495 -6173210 -5057816 -3842337 -2073927 860996 4251380 6436380 6015899 2736743
41487 2736743 -1861786 -4756703 -4002386 -1547624 -1646231 -5180416 -7532643 -4400315 1841119
41478 1841119 4808377 2469370 -895070 -1435874 -464212 -808290 -2080961 -2415652 -2313378
41469 -2313378 -3390002 -4749984 -3884260 -659060 2247578 2702251 941153 -1427762
41461 -1427762 -2377757 -298399 3882976 6205712 3806839 -1012260 -3451489 -2463681
41453 -2463681 -1415880 -2642979 -4559551 -4773874 -3113679 -581506 2070189 3591766
41445 3591766 2480398 -699168 -3207526 -3433349 -2432282 -1426748 -109118 1546539
41437 1546539 2327646 2063272 2378173 3542565 3211498 429018 -1795419 -824910 925621
$$ packed form
41495f173210J115394J215479J768410K934923L390384K185000m20481l279156
41487B736743m598529k894917P54317K454762r8607l534185k352227L132328O241434
41478A841119K967258k339007l364440n40804R71662l44078j272671l34691J02274
41469b313378j076624j359982Q65724L225200K906638M54673j761098k368915
41461a427762r49995K079358M181375K322736k398873m819099k439229R87808
41453b463681J047801j227099j916572k14323J660195K532173K651695J521577
41445C591766j111368l179566k508358k25823J001067J005534J317630J655657
41437A546539P81107k64374L14901J164392l31067k782480k224437R70509J750531
$$ plain form
41428 925621 -779923 -5483788 -8585771 -7934245 -6113866 -5778703 -6180424 -5636447 -4714038
41419 -4714038 -4990789 -6156442 -6209330 -4098124 -1055948 628302 -277467 -2962277 -5540712
41410 -5540712 -6930172 -7401497 -7316527 -6348417 -4488079 -2696257 -1590421 -469279 1278857
41401 1278857 2835822 3273408 3081409 2855088 1704448 -948358 -2985785 -1616167 2483271
41392 2483271 5468661 4820747 1377558 -2964790 -6994651 -9396958 -9058873 -7146240
41384 -7146240 -6488888 -7771330 -8529038 -7086977 -5119373 -4644142 -4748119 -3591225 -1926762
41375 -1926762 -1924377 -3434079 -4100471 -2936650 -1376054 -553393 315915 2089509 3794682
41366 3794682 3614082 1058064 -2503636 -5078240 -5544749 -4352277 -2945625 -2235836 -1723165
$$ packed form
41428I25621j705544m703865l101983O51526J820379L35163m01721N43977R22409
41419d714038k76751j165653n2888K111206L042176J684250r05769k684810k578435
41410e540712j389460m71325Q4970R68110J860338J791822J105836J121142J748136
41401A278857J556965M37586j91999k26321j150640k652806k037427J369618M099438
41392B483271K985390o47914l443189m342348m029861k402307L38085J912633
41384g146240O57352j282442p57708J442061J967604M75231j03977J156894J664463
41375a926762K385j509702o66392J163821J560596Q22661Q69308J773594J705173
41366C794682j80600k556018l561700k574604m66509J192472J406652P09789N12671
$$ plain form
41357 -1723165 -503057 1168750 2106773 1957463 1742522 2134581 1990242 -286409 -3958529
41348 -3958529 -5802686 -3752196 -76635 680404 -2738663 -6464238 -6368043 -3262204 -1151121
41339 -1151121 -1218060 -546023 2701952 5803038 5041897 811383 -3200828 -4975554 -5970848
41330 -5970848 -8049492 -10581396 -11312315 -9156342 -5550883 -3262398 -3772662 -5720975
41322 -5720975 -6513742 -5680909 -5457178 -7278432 -9189549 -8375074 -5101950 -1856139 840072
41313 840072 4873932 10311669 13549436 11486086 5860194 1437074 699215 2092176
41305 2092176 3049883 2836746 2042803 779328 -1521236 -4871756 -8059529 -9473002 -8547663
41296 -8547663 -6266951 -4100387 -2592580 -1359021 -316983 -112605 -994867 -2050813
$$ packed form
41357a723165J220108J671807R38023j49310k14941L92059j44339k276651l672120
41348c958529j844157K050490L675561P57039l419067l725575R6195L105839K111083
41339a151121o6939O72037L247975L101086p61141m230514m012211j774726r95294
41330e970848k078644k531904p30919K155973L605459K288485n10264j948313
41322e720975p92767Q32833K23731j821254j911117Q14475L273124L245811K696211
41313H40072M033860N437737L237767k063350n625892m423120p37859J392961
41305B092176R57707k13137p93943j263475k300564l350520l187773j413473R25339
41296h547663K280712K166564J507807J233559J042038K04378q82262j055946
$$ plain form
41288 -2050813 -2297601 -2030302 -2200709 -2757413 -2671635 -1671785 -849308 -1056518 -1629403 -1544952
41278 -1544952 -1247116 -2203124 -4685557 -7022483 -7462291 -6111566 -4528970 -3938694 -4502566
41269 -4502566 -5923029 -7695873 -8613226 -7157095 -3392142 -20227 -234119 -4047084
41261 -4047084 -7678820 -7529433 -4305071 -2013040 -2914462 -5005327 -5241210 -3702213 -2734835
41252 -2734835 -2783053 -1633269 1717801 4862669 5188671 3544795 2643062 2916430 2454706
41243 2454706 759118 -72959 1416881 3782582 4823654 4413596 3883034 3867413 4238940
41234 4238940 5181334 6635243 7246209 5710095 3213834 2875310 6153640 10944571 13927601
41225 13927601 13956643 12332044 10379738 7965243 4522073 559735 -2586393 -4142425
$$ packed form
41288b050813k46788K67299j70407n56704Q5778R99850Q22477k07210n72885Q4451
41278a544952K97836r56008k482433k336926m39808J350725J582596N90276n63872
41269d502566j420463j772844r17353J456131L764953L371915k13892l812965
41261d047084l631736J49387L224362K292031r01422k090865k35883J538997R67378
41252b734835m8218J149784L351070L144868L26002j643876r01733K73368m61724
41243B454706j695588q32077J489840K365701J041072m10058n30562j5621L71527
41234D238940R42394J453909O10966j536114k496261l38524L278330M790931K983030
41225A3927601K9042j624599j952306k414495l443170l962338l146128j556032
$$ plain form
41217 -4142425 -4306072 -3477204 -2104798 -1448999 -3046386 -6312575 -7822549 -4820304 913299
41208 913299 4559339 3662611 227356 -2610226 -3605757 -2453665 1333452 6613190 9858260
41199 9858260 8828788 5703704 4058649 3914689 2718087 410345 -90151 2231779
41191 2231779 4593791 4604393 3386067 2818302 2283235 544546 -994093 263535 4068959
41182 4068959 7093429 6711542 3453222 -122750 -1567603 185481 4071120 7172472
41174 7172472 6922207 3388449 -1113768 -4295675 -5035714 -3138541 363403 2957201
41166 2957201 2624049 434398 -480041 949402 2371317 1649593 4368 -132250 1016057
41157 1016057 1160620 -106779 -446779 1641771 4436057 5354918 4282846 3114889 2875188
$$ packed form
41217d142425j63647Q28868J372406O55799j597387l266189j509974L002245N733603
41208I13299L646040q96728l435255k837582r95531J152092L787117N279738L245070
41199I858260j029472l125084j645055j43960j196602k307742n00496K321930
41191B231779K362012J0602j218326n67765n35067j738689j538639J257628L805424
41182D068959L024470l81887l258320l575972j444853J753084L885639L101352
41174G172472k50265l533758m502217l181907p40039J897173L501944K593798
41166B957201l33152k189651r14439J429443J421915p21724j645225j36618J148307
41157A016057J44563j267399l40000K088550K794286R18861j072072j167957k39701
$$ plain form
41148 2875188 2837724 2236560 1497348 1587201 2930137 4953979 6131429 4944169 1798016
41139 1798016 -557068 -16174 1762888 1184522 -2162924 -4569550 -3405310 -877921
41131 -877921 -588960 -2190510 -2233691 568236 3883900 5552944 6075462 6643020 7015595
41122 7015595 6477617 5156180 3267171 527553 -2557414 -4164653 -3173016 -686734
41114 -686734 1569373 3316055 4948887 5768954 4692034 2323894 746906 1057518 2109995
41105 2109995 1952202 -16157 -2427473 -3351319 -2498746 -1815556 -3123050 -5433745 -6082363
41096 -6082363 -4617443 -3464108 -3822952 -3281176 477925 5458196 7573258 6023195
41088 6023195 3559152 1931251 280813 -1677728 -2182243 -532442 866889 -492727
$$ packed form
41148B875188l7464o01164p39212Q9853J342936K023842J177450j187260l146153
41139A798016k355084N40894J779062n78366l347446k406626J164240K527389
41131h77921K88961j601550m3181K801927L315664J669044N22518N67558L72575
41122G015595n37978j321437j889009k739618l084967j607239R91637K486282
41114f86734K256107J746682J632832Q20067j076920k368140j576988L10612J052477
41105B109995j57793j968359k411316r23846Q52573O83190j307494k310695o48618
41096f082363J464920J153335l58844N41776L759101M980271K115062j550063
41088F023195k464043j627901j650438j958541n04515J649801J399331j359616
$$ plain form
41080 -492727 -3755790 -5987449 -5805424 -4183362 -2578853 -1832564 -2274176 -3390018 -3720849
41071 -3720849 -2418930 -678678 -368620 -1387235 -1729384 -374681 1192980 1013039 -722743
41062 -722743 -2005092 -1557891 -84726 1034740 1311537 915486 -265384 -2256630 -4055276
41053 -4055276 -4382650 -3460477 -2607556 -1724089 971046 5595879 8935358 8187699 4975973
41044 4975973 2988107 2505647 526409 -3641215 -6405855 -4722012 -9640 4381324
41036 4381324 7097765 8219572 7140658 3692583 -129852 -2254942 -3393648 -5342010
41028 -5342010 -7314380 -6811354 -3905339 -1803011 -2561573 -4527706 -4951684 -3424743 -1640702
41019 -1640702 -801071 -210335 1841450 5937700 10081542 11134035 8554490 5700767
$$ packed form
41080d92727l263063k231659J82025J622062J604509P46289m41612j115842l30831
41071c720849J301919J740252L10058j018615l42149J354703J567661j79941j735782
41062g22743j282349M47201J473165J119466K76797l96051j180870j991246j798646
41053d055276l27374R22173Q52921Q83467K695135M624833L339479p47659l211726
41044D975973j987866m82460j979238m167624k764640J683843M712372M390964
41036D381324K716441J121807j078914l448075l822435k125090j138706j948362
41028e342010j972370N03026K906015K102328p58562j966133m23978J526941J784041
41019a640702Q39631N90736K051785M096250M143842J052493k579545k853723
$$ plain form
41011 5700767 5870601 7878685 7564491 3207135 -2775230 -7305324 -9429775 -9578031 -8667859
41002 -8667859 -8497432 -10479492 -13122231 -13226480 -10594933 -8898437 -10377577 -12365239
40994 -12365239 -11212257 -7332942 -3787859 -1827956 -798049 -906036 -2649619 -4221405
40986 -4221405 -2974677 410548 2269076 899087 -1583751 -2920508 -3405146 -3804041
40978 -3804041 -3312112 -1479426 -156862 -1277490 -3888492 -5494793 -5609881 -5879632 -6953823
40969 -6953823 -7388268 -6206603 -4864281 -5474366 -7888884 -9782355 -9541979 -8079766 -7427701
40960 -7427701 -8277278 -9624703 -10440626 -10686284 -10594605 -9949595 -8587768 -6906381 -5370432
40951 -5370432 -4168186 -3740327 -4641697 -6150012 -6177854 -3829482 -1095020 -439555 -1491151
$$ packed form
41011E700767J69834K008084l14194m357356n982365m530094k124451j48256R10172
41002h667859J70427j982060k642739j04249K631547J696496j479140j987662
40994a2365239J152982L879315L545083J959903J029907j07987j743583j571786
40986d221405J246728L385225J858528j369989k482838j336757m84638l98895
40978c804041M91929J832686J322564j120628k611002j606301j15088k69751j074191
40969f953823m34445J181665J342322o10085k414518j893471K40376J462213O52065
40960g427701q49577j347425q15923k45658R1679O45010J361827J681387J535949
40951e370432J202246M27859r01370j508315k7842K348372K734462O55465j051596
$$ plain form
40942 -1491151 -2053046 -1880598 -2969685 -5754159 -7464505 -5522782 -900832 3270772
40934 3270772 5249142 5490596 4830461 3401119 1257902 -918864 -2031516 -1394591 458524
40925 458524 2039302 2609240 3278655 5359741 8004131 9055087 8099324 6671863 5285241
40916 5285241 2799975 -404187 -1476314 784155 3286293 2707920 319958 -271338
40908 -271338 1110689 1172027 -1548290 -4789077 -6378928 -6825856 -7179410 -7081396 -6354029
40899 -6354029 -6245677 -7330948 -7750262 -5255478 -59692 5542844 9456709 10817254
40891 10817254 10046313 9007035 9815015 12131650 12777234 9517200 4179243 370769
40883 370769 -847430 -967700 -616074 1081477 3593008 4308197 2091741 -553586 -681328
$$ packed form
40942a491151n61895J72448j089087k784474j710346J941723M621950M171604
40934C270772J978370K41454o60135j429342k143217k176766j112652O36925J853115
40925D58524J580778N69938O69415K081086K644390J050956r55763j427461j386622
40916E285241k485266l204162j072127K260469K502138n78373k387962n91296
40908b71338J382027O1338k720317l240787j589851m46928l53554R8014P27367
40899f354029J08352j085271m19314K494784N195786N602536L913865J360545
40891A0817254p70941j039278Q07980K316635O45584l260034n337957l808474
40883C70769j218199j20270L51626J697551K511531P15189k216456k645327j27742
$$ plain form
40874 -681328 1011024 1239299 -1263401 -4063568 -4102044 -1077383 2595462 4158929 2509085
40865 2509085 -1104561 -3734049 -2969514 571291 3474221 3094487 569533 -526254
40857 -526254 1805904 6322050 10643898 13596122 14954961 14186021 10772894 5587304
40849 5587304 943192 -1087145 -291050 1631306 2473438 1216487 -1373337 -3734346
40841 -3734346 -4884983 -4643230 -3054044 -517866 1699154 2285747 1506896 966156 1438236
40832 1438236 2135694 2604426 3856796 6556322 9375390 10639232 10714020 11161032 12073748
40823 12073748 11915238 9878585 6992317 4762223 3714328 3262370 2220492 -297852
40815 -297852 -3686582 -5923475 -5604596 -3396997 -886512 938429 1189429 -1263150 -5821510
$$ packed form
40874f81328J692352K28275k502700k800167l8476L024661L672845J563467j649844
40865B509085l613646k629488P64535L540805K902930l79734k524954j095787
40857e26254K332158M516146M321848K952224J358839p68940l413127n185590
40849E587304m644112k030337P96095J922356Q42132j256951k589824k361009
40841c734346j150637K41753J589186K536178K217020N86593p78851n40740M72080
40832A438236O97458M68732J252370K699526K819068J263842P4788M47012R12716
40823A2073748j58510k036653k886268k230094j047895m51958j041878k518344
40815b97852l388730k236893L18879K207599K510485J824941K51000k452579m558360
$$ plain form
40806 -5821510 -9244870 -9028254 -6744568 -5674680 -6183967 -6318631 -6015822 -7019325 -8765238
40797 -8765238 -8310522 -5078253 -2027394 -1075083 -925353 -640819 -1462102 -3216034 -2901415
40788 -2901415 422087 2917926 1402639 -1670198 -2290171 -1052735 -1011700 -1777809 -624474
40779 -624474 2026618 3325406 3556389 5879182 10367759 13340159 13570492 14271690 17022157
40770 17022157 18251970 14761725 9267162 6872503 8185139 9406217 8036302 5221627
40762 5221627 2836557 1244746 504246 1444895 4163038 6582904 6045977 2411957 -1369284
40753 -1369284 -2362934 -785640 854576 1303649 1559099 2118539 1597509 -376985 -1041854
40744 -1041854 2077975 6879500 8856526 7089333 4996587 5075429 6073421 6112940 5555324
$$ packed form
40806e821510l423360K16616K283686J069888n09287j34664L02809j003503j745913
40797h765238M54716L232269L050859R52311J49730K84534q21283j753932L14619
40788b901415L323502K495839j515287l072837o19973J237436M1035p66109J153335
40779f24474K651092J298788K30983K322793M488577K972400K30333P01198K750467
40770A7022157J229813l490245n494563k394659J312636J221078j369915k814675
40762E221627k385070j591811p40500R40649K718143K419866n36927l634020l781241
40753a369284r93650J577294J640216M49073K55450N59440n21030j974494o64869
40744a041854L119829M801525J977026j767193k092746P8842R97992L9519n57616
$$ plain form
40735 5555324 5268441 4537960 2612649 606422 -16780 231876 -374272 -2364724 -4571503
40726 -4571503 -5606441 -5169357 -4245569 -4126043 -4742317 -4459304 -2492272 -584216 -489624
40717 -489624 -798384 1012060 3959375 4505668 2362526 1441771 3715205 5898921 4515030
40708 4515030 1098849 -423159 865524 2954267 4518886 5616572 6093533 5846012
40700 5846012 5705789 6042312 5571713 3316193 439793 -1458622 -2180807 -1463080 1917490
40691 1917490 7146898 9903406 7246188 2421780 1412929 5667049 11229804 14035456
40683 14035456 13049008 9311702 5217772 3926435 6178775 8340914 6725452 2907750
40675 2907750 1316360 2665827 3906991 3882234 4273451 5074984 4228381 2420176 3065037
$$ packed form
40735E555324k86883p30481j925311k006227o23202K48656o06148j990452k206779
40726d571503j034938M37084R23788J19526o16274K83013J967032J908056R4592
40717d89624l08760J810444K947315N46293k143142r20755K273434K183716j383891
40708D515030l416181j522008J288683K088743J564619J097686M76961k47521
40700E846012j40223L36523m70599k255520k876400j898415p22185P17727L380570
40691A917490N229408K756508k657218m824408j008851M254120N562755K805652
40683A4035456r86448l737306m093930j291337K252340K162139j615462l817702
40675B907750j591390J349467J241164k4757L91217Q01533q46603j808205O44861
$$ plain form
40666 3065037 6048534 6556730 2447832 -1877701 -1961078 456198 1144675 -120967 -747172
40657 -747172 -413915 -862416 -2143302 -2792652 -2896191 -3919476 -6103697 -8448263 -10406323
40648 -10406323 -11339785 -9441901 -3809999 3152358 7798006 9134381 8692947 7526497
40640 7526497 5708011 3987919 3343885 3216595 2462355 1657746 2141043 3116231 2272005
40631 2272005 -588790 -2938841 -3057597 -2142397 -2154284 -3112579 -3311706 -1258416 2957860
40622 2957860 7382620 9266239 7388694 3418716 350711 -98717 1930020 5361315
40614 5361315 8479267 9335106 7511703 4830587 2853510 678843 -2935376 -6437477
40606 -6437477 -7149657 -5481378 -4458809 -4990009 -4758526 -2618891 -973708 -2031496 -4125388
$$ packed form
40666C065037K983497N08196m108898m325533q3377K417276O88477j265642o26205
40657g47172L33257m48501j280886o49350j03539j023285k184221k344566j958060
40648a0406323r33462J897884N631902O962357M645648J336375m41434j166450
40640G526497j818486j720092o44034j27290p54240q04609M83297R75188q44226
40631B272005k860795k350051j18756R15200j1887r58295j99127K053290M216276
40622B957860M424760J883619j877545l969978l068005m49428K028737L431295
40614E361315L117952Q55839j823403k681116j977077k174667l614219l502101
40606f437477p12180J668279J022569n31200K31483K139635J645183j057788k093892
$$ plain form
40597 -4125388 -4034759 -1501642 771469 810086 -954196 -3338483 -5828523 -7990105 -8873329
40588 -8873329 -7920964 -5972816 -4528175 -3910224 -2846008 -451599 1926514 2103443 243901
40579 243901 -1038549 -416368 218249 -1025445 -2759684 -2571268 -1115929 -901024 -1597934
40570 -1597934 -75077 4341124 7881480 7136749 3508691 1154157 2118466 5031754
40562 5031754 7318875 7239498 4679043 1186781 -1269982 -2186124 -2568679 -3227912 -4389830
40553 -4389830 -6840051 -11194448 -15481641 -15945344 -11599353 -5923033 -2584248 -1489340
40545 -1489340 -651555 291126 725188 1318654 2829422 3880388 2744738 584717 105777
40536 105777 1343050 1567069 -468767 -2715565 -2827310 -954919 1082781 1800665 724698
$$ packed form
40597d125388R0629K533117K273111L8617j764282k384287k490040k161582q83224
40588h873329R52365J948148J444641O17951J064216K394409K378113J76929j859542
40579B43901j282450O22181O34617j243694j734239J88416J455339K14905o96910
40570a597934J522857M416201L540356p44731l628058k354534R64309K913288
40562E031754K287121p9377k560455l492262k456763r16142l82555o59233j161918
40553d389830k450221m354397m287193m63703M345991N676320L338785J094908
40545a489340Q37785R42681M34062N93466J510768J050966j135650k160021m78940
40536A05777J237273K24019k035836k246798j11745J872391K037700P17884j075967
$$ plain form
40527 724698 -1464623 -2975655 -2317771 -33235 1979795 2853571 3273585 3777501 4048791
40518 4048791 4035979 4344872 5243740 6409774 7635779 8591557 8227695 6073806 3899428
40509 3899428 4075714 6173812 7269629 5947618 3815336 2496122 1494336 72730
40501 72730 -1047585 -1313325 -1615226 -2230138 -1343080 2330619 6939199 9748538 10870149
40492 10870149 12330132 14138427 13931009 10635563 6207244 3056570 1434873 186580
40484 186580 -1170872 -2178129 -2706862 -3581358 -5634978 -8254844 -9367326 -7636350 -4552755
40475 -4552755 -3117325 -4139104 -5326373 -4759925 -3455585 -3055342 -2840334 -1414440 -45041
40466 -45041 -1251497 -4354411 -5535067 -2939507 957336 3135938 3809039 4883316 6478023
$$ packed form
40527G24698k189321j511032O57884K284536K013030Q73776M20014N03916K71290
40518D048791j2812L08893Q98868J166034J226005R55778l63862k153889k174378
40509C899428J76286K098098J095817j322011k132282j319214j001786j421606
40501G2730j120315k65740l01901o14912Q87058L673699M608580K809339J121611
40492A0870149J459983J808295k07418l295446m428319l150674j621697j248293
40484A86580j357452j007257n28733q74496k053620k619866j112482J730976L083595
40475d552755J435430j021779j187269N66448J304340M00243K15008J425894J369399
40466d5041j206456l102914j180656K595560L896843K178602O73101J074277J594707
$$ plain form
40457 6478023 6844622 4840508 1106551 -2579177 -4305671 -3384588 -1562595 -1718301 -4337882
40448 -4337882 -6579165 -6161184 -4808963 -5815618 -8975664 -10342762 -7264184 -1727477
40440 -1727477 2125847 2659656 2066306 3562757 7853147 12318194 13653910 11279024
40432 11279024 7691314 5352551 4153802 2558063 119421 -2427574 -4800690 -7238626
40424 -7238626 -9218329 -9736307 -8929946 -7977073 -7322263 -6538656 -6066957 -7180719 -9507258
40415 -9507258 -10387204 -7958838 -3569334 158401 2420545 3815261 3900422 1396104 -3196322
40406 -3196322 -7104772 -8068935 -6401187 -3713345 -764558 2445330 5197162 6053961
40398 6053961 4613692 2421100 1403047 1559501 975830 -1476533 -4078254 -3864481 -239107
$$ packed form
40457F478023L66599k004114l733957l685728j726494R21083J821993j55706k619581
40448d337882k241283M17981J352221j006655l160046j367098L078578N536707
40440a727477L853324N33809n93350J496451M290390M465047J335716k374886
40432A1279024l587710k338763j198749j595739k438642k546995k373116k437936
40424g238626j979703n17978Q06361R52873O54810P83607M71699j113762k326539
40415i507258q79946K428366M389504L727735K262144J394716Q5161k504318m592426
40406c196322l908450r64163J667748K687842K948787L209888K751832Q56799
40398F053961j440269k192592j018053J56454n83671k452363k601721K13773L625374
$$ plain form
40389 -239107 4080683 6165987 5955052 5438933 5599122 5427803 3773536 953613 -1639587
40380 -1639587 -2611991 -1102364 2707145 7126211 9868728 10148166 9333715 8917393 8433594
40371 8433594 6303023 2408291 -1276230 -2816714 -2261263 -1135458 -710072 -1227732 -2204582
40362 -2204582 -2776765 -2124163 -356895 1155473 1116697 -52622 -668004 168997 1979096
40353 1979096 4422131 7894014 11815782 13845561 12453076 9426656 7932253 8462909
40345 8462909 8718731 7416036 5804710 4735619 2733232 -1275052 -5143941 -5754161
40337 -5754161 -3258839 -948871 -1130953 -2964835 -4350439 -4209492 -2615906 -228401
40329 -228401 1786802 2367578 1686892 969321 916399 1016608 492406 -875200 -2835219
$$ packed form
40389b39107M319790K085304k10935n16119J60189j71319j654267k819923k593200
40380a639587r72404J509627L809509M419066K742517K79438q14451m16322m83799
40371H433594k130571l894732l684521j540484N55451J125805M25386n17660r76850
40362b204582n72183O52602J767268J512368l8776j169319o15382Q37001J810099
40353A979096K443035L471883L921768K029779j392485l026420j494403N30656
40345H462909K55822j302695j611326j069091k002387m008284l868889o10220
40337e754161K495322K309968j82082j833882j385604J40947J593586K387505
40329b28401K015203N80776o80686p17571n2922J00209n24202j367606j960019
$$ plain form
40320 -2835219 -4612810 -4851400 -2849242 60475 1742153 2084678 2980995 4961189 5714396
40311 5714396 3206434 -1280151 -4868424 -6689987 -7861385 -8662366 -8065661 -6160290
40303 -6160290 -4879982 -5443231 -6552093 -6233265 -4524854 -3196152 -3293338 -4046358 -4124549
40294 -4124549 -3054673 -1153222 1208297 3631095 5268784 5207141 3620975 2018889
40286 2018889 1684446 2101632 1694403 96608 -1276956 -1269361 -619628 -780860 -1788075
40277 -1788075 -2294160 -1373571 686997 3171726 5405815 6403626 5252837 2434810 -25318
40268 -25318 -457238 728501 1648753 935456 -1269985 -3872117 -5763525 -6411695 -6083830
40259 -6083830 -5443156 -4505731 -2249908 1961513 6606391 8805996 7642136 5827620
$$ packed form
40320b835219j777591k38590K002158K909717J681678L42525Q96317J980194P53207
40311E714396k507962m486585l588273j821563j171398q00981N96705J905371
40303f160290J280308n63249j108862L18828J708411J328702r7186p53020p8191
40294d124549J069876J901451K361519K422798J637689o1643j586166j602086
40286B018889l34443M17186m07229j597795j373564P595O49733j61232j007215
40277a788075n06085R20589K060568K484729K234089R97811j150789k818027k460128
40268b5318m31920J185739R20252p13297k205441k602132j891408o48170L27865
40259f083830O40674R37425K255823M211421M644878K199605j163860j814516
$$ plain form
40251 5827620 6819707 10552979 13474359 13077645 10934924 10378278 12447465 15477216 17734434
40242 17734434 18665388 18016923 15912657 14126908 15194639 19269789 23562067 26169712
40234 26169712 28970689 34998786 44071817 53151848 60612522 67952186 76970291 87145485
40226 87145485 96719844 105189146 113793061 124158573 136920850 150935019 163406581
40219 163406581 171653637 175397897 176640702 176666904 173992284 166300162 153933912 140264727
40211 140264727 128544580 119326430 111131230 102630062 93562780 84301488 75575513 68489913
40203 68489913 63810581 60887772 57995422 54220460 50421115 47680414 45426478 42174000
40195 42174000 37869492 34104993 31659795 29169649 25160805 20484994 17529240 17328868
$$ packed form
40251E827620R92087L733272K921380l96714k142721n56646K069187L029751K257218
40242A7734434R30954o48465k104266j785749J067731M075150M292278K607645
40234B6169712K800977O028097R073031R080031P460674P339664R018105J0175194
40226H7145485R574359Q469302Q603915J0365512J2762277J4014169J2471562
40219A63406581Q247056L744260J242805K6202k674620p692122j2366250j3669185
40211A40264727j1720147r218150q195200q501168r067282r261292q725975p085600
40203F8489913m679332k922809k892350l774962l799345k740701k253936l252478
40195D2174000m304508l764499k445198k490146m008844m675811k955754k00372
$$ plain form
40187 17328868 18395213 18220885 15246797 9740039 3726641 -60873 -204213 2109886
40179 2109886 4298521 4884858 4374816 3996414 4430754 5670441 7100152 7433338 5416407
40170 5416407 1202080 -3212048 -5189803 -3203830 2093078 7984694 11335184 11098677
40162 11098677 9227886 8408501 9042725 9319361 8101055 6525823 6357464 7664192 8757011
40153 8757011 8059559 5728620 3564194 3166573 3985496 3840636 1965086 526660 1788713
40144 1788713 4620491 5821070 4537705 3011786 2779766 2780675 2145714 2220390 4015260
40135 4015260 5728034 5070486 2671838 863982 76420 -1134409 -3026351 -4235859
40127 -4235859 -4604229 -6151480 -10323733 -15678087 -19159635 -18929767 -15617685 -11584673
$$ packed form
40187A7328868J066345j74328k974088n506758o013398l787514j43340K314099
40179B109886K188635N86337n10042l78402M34340J239687J429711L33186k016931
40170E416407m214327m414128j977755J985973N296908N891616L350490k36507
40162A1098677j870791q19385O34224K76636j218306j575232j68359J306728J092819
40153H757011o97452k330939k164426l97621Q18923j44860j875550j438426J262053
40144A788713K831778J200579j283365j525919k32020R09o34961P4676J794870
40135D015260J712774o57548k398648j807856p87562j210829j891942j209508
40127d235859l68370j547251m172253n354354l481548K29868L312082M033012
$$ plain form
40119 -11584673 -9163445 -8830453 -8896357 -7530684 -4883605 -2449978 -780719 869451
40111 869451 2702292 3665298 3022204 1503940 351846 59949 475971 1284322 1869289
40102 1869289 1412275 -314749 -2681654 -4971793 -6863147 -7974437 -7725444 -6127801
40094 -6127801 -4154740 -2840091 -2357355 -2270942 -2271045 -2320300 -2368400 -2199958 -1491840 -149368
40084 -149368 1164196 1254560 -135182 -1398191 -649711 1797016 3736940 4083483 4166666
40075 4166666 5216519 5862347 3778430 -541456 -3389015 -1963795 2013428 3893508
40067 3893508 1253809 -3450525 -5869422 -4669333 -2422738 -1921629 -3224838 -4909467
40059 -4909467 -6477948 -7855064 -7628824 -4156295 1559019 6135596 7491009 6633463
$$ packed form
40119a1584673K421228L32992o5904J365673K647079K433627J669259J650170
40111H69451J832841R63006o43094j518264j152094k91897M16022Q08351N84967
40102A869289m57014j727024k366905k290139j891354j111290K48993J597643
40094f127801J973061J314649M82736Q6413j03m9255m8100J68442P08118J342472
40084a49368J313564R0364j389742j263009P48480K446727J939924L46543Q3183
40075D166666J049853O45828k083917m319886k847559J425220L977223J880080
40067C893508k639699m704334k418897J200089K246595N01109j303209j684629
40059d909467j568481j377116K26240L472529N715314M576577J355413q57546
$$ plain form
40051 6633463 5277270 3501088 866379 -1733823 -3018992 -3289226 -3877133 -4992191
40043 -4992191 -5478255 -4690135 -3536630 -3464630 -4984663 -7114037 -7781991 -5202122 194602
40034 194602 5215524 6290097 2936979 -1528987 -3155673 -1131681 1748973 2264150
40026 2264150 113903 -2061935 -1762005 864008 3728774 5240360 5253142 4134249 2124473
40017 2124473 -219529 -1943553 -2532875 -2367304 -2193943 -2541683 -3461639 -4219017 -3601788
40008 -3601788 -1491966 225254 -395303 -2693305 -4138678 -3629184 -2328250 -1171155
40000 -1171155 318607 2155041 3061389 2616917 2241788 2750029 2869036 1750652 1038552
39991 1038552 2473943 5053302 6677275 7242236 7934014 8754891 9023397 9054476 8913297
$$ packed form
40051F633463j356193j776182k634709k600202j285169k70234n87907j115058
40043d992191m86064P88120J153505P2000j520033k129374o67954K579869N396724
40034A94602N020922J074573l353118m465966j626686K023992K880654N15177
40026B264150k150247k175838K99930K626013K864766J511586J2782j118893k009776
40017B124473k344002j724024n89322J65571J73361l47740r19956p57378O17229
40008c601788K109822J717220o20557k298002j445373N09494J300934J157095
40000a171155J489762J836434R06348m44472l75129N08241J19007j118384p12100
39991A038552J435391K579359J623973N64961O91778Q20877K68506L1079j41179
$$ plain form
39982 8913297 6871219 1995026 -2933353 -4421909 -3284052 -2928766 -3335851 -1309364
39974 -1309364 3003570 4968759 2619026 213570 1650659 4300934 3374313 -453075
39966 -453075 -2353408 -750998 1212726 1363761 1343327 2785235 4094837 2954982 13008
39957 13008 -1802360 -686332 2584672 5916770 7531578 6680208 3756409 75841 -2733572
39948 -2733572 -3592062 -2647956 -1120353 -116211 349322 686673 369380 -1644496 -4899003
39939 -4899003 -7042797 -6145001 -2666889 1256066 3586274 3265391 844268 -1133065
39931 -1133065 -66385 3282693 4955389 2788759 -453390 -875758 1142624 1858791
39923 1858791 -453095 -3769536 -5622430 -5427469 -3402294 146828 3705810 4964741
$$ packed form
39982H913297k042078m876193m928379j488556J137857L55286m07085K026487
39974a309364M312934J965189k349733k405456J437089K650275r26621l827388
39966d53075j900333J602410J963724J51035k0434J441908J309602j139855k941974
39957A3008j815368J116028L271004L332098J614808q51370k923799l680568k809413
39948b733572q58490R44106J527603J004142M65533L37351l17293k013876l254507
39939d899003k143794Q97796L478112L922955K330208l20883k421123j977333
39931a133065J066680L349078J672696k166630l242149m22368K018382P16167
39923A858791k311886l316441j852894J94961K025175L549122L558982J258931
$$ plain form
39915 4964741 3460491 1299383 500277 1013818 1855509 2554168 2815106 2371903 1943050
39906 1943050 2796513 4672203 5870237 6184110 7610536 10749439 12677539 10626902
39898 10626902 6148475 2944958 1628935 -244970 -3164627 -4157537 -1548014 1562410
39890 1562410 900528 -3288409 -6555879 -5897094 -2949981 -1148051 -1425442 -1852179 -559661
39881 -559661 2229204 4747755 5231610 3090134 -437483 -2792997 -2349060 -395364 130674
39872 130674 -1846759 -4522526 -6126836 -7220100 -8882003 -10101021 -8923941 -5518462
39864 -5518462 -2188148 -596694 -598209 -1457132 -2409974 -2272534 -530778 1187292 849787
39855 849787 -706279 -720344 884302 808247 -2421336 -5531079 -5164934 -3176167 -4100728
$$ packed form
39915D964741j504250k161108p99106N13541Q41691O98659K60938m43203m28853
39906A943050Q53463J875690J198034L13873J426426L138903J928100k050637
39898A0626902m478427l203517j316023j873905k919657r92910K609523L110424
39890A562410o61882m188937l267470O58785K947113J801930k77391m26737J292518
39881e59661K788865K518551M83855k141476l527617k355514M43937J953696N26038
39872A30674j977433k675767j604310j093264j661903j219018J177080L405479
39864e518462L330314J591454j515q58923r52842J37440J741756J718070l37505
39855H49787j556066j4065J604646p6055l229583l109743L66145J988767r24561
$$ plain form
39846 -4100728 -8443863 -11723940 -10322938 -5708153 -2081273 -1646340 -3244258 -4626668
39838 -4626668 -4925099 -4861200 -5091861 -5130047 -4493884 -4189624 -5422484 -6940781 -5908265
39829 -5908265 -2199325 515163 -496856 -3360201 -4692816 -4320835 -4210480 -4455495 -3797258
39820 -3797258 -3178493 -4873602 -7967627 -8451120 -4831214 -487059 957598 -104083
39812 -104083 -1227951 -1669486 -2052549 -2047185 -673098 1834372 4096390 5091746 4687698
39803 4687698 3430664 2518298 2977424 4129274 3911766 1369036 -2321319 -5712771 -8325611
39794 -8325611 -9410139 -7652042 -3491367 280185 2072717 3850088 7726203 11801513
39786 11801513 12182158 8329549 3642691 1041550 619043 1663611 4195417 7626062
$$ packed form
39846d100728m343135l280077J401002M614785L626880M34933j597918j382410
39838d626668k98431O3899k30661l8186O36163L04260j232860j518297J032516
39829e908265L708940K714488j012019k863345j332615L71981J10355k45015O58237
39820c797258O18765j695109l094025m83493L619906M344155J444657j061681
39812a04083j123868m41535l83063N364J374087K507470K262018R95356m04048
39803D687698j257034r12366M59126J151850k17508k542730l690355l391452k612840
39794h325611j084528J758097M160675L771552J792532J777371L876115M075310
39786A1801513L80645l852609m686858k601141m22507J044568K531806L430645
$$ plain form
39778 7626062 10058496 10130375 8268000 5438072 2015787 -1426028 -3581792 -3659933 -2331644
39769 -2331644 -806983 221719 330645 -820531 -2744366 -4142130 -4379412 -4143812 -4062691
39760 -4062691 -3697573 -2772885 -2363931 -3506896 -5179286 -5168620 -2985478 -621583 -24276
39751 -24276 -887994 -1638578 -1731767 -1805759 -1858174 -738194 1908798 4265023 4150190 1828077
39741 1828077 -301816 -841909 -804648 -1360342 -1619223 29855 3109874 5065010 4110835
39732 4110835 1103291 -1613396 -2605702 -2408216 -2457051 -3108113 -3082512 -1517665 -124757
39723 -124757 -1641444 -5754306 -8544432 -7224452 -3545487 -664853 1443549 4552834
39715 4552834 7437811 6395096 802814 -5223771 -7798730 -7097989 -5066121 -2212716
$$ packed form
39778G626062K432434P1879j862375k829928l422285l441815k155764p8141J328289
39769b331644J524661J028702J08926j151176j923835j397764k37282K35600Q1121
39760d062691L65118R24688M08954j142965j672390J0666K183142K363895N97307
39751b4276q63718p50584r3189p3992n2415J119980K646992K356225j14833k322113
39741A828077k129893n40093L7261n55694k58881J649078L080019J955136r54175
39732D110835l007544k716687r92306J97486m8835o51062K5601J564847J392908
39723a24757j516687m112862k790126J319980L678965K880634K108402L109285
39715D552834K884977j042715n592282o026585k574959P00741K031868K853405
$$ plain form
39707 -2212716 1324998 3929401 4315967 3844107 4720739 6822366 8282518 8349434 7651813
39698 7651813 6372189 4280466 2170681 1215299 1031242 252780 -1037957 -1304731 -84898
39689 -84898 1286848 1819379 2060256 2617067 2934217 2199887 363278 -2163835 -4651383
39680 -4651383 -5625988 -3884977 -690712 609773 -1521430 -4399495 -4168514 -689964
39672 -689964 2279276 1836523 -646304 -1554466 478136 3232652 3924719 2456987 920388
39663 920388 403222 -366675 -2706521 -5424435 -5850870 -3079449 1103345 4581905 6913081
39654 6913081 8521837 9197874 8546117 7298550 6829359 7219325 6805001 4258460 613169
39645 613169 -1601517 -1307664 -149078 -192574 -1017014 -430073 1923560 3466180 2271782
$$ packed form
39707b212716L537714K604403L86566m71860Q76632K101627J460152O6916o97621
39698G651813j279624k091723k109785r55382j84057p78462j290737k66774J219833
39689h4898J371746N32531K40877N56811L17150p34330j836609k527113k487548
39680d651383r74605J741011L194265J300485k131203k878065K30981L478550
39672f89964K969240m42753k482827r08162K032602K754516O92067j467732j536599
39663I20388n17166p69897k339846k717914m26435K771421M182794L478560K331176
39654F913081J608756O76037o51757j247567m69191L89966m14324k546541l645291
39645F13169k214686K93853J158586m3496q24440N86941K353633J542620j194398
$$ plain form
39636 2271782 224821 650434 3594712 5857221 5716133 5032752 5729991 6597808 5525129
39627 5525129 3276069 2601696 4205387 5930589 6082594 5507109 5688060 6430840 6577094
39618 6577094 5996104 5576686 5626166 5422296 4473267 3398018 3093992 3400200 3160231
39609 3160231 1732429 23768 -451724 511625 1359133 453241 -2195545 -5100976 -6712808
39600 -6712808 -6291942 -4010993 -1012901 905809 606922 -1254542 -2986150 -3688900 -3663954
39591 -3663954 -3215612 -2235707 -1208358 -1248736 -2266050 -2256815 138822 3030617 2967881
39582 2967881 -738226 -5052021 -7064904 -7142162 -7080716 -6614196 -3880776 997316 5066010
39573 5066010 5989444 4631568 3025434 1244895 -1746806 -4822223 -4785264 -519076 4836038
$$ packed form
39636B271782k046961M25613K944278K262509j41088o83381O97239Q67817j072679
39627E525129k249060o74373J603691J725202J52005n75485J80951P42780J46254
39618F577094n80990m19418M9480k03870r49029j075249l04026L06208k39969
39609C160231j427802j708661m75492R63349Q47508r05892k648786k905431j611832
39600f712808M20866K280949K998092J918710k98887j861464j731608p02750K4946
39591c663954M48342R79905J027349m0378j017314R235K395637K891795o2736
39582B967881l706107m313795k012883p7258O1446M66520K733420M878092M068694
39573E066010R23434j357876j606134j780539k991701l075417L6959M266188N355114
$$ plain form
39564 4836038 7377023 7062803 7091604 9111080 11153313 10953355 9470845 9435708 11222417
39555 11222417 12152119 10106620 6140063 2678932 595611 -413467 442880 4557746
39547 4557746 10789680 14922024 13667717 8125533 2032223 -2297054 -4670794 -4823664
39539 -4823664 -2272877 1468691 3318249 2596868 2449388 5463389 9585324 10830445
39531 10830445 9003912 7831344 9496948 11956722 12441233 10945254 8716086 5607104
39523 5607104 1302804 -2307709 -2786628 -763422 672690 358277 379919 2263930 4178654
39514 4178654 3558191 916998 -943485 -714921 410141 1242984 2131351 3546365 4743172
39505 4743172 4792429 4025295 3522352 3683819 4054471 4141199 3663490 2360504 457132
$$ packed form
39564D836038K540985l14220K8801K019476K042233j99958j482510l5137J786709
39555A1222417R29702k045499l966557l461131k083321j009078Q56347M114866
39547D557746O231934M132344j254307n542184o093310m329277k373740j52870
39539d823664K550787L741568J849558p21381j47480L014001M121935J245121
39531A0830445j826533j172568J665604K459774M84511j495979k229168l108982
39523E607104m304300l610513m78919K023206J436112l14413K1642J884011J914724
39514D178654o20463k641193j860483K28564J125062Q32843Q88367J415014J196807
39505D743172M9257p67134n02943J61467L70652Q6728m77709j302986j903372
$$ plain form
39496 457132 -795902 -90384 2051421 3160543 1307002 -2660985 -6030151 -7146706
39488 -7146706 -6635642 -5735547 -4536404 -2597496 -514567 444710 283534 635647 2566290
39479 2566290 4798287 4976359 2378433 -1358432 -4072152 -4963745 -4629337 -3819719 -2522310
39470 -2522310 -212761 3037797 5880654 6621900 5046407 2758571 1326034 727181
39462 727181 214673 -109831 295370 958594 746297 -421289 -1491665 -1905236 -1917964
39453 -1917964 -1208182 1160155 4752043 7237077 6806100 4025890 586161 -2425910
39445 -2425910 -4056246 -2957430 850666 4675835 5577339 3731564 1730701 875583
39437 875583 6124 -1908330 -3823016 -3925073 -1723093 1755744 5009293 6843332 6831388
$$ packed form
39496D57132j253034P05518K141805J109122j853541l967987l369166j116555
39488g146706N11064R00095J199143J938908K082929R59277j61176L52113J930643
39479B566290K231997J78072k597926l736865k713720q91593L34408Q09618J297409
39470b522310K309549L250558K842857P41246j575493k287836j432537n98853
39462G27181n12508l24504M05201O63224k12297j167586j070376m13571j2728
39453a917964P09782K368337L591888K485034m30977k780210l439729l012071
39445b425910j630336J098816L808096L825169R01504j845775k000863q55118
39437H75583q69459j914454j914686j02057K201980L478837L253549J834039j1944
$$ plain form
39428 6831388 5560795 4258084 4059710 5530321 8171777 10049052 9001950 5227353
39420 5227353 1655791 435204 71511 -2105014 -5512461 -6856960 -4991047 -2703547
39412 -2703547 -3085329 -6188551 -9958079 -12549983 -12983940 -11339252 -9141203 -7918499
39404 -7918499 -6843075 -3786237 741721 3309102 2437546 1073086 2279025 4927148
39396 4927148 6128752 5755007 5443027 4708814 1698690 -2676883 -4814268 -3060594 349831
39387 349831 2546939 2992283 2609336 1924228 904711 -620147 -2756827 -4751759 -4759922
39378 -4759922 -1986420 1339772 2159537 598823 -443879 267010 918859 268068 -165438
39369 -165438 1013198 2231116 913714 -3055714 -7388693 -9823962 -9371180 -6495556
$$ packed form
39428F831388j270593j302711j98374J470611K641456J877275j047102l774597
39420E227353l571562j220587l63693k176525l407447j344499J865913K287500
39412b703547l81782l103222l769528k591904m33957J644688K198049J222704
39404g918499J075424L056838M527958K567381q71556j364460J205939K648123
39396D927148J201604l73745l11980p34213l010124m375573k137385J753674L410425
39387C49831K197108M45344l82947o85108j019517j524858k136680j994932q163
39378d759922K773502L326192Q19765j560714j042702P10889O51849o50791m33506
39369a65438J178636J217918j317402l969428m332979k435269M52782K875624
$$ plain form
39361 -6495556 -3401989 -2761005 -4512428 -5073289 -1548108 4095189 6945918 4767472
39353 4767472 -107884 -4130697 -5711604 -4904816 -2188144 1138316 2743814 1323712
39345 1323712 -1265880 -1414681 2104680 6368050 7593103 5488750 2868069 1301782
39337 1301782 -494416 -3149700 -4242401 -1880980 1269934 1086920 -1686748 -2222600
39329 -2222600 1012776 3955842 3562007 2539098 4545737 8053879 8921644 6882164
39321 6882164 5167599 4762657 3401654 307780 -2070727 -1943629 -545553 473725
39313 473725 1130879 1287931 -430552 -3923886 -6000228 -3866774 981906 4500231 4994187
39304 4994187 4352353 4721441 5836048 6042180 4720963 2987310 2422436 3530666 5356673
$$ packed form
39361f495556L093567O40984j751423n60861L525181N643297K850729k178446
39353D767472m875356m022813j580907Q06788K716672L326460J605498j420102
39345A323712k589592j48801L519361M263370J225053k104353k620681j566287
39337A301782j796198k655284j092701K361421L150914j83014k773668n35852
39329b222600L235376K943066l93835j022909K006639L508142Q67765k039480
39321F882164j714565m04942j361003l093874k378507J27098J398076J019278
39313D73725O57154J57052j718483l493334k076342K133454M848680L518325M93956
39304D994187o41834L69088J114607K06132j321217j733653n64874J108230J826007
$$ plain form
39295 5356673 6476502 6320894 5513242 5030322 5125720 4937250 3246449 194720 -1773888
39286 -1773888 103748 5265335 9394700 8947972 5144413 1910411 873017 545904
39278 545904 -239624 -900880 -1191767 -1878349 -2579287 -1581753 1006834 2361762 703228
39269 703228 -2200509 -3847149 -4075308 -3485632 -1271172 2616294 5111673 3274998 -1121400
39260 -1121400 -3564656 -2801170 -1511230 -1230678 -421496 1555172 2184675 -461289 -4264405
39251 -4264405 -5629442 -3989717 -1804829 -1150374 -1983245 -2977710 -2658354 -392018 2547618
39242 2547618 3633169 1941844 -375768 -602140 1374398 3637238 5183013 6696649
39234 6696649 8730488 10603294 11184776 9845043 6882729 3916495 3242503 5398039
$$ packed form
39295E356673J119829j55608q07652m82920R5398j88470j690801l051729j968608
39286a773888J877636N161587M129365m46728l803559l234002j037394l27113
39278E45904p85528o61256k90887o86582p00938R97534K588587J354928j658534
39269G03228k903737j646640k28159N89676K214460L887466K495379j836675m396398
39260a121400k443256P63486J289940K80552Q09182J976668O29503k645964l803116
39251d264405j365037J639725K184888O54455q32871r94465L19356K266336K939636
39242B547618J085551j691325k317612k26372J976538K262840J545775J513636
39234F696649K033839J872806N81482j339733k962314k966234o73992K155536
$$ plain form
39226 5398039 7704305 6822304 2757924 -1210168 -2707171 -2675387 -3155325 -4422200 -5419119
39217 -5419119 -5702465 -5546414 -4886608 -3559737 -2269856 -2079992 -2913944 -3469813 -2744547
39208 -2744547 -994784 881847 2313089 3202007 3483321 2751526 397469 -3534861 -7456168
39199 -7456168 -8882197 -6819226 -3246065 -1221570 -1351461 -1065500 2061313 7000163
39191 7000163 10205273 9705925 7333312 6408142 7752902 8873868 7292128 3919049
39183 3919049 2220173 4072627 7439554 8822399 7454525 6011848 7048159 9673335
39175 9673335 10517466 7673769 2870557 -499203 -930818 172541 779817 660499 1076624
39166 1076624 2595739 4044737 3697673 964626 -3133279 -6588132 -7456974 -5149555
$$ packed form
39226E398039K306266q82001m064380l968092j497003L1784m79938j266875r96919
39217e419119k83346J56051O59806J326871J289881J89864q33952n55869P25266
39208b744547J749763J876631J431242Q88918K81314p31795k354057l932330l921307
39199g456168j426029K062971L573161K024495j29891K85961L126813M938850
39191G000163L205110m99348k372613r25170J344760J120966j581740l373079
39183C919049j698876J852454L366927J382845j367874j442677J036311K625176
39175I673335Q44131k843697m803212l369760m31615J103359O07276j19318M16125
39166A076624J519115J448998l47064k733047m097905l454853q68842K307419
$$ plain form
39158 -5149555 -1223490 1624829 2005994 1115085 1263579 3461848 6715560 9162032 9407283
39149 9407283 7285756 4026915 1383485 3393 -1022915 -2538878 -3930209 -4242907
39141 -4242907 -4089363 -5139999 -7791718 -10446453 -11189984 -9355388 -5592248 -1400350
39133 -1400350 1568968 2920399 4188890 6980554 10616626 12965697 13354059 12884441
39125 12884441 11989105 9949581 7242432 5832192 6109245 5985654 4411650 3215188
39117 3215188 3532101 3164936 419853 -1833885 73079 4158567 4607342 -69187 -5054267
39108 -5054267 -6169088 -4621819 -3275122 -2213758 -740262 -553258 -3356713 -7138326
39100 -7138326 -8290610 -6532311 -4694895 -4191670 -3707848 -2376580 -1392311 -1816541 -3083822
$$ packed form
39158e149555L926065K848319L81165q90909J48494K198269L253712K446472K45251
39149I407283k121527l258841k643430j380092j026308j515963j391331l12698
39141d242907J53544j050636k651719k654735p43531J834596L763140M191898
39133a400350K969318J351431J268491K791664L636072K349071L88362m69618
39125A2884441q95336k039524k707149j410240K77053j23591j574004j196462
39117C215188L16913l67165k745083k253738J906964M085488M48775m676529m985080
39108e054267j114821J547269J346697J061364J473496J87004k803455l781613
39100g138326j152284J758299J837416N03225M83822J331268R84269m24230j267281
$$ plain form
39091 -3083822 -4530851 -6414921 -8365867 -8645248 -6502867 -4070718 -4097044 -6158266 -6766686
39082 -6766686 -3627826 1337225 4059665 2945380 413528 -370890 785041 1712947
39074 1712947 1522980 1746340 3486914 5441120 6145590 6608681 8584492 11134261 11450365
39065 11450365 9049179 6598214 5905810 5460885 3307584 392588 -888767 -232127
39057 -232127 601639 773044 1261056 2698781 4033281 3892144 2201985 -18371 -1722845
39048 -1722845 -2413495 -2254770 -1695056 -490144 2433898 7042818 10536584 9462118 3899202
39039 3899202 -2143617 -5240633 -5766531 -5648374 -5058782 -3459560 -2203846 -2946924 -4094657
39030 -4094657 -2380056 1507196 2472625 -2016378 -7628344 -8674500 -5633673 -3546263
$$ packed form
39091c083822j447029j884070j950946k79381K142381K432149k6326k061222o08420
39082f766686L138860M965051K722440j114285k531852p84418J155931R27906
39074A712947j89967K23360J740574J954206P04470M63091J975811K549769L16104
39065A1450365k401186k450965o92404m44925k153301k914996j281355O56640
39057b32127Q33766J71405M88012J437725J334500j41137j690159k220356j704474
39048a722845o90650J58725N59714J204912K924042M608920L493766j074466n562916
39039C899202o042819l097016n25898J18157N89592J599222J255714p43078j147733
39030d094657J714601L887252R65429m489003n611966j046156L040827K087410
$$ plain form
39022 -3546263 -4164822 -4065923 -1010972 2010632 1214925 -2482939 -5259237 -5901094 -6493691
39013 -6493691 -8312855 -10006617 -10173447 -9290087 -8151390 -6294463 -3322381 -539705
39005 -539705 283422 -730793 -1747505 -1617836 -1011291 -1053068 -1768445 -2257825 -1782377
38996 -1782377 -253565 1880761 3751415 4396200 3529028 1886667 392259 -898668
38988 -898668 -2545675 -4543871 -6059733 -6461848 -5968855 -4988716 -3445616 -1289050 746362
38979 746362 1513530 531484 -1585233 -3654982 -4841764 -5390206 -6370122 -7991045 -8311076
38970 -8311076 -5041129 860593 5086256 4819045 2267575 1498821 2909910 3399660 1548764
38961 1548764 -351945 24177 2037626 3896340 5117522 5585847 4170057 433662
$$ packed form
39022c546263o18559R8899L054951L021604p95707l697864k776298o41857n92597
39013f493691j819164j693762j66830Q83360J138697J856927K972082K782676
39005e39705Q23127j014215j016712J29669O06545m1777p15377m89380M75448
38996a782377J528812K134326J870654O44785q67172j642361j494408j290927
38988h98668j647007j998196j515862m02115M92993R80139J543100K156566K035412
38979G46362P67168r82046k116717k069749j186782n48442r79916j620923l20031
38970h311076L269947N901722M225663k67211k551470p68754J411089M89750j850896
38961A548764j900709L76122K013449J858714J221182M68325j415790l736395
$$ plain form
38953 433662 -3476852 -4808701 -3588405 -2343196 -2728010 -3845089 -3774862 -1631323 1831991
38944 1831991 4839229 5974000 5453472 4577664 3638311 1479919 -2166041 -5276891 -5783305
38935 -5783305 -4184268 -2467884 -1282568 219848 2330300 4209129 5129886 5066802 4394128
38926 4394128 3981941 4851107 6599257 7116925 5204585 2369606 455312 -1183949 -4067544
38917 -4067544 -7449208 -9398382 -10017870 -10634996 -10550017 -8058653 -4548348 -3806248 -6537787
38908 -6537787 -9023499 -8349945 -5818080 -3897348 -2995986 -2920532 -4429260 -7148930 -8628059
38899 -8628059 -7819617 -7124243 -8541979 -10122617 -9081594 -6493281 -5721943 -7454482 -9282795
38890 -9282795 -9362478 -7812903 -5290770 -2775443 -2060864 -3909934 -6328669 -7070852 -7011766
$$ packed form
38953D33662l910514j331849J220296J245209l84814j117079P0227K143539L463314
38944A831991L007238J134771n20528q75808r39353k158392l645960l110850n06414
38935e783305J599037J716384J185316J502416K110452J878829R20757o3084o72674
38926D394128m12187Q69166J748150N17668j912340k834979j914294j639261k883595
38917d067544l381664j949174o19488o17126Q4979K491364L510305P42100k731539
38908f537787k485712O73554K531865J920732R01362P5454j508728k719670j479129
38899h628059Q08442O95374j417736j580638J041023K588313P71338j732539j828313
38890i282795p9683J549575K522133K515327P14579j849070k418735p42183N9086
$$ plain form
38881 -7011766 -8316758 -10109052 -9326457 -5781240 -2943817 -3022577 -4243329 -4052184 -2433135
38872 -2433135 -694090 994430 3344059 6498722 9875084 12542857 13348378 11718188
38864 11718188 8501207 4928098 1017980 -3519248 -7347283 -8573265 -7459852 -5768894
38856 -5768894 -3786092 -967979 543487 -3038721 -11295819 -18336399 -19481061 -16382444
38848 -16382444 -13395128 -11804239 -10432640 -9309540 -9111623 -8565382 -6016155 -2733881
38840 -2733881 -1389980 -1822313 -1455943 481091 2408920 3911156 6321442 9340350
38832 9340350 10532200 9315600 8219536 8497789 7539143 3081498 -2493226 -5193196
38824 -5193196 -5117508 -5593899 -7251137 -6808306 -2640975 1871402 2806220 1241629 1373314
$$ packed form
38881g011766j304992j792294P82595L545217K837423p8760j220752J91145J619049
38872b433135J739045J688520K349629L154663L376362K667773Q05521j630190
38864A1718188l216981l573109l910118m537228l828035j225982J113413J690958
38856e768894J982802K818113J511466l582208q257098p040580j144662L098617
38848a6382444K987316J590889J371599J123100J97917N46241K549227L282274
38840b733881J343901m32333L66370J937034J927829J502236K410286L018908
38832I340350J191850j216600j096064K78253r58646m457645n574724k699970
38824e193196P5688m76391j657238M42831M167331M512377R34818j564591J31685
$$ plain form
38815 1373314 4094844 5803268 4087921 1461021 1458857 3267820 3205346 607194 -1159686
38806 -1159686 -51466 1422802 24227 -3506404 -5947812 -6380646 -6800383 -8421153
38798 -8421153 -9888636 -9525554 -7437287 -4791171 -2474866 -1109293 -1218969 -2671827
38790 -2671827 -4604302 -6171977 -6803916 -6030761 -4227934 -3250301 -4623008 -6940620 -6994748
38781 -6994748 -4155388 -1649727 -2209035 -4190674 -3869440 -407264 3529724 5513860
38773 5513860 5637816 5108775 4491522 3886485 3490303 3299668 3046462 2754051 2645331
38764 2645331 2451541 1771374 1204736 1932390 3784108 4931661 4163408 2355781 855129
38755 855129 -418433 -1905114 -2367361 89576 4857724 8441367 8073418 4701401 1561112
$$ packed form
38815A373314K721530J708424j715347k626900k164J808963o2474k598152j766880
38806a159686J108220J474268j398575l530631k441408m32834m19737j620770
38798h421153j467483L63082K088267K646116K316305J365573j09676j452858
38790b671827j932475j567675o31939P73155J802827R77633j372707k317612n4128
38781f994748K839360K505661n59308j981639L21234L462176L936988J984136
38773E513860J23956n29041o17253o05037l96182j90635k53206k92411j08720
38764B645331j93790o80167n66638P27654J851718J147553p68253j807627j500652
38755H55129j273562j486681m62247K456937M768148L583643l67949l372017l140289
$$ plain form
38746 1561112 563255 1042017 1567522 1792400 2283220 3257602 3992169 3489534 1750378
38737 1750378 259149 591419 2226749 2623468 461229 -1899306 -866863 3527268
38729 3527268 7186676 7027492 4484844 2564987 1484240 -127903 -1053314 1698476
38721 1698476 7524594 11354428 9957290 6263881 4898452 5726292 5166905 2479308
38713 2479308 722695 1477871 2481394 1626749 -29068 -1075702 -2664467 -6038137
38705 -6038137 -9245869 -9300109 -6402354 -3124084 -177298 3851127 8658295 11413618
38697 11413618 10751851 8941106 8648591 9565707 9774092 8749915 7211837 5230276 2455028
38688 2455028 -382785 -1951013 -2137383 -2079642 -2495754 -3056154 -3274770 -3080746 -2666712
$$ packed form
38746A561112r97857M78762N25505K24878M90820R74382P34567n02635j739156
38737A750378j491229L32270J635330L96719k162239k360535J032443M394131
38729C527268L659408j59184k542648j919857j080747j612143r25411K751790
38721A698476N826118L829834j397138l693409j365429Q27840n59387k687597
38713B479308j756613P55176J003523q54645j655817j046634j588765l373670
38705f038137l207732n4240K897755L278270K946786M028425M807168K755323
38697A1413618o61767j810745k92515R17116K08385j024177j538078j981561k775248
38688B455028k837813j568228j86370N7741m16112n60400k18616J94024M14034
$$ plain form
38679 -2666712 -2557235 -3463378 -5191785 -6187326 -5279864 -3471181 -2667618 -2902463 -2338589
38670 -2338589 -50251 2824663 5060217 6790923 8160908 8082449 5805757 2826071
38662 2826071 1557637 2249748 2608934 756356 -2532416 -5056393 -5765101 -5231252 -4087566
38653 -4087566 -2296550 -259155 577486 -661944 -2583738 -2727934 -450750 2545842
38645 2545842 4589059 5498827 5372168 3770400 1280779 241477 2036478 4604655
38637 4604655 4583299 1502996 -1810259 -2580555 -252760 3951959 7578429 7616962 3274037
38628 3274037 -1832563 -2829518 569193 3796872 3517472 1217724 -220204 -473234 -418093
38619 -418093 524227 3081740 5858864 6763421 5473846 2634881 -1649700 -6197538 -7497176
$$ packed form
38679b666712J09477r06143j728407r95541R07462J808683Q03563k34845N63874
38670b338589K288338K874914K235554J730706J369985p8459k276692k979686
38662B826071j268434O92111L59186j852578l288772k523977p08708N33849J143686
38653d087566J791016K037395Q36641j239430j921794j44196K277184K996592
38645B545842K043217R09768j26659j601768k489621j039302J795001K568177
38637D604655k1356l080303l313255p70296K327795M204719L626470L8533m342925
38628C274037n106600r96955L398711L227679k79400k299748j437928k53030N5141
38619d18093R42320K557513K777124R04557j289575k838965m284581m547838j299638
$$ plain form
38610 -7497176 -3380988 2872337 5301705 2045827 -3151645 -5901232 -5054404 -2000492
38602 -2000492 937901 1235196 -1792318 -5045666 -4303119 483767 4869427 5386893 2825835
38593 2825835 -451098 -3391907 -5197880 -4395493 -1041629 2353662 4080308 5420601
38585 5420601 7698594 9326365 8278677 5723254 4332378 4175511 3199341 1067683
38577 1067683 -417705 -547727 -597215 -1207227 -1322756 -365709 567485 452489 -332775
38568 -332775 -1094984 -1790959 -2251734 -1790377 -343327 1069118 1663043 1735529 1768779 1816732
38558 1816732 2301117 4114185 6982168 8817042 7993589 5679939 4576318 5488437 6422457
38549 6422457 5423154 3248204 2281538 3220693 4141319 3390668 2310284 3582740 7092789
$$ packed form
38610g497176M116188O253325K429368l255878n197472k749587Q46828L053912
38602b000492K938393K97295l027514l253348P42547M786886M385660N17466k561058
38593B825835l276933k940809j805973Q02387L353864L395291J726646J340293
38585E420601K277993J627771j047688k555423j390876j56867r76170k131658
38577A067683j485388j30022m9488o10012j15529R57047R33194j14996p85264
38568c32775p62209o95975m60775M61357J447050J412445N93925P2486L3250M7953
38558A816732M84385J813068K867983J834874q23453k313650j103621R12119R34020
38549F422457r99303k174950r66666R39155R20626p50651j080384J272456L510049
$$ plain form
38540 7092789 9259710 7257571 2451216 -1513563 -2770824 -1901509 238074 3136364
38532 3136364 5520644 5926155 4606044 3051422 1541424 -728558 -2826115 -1993507
38524 -1993507 2412969 7080990 8504844 6961383 5132156 4378377 4312185 4642611 5075553
38515 5075553 4246878 1228573 -2227230 -3257463 -1716628 -371963 -1159972 -3237648
38507 -3237648 -4937094 -5534333 -4608334 -1834167 1608546 3264633 2223301 309046
38499 309046 -481251 -260372 -36800 115266 387952 237445 -559408 -1239745 -1767226 -3472076
38489 -3472076 -6230646 -6975440 -3667667 793213 1950883 243832 348930 4050622
38481 4050622 7650239 7546433 4842033 2558398 1326984 311100 23693 1333031
$$ packed form
38540G092789K166921k002139m806355l964779j257261Q69315K139583K898290
38532C136364K384280M05511j320111j554622j509998k269982k097557Q32608
38524a993507M406476M668021J423854j543461j829227p53779o6192L30426M32942
38515E075553q28675l018305l455803j030233J540835J344665p88009k077676
38507c237648j699446n97239R25999K774167L442713J656087j041332j914255
38499C09046p90297K20879K23572J52066K72686j50507p96853o80337n27481j704850
38489c472076k758570p44794L307773M460880J157670j707051J05098L701692
38481D050622L599617j03806k704400k283635j231414j015884k87407J309338
$$ plain form
38473 1333031 3086845 3388551 2361102 1405718 625025 -694516 -1787813 -1122663 835965
38464 835965 1863042 992495 -656822 -1965027 -2708676 -2471526 -900679 684777 136061
38455 136061 -2453868 -4378502 -3616795 -792188 2608390 6013644 9033073 10850126
38447 10850126 11350935 11307978 10729116 8819211 6301569 5522936 6978110 8028467 6885094
38438 6885094 5651846 6918232 9086252 8174940 3467071 -1625888 -4155385 -4381435
38430 -4381435 -3745813 -2701831 -1381927 -456428 -327291 -699731 -1435560 -2581234 -3341659
38421 -3341659 -2636142 -1146878 -1159680 -3593485 -6667865 -8369257 -8701566 -8327186 -6554786
38412 -6554786 -2657555 1528217 2503548 -950271 -6043176 -8812366 -7971209 -5503112
$$ packed form
38473A333031J753814L01706j027449r55384p80693j319541j093297O65150J958628
38464H35965J027077q70547j649317j308205p43649K37150J570847J585456n48716
38455A36061k589929j924634P61707K824607L400578L405254L019429J817053
38447A0850126N00809m2957n78862j909905k517642p78633J455174J050357j143373
38438F885094j233248J266386K168020r11312m707869n092959k529497k26050
38430d381435O35622J043982J319904R25499J29137l72440p35829j145674p60425
38421c341659P05517J489264j2802k433805l074380j701392l32309L74380J772400
38412f554786L897231M185772R75331l453819n092905k769190Q41157K468097
$$ plain form
38404 -5503112 -4088687 -4659897 -6311749 -7851882 -8891270 -9494043 -9316526 -7650755 -4468063
38395 -4468063 -1167626 145782 -1413928 -4165393 -4964309 -2366791 1526597 3338064
38387 3338064 2479421 1536879 2093310 2020117 -1277245 -6122674 -7759436 -4466090 -41327
38378 -41327 985171 -1180705 -2632382 -1189949 1254497 1716108 -415487 -3588378 -6402956
38369 -6402956 -8402131 -9115456 -7860426 -4936391 -2037587 -777652 -1331253 -2956007
38361 -2956007 -4921684 -6048142 -4443754 540853 6609896 10738359 12868332 15102949
38353 15102949 17228615 16196920 11249257 6355250 5177891 6208695 5892149 4392456
38345 4392456 4457677 5912819 5706703 3445591 2692689 5640829 9830776 11651704 10509727
$$ packed form
38404e503112J414425n71210j651852j540133j039388o02773J77517J665771L182692
38395d468063L300437J313408j559710k751465p98916K597518L893388J811467
38387C338064q58643r42542N56431p3193l297362m845429j636762L293346M424763
38378d1327J026498k165876j451677J442433K444446M61611k131595l172891k814578
38369f402956j999175p13325J255030K924035K898804J259935n53601j624754
38361b956007j965677j126458J604388M984607O069043M128463K129973K234617
38353A5102949K125666j031695m947663m894007j177359J030804l16546j499693
38345D392456O5221J455142k06116k261112p52902K948140M189947J820928j141977
$$ plain form
38336 10509727 8148039 6097492 5087827 4937735 3927988 359611 -4288782 -6113434
38328 -6113434 -3894388 -975006 -531542 -1535298 -1447209 -506957 -676487 -2035268 -3000448
38319 -3000448 -3126016 -3291133 -3814691 -4333454 -4814438 -5072741 -4305219 -2648911 -1864231
38310 -1864231 -2800640 -3835948 -3812443 -4528116 -7556854 -10407899 -9364203 -5061868 -1577178
38301 -1577178 -557296 -65182 905202 894348 -338397 -549002 1051933 1992449 674632
38292 674632 -514942 1351029 5205468 7384348 6418999 4364298 3942116 5824215 8308937
38283 8308937 8767845 5993084 1732935 -838197 -535585 979223 1984311 2788386 4334887
38274 4334887 6228882 7261189 6891900 5343039 3098820 934073 -498194 -1519152
$$ packed form
38336A0509727k361688k050547j009665j50092j009747l568377m648393j824652
38328f113434K219046K919382M43464j003756Q8089R40252j69530j358781r65180
38319c000448j25568j65117n23558n18763m80984k58303P67522J656308P84680
38310a864231r36409j035308K3505p15673l028738k851045J043696M302335L484690
38301a577178J019882M92114R70384j0854j232745k10605J600935R40516j317817
38292F74632j189574J865971L854439K178880r65349k054701m22182J882099K484722
38283H308937M58908k774761m260149k571132L02612J514808J005088Q04075J546501
38274D334887J893995J032307l69289j548861k244219k164747j432267j020958
$$ plain form
38266 -1519152 -2762510 -3486139 -2185548 635040 2244727 1256842 -353053 -106328 1664944
38257 1664944 2880968 2805406 2411819 2505190 2989575 3530184 3834135 3626960 2927719 1770223
38247 1770223 -418633 -3870675 -6807444 -6706924 -3857742 -1449954 -1179695 -1282848 -368817
38238 -368817 -301519 -2817046 -5912852 -6913445 -7126496 -9525807 -12921593 -12668657 -7203165
38229 -7203165 -76387 5118668 8385848 10843540 11841183 10461241 7762040 5648339
38221 5648339 4734783 4548734 4702190 4829258 4338065 3100587 1726437 781903 484707
38212 484707 1156924 2889518 4770699 5613642 5340996 4478344 2800167 166723 -1849191
38203 -1849191 -1406089 751625 2240524 2610447 3139284 3120990 16737 -5695043 -9484661
$$ packed form
38266a519152j243358p23629J300591K820588J609687r87885j609895K46725J771272
38257A664944J216024p5562l93587R3371M84385N40609L03951k07175o99241j157496
38247A770223k188856l452042k936769J00520K849182K407788K70259j03153R14031
38238c68817O7298k515527l095806j000593k13051k399311l395786K52936N465492
38229g203165P126778N195055L267180K457692R97643j379942k699201k113701
38221E648339r13556j86049J53456J27068m91193j237478j374150r44534k97196
38212D84707O72217J732594J881181Q42943k72646q62652j678177k633444k015914
38203a849191M43102K157714J488899L69923N28837j8294l104253n711780l789618
$$ plain form
38194 -9484661 -8503026 -5223666 -3200150 -2258897 -665310 742852 91778 -1804160 -2795265
38185 -2795265 -3101666 -4268381 -5599355 -5204716 -3792929 -3734246 -4773764 -4472577 -2918330
38176 -2918330 -3054058 -5622978 -7493767 -6226230 -3014119 240674 3524799 6677355
38168 6677355 7862353 6307061 4078061 2998589 2147526 480284 -745211 -753361 -1696492
38159 -1696492 -4887787 -7020242 -4499216 22899 426608 -3973782 -7481633 -6683809
38151 -6683809 -4838619 -5521624 -6751147 -5094930 -2012130 -1487373 -3291224 -3303504 -32980
38142 -32980 3498058 4877396 5460638 6941808 7859175 5844440 1641134 -1367203 -1037545
38133 -1037545 1617692 4049749 4636010 3671594 2516301 1720494 202961 -2927935 -6100138
$$ packed form
38194i484661R81635L279360K023516R41253J593587J408162o51074j895938r91105
38185b795265l06401j166715j330974L94639J411787N8683j039518L01187J554247
38176b918330j35728k568920j870789J267537L212111L254793L284125L152556
38168F677355J184998j555292k229000j079472q51063j667242j225495q150r43131
38159a696492l191295k132455K521026M522115M03709m400390l507851P97824
38151f683809J845190o83005j229523J656217L082800N24757j803851j2280L270524
38142c2980L531038J379338N83242J481170R17367k014735m203306l008337L29658
38133a037545K655237K432057N86261r64416j155293p95807j517533l130896l172203
$$ plain form
38124 -6100138 -6571543 -4349176 -2741621 -3845702 -5490637 -4547336 -1519616 794678
38116 794678 2060854 4528361 8412999 10416182 7930763 2251257 -3615234 -8060097
38108 -8060097 -10378960 -9593911 -6142352 -3127435 -3230709 -5207687 -5887673 -4952935 -4890573
38099 -4890573 -6270515 -6232417 -2838389 1539537 2990136 710431 -2846497 -5433475
38091 -5433475 -6865593 -7925566 -9046565 -10161051 -10792525 -10150439 -7778032 -4120853
38083 -4120853 -148170 3186339 4805339 3760382 537577 -2642245 -3977592 -3935413
38075 -3935413 -3729913 -2799867 200160 4186567 5870437 3856394 424044 -1783607
38067 -1783607 -2839780 -3904808 -4543633 -3861130 -2856897 -3017148 -3378688 -1847452 792292
$$ packed form
38124f100138m71405K222367J607555j104081j644935R43301L027720K314294
38116G94678J266176K467507L884638K003183k485419n679506n866491m444863
38108h060097k318863P85049L451559L014917j03274j976978o79986R34738O2362
38099d890573j379942L8098L394028M377926J450599k279705l556928k586978
38091e433475j432118j059973j120999j114486o31474O42086K372407L657179
38083d120853L972683L334509J619000j044957l222805l179822j335347M2179
38075c935413K05500R30046L000027L986407J683870k014043l432350k207651
38067a783607j056173j065028o38825O82503J004233j60251l61540J531236K639744
$$ plain form
38058 792292 1256032 -1300970 -3688666 -3294163 -1620245 -1411220 -2653148 -3869272 -5398957
38049 -5398957 -8209844 -10542425 -9259385 -4569906 -264633 1304568 1525147 1898834
38041 1898834 1290944 -1181162 -3128536 -1718831 1848401 3670970 2457921 774840
38033 774840 899995 2011435 2216580 1200978 -318677 -2101239 -3899437 -4592785 -3276801
38024 -3276801 -634274 1942497 4065005 6044166 7374215 6903244 4455888 1098634
38016 1098634 -2209440 -4973344 -6076906 -4041121 591005 4317477 3705634 -861055
38008 -861055 -5603619 -7427033 -6554956 -5189283 -4893948 -5788451 -7129373 -7709619 -6424744
37999 -6424744 -3571561 -1245081 -1344006 -3214473 -4220095 -2681156 702760 4353135
$$ packed form
38058G92292M63740k557002k387696L94503J673918K09025j241928j216124j529685
38049e398957k810887k332581J283040M689479M305273J569201K20579L73687
38041A898834o07890k472106j947374J409705L567232J822569j213049j683081
38033G74840J25155J111440K05145j015602j519655j782562j798198o93348J315984
38024c276801K642527K576771K122508J979161J330049m70971k447356l357254
38016A098634l308074k763904j103562K035785M632126L726472o11843m566689
38008h61055m742564j823414Q72077J365673K95335q94503j340922n80246J284875
37999f424744K853183K326480r8925j870467j005622J538939L383916L650375
$$ plain form
37991 4353135 7352004 8912190 7803435 3870038 -500116 -2159119 -644159 1481972
37983 1481972 2038196 1540843 1367170 1141157 -316867 -2225410 -2333590 -567008 -43098
37974 -43098 -3021203 -7278038 -8504445 -5663151 -1749882 781004 2763316 5303997
37966 5303997 6417725 3403894 -2254634 -5398584 -3333197 816054 2329255 848616
37958 848616 97364 2380731 5659417 6573649 4611150 2065799 832423 692846 554903
37949 554903 -5771 -885600 -2090216 -3346759 -3586876 -1804021 1580729 4932373 7013932
37940 7013932 7699590 7113898 5107385 2029229 -945773 -3033648 -4633442 -6034351
37932 -6034351 -6127684 -3756518 32324 2646655 3026657 2662939 3085748 3679005 2903072
$$ packed form
37991D353135K998869J560186j108755l933397m370154j659003J514960K126131
37983A481972N56224m97353j73673k26013j458024j908543j08180J766582N23910
37974d3098k978105m256835j226407K841294L913269K530886J982312K540681
37966E303997J113728l013831n658528l143950K065387M149251J513201j480639
37958H48616p51252K283367L278686R14232j962499k545351j233376j39577j37943
37949E54903n60674q79829j204616j256543k40117J782855L384750L351644K081559
37940G013932O85658n85692k006513l078156k975002k087875j599794j400909
37932f034351r3333K371166L788842K614331L80002l63718M22809N93257p75933
$$ plain form
37923 2903072 730860 -1284841 -1939217 -1358130 -231162 976981 1878936 2009747 1389300
37914 1389300 966598 1836006 3732636 4803063 3590882 1051254 -495665 -601840 -1379286
37905 -1379286 -4010014 -6168741 -4878744 -928515 2027865 2380605 1807276 1490155 356085
37896 356085 -1706268 -2096927 595007 3306664 2143884 -2034935 -4692521 -3661977
37888 -3661977 -1307008 -670324 -1908873 -2930165 -1727880 2171256 7059496 9881568
37880 9881568 9242325 7327817 7167793 8465720 8258518 5365198 1680433 -938834 -2379599
37871 -2379599 -2602114 -1217003 502096 199563 -1688654 -1570102 2101316 6152126 7447149
37862 7447149 7524363 9484771 12556711 13459528 11854069 10563177 10728579 10350507 7971690
$$ packed form
37923B903072k172212k015701o54376N81087J126968J208143R01955J30811o20447
37914A389300m22702Q69408J896630J070427j212181k539628j546919j06175p77446
37905a379286k630728k158727J289997L950229K956380L52740n73329l17121j134070
37896C56085k062353l90659K691934K711657j162780m178819k657586J030544
37888c661977K354969O36684j238549j021292J202285L899136M888240K822072
37880I881568o39243j914508j60024J297927k07202k893320l684765k619267j440765
37871b379599k22515J385111J719099l02533j888217J18552L671418M050810J295023
37862G447149P7214J960408L071940R02817j605459j290892J65402l78072k378817
$$ plain form
37853 7971690 4672276 1729853 -927875 -3064017 -3472858 -2126313 -827943 -577887
37845 -577887 -317698 463552 15407 -2898504 -6087120 -6020455 -2221063 2138564 3716234
37836 3716234 1858448 -1561689 -3943569 -3864442 -2164213 -935110 -934637 -760924 754519
37827 754519 2571010 3156601 3053941 3908460 5701652 7110950 8297152 10906392 14977619
37818 14977619 18208034 19164932 19179910 20033884 21875690 24819142 30251986 38149835 44893653
37809 44893653 46936273 45868854 46624845 50838779 55454149 58486363 62355979 69449162
37801 69449162 77441288 82048837 82589752 81791744 81328947 80777611 80424781 81620787 83728265
37792 83728265 83601492 79391125 72957949 67408522 63779963 61072834 58041030 53893564
$$ packed form
37853G971690l299414k942423k657728k136142m08841J346545J298370K50056
37845e77887K60189P81250m48145k913911l188616O6665L799392M359627J577670
37836C716234j857786l420137k381880P9127J700229J229103M73J73713J515443
37827G54519J816491N85591j02660Q54519J793192J409298J186202K609240M071227
37818A4977619L230415R56898J4978Q53974J841806K943452N432844P897849O743818
37809D4893653K042620j067419P55991M213934M615370L032214L869616P093183
37801F9449162P992126M607549N40915p98008m62797n51336l52830J196006K107478
37792H3728265j26773m210367o433176n549427l628559k707129l031804m147466
$$ plain form
37784 53893564 48451410 42568178 37401230 32665241 26816849 19500953 12367550 6885100
37776 6885100 3075878 1155548 2204425 5661662 8134225 6799269 2662924 -1378166
37768 -1378166 -4149316 -5749872 -5299261 -2266940 930508 1136556 -803435 -756310 2787335
37759 2787335 6614655 7626161 6981517 7782258 10605259 12999786 12176292 7143507 -472613
37750 -472613 -6804663 -8364372 -5323385 -1117349 1563107 2675868 2515657 372096
37742 372096 -3023299 -4508136 -2521663 -149812 -1234526 -4767007 -6184672 -3471735
37734 -3471735 1045263 4534317 6105880 5417528 2296080 -1244323 -1696800 1451589
37726 1451589 4238000 3157256 -323061 -2328335 -2021337 -1692109 -2165554 -1328334 1969545
$$ packed form
37784E3893564n442154n883232n166948m735989n848392p315896p133403n482450
37776F885100l809222j920330J048877L457237K472563j334956m136345m041090
37768a378166k771150j600556M50611L032321L197448K06048j939991M7125L543645
37759B787335L827320J011506o44644Q00741K823001K394527q23494n032785p616120
37750d72613o332050j559709L040987M206036K680456J112761j60211k143561
37742C72096l395395j484837J986473K371851j084714l532481j417665K712937
37734c471735M516998L489054J571563o88352l121448l540403m52477L148389
37726A451589K786411j080744l480317k005274L06998L29228m73445Q37220L297879
$$ plain form
37717 1969545 5057947 4409293 405686 -2789857 -2186451 701810 2202388 1108470
37709 1108470 -453470 -560137 -153169 -1246035 -3797269 -6060395 -7437193 -8904605
37701 -8904605 -10429920 -10187242 -7480551 -4606365 -3959280 -4445552 -2995355 759653 3626291
37692 3626291 3061941 259595 -1902068 -2412998 -2336952 -2525353 -2607894 -1875990 -65315
37683 -65315 2484839 4621977 4829441 2954872 1055417 1176128 2449337 1933434 -1417363
37674 -1417363 -5172763 -6516707 -5560760 -4486929 -4422726 -4587964 -4068999 -2970530 -1638821
37665 -1638821 174308 2813455 5782604 7708692 7377899 4982748 2239153 783750
37657 783750 532802 452440 865547 3354056 7580689 10038187 7897415 3013068 -229053
$$ packed form
37717A969545L088402o48654m003607l195543O03406K888261J500578j093918
37709A108470j561940j06667M06968j092866k551234k263126j376798j467412
37701h904605j525315K42678K706691K874186O47085m86272J450197L755008K866638
37692C626291n64350k802346k161663n10930P6046j88401q2541P31904J810675
37683f5315K550154K137138K07464j874569j899455J20711J273209n15903l350797
37674a417363l755400j343944R55947J073831O4203j65238N18965J098469J331709
37665a638821J813129K639147K969149J926088l30793k395151k743595j455403
37657G83750k50948q0362M13107K488509M226633K457498k140772m884347l242121
$$ plain form
37648 -229053 -562868 -744047 -2682075 -4590903 -4292031 -2918211 -3134183 -5076863 -6404560
37639 -6404560 -5803631 -4230441 -2582766 -147086 3759302 7858486 9841717 8951500
$$ packed form
37648b29053l33815j81179j938028j908828K98872J373820k15972j942680j327697
37639f404560O00929J573190J647675K435680L906388M099184J983231q90217
$$ [...]
##END NTUPLES=NMR SPECTRUM
##END=
