##TITLE=31P_DE-80H_X3
 64 sc D2O
 26.2.2025
##JCAMPDX= 6.0         $$ Bruker NMR JCAMP-DX V2.0
##DATA TYPE= NMR SPECTRUM
##DATA CLASS= NTUPLES
##ORIGIN= UXNMR, Bruker Analytische Messtechnik GmbH
##OWNER= root
$$ XWIN-NMR		Version 3.5
$$ Thu Feb 27 16:47:28 2025 Russian Standard Time (UT+4h)  new_Human@DPX200
##.OBSERVE FREQUENCY= 81.013821
##.OBSERVE NUCLEUS= ^31P
##.ACQUISITION MODE= SIMULTANEOUS
##.ACQUISITION SCHEME= undefined
##.AVERAGES= 64
##.DIGITISER RES= 17
##SPECTROMETER/DATA SYSTEM= spect
##.PULSE SEQUENCE= zgpg30
##.SOLVENT NAME= CDCl3
##.SHIFT REFERENCE= (INTERNAL, CDCl3, 0, 198.062)
##AUDIT TRAIL= $$ (NUMBER, WHEN, WHO, WHERE, WHAT)
$$ ##TITLE= Audit trail, XWIN-NMR		Version 3.5
$$ ##JCAMPDX= 5.01
$$ ##ORIGIN= Bruker BioSpin GmbH
$$ ##OWNER= new_Human
$$ C:/Bruker/XWIN-NMR/data/yarkov/nmr/P31/2/pdata/1/auditp.txt
$$ ##AUDIT TRAIL=  $$ (NUMBER, WHEN, WHO, WHERE, WHAT)
(   1,<2025-02-27 16:46:24.68 +0400>,<new_Human>,<DPX200>,
      <created by zg, POWCHK disabled, PULCHK disabled
       configuration hash MD5:
       00 E9 B6 7A A2 85 ED C7 34 08 36 98 17 FE 4E 26
       data hash MD5: 32K
       86 6C FE FF 10 E2 CF 89 44 2A E7 BC F0 FB 16 86>)
(   2,<2025-02-27 16:46:28.34 +0400>,<new_Human>,<DPX200>,
      <Start of raw data processing
       efp BC_mod = 2 LB = 1.5 FT_mod = 6 PKNL = 1 PHC0 = 1775.032 PHC1 = 18.69542 SI = 64K 
       data hash MD5: 64K
       13 B7 77 BE DB 4F 3F B6 FC DA 57 71 7B CC 47 3A>)
(   3,<2025-02-27 16:46:50.42 +0400>,<new_Human>,<DPX200>,
      <pk PHC0 = 25.92194 PHC1 = -5.199997 
       data hash MD5: 64K
       49 F7 3D FB 0B 4C D7 FE A4 BF 2A F6 C5 98 DF DB>)
$$ ##END=
$$ 
$$ hash MD5
$$ 42 D2 E6 65 8F 1B 50 2B 3F 10 BE 4C E0 97 6A 35
##$RELAX= 
##$RELAX= 
##$RELAX= 
##$RELAX= 
##$RELAX= 
##$RELAX= 
##$RELAX= 
##$RELAX= 
$$ Bruker specific parameters
$$ --------------------------
##$DU= <C:/Bruker/XWIN-NMR>
##$EXPNO= 2
##$NAME= <P31>
##$PROCNO= 1
##$TYPE= <nmr>
##$USER= <yarkov>
##$AMP= (0..31)
100 100 100 100 100 100 100 100 100 100 100 100 100 100 100 100 100 100 
100 100 100 100 100 100 100 100 100 100 100 100 100 100 
##$AQSEQ= 0
##$AQ_mod= 1
##$AUNM= <au_zg>
##$AUTOPOS= <>
##$BF1= 81.014009
##$BF2= 200.13
##$BF3= 200.13
##$BF4= 200.13
##$BF5= 200.13
##$BF6= 200.13
##$BF7= 200.13
##$BF8= 200.13
##$BYTORDA= 1
##$CFDGTYP= 0
##$CFRGTYP= 5
##$CHEMSTR= <none>
##$CNST= (0..31)
1 1 145 1 1 1 1 1 1 1 1 1 1 1 1 1 1 1 1 1 1 1 1 1 1 1 1 1 1 1 1 1 
##$CPDPRG= <waltz16>
##$CPDPRG1= <>
##$CPDPRG2= <waltz16>
##$CPDPRG3= <>
##$CPDPRG4= <mlev>
##$CPDPRG5= <mlev>
##$CPDPRG6= <mlev>
##$CPDPRG7= <mlev>
##$CPDPRG8= <mlev>
##$CPDPRGB= <>
##$CPDPRGT= <>
##$D= (0..31)
0 1 0 0 0 0 0 0 0 0.06 0 0.03 2e-05 3e-06 0 0 0.0002 0 0 0 0 0 0 0 0 0 
0 0 0 0 0 0 
##$DATE= 1740660384
##$DBL= (0..7)
120 120 120 11 120 120 24 19 
##$DBP= (0..7)
150 150 150 150 150 150 150 150 
##$DBP07= 0
##$DBPNAM0= <>
##$DBPNAM1= <>
##$DBPNAM2= <>
##$DBPNAM3= <>
##$DBPNAM4= <>
##$DBPNAM5= <>
##$DBPNAM6= <>
##$DBPNAM7= <>
##$DBPOAL= (0..7)
$$ [...]
##$SUBNAM3= <"">
##$SUBNAM4= <"">
##$SUBNAM5= <"">
##$SUBNAM6= <"">
##$SUBNAM7= <"">
##$SUBNAM8= <"">
##$SUBNAM9= <"">
##$SW= 400.765351723535
##$SWIBOX= (0..15)
0 1 3 0 0 0 0 0 0 0 0 0 0 0 0 0 
##$SW_h= 32467.5324675325
##$TD= 32768
##$TD0= 1
##$TE= 0
##$TE2= 300
##$TE3= 300
##$TEG= 300
##$TL= (0..7)
0 120 53 12 22 120 120 120 
##$TP= (0..7)
150 150 150 150 150 150 150 150 
##$TP07= 0
##$TPNAME0= <>
##$TPNAME1= <>
##$TPNAME2= <>
##$TPNAME3= <>
##$TPNAME4= <>
##$TPNAME5= <>
##$TPNAME6= <>
##$TPNAME7= <>
##$TPOAL= (0..7)
0.5 0.5 0.5 0.5 0.5 0.5 0.5 0.5 
##$TPOFFS= (0..7)
0 0 0 0 0 0 0 0 
##$TUNHIN= 0
##$TUNHOUT= 0
##$TUNXOUT= 0
##$USERA1= <user>
##$USERA2= <user>
##$USERA3= <user>
##$USERA4= <user>
##$USERA5= <user>
##$V9= 5
##$VALIST= <valist>
##$VCLIST= <CCCCCCCCCCCCCCC>
##$VD= 0
##$VDLIST= <DDDDDDDDDDDDDDD>
##$VPLIST= <PPPPPPPPPPPPPPP>
##$VTLIST= <TTTTTTTTTTTTTTT>
##$WBST= 1024
##$WBSW= 4
##$XGAIN= (0..3)
0 0 0 0 
##$XL= 0
##$YL= 0
##$YMAX_a= 39243
##$YMIN_a= -44117
##$ZGOPTNS= <>
##$ZL1= 120
##$ZL2= 120
##$ZL3= 120
##$ZL4= 120
##$ABSF1= 0
##$ABSF2= 0
##$ABSG= 0
##$ABSL= 0
##$ALPHA= 0
##$AQORDER= 0
##$ASSFAC= 0
##$ASSFACI= 0
##$ASSFACX= 0
##$ASSWID= 0
##$AUNMP= <proc_1d>
##$AZFE= 0.1
##$AZFW= 0.5
##$BCFW= 0
##$BC_mod= 2
##$BYTORDP= 0
##$COROFFS= 0
##$CY= -3
##$DATMOD= 1
##$DC= 0
##$DFILT= <>
##$DTYPP= 0
##$F1P= 0
##$F2P= 0
##$FCOR= 1
##$FTSIZE= 65536
##$FT_mod= 6
##$GAMMA= 0
##$GB= 0
##$INTBC= 1
##$INTSCL= 9.790993e-09
##$ISEN= 30
##$LB= 1.5
##$LEV0= 0
##$LPBIN= 0
##$MAXI= 10000
##$MC2= 0
##$MEAN= 0
##$ME_mod= 0
##$MI= 50
##$NCOEF= 0
##$NC_proc= -4
##$NLEV= 6
##$NOISF1= 182.463
##$NOISF2= 159.3651
##$NSP= 0
##$NTH_PI= 0
##$NZP= 0
##$OFFSET= 198.0616
##$PC= 4
##$PHC0= 1800.954
##$PHC1= 13.49542
##$PH_mod= 1
##$PKNL= yes
##$PPARMOD= 0
##$PSCAL= 0
##$PSIGN= 0
##$REVERSE= no
##$SF= 81.0140089999434
##$SI= 65536
##$SIGF1= 159.3651
##$SIGF2= -187.1042
##$SINO= 113.3802
##$SIOLD= 16384
##$SREGLST= <1H.CDCl3>
##$SSB= 0
##$STSI= 65536
##$STSR= 0
##$SW_p= 32467.5324675325
##$SYMM= 0
##$S_DEV= 0
##$TDeff= 32768
##$TDoff= 0
##$TI= <>
##$TILT= no
##$TM1= 0
##$TM2= 0
##$TOPLEV= 0
##$USERP1= <user>
##$USERP2= <user>
##$USERP3= <user>
##$USERP4= <user>
##$USERP5= <user>
##$WDW= 1
##$XDIM= 65536
##$YMAX_p= 499701391
##$YMIN_p= -22936728
$$ End of Bruker specific parameters
$$ ---------------------------------
##NTUPLES= NMR SPECTRUM
##VAR_NAME=  FREQUENCY,     SPECTRUM/REAL,   SPECTRUM/IMAG
##SYMBOL=    X,             R,               I
##VAR_TYPE=  INDEPENDENT,   DEPENDENT,       DEPENDENT
##VAR_FORM=  AFFN,          ASDF,            ASDF
##VAR_DIM=   65536,         65536,           65536
##UNITS=     HZ,            ARBITRARY UNITS, ARBITRARY UNITS
##FACTOR=    0.49542278885378, 1,            1
##FIRST=     16045.7642231865, 0,            0
##LAST=      -16421.768244346, 0,            0
##MIN=       -16421.768244346, -22936728,    0
##MAX=       16045.7642231865, 499701391,    0
$$ Real data points
##PAGE= N=1
##DATA TABLE= (X++(R..R)), XYDATA
$$ [...]
45394b50757L89034J62814q8785l0277J20605j2809k86131k40105J25185L21549
$$ -250757 138277 301091 212306 182029 302634 289825 3694 -236411 -111226 210323
45384B10323J38480q6685p8206J051k3493j0457J21427J18611j59071l80838k30002
$$ 210323 348803 262118 183912 184963 161470 151013 272440 391051 231980 -148858 -378860
45373c78860N6400O2737j39331j76147m6260q3058l03293l24954j0667K77446
$$ -378860 -322460 -259723 -399054 -575201 -621461 -704519 -1007812 -1332766 -1343433 -1065987
45363a065987K34719M1866J5060J32674J76951J37281J76330K80862K22267r2225
$$ -1065987 -831268 -789402 -774342 -641668 -464717 -327436 -151106 129756 352023 259798
45353B59798m13042m09483p2247K66750L33524K05805J07935L9829j60689m31059
$$ 259798 -153244 -562727 -634974 -368224 -34700 171105 279040 318869 158180 -272879
45343b72879m74287k21301Q722j6313r9114J6084K09968K33465J39969J10269
$$ -272879 -747166 -968467 -959745 -976058 -1075172 -1059088 -849120 -615655 -475686 -365417
45333c65417O1688j46575k93687p2697L12307L50319Q432k23045j19907m200j01655
$$ -365417 -303729 -450304 -743991 -816688 -504381 -154062 -145630 -368675 -488582 -492782 -594437
45322e94437j76018m0495Q3784L4559O3013L35984M95151J75884l40084m81216
$$ -594437 -770455 -810950 -727166 -692607 -629594 -293610 201541 377425 37341 -443875
45312d43875j95611P1435Q4721L6929R2407J42871Q3970R536K9924J06114J26841
$$ -443875 -639486 -568051 -483330 -446401 -353994 -211123 -127153 -117617 -87693 18421 145262
45301A45262J9448j97316l51095k01779K36008N61141L99996j09974m64322l76711
$$ 145262 164710 -32606 -383701 -585480 -349472 211669 611665 501691 37369 -339342
45291c39342l0290K07347J41764j24654k72060m5597M00564N78254K59810j79021
$$ -339342 -369632 -162285 -20521 -145175 -417235 -462832 -62268 515986 775796 596775
45281E96775k48907N191J57670M7370j07774j51208j43452j03036J7184Q4333
$$ 596775 347868 353059 510729 558099 450325 299117 155665 52629 69813 154146
45271A54146r3605l59388l18999M7028K79782R1781k52477l87726l26439k54804
$$ 154146 60541 -298847 -617846 -570818 -291036 -199255 -451732 -839458 -1165897 -1420701
45261a420701j64373L0425K37065L18287L12837L04184K40823R3626R722Q7103
$$ -1420701 -1585074 -1554649 -1317584 -999297 -686460 -382276 -141453 -47827 -38105 48998
45251D8998J65598P1558q9046j18470n2959m5562o5236O682R3490L7774p6157
$$ 48998 214596 286154 197108 78638 25679 -19883 -85119 -78437 15053 52827 -23330
45240b3330k5616J55529J94370N859j89151k18686j57258r7690L253J34190J31388
$$ -23330 -48946 106583 300953 306812 117661 -101025 -258283 -355973 -352720 -218530 -87142
45229h7142o2059k28977j47977J09805L16626L89688L80558K84515Q1340r8232
$$ -87142 -149201 -378178 -526155 -416350 -99724 289964 670522 955037 1036377 938145
45219I38145q3755N6569P2049r0608j84141m4483J25591M4312k13559l07073j11377
$$ 938145 854390 910959 983008 892400 708259 663776 789367 833679 620120 313047 201670
45208B01670J29854J69184N7578j2474R997M3171M0423Q256n7152j24500j01790
$$ 201670 331524 500708 558286 545812 555809 598980 639403 647659 590507 466007 364217
45197C64217J6019O5364o8568k41893k42652j16272q0037j56671j51164p301Q3482
$$ 364217 380236 445600 377032 135139 -107513 -223785 -303822 -460493 -611657 -618958 -535476
45186e35476J1330o5040K642J00662N9841n0269l8650R3029J52026L5919j44512
$$ -535476 -524146 -589186 -586544 -485882 -426041 -476310 -514960 -421931 -269905 -233986 -378498
45175c78498k21938j46476k185Q7155P7709N1006R5787J53515Q7245q8488j96514
$$ -378498 -600436 -746912 -749097 -661942 -584233 -533227 -437440 -283925 -196680 -285168 -481682
45164d81682j55973p5949j6444J31709L79623M62631J72907k58827l85823j07461
$$ -481682 -637655 -713604 -730048 -598339 -218716 243915 416822 157995 -227828 -335289
45154c35289K32051K99898J07413j31233k55448k09755k5474J48168J27100q6665
$$ -335289 -103238 196660 304073 172840 -82608 -292363 -317837 -169669 -42569 -129234
45144a29234k52690j58076J13018K60127J06397j99111l39566j73966J16647K58176
$$ -129234 -381924 -540000 -426982 -166855 -60458 -259569 -599135 -773101 -656454 -398278
45134c98278K10822J64663K20852K43869J10895n2683m8538Q0979J01083q4270
$$ -398278 -187456 -22793 198059 441928 552823 500140 451602 532581 633664 549394
45124E49394l14612l90586k75921o9994J06152J72818J26903L9485k0416m1608
$$ 549394 234782 -155804 -431725 -501719 -395567 -222749 -95846 -56361 -76777 -118385
45114a18385k8161K0969M0611p3742k70531l08178o9766K10048K28808K7122j13819
$$ -118385 -146546 -125577 -84966 -158708 -429239 -737417 -807183 -597135 -368327 -341205 -455024
45103d55024j04367r3736j12731M462K64977L84393J74224j55137k65409j15348
$$ -455024 -559391 -653127 -765858 -761396 -496419 -112026 62198 -92939 -358348 -473696
45093d73696O5087J21599J13888J41081J74842J01704j10175l06945k60601M9100
$$ -473696 -408609 -287010 -173122 -32041 142801 244505 134330 -172615 -433216 -384116
45083c84116L23103K51622r1369l31875k73188q6664J2442M4697J05823J39693
$$ -384116 -61013 190609 99240 -232635 -505823 -592487 -580045 -535348 -429525 -289832
45073b89832N8496m8092j9772J26849K16625J43689l1925j68295j35059J01664
$$ -289832 -231336 -279428 -299200 -172351 44274 187963 156038 -12257 -147316 -45652
45063d5652L88455M59679K19070j18794k74540k15501j04111k4162P2388J85258
$$ -45652 342803 802482 1021552 902758 628218 412717 308606 284444 356832 542090
45053E42090K15657J25088N486o2996j24111k46170l68920l33093p6837K41529
$$ 542090 757747 882835 888321 825325 701214 455044 86124 -246969 -323806 -82277
45043h2277L73009K42330K2726r5625j28071j85011k25468j06836J39918K97006
$$ -82277 290732 533062 555788 460163 332092 147081 -78387 -185223 -45305 251701
45033B51701K63121J70488J35659J01668K1289k2301j1662r0356k83548l39393
$$ 251701 514822 685310 820969 922637 943926 921625 909963 819607 536059 196666
45023A96666q7562K21706K16581p8411l07661k86651j55401q0665q4282j43063
$$ 196666 109104 330810 547391 468980 161319 -125332 -280733 -361398 -445680 -588743
45013e88743j94577p2449K84592N89392M93814J19715n8258R0206J75018n5839
$$ -588743 -783320 -855769 -571177 18215 512029 631744 573486 663692 838710 782871
45003G82871l02438k21884J2710K6665j45360j77447k6607L9668n9775j04780
$$ 782871 480433 258549 271259 297924 152564 -24883 -51490 -11822 -71597 -176377
44993a76377L729P2877k2247j20645p1821J0120k1497o7607M0410K24540K49753
$$ -176377 -172648 -99771 -122018 -242663 -314484 -304364 -325861 -393468 -353058 -128518 121235
44982A21235O1642j67047k89620k94582j75506J03159M54256O47859N44267K51079
$$ 121235 182877 15830 -273790 -568372 -743878 -640719 -186463 461396 1005663 1256742
44972A256742k8956k13259l16497l12005j61290M9412J46715P2374n5208j15649
$$ 1256742 1227786 1014527 698030 386025 224735 274147 420862 493236 438028 322379
44962C22379j24051j35953j08214L6917K44873L41241K36414M1264o3445k2448
$$ 322379 198328 62375 -45839 -8922 235951 577192 813606 854870 791425 768977
44952G68977P6729J40294J46468Q9911o3917l06903n14596n29688l30574o0642
$$ 768977 845706 986000 1132468 1222379 1158462 851559 336963 -192725 -523299 -583941
44942e83941J23593J83471J73917J62709J96025K57911K23847l8177m39555o53595
$$ -583941 -460348 -276877 -102960 59749 255774 513685 737532 699355 259800 -393795
44932c93795m58196k0911L00838L73360L28926K65471J48350J2615n784P5269
$$ -393795 -851991 -872902 -572064 -198704 130222 395693 544043 556658 550874 626143
44922F26143M2908j63377k84807j06136J97850K98455J64569M2439O4156J15958
$$ 626143 669051 505674 220867 114731 312581 611036 775605 818044 882200 998158
44912I98158P7012k2750j05485j44854j37157r4485p4919j20130j78666j82411
$$ 998158 1075170 1052420 946935 802081 664924 570439 495520 375390 196724 14313
44902A4313j53848j35646q4940L3258J28858J21054J04441J87716K50263J06632
$$ 14313 -139535 -275181 -360121 -326863 -198005 -76951 27490 215206 465469 572101
44892E72101j35405j73815J5173J11060n5477k34671j48720R0379J69352J9805
$$ 572101 436696 262881 278054 389114 333637 98966 -49754 40625 209977 229782
44882B29782j44930j56294o3203r53j6945l4308N2456K19035K72509Q2846j71728
$$ 229782 84852 -71442 -134645 -135598 -152543 -186851 -134395 84640 357149 439995 268267
44871B68267j85115K7329J09330j04734l10669j89202J01477J82113L7676o467
$$ 268267 83152 110481 219811 115077 -195592 -384794 -283317 -101204 -63528 -69995
44861f9995J62625K81077J57121l5796o5347K796m3226k07523l03787k53887j56763
$$ -69995 92630 373707 530828 495032 429685 432481 389255 181732 -122055 -375942 -532705
44850e32705o6328R0582K98922L39595O3557l05165l61857m2756K53002J72661
$$ -532705 -599033 -508451 -209529 130066 193623 -111542 -473399 -516155 -263153 -90492
44840i0492j36401k62184q5211J41250K07190J68728J32829Q3537J1272j2984
$$ -90492 -226893 -489077 -574288 -433038 -225848 -57120 75709 159246 170518 157534
44830A57534o488j04757k87144k89780J4370L35396L12780K1704j28089N5109
$$ 157534 151046 46289 -240855 -530635 -516265 -180869 131911 153615 25526 80635
44820H0635L43272M38403K98186O6615j32202k42893k44560j66605r4574j03700
$$ 80635 423907 862310 1160496 1227111 1094909 852016 607456 440851 346277 242577
44810B42577j89744k66346k28393n2078J55830K53479K11454J05821p405r6625
$$ 242577 52833 -213513 -441906 -493984 -338154 -84675 126779 232600 225195 128570
44800A28570p0247J19940K87033J69506j52129k83246q9674P0557q9335l09915
$$ 128570 58323 178263 465296 634802 482673 199427 109753 180310 90975 -218940
44790b18940k09641Q2822J49584l2654j02922N6453J78410J21483P2344J45148
$$ -218940 -428581 -345759 -196175 -228829 -331751 -275298 -96888 24595 96939 242087
44780B42087J83670R5721K1481K1562n8350k47985l14507j57343k0248q5259j56427
$$ 242087 425757 521478 542959 564521 506171 258186 -56321 -213664 -233912 -319171 -475598
44769d75598p907K23307K82689K09417J98281K34375J72590L7633n0858j28581
$$ -475598 -483505 -260198 22491 231908 430189 664564 837154 874787 823929 695348
44759F95348k70361l38804j60926J21730J94346K3594j25420j07978m0706j6484
$$ 695348 424987 86183 -74743 46987 241333 264927 139507 31529 -9177 -25661
44749b5661K6668R9833R2272j3721p9809l6699L1379Q4181J85888K92155K12765
$$ -25661 1007 100840 193112 179391 99582 62883 94262 178443 364331 656486 869251
44738H69251q4340l37362l18779j36680m4167q7313j26017j02031q5137r2435
$$ 869251 784911 447549 128770 -7910 -52077 -139390 -265407 -367438 -452575 -545010
44728e45010m1157J07786K82483L85151L54931J64281j37306l77670l79831j65684
$$ -545010 -586167 -478381 -195898 189253 544184 708465 571159 193489 -186342 -352026
44718c52026M5772R1088M0716O5384J83594K31471P8492j98641l83762l28933
$$ -352026 -306254 -215166 -174450 -109066 74528 305999 384491 185850 -197912 -526845
44708e26845q1836J60804K15519P1021q8139n6079J60615L23907K28751n0880
$$ -526845 -608681 -447877 -232358 -161337 -249476 -305555 -144940 178967 407718 356838
44698C56838k46131j95972J1044J78606J93761P4417p7513j42401p8512K0369
$$ 356838 110707 -85265 -74221 104385 298146 372563 295050 152649 74137 94506
44688I4506K2988p5356j55859j38971n5605L9040J14684J29218O5500M366J8785
$$ 94506 117494 42138 -113721 -252692 -308297 -269257 -154573 -25355 40145 44511 63296
44677F3296Q066j63597l56605k56424J27503L64318J87878j04753j07020J01310
$$ 63296 71362 -92235 -448840 -705264 -577761 -213443 -25565 -130318 -237338 -136028
44667a36028J66281P3504J11862L02089L28347Q9920j14180r4651p5385k61176
$$ -136028 30253 103757 215619 517708 846055 935975 821795 727144 651759 390583
44657C90583m27622k53252J40572L10081Q1710k42775k87103k6889K29514J96466
$$ 390583 -37039 -290291 -149719 160362 242072 -703 -287806 -314695 -85181 111285
44647A11285q7901l08048k35123J366J05324K1888m1183O952N758j20269j66270
$$ 111285 23384 -284664 -519787 -518421 -413097 -391209 -432392 -425440 -419682 -539951 -706221
44636g06221K4260K66338L10606K26489K25045K44890N8952k58474l34178l0913
$$ -706221 -681961 -415623 -105017 121472 346517 591407 650359 391885 57707 26794
44626B6794L21368L56195J04499j44169k31292k15688j93070j96639k26098k53068
$$ 26794 348162 704357 808856 664687 433395 217707 24637 -172002 -398100 -651168
44616f51168k17838r0633R0281K72867M21343M62356L03435j4522k65477k48069
$$ -651168 -869006 -959639 -869358 -596491 -175148 287208 590643 576121 310644 62575
44606F2575j2853K04058K39166J08633j01800l28126m90718m79450k58104N2193
$$ 62575 49722 253780 492946 601579 499779 171653 -319065 -798515 -1056619 -1004426
44596a004426K58465K70652J67470R2121J06884J58469J67156J20784O7899L6995
$$ -1004426 -745961 -475309 -307839 -215718 -108834 49635 216791 337575 405474 442469
44586D42469k661q7176j87033k16747j19713O7484K40835L14902K79364J77266
$$ 442469 439808 352632 165599 -51148 -170861 -103377 137458 452360 731724 908990
44576I08990M9347q0073j75120j88782j10936J0826J19689J92390K12924J51894
$$ 908990 958337 878264 703144 514362 403426 414252 533941 726331 939255 1091149
44566A091149K8857m6444R034J01035M2134j76749l26860k47104q9573r6435k08804
$$ 1091149 1120006 1073562 1082596 1183631 1225765 1049016 722156 475052 385479 289044 80240
44555H0240j34668J70369L52472J42352k18809k83748j8449J74979M8894j72914
$$ 80240 -54428 115941 468413 610765 391956 108208 89759 264738 313632 140718
44545A40718j69775L6245J93111J90812J08595N025j12895j62747n0984J26669
$$ 140718 -29057 7188 200299 391111 499706 504731 391836 229089 178105 304774
44535C04774J39626p3010k92928k72950j087L11611M19054K18763j46333l65229
$$ 304774 444400 371390 78462 -194488 -195575 116036 535090 753853 607520 242291
44525B42291k59730o464P6759m7896j19756l262J07634K2448j25076q4447J21156
$$ 242291 -17439 -23903 52856 4960 -114796 -118058 -10424 12024 -113052 -197499 -76343
44514g6343K29105J05705j06299j97747j10191N5566J44501P3539o6693p4734
$$ -76343 152762 258467 152168 -45579 -155770 -100204 44297 117836 51143 -23591
44504b3591J13881L01536K58257J9454j71952j77336p9475j5223l4565j23017
$$ -23591 90290 391826 650083 669537 497585 320249 240774 225551 190986 67969
44494F7969k29300k58100j53461j92O9156O9826J40164L05805M04220K93676K9546
$$ 67969 -161331 -419431 -572892 -573084 -503928 -434102 -293938 11867 416087 709763 739309
44483G39309k18131l33458l02902j86929q6724n9039l3989R4609K74136L05451
$$ 739309 521178 187720 -115182 -302111 -388835 -447874 -481863 -387254 -113118 192333
44473A92333J09435j27890j69822j9264R9403J6219j99586l21386j94206J07820
$$ 192333 301768 173878 4056 -15208 84195 100414 -99172 -420558 -614764 -506944
44463e06944L43268L41589J63161j2340j02364j36269j11214N531J29687R6227
$$ -506944 -163676 177913 341074 328734 226370 90101 -21113 -15582 114105 210332
44453B10332r7096k41764j97585p2141k2188k5446J3488N9016J5228q0506r6771
$$ 210332 113236 -128528 -326113 -398254 -420442 -445888 -432400 -373384 -358156 -438662 -535433
44442e35433O810J61506K95937L42484K28495Q825r2597M0350J91681R5099j39301
$$ -535433 -528623 -367117 -71180 271304 499799 508624 416027 456377 648058 743157 603856
44431F03856j72703J1241M8961k29055n10331m68069k20408o7761r438J53859
$$ 603856 431153 442394 491355 262300 -248031 -716100 -936508 -1004269 -1013707 -859848
44421h59848L78855L97866J54733q9194j25404j7452J02426K05954K49566J24678
$$ -859848 -480993 -83127 71606 -17588 -142992 -160444 -58018 147936 397502 522180
44411E22180j24605k31002l6857K42672K84446Q5135q4790r5109q8897j82503
$$ 522180 397575 166573 129716 372388 656834 741969 657179 562070 473173 290670
44401B90670k57139j62320K1329P8177l8537j43356p8718O8021Q4561o9366j84926
$$ 290670 33531 -128789 -107460 -29283 -67820 -211176 -289894 -221873 -137312 -206678 -391604
44390c91604o4290K14002L81721L08709J31190L4401L1495K8411n506m9510j33737
$$ -391604 -455894 -241892 139829 448538 579728 614129 645624 674035 668529 619019 485282
44379D85282k84221m01922l46220j41169L6740R6159J27010K21329L21241L12519
$$ 485282 201061 -200861 -547081 -688250 -651510 -555351 -428341 -207012 114229 426748
44369D26748J80377P063j21361j61755j32510j16614j73028k23699j24632J18726
$$ 426748 607125 614188 492827 331072 198562 81948 -91080 -314779 -439411 -320685
44359c20685L18419L37045K37047J30600J2807j43080k38369j54083M6004J59403
$$ -320685 -2266 334779 571826 702426 715233 572153 333784 179701 225705 385108
44349C85108Q6452o8822j35695n1666Q3129R2984q2090k62373j98052R1922K88667
$$ 385108 471560 402738 267043 215377 298506 391490 309400 47027 -151025 -59103 229564
44338B29564J73405q5873j81390o0355R8268J76163J75621Q1388j05190k47042
$$ 229564 402969 317096 135706 75351 173619 349782 525403 606791 501601 254559
44328B54559k09109p2881K330O3837K42755M03925K64445j08376k81657o2652
$$ 254559 45450 -27431 -25101 38736 281491 685416 949861 841485 559828 497176
44318D97176K10170J63184j16302l05829l17922k71989j86688o842J61720J35267
$$ 497176 707346 870530 754228 448399 130477 -141512 -328200 -335042 -173322 -38055
44308c8055m7075j33407J3878K63637M00709L43755J72769K2604n1746j25950
$$ -38055 -85130 -218537 -204659 58978 459687 803442 976211 998815 947069 821119
44298H21119k66211l53881k07525R1262K11713J4775k43386k93085j99906j38461
$$ 821119 554908 201027 -6498 84764 296477 311252 67866 -225219 -425125 -563586
44288e63586o9063Q6276J69787L2658j14435K3241L11989L58910J31119k5043
$$ -563586 -632649 -546373 -376586 -343928 -458363 -435122 -123133 235777 366896 341853
44278C41853J9673J5060j56345k50417j09101N9395O1607L3039J29124K12009
$$ 341853 361526 376586 220241 -30176 -139277 -79882 -18275 14764 143888 355897
44268C55897J21748j339L7443J25933L0132k12176l59655l06932j17837J35820
$$ 355897 477645 476306 513749 639682 669814 457638 97983 -208949 -326786 -190966
44258a90966L20399J93710k73169o47992m63161J51611N88780N06692J39119j49093
$$ -190966 129433 323143 49974 -598018 -1061179 -909568 -320788 185904 325023 175930
44248A75930k73625l04848k42448r2980L3197O7937Q7223J45144J44319l189k01135
$$ 175930 -97695 -402543 -644991 -737971 -704774 -636837 -549614 -404470 -260151 -263340 -464475
44237d64475k81021k09133p8651M2014J62335L01871M19503M01870J57306k10337
$$ -464475 -745496 -954629 -1033280 -991266 -828931 -527060 -107557 294313 451619 241282
44227B41282l92920k01035J39367K17907k5162k31128j45248N9390J12561L7904
$$ 241282 -151638 -352673 -213306 4601 -20561 -251689 -396937 -337547 -224986 -187082
44217a87082l988m3562j85794l07076j89681Q9830K12398P3166q7769o6103M8128
$$ -187082 -191070 -234632 -420426 -727502 -917183 -827353 -614955 -541789 -629558 -695661 -647533
44206f47533Q7402N6792L3292m195q9123j41195p6792M4701J11845J16116J00739
$$ -647533 -560131 -503339 -470047 -474242 -563365 -704560 -781352 -736651 -624806 -508690 -407951
44195d07951M6006n9591j12043j1062J56223K01468R0266k0666K602J33319K51933
$$ -407951 -361945 -421536 -533579 -544641 -388418 -186950 -96684 -117350 -114748 18571 270504
44184B70504K49266Q7820j26588j75683K2009K28909J42587j74344l37647j54261
$$ 270504 519770 607590 481002 305319 327328 556237 698824 524480 186833 32572
44174C2572J43132K62320K05089J03207m9691k58447l16932n7931K89534L29605
$$ 32572 175704 438024 643113 746320 696629 438182 121250 63319 352853 682458
44164F82458O4599j02184K9526J86130Q2467j49540k11936r5569j8984m2534j7635
$$ 682458 747057 644873 674399 860529 942996 793456 581520 485951 466967 424433 406798
44153D06798J07540J65537Q145k65486l81254j57608K84164N63782L88588q9318
$$ 406798 514338 679875 688020 422534 41280 -116328 167836 731618 1120206 1030888
44143A030888l88760k69109k7814n7655k66753k28575J53851M80163M22934J51078
$$ 1030888 642128 373019 345205 287550 20797 -207778 -53927 426236 849170 1000248
44133A000248L856j1474j32591l86086n11458l45903n4517J02797Q3003L5670
$$ 1000248 1004104 992630 860039 473953 -37505 -383408 -437925 -335128 -252125 -216455
44123b16455N6591Q2389J6229j29449k48542k59179j66977k7865J02096J71527
$$ -216455 -159864 -77475 -61246 -190695 -439237 -698416 -865393 -893258 -791162 -619635
44113f19635J46353O1843K0452P6574J48389J11211l6821j72181j96861j16549
$$ -619635 -473282 -411439 -390987 -314413 -166024 -54813 -91634 -263815 -460676 -577225
44103e77225J7748J51178K10106J55055O5585O1328J18457R7040j5833o0733J2951
$$ -577225 -559477 -408299 -198193 -43138 22447 83775 202232 299272 283439 222706 235657
44092B35657J1555j92621l79488k49911J13282L22227K05997j2432r6652p5290
$$ 235657 247212 54591 -324897 -574808 -461526 -139299 66698 54266 -42386 -117676
44082a17676l5050Q2490K66253K44872j80058p10726p92833l03591K77771M71606
$$ -117676 -152726 -70236 196017 440889 260831 -449895 -1242728 -1546319 -1268548 -796942
44072g96942L23658J90058K18212K68519K22784J10727l5927k12035l00362j40376
$$ -796942 -473284 -283226 -65014 203505 426289 537016 501089 289054 -11308 -151684
44062a51684J84101L46493K04247K3770P7796J92067n704m56213o45617k97303
$$ -151684 32417 378910 583157 606927 684723 876790 871086 414873 -230744 -528047
44052e28047K20983L71191J06690j74963j97995o1637K5209J4058j7068M202R8252
$$ -528047 -307064 64127 170817 -4146 -202141 -263778 -238569 -224511 -241579 -237377 -139125
44041a39125K13590K43298J53313N7192M2905j240j94454l58727j89634K39322
$$ -139125 74465 317763 471076 528268 571173 569933 375479 16752 -172882 66440
44031F6440M56347K10547j69769k44946n1321M7119q2687k44705k83787k46701
$$ 66440 522787 733334 563565 318619 267298 314417 231730 -12975 -296762 -543463
44021e43463j94968j26685q9360j30152j35505L2549K45082K36828N4187M5053
$$ -543463 -738431 -865116 -954476 -1084628 -1220133 -1187584 -942502 -705674 -651487 -606434
44011f06434L03806M68625K64255o2050j18899N7430J32918J5700q3765o4129
$$ -606434 -302628 165997 430252 368202 249303 306733 439651 455351 371586 307457
44001C07457o7963j84411k91123k54871r2330J07929K54298K36015K3905k02540
$$ 307457 239494 55083 -236040 -490911 -583241 -475312 -221014 15001 38906 -163634
43991a63634k21758p9138k5572j26523j67896j5412J75486K25816J88247J80567
$$ -163634 -385392 -464530 -490102 -616625 -784521 -799933 -624447 -398631 -210384 -29817
43981b9817J53388J5045j46231j62148l1898Q9332R5163K524j10461j38420p868
$$ -29817 123571 138616 -7615 -169763 -201661 -112329 -17166 -14642 -125103 -263523 -271391
43970b71391J97220K75566J75022P4749P4133n309k87812n00835k97569J67690
$$ -271391 -74171 201395 376417 451166 525299 519990 232178 -268657 -566226 -398536
43960c98536L64659J09880k02259k01275k9670k3151j76940k16762m9208J43749
$$ -398536 -33877 76003 -126256 -327531 -357201 -380352 -557292 -774054 -823262 -679513
43950f79513K08342J81974J50585J24493Q7565M8848J9324R120L3065N4256k3663
$$ -679513 -471171 -289197 -138612 -14119 73446 122294 141618 150738 183803 238059 214396
43939B14396k11290l41235k54600m1459N8868j1778o9904P014R0885J1835j72402
$$ 214396 3106 -338129 -592729 -634188 -575320 -587098 -657002 -649988 -559103 -547268 -719670
43928g19670k45489j07978J30181L07140L68278L67869L70549L65714K77015Q1135
$$ -719670 -965159 -1073137 -942956 -635816 -267538 100331 470880 836594 1113609 1194744
43918A194744j03626j34359n5519o2943j98227k37521k4159K29782J95635r3148
$$ 1194744 1091118 956759 901240 838297 640070 402549 378390 608172 803807 710659
43908G10659k75937j75387M929N5309L8251M4511m0781k75069l92697j41209K51243
$$ 710659 434722 259335 264264 319573 357824 402335 361554 86485 -306212 -447421 -196178
43897a96178L23139N5350r5320J01625L06626J47136k30104m07603k69582l8249
$$ -196178 126961 182311 86991 188616 495242 642378 412274 4671 -264911 -303160
43887c03160J15594K06391K47061J97792J01239O1940P7769N1905l2490r8992
$$ -303160 -187566 18825 265886 463678 564917 626857 704626 756531 724041 625049
43877F25049j23116j39588j24681l3123O0558L0274q8572j30108n9937k1040p1836
$$ 625049 501933 362345 237664 204541 265099 295373 206801 76693 16756 -4284 -76120
43866g6120o7207J01548K99421L09262J14347r4016j51768q5126m7550j28517
$$ -76120 -143327 -41779 257642 566904 681251 587235 435467 350341 302791 174274
43856A74274k36301k08551n3598K0204j01230k40660j89798n1306p4750k12159
$$ 174274 -62027 -270578 -324176 -303972 -405202 -645862 -835660 -886966 -961716 -1173875
43846a173875j48530J83022M26069K76031j12459l52413k65788M7714L91504N56307
$$ -1173875 -1322405 -1139383 -713314 -437283 -549742 -902155 -1167943 -1120229 -728725 -172418
43836a72418L97832J7276k64335k64646j34685o4221Q098J91286L46628K74619
$$ -172418 225414 242690 -21645 -286291 -420976 -485197 -477099 -285813 60815 335434
43826C35434P4785K8569J80638L01837K43628R0314l2138q6051o9648k2863n4966
$$ 335434 410219 438788 619426 921263 1164891 1255205 1223067 1137016 1067368 1044505 989539
43815I89539j83485k14466p780K18654J40359j61059k79148j03482R454j87974
$$ 989539 806054 591588 583808 802462 942821 781762 502614 399132 408586 220612
43805B20612m31624l42446K7123L04692K99270J43571J9896l7125p9732j39340
$$ 220612 -211012 -553458 -526335 -221643 77627 221198 241094 203969 124237 -15103
43795a5103j93214j78490o7240N1172M1970r3797k07856j95934p9600J12612L69545
$$ -15103 -208317 -386807 -454047 -402875 -360905 -454702 -662558 -858492 -938092 -825480 -455935
43784d55935N56767M63784J09166j87572j89831m4145l6694j93681l11255k74401
$$ -455935 100832 564616 673782 486210 296379 252234 215540 21859 -289396 -563797
43774e63797j50013k9135M7577N1782K385n141P4911J48822J34208J02993J36610
$$ -563797 -713810 -742945 -695368 -643586 -641201 -646342 -571431 -422609 -288401 -185408 -48798
43763d8798J53552N8200m6643r990R0156O1342o9166j01303k0422j3868r7076
$$ -48798 104754 162954 116311 106321 196477 257819 188653 87350 66928 53060 -44016
43752d4016l8959K17489L52565J05565k91445l76447n4178L16667M05819K54966
$$ -44016 -82975 134514 487079 592644 301199 -75248 -129426 187241 593060 848026
43742H48026R5603J6488n5181j33872j04926Q5058K69416K03551j40432n14338
$$ 848026 943629 960117 904936 771064 666138 751196 1020612 1224163 1083731 569393
43732E69393o57428n37490k95000n7985J05024J57877J52351K24285L84206M00372
$$ 569393 -88035 -625525 -920525 -978510 -873486 -715609 -563258 -338973 45233 445605
43722D45605R5476l01274l67832p1503J57033L8623j56574m1645K87653L96000
$$ 445605 541081 239807 -128025 -199528 -42495 -3872 -160446 -202091 85562 481562
43712D81562J48646j14473p0182J82288L01262J12960k53806n15063m36628k0621
$$ 481562 630208 515735 445553 627841 929103 1042063 788257 273194 -163434 -184055
43702a84055M18656M86219J34804k39941k71737q5053p5937k97598l68530p0889
$$ -184055 234601 720820 855624 615683 343946 258893 182956 -114642 -483172 -554061
43692e54061K70278K42826l8642j13951J24566L03856J78607k2200k9269L1011
$$ -554061 -283783 -40957 -79599 -193550 -68984 234872 413479 391279 362010 393021
43682C93021p7289k34350j54359R8750J80790K5528n0824J25231K99914J89286
$$ 393021 315732 81382 -72977 25773 206563 232091 181267 306498 606412 795698
43672G95698j07859k89957k53813j17406K0724J42267J99260J21454o5335k22451
$$ 795698 687839 397882 144069 26663 47387 189654 388914 510368 445033 222582
43662B22582k09961r441K18588K35072m240k17995j26388J22625J28509j32269
$$ 222582 12621 3180 221768 456840 452600 234605 108217 230842 359351 227082
43652B27082k13325J01080L80081J60097l16634m22678n7923K42238J15816j64881
$$ 227082 13757 114837 494918 655015 338381 -84297 -142220 100018 215834 50953
43642E0953j81354M9124K06819J46309J519o4986l0180K2281k498j07715j62781
$$ 50953 -130401 -81277 125542 271851 273370 208384 178204 200485 197987 90272 -72509
43631g2509m7679J44704J78476j4221k30446k64205j40385n170Q4720J58730K15497
$$ -72509 -120188 24516 202992 188771 -41675 -305880 -446265 -451435 -366715 -207985 7512
43620G512K14832J35800j3569j85770k69777j72275M3584J99319K09776J46437
$$ 7512 222344 358144 344575 158805 -110972 -283247 -239663 -40344 169432 315869
43610C15869Q3771K3124j5294Q19j6427j94704m27191m18646j18626J47166J48159
$$ 315869 399640 422764 407470 408289 391862 197158 -230033 -648679 -767305 -620139 -471980
43599d71980Q3845J98482L18410J36151k10100k69871M1115L10163K40619K4285
$$ -471980 -388135 -189653 128757 264908 54808 -215063 -173948 136215 376834 401119
43589D01119l7771K9627J9475j08551k34600k83732k47219j16530N5871J39480
$$ 401119 363348 392975 412450 303899 69299 -214433 -461652 -578182 -522311 -382831
43579c82831J01964R0084K03580L10535K45616Q4740L6260J24704J71983O9803
$$ -382831 -280867 -190783 12797 323332 568948 653688 689948 814652 986635 1056438
43569A056438j00563k24098k78788k82445k31292j26215J2543J60011K57033K09939
$$ 1056438 955875 731777 452989 170544 -60748 -186963 -174420 -14409 242624 452563
43559D52563J5577j62349j72274r2955j12914k12435j73106N4934K23681J53012
$$ 452563 468140 305791 133517 40562 -72352 -284787 -457893 -402959 -179278 -26266
43549b6266K6282J13442L29173L27977J2621l10541l48912j77476m5332j488Q7248
$$ -26266 16 113458 442631 770608 783229 472688 123776 -53700 -99032 -100520 -13272
43538a3272K29164K48703O8930j27744j26294L6985J37106N9906q2689j44160
$$ -13272 215892 464595 533525 405781 279487 316472 453578 513484 430795 286635
43528B86635j42153j95486l05952k94669q344M30741O59362M34832m8057l01107
$$ 286635 144482 -51004 -356956 -651625 -659969 -229228 430134 864966 816909 515802
43518E15802o6755L69573M91840J50215k80373l68553j27234O0553n1033k88246
$$ 515802 449047 818620 1310460 1460675 1180302 811749 684515 745068 694035 405789
43508D05789l17070o8805K01209K46957J03036k3015l5968k0886n7425j02606
$$ 405789 88719 19914 221123 468080 571116 548101 512133 491247 433822 331216
43498C31216j02608j04617j63404k16974j73381p2505k9201l8244J4695J34890
$$ 331216 228608 123991 -39413 -256387 -429768 -502273 -531474 -569718 -555023 -420133
43488d20133J70930M5330j11709j52645j11198r1327o8697L7952J66971J66935
$$ -420133 -249203 -203873 -315582 -468227 -579425 -670752 -739449 -701497 -534526 -367591
43478c67591L5070o8618o3710m1100o3402l7834J09263K58934K38318O2447r2848
$$ -367591 -332521 -401139 -464849 -505949 -569351 -607185 -497922 -238988 -670 61777 -31071
43467c1071j18760n3262L5845J14133J31167M7321o2791o7190J6846J7894j04657
$$ -31071 -149831 -203093 -167248 -53115 78052 125373 62582 -4608 12238 30132 -74525
43456g4525j29754J10644M09554M08041R6310j63222j45986l5490o9504j67938
$$ -74525 -204279 -93635 315919 723960 820270 657048 511062 475572 406068 238130
43446B38130j26564M380J2358j01564j29624j9440N6586L0784N5911J88489K22559
$$ 238130 111566 115946 128304 26740 -102884 -122324 -65738 -34954 20957 209446 432005
43435D32005J5739k33524k59160j22998q2132j56077j15555R6244K16160M6606
$$ 432005 447744 214220 -44940 -167938 -250070 -406147 -521702 -425458 -209298 -162692
43425a62692k23849k64885n3093J27263J09377O1265J86433L69072L19374K5127
$$ -162692 -386541 -651426 -704519 -577256 -467879 -406614 -220181 148891 468265 493392
43415D93392j89027j29471j4288r1526j93319p84L58992M03731K7546k86934j68502
$$ 493392 304365 174894 160606 69080 -124239 -125023 233969 637700 665246 378312 209810
43404B09810J20139J49263j9608l4589J15864J30840l6616r3709Q4532K55768
$$ 209810 329949 479212 459604 425015 540879 671719 635103 541394 625926 881694
43394H81694K14211P0894Q043J7764J3422j2271n1567j23052j71149j03444K0279
$$ 881694 1095905 1166799 1174842 1192606 1206028 1193757 1142190 1019138 847989 744545 764824
43383G64824L3277o4521j02261m8470o5155j85259k22581j09465k6580n1065J6442
$$ 764824 798101 733580 631319 582849 517694 332435 109854 389 -26191 -77256 -60814
43372f0814K72095M48973K91564n4003k84415l44315l17588j58592J35669K97642
$$ -60814 211281 660254 951818 897815 613400 269085 -48503 -207095 -71426 226216
43362B26216J18123j51246j27631Q8741P6228j86050k50962O9462L75566K69238
$$ 226216 344339 193093 65462 154203 230431 44381 -206581 -137119 238447 507685
43352E07685r7836l03471k06058K8676K41867L69196L45398J54621p4352j85030
$$ 507685 409849 106378 -99680 -71004 170863 540059 885457 1040078 965726 780696
43342G80696j75109j58297j88066k05659j35108J8366J43679J12512m5135j10639
$$ 780696 605587 447290 259224 53565 -81543 -63177 80502 193014 147879 37240
43332C7240M3421J99616L9869l54172n15988k14566J96957K52174l041j25530
$$ 37240 80661 280277 320146 -34026 -550014 -764580 -567623 -315449 -318490 -444020
43322d44020P0316K66638J14779k61705m07820j19742K85408L59370P7337j66750
$$ -444020 -373704 -107066 7713 -253992 -661812 -781554 -496146 -136776 -59439 -226189
43312b26189j09731O6165Q6506J4299O2888J48771J0102k66033k57009J44531
$$ -226189 -335920 -269755 -183249 -168950 -106062 42709 52811 -213222 -470231 -325700
43302c25700M78055L32318r2602l13543k13536m8758K4353P8956J37270Q9026
$$ -325700 152355 484673 392071 78528 -135008 -183766 -159413 -80457 56813 145839
43292A45839p4823j95447j78746j17045j20779j65619j58805o0539Q8975J91860
$$ 145839 71016 -124431 -303177 -420222 -541001 -706620 -865425 -925964 -836989 -645129
43282f45129J51726j0271j26347o1882J06847J95426J55625R7184Q9354P8140
$$ -645129 -493403 -503674 -630021 -691903 -585056 -389630 -234005 -136821 -47467 30673
43272C0673J4398n9953r5671j13420j42661j39519k5946J88459L52588K91964
$$ 30673 45071 -14882 -110553 -223973 -366634 -506153 -532099 -343640 8948 300912
43262C00912K8267j62443k2962L51176N83479M56886J38877q7482j46802j28153
$$ 300912 329179 166736 143774 494950 1078429 1535315 1674192 1586710 1439908 1311755
43252A311755r9911j19977k69577m89918n23262k28682J57127K97338J88054P2304
$$ 1311755 1211844 1091867 822290 332372 -190890 -419572 -262445 34893 222947 295251
43242B95251L2058l0607p5797M9572K53952K36589k2461j55610M3818K79821J87294
$$ 295251 327309 296702 220905 270477 524429 761018 738557 582947 626765 906586 1093880
43231A093880j50408l82911l88374k90985j30319J49347M24907M33517J38665
$$ 1093880 943472 560561 172187 -118798 -249117 -99770 325137 758654 897319
43222H97319j88676l25668l24823l05676k32964n0600J23536J29731J5547k9672
$$ 897319 708643 382975 58152 -247524 -480488 -531088 -407552 -277821 -262274 -291946
43212b91946M1863R3928M9791n465j7312o8105j74220j54605R5855L25578J96283
$$ -291946 -250083 -156155 -106364 -111829 -129141 -197246 -371466 -526071 -430216 -104638 91645
43201I1645j89668l35625j1206M11785M57758J52300j09879j34017o8239n1114
$$ 91645 -98023 -433648 -444854 -33069 424689 576989 467110 333093 264854 213740
43191B13740k4502O3655J18655N9568m1699p2618k2741M5966Q1102N3407l0365
$$ 213740 189238 252893 371548 431116 389417 316799 294058 340024 421126 474533 444168
43180D44168j07354j25047j19648j42077j40431m3791O1867O639j91268k83411
$$ 444168 336814 211767 92119 -49958 -190389 -234180 -172313 -165674 -356942 -640353
43170f40353q8411K69499M73473L10110j41787n47687n82327k54405R0113J92353
$$ -640353 -728764 -459265 14208 324318 182531 -365156 -947483 -1201888 -1111775 -919422
43160i19422J89874L23670M85454L71557K2027j79045q8412m47j23720k37708
$$ -919422 -729548 -405878 79576 451133 473160 294115 205703 205256 81536 -156172
43150a56172j01942J19273J45837M9035Q9305K48630K71093R3726p5904r1934
$$ -156172 -258114 -138841 6996 56031 145336 393966 665059 758785 682881 590947
43140E90947j8115N3478J04305J03686J9950p4614q2390n6359j26655k66630l17373
$$ 590947 572832 626310 730615 834301 854251 779637 697247 640888 514233 247603 -69770
43129f9770k43811j71774j45595m8579J61100L04426J91543j13194l41949l07150
$$ -69770 -313581 -485355 -630950 -679529 -518429 -214003 -22460 -135654 -477603 -784753
43119g84753p2588J47434K22307K16736K57816L32886L06049J29418q5253k33712
$$ -784753 -857341 -709907 -487600 -270864 -13048 319838 625887 755305 670052 436340
43109D36340l13974l04543j35102J09212J53640j07329l79659l27911l7668J36242
$$ 436340 122366 -182177 -317279 -208067 -54427 -161756 -541415 -869326 -906994 -770752
43099g70752Q6974K7039Q3690J37647J02652P6493J18798J19532J0470q6144m9129
$$ -770752 -683778 -656739 -573049 -435402 -332750 -256257 -137459 -17927 -7457 -93601 -142730
43088a42730N3280Q9024N6349M0749O8574R6700Q4319J9775o2173p1885L8807
$$ -142730 -89450 -426 55923 96672 165246 261946 346265 366040 303867 231982 270789
43077B70789J66585J57957L2002l1972M3562J27421Q3312n5193j74630k23430
$$ 270789 437374 595331 627333 595361 638923 766344 849656 794463 619833 396403
43067C96403j98984j07386n379J6887m2225p9492l9705P709j2843q1714j38633
$$ 396403 197419 90033 84654 101541 59316 -20176 -59881 -52172 -65015 -146729 -285362
43056b85362j47073q0079N7142J74285J76599J06038P7898Q6449L7336l0663L0565
$$ -285362 -432435 -512514 -455372 -281087 -104488 1550 79448 165897 203233 172570 203135
43045B03135J93580K27535M5029j49776j81800j46474j67003j35706O8347K75467
$$ 203135 396715 624250 669279 519503 337703 191229 24226 -111480 -43133 232334
43035B32334K19375m7856k00429q0598J28842J88736P3564p8811j41497p8781
$$ 232334 451709 403853 203424 122826 251668 440404 513968 435157 293660 214879
43025B14879M5642J09267M9368n5543q4998m1407m4691j66536l22013l30447q6480
$$ 214879 260521 369788 419156 363613 278615 237208 192517 25981 -296032 -626479 -712959
43014g12959K84882M67337K61342j40992l39759k17736n6201q8002j71933p8022
$$ -712959 -428077 39260 300602 159610 -180149 -397885 -454086 -542088 -714021 -792043
43004g92043J25456K18535K00288K24829K66937J58003p6381k06657j43816l5494
$$ -792043 -666587 -448052 -247764 -22935 244002 402005 325624 118967 -24849 -60343
42994f0343J0279M6042Q4920L6627p0004l9779J84974L67276K67116m9768l17600
$$ -60343 -50064 -4022 80898 117525 47521 7742 192716 559992 827108 777340 459740
42983D59740l71029k46074r3851o8378j82855k30138m658L47289M18305R2124
$$ 459740 88711 -157363 -251214 -319592 -502447 -732585 -737243 -389954 28351 120475
42973A20475k35898j83283R6411J85933K8654o4277M4247J48177J13773J01638
$$ 120475 -115423 -298706 -202295 -16362 12292 -51985 -7738 140439 254212 355850
42963C55850K20295K61635K4969l00408l57609j20915J01686J22593N8095L7323
$$ 355850 576145 837780 862749 562341 204732 83817 185503 308096 366191 403514
42953D03514M314q1150q7730N6349J54603J76k63553l02798q1323Q4908L719j30964
$$ 403514 407828 326678 238948 295297 449900 450076 186523 -116275 -197598 -112690 -108971 -239935
42941b39935p6134R5936J64125J15048R6947J22903P3391m4940r1284m9925n6508
$$ -239935 -316069 -220133 -56008 59040 155987 278890 352281 307341 216057 166132 109624
42930A09624j16597m5051J98969L45723J74585j28074k08573m7603M3057q7863
$$ 109624 -6973 -52024 146945 492668 667253 539179 330606 283003 326060 238197
42920B38197k17132j13919J12745K06948J48528J22051J78097J67324K7982q8047
$$ 238197 21065 -92854 19891 226839 375367 497418 675515 842839 870821 782774
42910G82774o7036k2225r2269k03056k07942j48418j57402j76335l0511K13610
$$ 782774 715738 693513 601244 398188 190246 41828 -115574 -291909 -322420 -108810
42900a08810K47451k7857k91088k02293J61669M43882M41697K30051l0785k15040
$$ -108810 138641 110784 -180304 -382597 -220928 222954 664651 894702 863917 648877
42890F48877k34510j12148j3368m8635j00783j2298J24939P8697j49621k87011
$$ 648877 414367 302219 288851 240216 139433 127135 252074 330771 181150 -105861
42880a05861j63525O7424J53626M2863j13672j47259n797K12535L26796K40925
$$ -105861 -269386 -201962 -48336 -5473 -119145 -266404 -272201 -59666 267130 508055
42870E08055L8883j49054l05310m33118m06385j22417K45398L97374L10384K29723
$$ 508055 546938 397884 92574 -340544 -746929 -869346 -623948 -226574 83810 313533
42860C13533K34231J21076j69902l43611j81529P5513O3418j62692k37291m2972
$$ 313533 547764 668840 498938 155327 -26202 49311 112729 -49963 -287254 -330226
42850c30226J64149J88508J51871K15410K75647J16439k36107m83787l96342q1129
$$ -330226 -166077 22431 174302 389712 665359 781798 545691 61904 -334438 -415567
42840d15567J47829J27224k0135j13669j46097j88961j96211r3133J4607l3354
$$ -415567 -267738 -140514 -160649 -274318 -420415 -609376 -805587 -898720 -884113 -917467
42830i17467j37853l7172K44761L69193K11865P3914J61609K11052m3158l33559
$$ -917467 -1055320 -1092492 -847731 -478538 -266673 -192759 -31150 179902 136744 -196815
42820a96815k36141J19596K24583k033j13466R8548K60899M8236k80694k83411
$$ -196815 -432956 -313360 -88777 -90810 -204276 -105728 155171 203407 -77287 -360698
42810c60698L2263L00461L26135K13919R3987M631j2956N5684R7684p004j83106
$$ -360698 -328435 -27974 298161 512080 606067 610698 597742 653426 751110 744106 561000
42799E61000k35492j04442R0628K25609K54642J64608j833j05447m2509R1591
$$ 561000 325508 221066 311694 537303 791945 956553 954720 849273 806764 898355
42789H98355J01556n8462k53790l51705k99626p6483K46547M28623K75296m4128
$$ 898355 999911 941449 687659 335954 36328 -40155 206392 635015 910311 866183
42779H66183j41934N1140J56276r9678m58500n00338k37973k6582J240M2615J77644
$$ 866183 724249 775389 931665 831987 373487 -126851 -364824 -391406 -390166 -347551 -169907
42768a69907K03696L9515m6520J57842M27440M09632J48694j6726N034l5176k56218
$$ -169907 33789 73304 26784 184626 612066 1021698 1170392 1153666 1158700 1123524 867306
42757H67306m11856k66124M4050K15861J89375J40399J55646J33133M792j20437
$$ 867306 455450 189326 233376 449237 638612 779011 934657 1067790 1072582 952145
42747I52145j01288M6382J72160J59814K7797j15160j72428j17738L790R1405
$$ 952145 850857 897239 1069399 1229213 1257010 1141850 969422 851684 855474 946879
42737I46879L4880j67427l25694k19432Q5332K26087R151k53046j31910K64100
$$ 946879 981759 814332 488638 269206 354538 580625 589776 336730 204820 468920
42727D68920L80572J6566l47953k27860J93004L82248K20661N2207Q0156J23792
$$ 468920 849492 866058 518105 290245 483249 865497 1086158 1138365 1218521 1342313
42717A342313Q436j53677j93369j42199j19620j32152j04837l024J42764K37622
$$ 1342313 1350749 1197072 1003703 861504 741884 609732 504895 501871 644635 882257
42707H82257J44284j51675m02804l22088J7452K11454L0111k97692m06655k20824
$$ 882257 1026541 874866 472062 149974 167426 378880 408991 111299 -295356 -516180
42697e16180O3281K50617K57959Q8382j42132k40423j32534M2205J20811J02554
$$ -516180 -452899 -202282 55677 144059 1927 -238496 -371030 -328825 -208014 -105460
42687a05460O4457K5539O708Q1725K21091K20020l6444l41629l96345j95707O399
$$ -105460 -41003 -15464 -8756 72969 294060 514080 477636 136007 -260338 -456045 -449646
42676d49646N8430L0009L247l6942q5966q0966k3850J638k7071l2623L5123J43705
$$ -449646 -391216 -361207 -357960 -394902 -480868 -561834 -585684 -584046 -611117 -643740 -608617 -464912
42664d64912K54040L35088L09935J25498j14581k23481j55825l3189N5552J29633
$$ -464912 -210872 124216 434151 559649 445068 221587 65762 32573 88125 217758
42654B17758J82354J47222M6629Q540O5515R1454J8073m1924M007M5585p0049
$$ 217758 400112 547334 593963 602503 668018 759472 777545 735621 739628 785213 715164
42643G15164k87900l92776k61298K8683K93615L78276K53761M8512o9030o8746
$$ 715164 427264 34488 -226810 -198127 95488 473764 727525 776037 707007 638261
42633F38261m1766r821Q8082J87698J03394j45339k49089m7613J68383P0996j76155
$$ 638261 596495 586674 674756 862454 965848 820509 571420 523807 692190 763186 587031
42622E87031j64887R3174J80716m1792k24239j35538m5178k19778m00652j84221
$$ 587031 422144 515318 696034 654242 430003 294465 249287 29509 -371143 -555364
42612e55364K91151M85705K31231n3480Q051K55724K99233P1936j46714j43105
$$ -555364 -264213 221492 452723 399243 407294 663018 962251 1034187 887473 744368
42602G44368O468J08190R5870N1408M3232J4827j30284l51193m57960l26097n3284
$$ 744368 750836 859026 954896 1006304 1049536 1064363 934079 582886 124926 -201171 -254455
42591b54455J68797K59360K25782M6739k31904l58058j02571L44101M87391J58295
$$ -254455 -85658 173702 399484 446223 214319 -143739 -246310 97791 585182 743477
42581G43477k33662k59222l4046M7300n4297k7811K12467L57845J98585m9474
$$ 743477 509815 250593 216547 263847 209550 181739 394206 752051 950636 901162
42571I01162q7305M7583J13769L8509o6092j35820j74787j21053P4893K68645
$$ 901162 813857 861440 975209 1013718 947626 811806 637019 515966 590859 859504
42561H59504K50321O7615n967J17142J83786j8730l17403l77096j53876P8770
$$ 859504 1109825 1177440 1171473 1288615 1472401 1453671 1136268 759172 605296 684066
42551F84066J08318n861r9770j05002l7857O6748J44382J31734O5387N1827R2920
$$ 684066 792384 786523 686753 581751 543894 610642 755024 886758 952145 1003972 1096892
42540A096892O1552p9275j66195n9981J29957J88575Q2293m9258j25663j81929
$$ 1096892 1158444 1079169 912974 852993 982950 1171525 1253818 1204560 1078897 896968
42530H96968k28955k29985k04051j92085j38435J7130J51002P8488j24576j69421
$$ 896968 668013 438028 233977 41892 -96543 -79413 71589 150077 25501 -143920
42520a43920K3704K11636K28074K14717K97388L16994J20967j18222j58454o4279
$$ -143920 -120216 91420 319494 534211 831599 1148593 1269560 1151338 992884 928605
42510I28605k5407J2290J72958K65142J3838l84299m19989l4593K50723J13988
$$ 928605 903198 915488 1088446 1353588 1367426 983127 563138 528545 779268 893256
42500H93256j14259k5139K41430K91683J09400K158Q7567K03853K42215K32366
$$ 893256 778997 753858 995288 1286971 1396371 1398529 1486096 1689949 1932164 2164530
42490B164530J40264j04651l74197m15873k12691l8042q8732k56554l29948k49174
$$ 2164530 2304794 2200143 1825946 1410073 1197382 1159340 1070608 814054 484106 234932
42480B34932q2568J01631K42741K72603J88478Q4405M8901P1917Q7587O9401N4316
$$ 234932 152364 253995 496736 769339 957817 1042222 1091123 1163040 1250627 1320028 1374344
42469A374344R0452J65169J88522R6947j8646O006J39750J10937k14472n21786
$$ 1374344 1464796 1629965 1818487 1915434 1896788 1902794 2042544 2153481 1939009 1417223
42459A417223l57233K54518P44874O49711J50077j63486M6792N72397R54561R28630
$$ 1417223 1059990 1314508 2059382 2709093 2859170 2695684 2742476 3314873 4269434 5198064
42449E198064N81428J91694k3556m9173k5122q7336k47537m07343m71859m42794
$$ 5198064 5779492 5971186 5947630 5898457 5873335 5785999 5538462 5131119 4659260 4216466
42439D216466l93394l54522k67393r1671Q0120J03636k8207j70066k02067j21795
$$ 4216466 3823072 3468550 3201157 3109486 3189606 3293242 3265035 3094969 2892902 2771107
42429B771107L5395K18133K80364P9982k56233l76966j69767K5706j05451l46058
$$ 2771107 2806502 3024635 3304999 3384981 3128748 2751782 2582015 2607721 2502270 2156212
42419B156212k37794K12470M92179K93165p7467j43421J41298M35731M86036L44190
$$ 2156212 1918418 2130888 2623067 2916232 2838765 2695344 2836642 3272373 3758409 4102599
42409D102599J88144J11657J07112J46612K23030L17263L53618K54176P5876P118
$$ 4102599 4290743 4402400 4509512 4656124 4879154 5196417 5550035 5804211 5880087 5887205
42399E887205J31003K71685K18903M5569K0960K25267M40743M53999L05193K00774
$$ 5887205 6018208 6289893 6508796 6554365 6575325 6800592 7241335 7695334 8000527 8201301
42389H201301L09379O49479J039571J178629R49732O27308N86266Q27478J030510
$$ 8201301 8510680 9160159 10199730 11378359 12328091 12955399 13541665 14369143 15399653
42380A5399653J062177J127943J372976J669521J923376K266037K765224L254976
$$ 15399653 16461830 17589773 18962749 20632270 22555646 24821683 27586907 30841883
42372C0841883L681611M335312N468202O930321Q477698J0215022J2411103J5090729
$$ 30841883 34523494 38858806 44327008 51257329 59735027 69950049 82361152 97451881
42364I7451881J8195067K1997840K6957587L3229396M0612702M8619653N5757675
$$ 97451881 115646948 137644788 164602375 197831771 238444473 287064126 342821801
42357C42821801N8631332N2795343L5754521R698394j8753153m1848343n4581440
$$ 342821801 401453133 454248476 490002997 499701391 480948238 439099895 384518455
42350C84518455n6608483n1367963m3406374l5874584k9750657k4747872k0512284
$$ 384518455 327909972 276542009 233135635 197261051 167510394 142762522 122250238
42343A22250238j6982516j4105122j1693865r617792p908878o607991n620632
$$ 122250238 105267722 91162600 79468735 69850943 61942065 55334074 49713442
42336D9713442m795441m079938l522412l133777k822681k507062k226793k048175
$$ 49713442 44918001 40838063 37315651 34181874 31359193 28852131 26625338 24577163
42328B4577163j890020j602308j244644j084581j201535j296064j098408p86388
$$ 24577163 22687143 21084835 19840191 18755610 17554075 16258011 15159603 14373215
42320A4373215p03061p86948o71811l40120k38861n94311r98393r52502n46066
$$ 14373215 13670154 12883206 12211395 11871275 11632414 11038103 10039710 9087208 8541142
42311H541142k66069l06784m22345l98467l24363l45019m16106m22290l61282
$$ 8541142 8275073 7968289 7545944 7147477 6823114 6478095 6061989 5639699 5278417
42302E278417k88810j95988n5421P9732J24912Q2106K6823j4960j00729k53407
$$ 5278417 4989607 4793619 4738198 4817930 4942842 5024948 5051771 5036811 4936082 4682675
42292D682675l66698l01899p7479J15302J26564J1211q4350j25894j70954j96131
$$ 4682675 4315977 4014078 3936599 4051901 4178465 4189676 4105326 3979432 3808478 3612347
42282C612347j02476R6282K43441K45524J75649J12888J7403j44919k81225k94090
$$ 3612347 3509871 3606153 3849594 4095118 4270767 4383655 4401058 4256139 3974914 3680824
42272C680824k26211j58228m9805J73126M35378N75343N66391N26836N11970M41808
$$ 3680824 3454613 3296385 3246580 3419706 3855084 4430427 4996818 5523654 6035624 6477432
42262F477432K60787L6234j51817l07664m46927n28725n41616n67769o47504o41161
$$ 6477432 6738219 6774453 6622636 6314972 5868045 5339320 4797704 4229935 3582431 2941270
42252B941270l84955N883J67404o3754l60516k67101J82474M51301J90205k91357
$$ 2941270 2556315 2562198 2729602 2665848 2305332 2038231 2220705 2672006 2862211 2570854
42242B570854m47682k19905l4302j29939k40335n9741K66995L55835J22868j43772
$$ 2570854 2123172 1903267 1868965 1739026 1498691 1438950 1705945 2061780 2184648 2040876
42232B040876k02387j22907r8559j57276j58725j9993J46468J59623J4931q1555
$$ 2040876 1838489 1715582 1617023 1459747 1301022 1281029 1427497 1587120 1602051 1520496
42222A520496J0156J40132P1983j40676k02837k3348J46821J22411N8787J26300
$$ 1520496 1530652 1670784 1742767 1602091 1399254 1375906 1522727 1645138 1703925 1830225
42212A830225J64295m1640l13716k79061N0877K67207J60186j5058K4621J93851
$$ 1830225 1994520 1952880 1639164 1360103 1410980 1678187 1838373 1823315 1847936 2041787
42202B041787K58497K18607K48518L90124N17474N51715N51999O13820P86546
$$ 2041787 2300284 2518891 2767409 3157533 3675007 4226722 4778721 5392541 6179087
42193F179087J076154J453145J874930K360165L038643M086346N534748O994747
$$ 6179087 7255241 8708386 10583316 12943481 15982124 20068470 25603218 32597965
42185C2597965P516490O016033K287922k348072n810215o944273o312027n213548
$$ 32597965 40114455 46130488 48418410 46070338 40260123 33315850 27003823 21790275
42177B1790275m278884l327963k264582j463462j204252j235313j163988r71951
$$ 21790275 17511391 14183428 11918846 10455384 9251132 8015819 6851831 5879880
42169E879880q68459q47532p04185m04037j54397j00426j63583k17033k43206
$$ 5879880 5011421 4163889 3459704 3055667 2901270 2800844 2637261 2420228 2177022
42160B177022k55342k14217j19018p1600j35703k00579j11739Q5811J66993K2366
$$ 2177022 1921680 1707463 1588445 1516845 1381142 1180563 1068824 1154635 1321628 1343994
42150A343994j76183j88371j7908J00448J7841j41076j61881k5126R5402Q9684
$$ 1343994 1167811 979440 961532 1061980 1079821 938745 776864 751738 847140 936824
42140I36824M6251Q9839J82620J87199Q7143J6481L6048K801k21050m90882m83282
$$ 936824 983075 1072914 1255534 1442733 1529876 1546357 1582405 1585206 1364156 873274 389992
42129C89992j19355K66473K99229N106k75516l52464l46498l64746k67678P2659
$$ 389992 270637 537110 836339 841445 565929 213465 -133033 -497779 -765457 -692798
42119f92798M53089N25983K59653k0720p6729k4552p2318j84327j74460k2412
$$ -692798 -239709 286274 545927 525207 448478 423926 351608 167281 -7179 -29591
42109b9591R5633O9887r882j5052M0748L9732o8668j73363q3281K60772O37110
$$ -29591 66042 135929 126047 110995 151743 191475 122807 -50556 -133837 126935 764045
42098G64045O93443L36191j05220k40479r2122j9786j78055k93269q9487K75840
$$ 764045 1457488 1793679 1688459 1447980 1355858 1336072 1158017 864748 775261 1051101
42088A051101M05050J74755j54110k95029k11426m0778P6271N8560p6415j90242
$$ 1051101 1456151 1630906 1476796 1181767 970341 929563 1005834 1064394 987979 797737
42078G97737j56484m3360l7102j54098j87232j5609J90211K10096J02898J05766
$$ 797737 641253 597893 560791 406693 219461 203852 394063 604159 707057 812823
42068H12823K49163K79817L0176k91977l26480k4037K64550K11645q7893k63204
$$ 812823 1061986 1341803 1371979 1080002 753522 729485 994035 1205680 1117787 854583
42058H54583j59591q67j3638q8252J4946K51270L25790J14734j84141l58218m12147
$$ 854583 694992 694125 680487 592235 607181 858451 1184241 1298975 1114834 756616 344469
42047C44469m07950k86878q039K77652L64373K36712N8451k7738n365M2815L679
$$ 344469 -63481 -350359 -358398 -80746 283627 520339 578790 551052 545687 588502 592181
42036E92181j39943k17673m6945K55201L38555R8338j48559j35656m2985j56852
$$ 592181 452238 234565 187620 442821 781376 879714 731155 595499 552514 395662
42026C95662l56883l02369K224K19204K01390J14540M4914j02172k50159j23213
$$ 395662 38779 -263590 -261366 -42162 159228 273768 318682 216510 -33649 -156862
42016a56862K69853N06730L32075L8095J321J31191J02093q8580j61195l7611
$$ -156862 112991 619721 951796 989891 991212 1122403 1224496 1135916 974721 937110
42006I37110O2060j9694j97968l27849l42669k12170L4145K33333K14278J0451
$$ 937110 999170 979476 781508 453659 110990 -101180 -67035 166298 380576 391027
41996C91027j84652k48062j78411J8324L02148M89566L83642M1605k54035l15155
$$ 391027 206375 -41687 -220098 -201774 100374 589940 973582 1015187 761152 445997
41986D45997j94797k0663J38934K18581J47454l3068j72768j85501j14952j8962
$$ 445997 251200 230537 369471 588052 735506 702438 529670 344169 229217 210255
41976B10255P8335J13166K3817j06118j15856k0493j2211j42800k05907n4964
$$ 210255 288590 401756 425573 319455 203599 183106 170895 28095 -177812 -232776
41966b32776J46458J62509L7941J7271J79325L32698K65506k2001l25670m05094
$$ -232776 -86318 76191 114132 131403 310728 643426 908932 886931 561261 156167
41956A56167j91821R9199J50125p3681k27907k6005L37460M20591J40494j21950
$$ 156167 -35654 63545 213670 139989 -87918 -113923 223537 644128 784622 662672
41946F62672o6125J47565K01394P7719j8046m8606j61892l31350k83840Q0262
$$ 662672 596547 744112 945506 1023225 1005179 956573 794681 463331 179491 259753
41936B59753M21021L41667o7531l18062j51903J60577K33358N4537j11185j50137
$$ 259753 680774 1022441 954910 636848 484945 645522 878880 933417 822232 672095
41926F72095j79314k49936k37380q6549N0936M6206N7P2605K20435K72463K03096
$$ 672095 492781 242845 5465 -81084 -30148 16058 16115 88720 309155 581618 784714
41915G84714J49669J64105J18019q6038l28740l93060k26265j5085K987k11835
$$ 784714 934383 1098488 1216507 1130469 801729 408669 182404 167319 170306 -41529
41905d1529m38058l94808l9610L51459M51337K27481l3806n6092J35969K88756
$$ -41529 -479587 -874395 -914005 -562546 -111209 116272 82466 26374 162343 451099
41895D51099K31743M6787p5496p8590p2320j35692j85197j13638N274r284j58591
$$ 451099 682842 729629 654133 575543 503223 367531 182334 68696 73970 64686 -93905
41884i3905k09043j2551K45798K64662J6719k37631k91292j78043k0948J30148
$$ -93905 -302948 -315499 -69701 194961 211680 -25951 -317243 -495286 -516234 -386086
41874c86086K58281L21076L03174K25486P4076j46882k75884j18976J99612K56796
$$ -386086 -127805 193271 496445 721931 796007 649125 373241 254265 453877 710673
41864G10673j07780m67685l31928J62210M34133K71951M9743P6699J55448K550
$$ 710673 602893 135208 -196720 -34510 399623 671574 721317 798016 953464 956014
41854I56014k46331k78922j18949k9089l5148O5680K54469K37516p4006l64857
$$ 956014 709683 430761 311812 282723 247575 313255 567724 805240 731234 366377
41844C66377l54413j72886j02623j46416q8940J30647L40948L90103K87548J13255
$$ 366377 11964 -160922 -263545 -409961 -498901 -368254 -27306 362797 650345 763600
41834G63600n2292j14687l5477P0596M2333j05808k00171j71152j48291k23570
$$ 763600 711308 596621 561144 631740 674073 568265 368094 196942 48651 -174919
41824a74919k71230j40842P1012J24967o604p7535Q0525L05323L30496J55984
$$ -174919 -446149 -586991 -515979 -391012 -397616 -475151 -394626 -89303 241193 397177
41814C97177J6103K0580L3979m8885j15695m7582N5309M3435j2029N1647J62629
$$ 397177 413280 433860 467839 418954 303259 255677 310986 354421 342392 394039 556668
41803E56668Q9388j55612k71518j09523J07905J46051Q7662J05845J27538p602
$$ 556668 646056 490444 218926 109403 217308 363359 451021 556866 684404 676802
41793F76802k03052k25261r4778m8368j20525p7330J61103L22767J67212j43271
$$ 676802 473750 248489 153711 105343 -15182 -92512 68591 391358 558570 415299
41783D15299k56003r8246N6466l3764k77174l63188j30442K19922L19317N8498
$$ 415299 159296 61050 117516 83752 -193422 -556610 -687052 -467130 -147813 -89315
41773h9315k61104k90051n8042J19797J00884M9063R8103J40443O2279l1479L673
$$ -89315 -350419 -640470 -698512 -578715 -477831 -428768 -330665 -190222 -127943 -159422 -155749
41762a55749J10132J49579J39974J71257J77104J9502k23758k80800m7803K38099
$$ -155749 -45617 103962 243936 415193 592297 611799 388041 107241 59438 297537
41752B97537K77746O0639j52694j46796L3246J79496J71891Q0560K3738o72o9391
$$ 297537 575283 635922 483228 336432 369678 549174 721065 801625 825363 824691 755300
41741G55300j63389j61933k3454J33658J70905O7087j05308k40220k19006j0841
$$ 755300 591911 429978 406524 540182 711087 778174 672866 432646 213640 202799
41731B02799K03866J71624q9817k51353r7993J66373J99812l4374k95676m15616
$$ 202799 406665 578289 488472 237119 139126 305499 505311 470937 175261 -240355
41721b40355l95032k41972K6636K42463K00138m1094j74461k6053K46924L93832
$$ -240355 -635387 -877359 -850723 -608260 -408122 -449216 -623677 -649730 -402806 -8974
41711h974L52712K26507J08201J4649p8990j89569k71393k29399n3980J09149
$$ -8974 343738 570245 678446 693095 614105 424536 153143 -76256 -130236 -21087
41701b1087J28458O4000M2309L1857p2343k05354k06213j06885q9714j49890q1790
$$ -21087 107371 171371 213680 245537 173194 -32160 -238373 -345258 -434972 -584862 -666652
41690f66652J45210K88731K15554J01315J05598J18705J8755o9499k717J03341
$$ -666652 -521442 -232711 -17157 84158 189756 308461 327216 257717 255000 358341
41680C58341P3241k3050k1567K4268m6380j88574k16107j04040J9809J13637K09714
$$ 358341 431582 408532 386965 411233 364853 176279 -39828 -143868 -124059 -10422 199292
41669A99292K41180J39891L7972R4719J83331N7796k07406k90384j40134m6484
$$ 199292 440472 580363 618335 713054 896385 954181 746775 456391 316257 269773
41659B69773j23751j18717J08740K89117J73904n2002r0765j5718r0403k75550
$$ 269773 146022 27305 136045 425162 599066 547064 456299 440581 350178 74628
41649G4628k88250p9448R6818Q6005m686p1658j44043j81845m1704K20356K78304
$$ 74628 -213622 -293070 -196252 -110247 -114933 -186591 -330634 -512479 -554183 -333827 -55523
41638e5523k0914l41732k51625J76785M39108K66515n5507j25418N4100J79451
$$ -55523 -76437 -418169 -669794 -493009 -53901 212614 157107 31689 85789 265240
41628B65240J16359J8036R703N782q6999j84556j73494r9998n9262q133J36018
$$ 265240 381599 399635 409338 415120 328121 143565 -29929 -129927 -189189 -197322 -61304
41617f1304K89691K96129J80897J04084P7060l2414j92002j79995L0953J41523
$$ -61304 228387 524516 705413 809497 886557 854143 662141 482146 513099 654622
41607F54622l8741k64117k12294J8513Q4862m4057o3246J38788K85265J55018
$$ 654622 615881 351764 139470 157983 242845 198788 135542 274330 559595 714613
41597G14613p4825j13018K9702J18054N0066p3501j64600k32242k66536k09321
$$ 714613 639788 526770 556472 674526 724592 651091 486491 254249 -12287 -221608
41587b21608p0125M9897Q6587P6199O2044K4342n1972j11875r6393l0062K4597
$$ -221608 -291733 -241836 -155249 -79050 -17006 7336 -44636 -156511 -252904 -282966 -258369
41576b58369P3385J70179K84550K81538R9848j07199j13766R3002K69871K05016
$$ -258369 -184984 -14805 269745 551283 651131 543932 430166 523168 793039 998055
41566I98055l1454j94309j61528l7148J4037n9357j86927k61419k12362n4748
$$ 998055 966601 772292 610764 573616 587653 528296 341369 79950 -132412 -187160
41556a87160J08899J67822J00008k0049r2010n2954Q2257K03288J82731L1169
$$ -187160 -78261 89561 189569 169520 77510 24556 106813 310101 492832 524001
41546E24001q7766p1668l0235j10917k53646k77395j57242k8359N7313J64305
$$ 524001 436235 364567 334332 223415 -30231 -307626 -464868 -493227 -435914 -271609
41536b71609K63769K35108J23575J33230K65038K39715n0471k83023j44838J92723
$$ -271609 -7840 227268 350843 484073 749111 988826 938355 655332 510494 703217
41526G03217L35023K23725R5151R253j78751m10512m10266j57141Q691j00613
$$ 703217 1038240 1261965 1357116 1366369 1187618 777106 366840 209699 218390 117777
41516A17777k37764j45295M3372Q2261L3345R2886J77911M2053k71583m38063
$$ 117777 -119987 -265282 -221910 -139649 -106304 -13418 164493 206546 -65037 -503100
41506e03100l21097j30834n0547J1886J73287L15135K66790R4884L98J1316p745
$$ -503100 -824197 -955031 -1005578 -993692 -820405 -505270 -238480 -143596 -143198 -131882 -139627
41495a39627o3980J4475K64171M20528K39083j26193k83311j25131M0744m0037
$$ -139627 -203607 -189132 75039 495567 734650 608457 325146 200015 240759 200722
41485B00722k04743j65968J7703N8160n4948k0151K42937L81858J35731k10738
$$ 200722 -4021 -169989 -152286 -94126 -149074 -169225 73712 455570 591301 380563
41475C80563k03811J16108K80607P9424j72986j40974O1672R7614q3731k04285
$$ 380563 176752 292860 573467 652891 479905 338931 400603 498217 414486 210201
41465B10201q0130J23355J25446r9431k98870k68055q2636N5309J10194K04026
$$ 210201 130071 253426 378872 279441 -19429 -287484 -370120 -314811 -204617 -591
41455e91L39034L31585J06739j25210j45927m2653m3358j42961j42925j8967K9289
$$ -591 338443 670028 776767 651557 505630 462977 419619 276658 133733 114766 144055
41444A44055o9282j24864j2657J02015K7074j40640j53420L3264K20722K36924
$$ 144055 74773 -50091 -62748 39267 66341 -74299 -227719 -194455 26267 263191
41434B63191J11398pK2301J48075J98614K6398k64858l86971k25987o693J6234
$$ 263191 374589 374582 396883 544958 743572 769970 505112 118141 -107846 -114539 -98305
41423i8305r5133r2123P3255J95549J28784l8912j50212j60348j04159q674R3532
$$ -98305 -193438 -285561 -212306 -16757 112027 73115 -77097 -237445 -341604 -350278 -256746
41412b56746J48012J38118J14821J31379J77076J82203O8048j72235l98048l93096
$$ -256746 -108734 29384 144205 275584 452660 634863 702911 530676 132628 -260468
41402b60468j11993J94406K33261L0549j11407k6795J13604Q2137q5935j83968
$$ -260468 -372461 -178055 55206 85755 -25652 -52447 61157 143294 57359 -126609
41392a26609j41911q0772r0308j06870m8392M5049Q4202P7923J05434J55071J08735
$$ -126609 -268520 -349292 -439600 -546470 -594862 -549813 -465611 -387688 -282254 -127183 -18448
41381a8448n5438j48754P681K93965L96361K27122N4394J14707K68361K14146
$$ -18448 -73886 -222640 -214959 79006 475367 702489 756883 871590 1139951 1354097
41371A354097p1045l18915l42516k13069p7158j9r309j02232j66436p1791J07261
$$ 1354097 1283052 964137 621621 408552 331394 331375 322066 219834 53398 -18393 88868
41360H8868J36803m5549k22459k01757n1406P3131J54699K25820K17379P5183
$$ 88868 225671 180122 -42337 -244094 -295500 -222369 -67670 158150 375529 450712
41350D50712q6070j21989o9245n6750q2845m6056N8027J28734J14530M7519l1733
$$ 450712 364642 242653 173408 116658 33813 -12243 45784 174518 289048 336567 304834
41339C04834p4776k2989Q2722Q9950l8501j18528l4879K3184j36489l17557j77088
$$ 304834 230058 207069 289791 379741 341240 222712 187833 211017 74528 -243029 -420117
41328d20117K18255M49229L49086J62953N6680j06775l56139m05300j18669J78344
$$ -420117 -201862 247367 596453 759406 816086 709311 353172 -52128 -170797 7547
41318G547J74359M9015J05695K01996J2011l14906k91099J23956L84305J30497
$$ 7547 181906 230921 336616 538612 550623 235717 -55382 68574 452879 583376
41308E83376l23807m82174l00451p9031J9559N4317O0445K666p7027p9546q142
$$ 583376 259569 -222605 -523056 -602087 -582528 -528211 -467766 -465100 -542127 -621673 -629815
41297f29815L9668K7949J6556N5044J31889K09148K41380J98397J24223J08570
$$ -629815 -590147 -562198 -545642 -490598 -358709 -149561 91819 290216 414439 523009
41287E23009J35410N1688k07949m47618m05281q5187K42768L62588K98623J83356
$$ 523009 658419 710107 502158 54540 -350741 -435928 -193160 169428 468051 651407
41277F51407Q5377J5622j6720l2801q9447j79516j86934k8752J87975K46288P3696
$$ 651407 736784 752406 735686 702885 613438 433922 246988 218236 406211 652499 726195
41266G26195j55180k17542j01649L053k9398r3751r979K08914L47634K53128J9193
$$ 726195 571015 353473 251824 254877 225479 131728 121749 330663 678297 931425 950618
41255I50618j33850j03146J8438O5473l7729k02058k34145k3001K97310M31829
$$ 950618 816768 713622 732060 797533 759804 557746 323601 300600 597910 1029739
41245A029739K33962j12767k93133k11108o1625n7921j77790k30359j25174J0707
$$ 1029739 1263701 1150934 857801 646693 585068 527147 349357 118998 -6176 4531
41235D531J4080q0183q7202M3234J26030J2842j63778j85707r7725j25216k68725
$$ 4531 18611 -61572 -148774 -105540 20490 33332 -130446 -316153 -413878 -539094 -807819
41224h07819k60620Q953K98345L76158L18665K73693J88231J0783p6363O2400
$$ -807819 -1068439 -1059486 -761141 -384983 -66318 207375 395606 406389 330026 392426
41214C92426J97207N1776k08172k10919m028K0610j88449k40485J1912J91716
$$ 392426 589633 641409 433237 222318 218290 238900 50451 -190034 -178122 13594
41204A3594K6527j97041j30017O9407N9392q1371k2334K14666K71330K4485k47887
$$ 13594 40121 -156920 -286937 -217530 -158138 -239509 -261843 -47177 224153 248638 751
41193G51k87243j23607R9295K83770L28653J80326j5980l8872R7795J67478Q3731
$$ 751 -286492 -410099 -310804 -27034 301619 481945 465965 427093 524888 692366 776097
41182G76097o507j9311o2857j80551k15582p9333M8881k7078k07886k23761j375
$$ 776097 769590 750279 687422 506871 291289 211956 260837 233759 25873 -197888 -199263
41171a99263K49080K89876R4644j59467k76811k23079j31294j10187r1535M7505
$$ -199263 49817 339693 434337 274870 -1941 -225020 -356314 -466501 -558036 -510531
41161e10531K57280L56681K94124J97570J32176m948k56266m37350l47752n2325
$$ -510531 -253251 103430 397554 595124 727300 722352 466086 28736 -319016 -371341
41151c71341J90857K35289J60187J04757R6958P2883J2116j332J05925K32781
$$ -371341 -180484 54805 214992 319749 416707 489590 501706 500374 606299 839080
41141H39080J65091j20529l32872k08486J08709K49195J30464J4965M7309N6344
$$ 839080 1004171 883642 550770 342284 450993 700188 830652 845617 892926 949270
41131I49270p1982j45732m804J52948O0704j81620k57265j10535J6853k0489j12614
$$ 949270 877288 731556 726752 879700 940404 758784 501519 390984 407837 387348 274734
41120B74734j30032q4078k2586M0668N5263m4581k06368k71177j47033J13296
$$ 274734 144702 60624 38038 78706 133969 89388 -116980 -388157 -535190 -421894
41110d21894L80759N02894L61746K4224k29953j98609j8415L9449m6415r8028
$$ -421894 -41135 461759 823505 847729 617776 419167 400752 440201 393786 295758
41100B95758r6852j80518k83924j40023K52434M91553K97477q5107k35234r7408
$$ 295758 198906 18388 -265536 -405559 -153125 338428 635905 550798 315564 218156
41090B18156P0145J19510J09836Q5773L8386M5515J95669L74771L64555J84400
$$ 218156 288301 407811 517647 603420 641806 687321 882990 1257761 1622316 1806716
41080A806716J18903L37565O69209Q43940Q08874O96673N97795M90101L32605
$$ 1806716 1925619 2263184 2932393 3776333 4585207 5281880 5879675 6369776 6702381
41071F702381J17643j49184m41040o84576p93282p34107n53067l55771k63121
$$ 6702381 6820024 6670840 6229800 5545224 4751942 4017835 3464768 3108997 2845876
41062B845876l32661m87244n53843m15079j22831J41100K02790J8502k77352m42210
$$ 2845876 2513215 2025971 1472128 1057049 934218 1075318 1278108 1296610 1019258 577048
41052E77048l22841k4711J76183J33940j9861q1338l7668k0058o6193r0049p4390
$$ 577048 254207 229496 405679 539619 519758 438420 400752 380694 314501 224452 150062
41041A50062j12602k07531k01595k0175J55113J14423o8948j33166P280J71594
$$ 150062 37460 -170071 -371666 -391841 -236728 -122305 -191253 -324419 -317139 -145545
41031a45545J87224Q3325j8602m7837K6757J90880K97896J48888k29623n22990
$$ -145545 41679 125004 106402 58565 85322 276202 574098 722986 493363 -29627
41021b9627m77347k05367k040N0081J15063K86989M26436L53968R3474j34496
$$ -29627 -506974 -712341 -714381 -664300 -549237 -262248 164188 518156 611630 477134
41011D77134j32964N9111J76184J3190k93219m02898k30766o6139j09005j28917
$$ 477134 344170 403281 579465 592655 299436 -103462 -334228 -400367 -509372 -638289
41001f38289J45719M89126M26489k5602l00452p0166K96888K92950k3292j93413
$$ -638289 -492570 -3444 423045 397443 96991 26825 323713 616663 593371 399958
40991C99958m9489J13918K9963j77600k16103l0942J46182J10682n9628j19520
$$ 399958 350469 464387 494350 316750 100647 69705 215887 326569 266941 147421
40981A47421N259J14043L6203r0532k2251J98893L02233K10339J08204N6051j23341
$$ 147421 152680 266723 302926 212394 190143 389036 691269 901608 1009812 1065863 942522
40970I42522m32701n22709j81401K73198L92977J81095m2678j66499l06045m29396
$$ 942522 509821 -12888 -194289 78909 471886 652981 610303 443804 137759 -291637
40960b91637l64535j38522N8271K17265M46456N85473L30799j85999m03200q8850
$$ -291637 -656172 -794694 -736423 -519158 -72702 512771 843570 657571 254371 165521
40950A65521L09724L05532r072k57953l44328l63810k48300O9876L19342J66461
$$ 165521 475245 780777 771705 513752 169424 -194386 -442686 -372810 -53468 112993
40940A12993k42658m34103k79323j07781j15851r0629J32402L19404J99950q4953
$$ 112993 -129665 -563768 -843091 -950872 -1066723 -1157352 -1024950 -705546 -505596 -590549
40930e90549j80360j1365J78860K02827J13269M4875O0728J60881L00298L81803
$$ -590549 -770909 -782274 -603414 -400587 -287318 -242443 -181715 -20834 279464 661267
40920F61267L31819J86948L0626j24548k94940m04816l43039j46272O024J6424
$$ 661267 993086 1180034 1210660 1086112 791172 386356 43317 -102955 -96931 -80507
40910h0507k5043r033L5789L5914K1595O0265J02514L8389j02226j48415k5265
$$ -80507 -105550 -114583 -78794 -42880 -21285 38980 141494 179883 77657 -70758 -96023
40899i6023J30931J61787Q3349n30p9320j83596k17125m3661K37232L08084L9287
$$ -96023 34908 196695 280044 279514 200194 16598 -200527 -244188 -6956 301128 340415
40888C40415k82599k95931k7278J78822J33140k0474j05632j45743j96803j65742
$$ 340415 57816 -238115 -265393 -86571 46569 26095 -79537 -225280 -422083 -587825
40878e87825J9995K04639J87153M2044K5863J73115K29218N6944j21065n1297
$$ -587825 -567830 -363191 -176038 -133994 -108131 64984 294202 351146 230081 178784
40868A78784J42111J11413k03502m56662l46396L656K41018K38533J73699J90083
$$ 178784 320895 432308 228806 -227856 -574252 -570596 -329578 -91045 82654 272737
40858B72737J83186J3628k09534k30530J46K39576K56290Q2364j05893k22938
$$ 272737 455923 469551 260017 29487 29633 269209 525499 607863 501970 279032
40848B79032k70892k19196o3369N9530J1494j09034p7186J00708J76493P1546
$$ 279032 8140 -211056 -274425 -214895 -203401 -312435 -389621 -288913 -112420 -40874
40838d0874L5699K38481M39952L12482p2264l51021l61260k42742j09130O7878
$$ -40874 -5175 233306 673258 985740 913476 562455 201195 -41547 -150677 -82799
40828h2799K32202K09004j0765j98107k03637j34044j12901q6490O910Q6898R9918
$$ -82799 149403 358407 347642 149535 -54102 -188146 -301047 -387537 -380627 -293729 -193811
40817a93811J40416K40521K40023O3859o4310O9098L05478L36969J65810L2598
$$ -193811 -53395 187126 427149 491008 426698 495796 801274 1138243 1304053 1336651
40807A336651k9009k11880n07105o10074l56790L0322K63754L20661L11207K40656
$$ 1336651 1307642 1095762 588657 -21417 -378207 -347885 -84131 236530 547737 788393
40797G88393R0731k5875J451Q4475M7799j16597k48309k33713j08889J5086L4703
$$ 788393 879124 853249 854700 939175 986974 870377 622068 388355 279466 294552 329255
40786C29255r2855k84156l57935k21556K359J14830O7858k7466p6325q3511p9007
$$ 329255 236400 -47756 -405691 -627247 -624888 -510058 -442200 -469666 -545991 -629502 -708509
40775g08509n7202m788O9476J42626J85435J79485J51970J53246J66059J01189
$$ -708509 -765711 -770499 -701023 -558397 -372962 -193477 -41507 111739 277798 378987
40765C78987n3085j47925n0115J35307J54044o5606k93299k79170o9346O7753
$$ 378987 325902 177977 127862 263169 417213 351607 58308 -220862 -290208 -222455
40755b22455K398r1553J2010K61253L72678K07925l4740r4442m113j0200j77386
$$ -222455 -220057 -311610 -299600 -38347 334331 542256 507516 413074 408961 398761 221375
40744B21375k80070j47867O6576J05077l2817j20063m2204P5559R6737O7882J06159
$$ 221375 -58695 -206562 -139986 -34909 -67726 -187789 -229993 -154434 -57697 10185 116344
40733A16344J95745K05641Q2202p0997j34862j37421k01243l27974l30747p0414
$$ 116344 312089 517730 599932 528935 394073 256652 55409 -272565 -603312 -673726
40723f73726K92453M25185K26768l8975r1625K0401N8892l0426q8969n6904p5436
$$ -673726 -381273 43912 270680 231705 140080 160481 219373 188947 99978 43074 -32362
40712c2362k04863k51271m2078K58028L25207J33273K142J30184K91596J66662
$$ -32362 -237225 -488496 -530574 -272546 52661 185934 188076 318260 609856 776518
40702G76518j67384l19872j37721Q5216M5214j41593j36646J21617L43998K86712
$$ 776518 609134 289262 151541 236757 281971 140378 3732 125349 469347 756059
40692G56059J7852k37603l50913l31275k40058j28335O742K07585M23153M50347
$$ 756059 773911 536308 185395 -145880 -385938 -514273 -507531 -299946 123207 573554
40682E73554J71268j88253k62945l2895J41074L3693j63524k10968j92690k93004
$$ 573554 744822 556569 293624 260729 401803 435496 271972 61004 -131686 -424690
40672d24690m27436l80883j65919M0424K06272M02126N34605M36448J90161N5273
$$ -424690 -852126 -1233009 -1398928 -1358504 -1152232 -750106 -215501 220947 411108 466381
40662D66381P0652L0632j15920j60215j3380J05579M798j96010k69860j81975
$$ 466381 537033 567665 451745 291530 278150 383729 388527 192517 -77343 -259318
40652b59318m9132L3070Q765j25629k30683j27680J18088K28867J24957M8433
$$ -259318 -308450 -275380 -266615 -392244 -622927 -750607 -632519 -403652 -278695 -230262
40642b30262J42327K04850P8815j9656J24352K87379J45556j41424j47429J14908
$$ -230262 -87935 116915 195730 176074 300426 587805 733361 591937 444508 559416
40632E59416K05457j3968j67865j3409J81326J46018P2196K22366L98440K24669
$$ 559416 764873 750905 583040 569631 750957 896975 969171 1191537 1589977 1814646
40622A814646k18802m71519l41370r5331M402m851l1790j34681l08379l31871
$$ 1814646 1595844 1124325 782955 687624 692026 687175 655385 520704 212325 -119546
40612a19546o8185K42122K43505m1513k25824q3648J55443J43813j08140k64576
$$ -119546 -187731 54391 297896 256383 30559 -53089 102354 246167 138027 -126549
40602a26549j19454J59241K77160J57384n9489k40909l30538k56430J5661L09781
$$ -126549 -246003 -86762 190398 347782 288293 47384 -283154 -539584 -523923 -214142
40592b14142L37383P9921j12479K5173K79755K56069m7471k62557k21146j53965
$$ -214142 123241 203162 90683 115856 395611 651680 604209 341652 120506 -33459
40582c3459k32432k59034l1709K57354K88119J04966J7468J04151J54269Q2930
$$ -33459 -265891 -524925 -556634 -299280 -11161 93805 111273 215424 369693 452623
40572D52623N6532J38185J32213p1473k66569k38778r8973q9235k03401k30743
$$ 452623 509155 647340 779553 708080 441511 202733 103760 14525 -188876 -419619
40562d19619r2975P6015J49117J26246N5875j5776l7743k3521q7574k75282m02125
$$ -419619 -512594 -436579 -287462 -161216 -105341 -121117 -158860 -182381 -269955 -545237 -947362
40551i47362k33257J81428N14203N29615L20770J50303J63031K77065K75050J0125
$$ -947362 -1180619 -999191 -484988 44627 365397 515700 678731 955796 1230846 1240971
40541A240971l95212n98962m06965l8251J34018N9433J9533J66477L00288J87755
$$ 1240971 845759 246797 -160168 -198419 -64401 -4968 14565 181042 481330 669085
40531F69085j06647l33063l47302j80282M2759J43396j0802l19911m75578k93614
$$ 669085 562438 229375 -117927 -298209 -255450 -112054 -122856 -442767 -918345 -1211959
40521a211959P1556L45332M49149M77169M75068M02473K50595N9421j35200k67318
$$ -1211959 -1140403 -795071 -345922 131247 606315 1008788 1259383 1318804 1183604 916286
40511I16286k25951O815K63790L50568K42194M0789j67926l13804l15792j97979
$$ 916286 690335 697150 960940 1311508 1553702 1594491 1426565 1112761 796969 598990
40501E98990j28688j91173k23127o2252J57539J77638P340r8804k2161J04796
$$ 598990 470302 279129 56002 -6250 151289 328927 336267 237463 215302 320098
40491C20098J58525J57365J11858k4865k07018l00721k83760k49362j89619l3
$$ 320098 478623 635988 747846 722981 515963 215242 -68518 -317880 -507499 -507532
40481e07532K64047L85567L09471K18047K01011J22581o7578j83707j31480r5047
$$ -507532 -243485 142082 451553 669600 870611 993192 925614 741907 610427 515380
40471E15380j84879j96436j89J17303j22285m50279l84704K7754K81079J78938
$$ 515380 330501 134065 133876 251179 128894 -321385 -706089 -678335 -397256 -218318
40461b18318L7539O6972N9814j16388j78777J04812M51249M30830Q7208j63430
$$ -218318 -180779 -113807 -53993 -170381 -349158 -244346 206903 637733 724941 561511
40451E61511j20912M1042J31139J38493P8635q3138k97514m12272l44511j51084
$$ 561511 440599 481641 612780 751273 829908 746770 449256 36984 -307527 -458611
40441d58611P3214K45936K76344J46268l455j4884P4144J02913L9490j2326k7013
$$ -458611 -385397 -139461 136883 283151 279696 264812 338956 441869 481359 469033 442020
40430D42020p1361j05038M155K18834L06012J56367o1725j54984j29546p4068
$$ 442020 370659 265621 269776 488610 794622 950989 889264 734280 604734 530666
40420E30666r971L4694p456q2052j6008J83426K48951M6530j77030j66925o0090
$$ 530666 520695 555389 547933 465881 449873 633299 882250 928780 751750 584825 524735
40409E24735j18617k54773j91352J8741M6037j56489k53219n8564J92947K38663
$$ 524735 406118 151345 -40007 -21266 24771 -131718 -384937 -443501 -250554 -11891
40399a1891J37187O7047M4731J9323K2236M9480k281j16220p9342J82255L86092
$$ -11891 125296 192343 237074 256397 278633 328113 325832 209612 130270 312525 698617
40388F98617K41828j25176l32467k26406O588J44385J38457N3001l0665n4531
$$ 698617 940445 815269 482802 256396 262984 407369 545826 598827 568162 513631
40378E13631l9617o9466j47472j59648n8835M3683P5505J31516K57131K79605
$$ 513631 474014 404548 257076 97428 38593 82276 157781 289297 546428 826033
40368H26033O9058j80236j88487j2190M7215r5780k21570j77905p6804o4161j06920
$$ 826033 895091 714855 526368 514178 561393 465613 244043 66138 -10666 -74827 -181747
40357a81747r2161L865J05221J09342k5583j91441j95572j2499J46524J48979
$$ -181747 -273908 -270043 -164822 -55480 -81063 -272504 -468076 -480575 -334051 -185072
40347a85072J55253L05437L86473J38532k49952l58533j78611q8769j73665o8030
$$ -185072 -29819 275618 662091 800623 550671 192138 13527 -75242 -248907 -316937
40337c16937L68866O96102M91839m0462l78990l40584j37340J2888L9630o2662
$$ -316937 51929 748031 1239870 1199408 820418 479834 342494 355382 395012 332350
40327C32350k04158j99148p791J46340Q5903n4955q1165o7772j76132k96306j88575
$$ 332350 128192 -70956 -78747 67593 153496 98541 17376 -50396 -226528 -522834 -711409
40316g11409J00107K72678K15597J16241J26206J52124M2857j92883m11653m57683
$$ -711409 -611302 -338624 -123027 -6786 119420 271544 314401 121518 -290135 -747818
40306g47818k53207J11112L83077L72739J69541L0559O9112J62407J52121K7923
$$ -747818 -1001025 -889913 -506836 -134097 35444 66003 135115 297522 449643 477566
40296D77566r4453j07409k0853M5173J6283j0341Q9725K22209J73052k3823p8871
$$ 477566 383113 275704 254851 300024 316307 305966 395691 617900 790952 767129 688258
40285F88258R6187K09463L9050k17882k79284j98434j66789j39720N785J41813
$$ 688258 784445 993908 1032958 815076 535792 337358 170569 30849 36634 178447
40275A78447Q0903o7955j00584j08336k63734l79228j58743K16062K77847K0447
$$ 178447 259350 191395 90811 -17525 -281259 -660487 -819230 -603168 -325321 -304874
40265c04874r1377J06675K59269J55450M9955J23133J51419j6376j40032n3352
$$ -304874 -396251 -289576 -30307 125143 175098 298231 449650 433274 293242 239890
40255B39890N489j24926j57147J23856L71961K06891r9695k9322L11322L30196
$$ 239890 245379 120453 -36694 87162 459123 666014 566319 536997 848319 1178515
40245A178515j09357m70291l35581O8634K95449K36404O4937r2306k10456k55605
$$ 1178515 1069158 598867 263286 331920 627369 863773 928710 836404 625948 370343
40235C70343j95248n6030J03715K24804K42744J35368k2111j18142j04801J637
$$ 370343 175095 119065 222780 447584 690328 825696 803585 685443 580642 582279
40225E82279J42206J84996O234k95371m11325j93576J29013K64274K27579J97394
$$ 582279 724485 909481 915715 620344 209019 15443 144456 408730 636309 833703
40215H33703J68814K9739j28089q7003J35757K79970J97787j1011k00839k90769
$$ 833703 1002517 1032256 904167 817164 952921 1232891 1430678 1419667 1218828 928059
40205I28059k05518M4103K37905J61076n8624q9529J18609K63942J45498r0849
$$ 928059 722541 766644 1004549 1165625 1107001 1017472 1136081 1400023 1545521 1454672
40195A454672k31701k57440k21238j03628Q2406K19900K29160J43719L107j66253
$$ 1454672 1222971 965531 744293 640665 723071 942971 1172131 1315850 1318957 1152704
40185A152704k51627j45856M2585J07183Q6349K01524M11959L82220K4171k78928
$$ 1152704 901077 755221 797806 904989 991338 1192862 1604821 1987041 2011212 1732284
40175A732284j97664J07811L27115M83233P73139J174633J554407J945907K303405
$$ 1732284 1534620 1642431 1969546 2452779 3225918 4400551 5954958 7900865 10204270
40166A0204270K142357R65696q84642k275794k423252j696560j060030r47168
$$ 10204270 12346627 13312323 12427681 10151887 7728635 6032075 4972045 4024877
40158D024877r92741p55034l19380o5656r8791j69129q7657L8065M2250l8005
$$ 4024877 3032136 2277102 1957722 1892066 1793275 1624146 1536489 1574554 1616804 1578799
40148A578799p7307p6148q6424n8660K6913L759k32722m12924j76449L36857N50849
$$ 1578799 1501492 1425344 1338920 1280260 1307173 1310932 1078210 665286 488837 825694 1376543
40137A376543J98191l37058n55037m00070j21798J09671K32592K06633J27960
$$ 1376543 1574734 1237676 682639 282569 160771 270442 503034 709667 837627
40128H37627K03394M12617M54238K34883J03483L19644O03781N86820M38583N96626
$$ 837627 1041021 1453638 1907876 2142759 2246242 2565886 3169667 3756487 4195070 4791696
40118D791696J029131J227440Q90223K46836k75155m11695j55107K55706N35505
$$ 4791696 5820827 7048267 7938490 8185326 7910171 7498476 7343369 7599075 8134580
40109H134580P40457J238980K111924L017088L975097N573896P549027P786968
$$ 8134580 8875037 10114017 12225941 15243029 19218126 24792022 32341049 40128017
40101D0128017M217165k156686p444138q695044o636864m085465k681971k119873
$$ 40128017 44345182 42188496 34744358 26049314 19412450 15326985 12645014 10525141
40093A0525141j737319j476762j363968j149370p47984m10018k85555k72749l32973
$$ 10525141 8787822 7311060 5947092 4797722 4049738 3639720 3354165 3081416 2748443
40084B748443m99143n71092k95040J21117J75446j58596l27274j9392L69304L31452
$$ 2748443 2249300 1678208 1383168 1504285 1679731 1521135 1193861 1174469 1543773 1875225
40074A875225p6685m34850n34439m53477k63304L1762L41487N06097M59939K71762
$$ 1875225 1798540 1363690 829251 375774 112470 144232 485719 991816 1451755 1723517
40064A723517N8006q3609j16118q8421o8806n0127R959Q5203J23563J57568K40513
$$ 1723517 1781523 1697914 1581796 1493375 1424569 1374442 1384401 1469604 1593167 1750735 1991248
40053A991248L07349K51512J14801L7945L8912P543q8449j57216j39605o8445
$$ 1991248 2298597 2550109 2664910 2702855 2741767 2749310 2660861 2503645 2364040 2295595
40043B295595L192K231j54470l87119m20707j62757L3999j78500n44397m82704
$$ 2295595 2298787 2301018 2146548 1759429 1338722 1175965 1209964 1031464 487067 4363
40033D363N7914M93124M25021R7236j21996k32186l23362k53586L7117K39504
$$ 4363 62277 555401 980422 1077658 955662 723476 400114 146528 183645 423149
40023D23149J00205j25926m9094K30773K84640J3455k51839k59522j02374J6297
$$ 423149 523354 397428 348334 579107 863747 877202 625363 365841 263467 279764
40013B79764O898j02450j72615l1442K54046L22628k924l46378k34216K10519
$$ 279764 286662 184212 11597 -19845 234201 556829 553905 207527 -26689 183830
40003A83830M47701L18463J79808K17595J56092j65289m13228k78573K24J9191
$$ 183830 631531 949994 1129802 1347397 1503489 1338200 924972 646399 646623 665814
39993F65814j49091j25700J10295J86083l5005k12236n8580K14642K17840n7542
$$ 665814 516723 391023 501318 687401 652396 440160 381580 596222 814062 756520
39983G56520k69401k25309q5217n3737j11012j44111j51842j66544j15911M6295
$$ 756520 487119 261810 176593 122856 11844 -132267 -284109 -450653 -566564 -520269
39973e20269J69825R1138o3774r380K62930M41794L46467J51610N1048l1143k10839
$$ -520269 -350444 -259306 -323080 -332460 -69530 372264 718731 870341 921389 890246 679407
39962F79407l64672l22349j66354r2101r7160m7282N7305J17027J38886J76781
$$ 679407 314735 -7614 -173968 -266069 -363229 -410511 -353206 -236179 -97293 79488
39952G9488J57913L156j67644j89739j22322j16640j21144j032J49356J38670
$$ 79488 237401 240557 72913 -116826 -239148 -355788 -476932 -477964 -328608 -189938
39942a89938M4885Q9516J94724O8575k56976l93592j82903Q1635J37138P4620
$$ -189938 -145053 -55537 139187 207762 -49214 -442806 -625709 -544074 -406936 -332316
39932c32316L6227k9775j22305n9400J71739K66807O1575j64314j10483J00862
$$ -332316 -296089 -325864 -448169 -507569 -335830 -69023 -7448 -171762 -282245 -181383
39922a81383J93781J79572K03676J92872J8327j72147j53223j7937j5908j05583
$$ -181383 12398 191970 395646 588518 606845 434698 281475 263538 247630 142047
39912A42047l7674J78270K61696J14274m8860o0707j0301l0753j10870j73804
$$ 142047 104373 282643 544339 658613 609753 549046 538745 507992 397122 223318
39902B23318j68540p0289N7610M7506j49538l04109j94327L7544R1649LO4197
$$ 223318 54778 -15511 42099 89605 -59933 -364042 -558369 -520825 -429176 -429173 -364976
39891c64976L06568L61744K3994m21118n75279l87558p7635J78320L10674K87881
$$ -364976 -58408 303336 327330 -93788 -669067 -1056625 -1134260 -955940 -645266 -357385
39881c57385J67799R4390J05036O2253j05497k37698j60575N0911J86679J82254
$$ -357385 -189586 -95196 9840 72093 -33404 -271102 -431677 -380766 -194087 -11833
39871a1833J28636P4201j6373j31990j93433j77186j53989j74052j85075j03767
$$ -11833 116803 191004 174631 42641 -150792 -327978 -481967 -656019 -841094 -944861
39861i44861O2228J99735K07836J19188P0741J38186K39971K38677R4313j20617
$$ -944861 -882633 -682898 -475062 -355874 -285133 -146947 93024 331701 426014 305397
39851C05397k97932l34365j79248P1379K08279J42980K7188J9185L8224p0283
$$ 305397 7465 -326900 -506148 -434769 -226490 -83510 -56322 -37137 1087 -69196
39841f9196k21175j87280J8425J19916k6561k50896l46226l06623k05698n3126
$$ -69196 -290371 -477651 -459226 -339310 -365871 -616767 -962993 -1269616 -1475314 -1528440
39831a528440J13415J82075J39063J23121J89143J88325K4118j38945r6602R7649
$$ -1528440 -1415025 -1232950 -1093887 -970766 -781623 -593298 -569180 -708125 -804727 -707078
39821g07078K39989K72556K74453K35247N9366k08414l53517k41130J9705K06933
$$ -707078 -467089 -194533 79920 315167 374533 166119 -187398 -428528 -408823 -201890
39811b01890K09898R7727J5261L2910Q5487O7410j8613o1756k103Q4163R1771
$$ -201890 8008 105735 120996 153906 239393 306803 288190 226434 224331 308494 400265
39800D00265Q797j05277j93461k13548j48483m7037J3752L9092J09894K34778
$$ 400265 409062 303785 110324 -103224 -251707 -298744 -284992 -245900 -136006 98772
39790I8772L05286K46664J20564K6444p946Q865P3851J39483J23809K8595n1473
$$ 98772 404058 650722 771286 797730 789784 798649 872500 1011983 1135792 1164387 1112914
39779A112914q0162j18660j72628j58335q7416j01664k19692k48560j00970L933
$$ 1112914 1032752 914092 741464 583129 495713 394049 174357 -74203 -175173 -171240
39769a71240j24246k89194j69828J72943L69468K80158J32389Q9961K2625j63700
$$ -171240 -295486 -584680 -754508 -581565 -212097 68061 200450 290411 313036 149336
39759A49336k60563n0712L12153M66352L03314M2975j21107k30104l68724m60417
$$ 149336 -111227 -161939 150214 616566 919880 962855 841748 611644 242920 -217497
39749b17497l82721j79303q776P9484J76032L11681L69191K58413P0430l4746
$$ -217497 -600218 -779521 -788297 -708813 -532781 -221100 148091 406504 476934 442188
39739D42188k0977L0740N1961J6291q5907j89786j50130O4965K40329J42966j54660
$$ 442188 421211 451951 503912 520203 434296 244510 94380 159345 399674 542640 387980
39728C87980l55344l12024j39746J8696J31163J86387J78653J87670K67246K75967
$$ 387980 32636 -279388 -419134 -400438 -269275 -82888 95765 283435 550681 826648
39718H26648O6111j90717j83738L2718R1957q0150j48511J9312J09928l0084m3150
$$ 826648 892759 702042 518304 551022 642979 562829 414318 433630 543558 513474 470324
39707D70324L10727O21436M12480r3698l40805k99489l61064n45806m73220r5742
$$ 470324 781051 1402487 1814967 1721269 1380464 1080975 719911 174105 -299115 -394857
39697c94857J67073J16489L5398J12949J28595o7088k11979o1279J94961K42086
$$ -394857 -227784 -111295 -75897 37052 165647 98559 -113420 -174699 20262 262348
39687B62348J04573J5984K4575K011p3762p8747N2095K21998K69723J36237l9276
$$ 262348 366921 382905 407480 409491 335729 256982 309077 531075 800798 937035 897759
39676H97759m5719R9938J10312j50164l76570k37892Q3174J52040k6855n3771
$$ 897759 852040 951978 1062290 912126 535556 297664 380838 532878 506023 452252
39666D52252J58875K49370N3476j43237j57659j89713l25877k85436K6900K09255
$$ 452252 611127 860497 913973 770736 613077 423364 97487 -187949 -161049 48206
39656D8206q484k67966j57505J15742J31264j2328N7938K63991K10361q7839k11858
$$ 48206 39722 -228244 -385749 -270007 -138743 -151071 -93133 170858 381219 293380 81522
39645H1522m4250R1001K9629j2838P8035R3358p1031j68080M716K68414L29620
$$ 81522 37272 128273 157902 145064 223099 316457 245426 77346 82062 350476 680096
39634F80096J59757o1908k01053k24126j48209m1520L2034R9890J91943K01936
$$ 680096 839853 777945 576892 352766 204557 163037 195071 294961 486904 688840
39624F88840L2925j55967j10490J00565J21596j61049m15905l31246l4726J32685
$$ 688840 721765 565798 455308 555873 677469 516420 100515 -230731 -265457 -132772
39614a32772P2599l6475l5063P0095J88243K33400J63937K0926r9007j43621j30161
$$ -132772 -60173 -96648 -131711 -61616 126627 360027 523964 544890 445883 302262 172101
39603A72101p3089J9629P6345J3654j09840j16439N6739K45913K45528M4911j56425
$$ 172101 99012 118641 194986 208640 98800 -17639 39100 285013 530541 575452 419027
39592D19027j38629J13087L33331K05830k44819n97777n12277j38299J46012K69197
$$ 419027 280398 393485 726816 932646 687827 90050 -422227 -560526 -414514 -145317
39582a45317M30879O07765M99603M9004l56366l85781j82631o9930q3145m8428
$$ -145317 285562 893327 1392930 1441934 1085568 699787 517156 447226 364081 315653
39572C15653M8098M4165j16144k99600l62167k72509r1077P6919J54544J77176
$$ 315653 363751 407916 291772 -7828 -369995 -642504 -733581 -656662 -502118 -324942
39562c24942K25337K49442J10855j52281k95950k07158o2314j1749O3018K67180
$$ -324942 -99605 149837 260692 108411 -187539 -394697 -457011 -468760 -405742 -138562
39552a38562L89449J84324j79009k87447o2294J51104R4085r6695j71134j05829
$$ -138562 250887 435211 256202 -31245 -93539 57565 151650 54955 -116179 -222008
39542b22008l1471q66K0188L0951p538q9391j45752r7748P1415K56348K75981
$$ -222008 -253479 -254345 -234157 -203206 -210744 -300135 -445887 -543635 -472220 -215872 60109
39531F0109O6327j97672k76230j45073R617N9514N6702P4225P4555J545j04709
$$ 60109 126436 -71236 -347466 -492539 -482922 -423408 -366706 -292481 -217926 -216381 -321090
39520c21090j56018j13639J10J26102J93758J96784K31830L55167M22804K38385
$$ -321090 -477108 -590747 -590637 -464535 -270777 -73993 157837 513004 935808 1174193
39510A174193j21014l23932k08721L126M1317n3980q7552n7736j01978j90945
$$ 1174193 1053179 729247 520526 523652 564969 510989 423437 365701 263723 72778
39500G2778j51487K5725J58242J67386J54321J46582M1927j06410l9903K91733
$$ 72778 -78709 -52984 105258 272644 426965 573547 615474 509064 469161 760894
39490G60894N26226L53920k865p3440K12578M66028L76163J5584l74334o10881
$$ 760894 1287120 1641040 1638175 1564735 1777313 2243341 2619504 2635088 2260754 1649873
39480A649873n71033k66914K1635j9896k92494l61380q4459J66008Q3146j14548
$$ 1649873 1078840 811926 833561 813665 521171 159791 75332 241340 324486 209938
39470B09938q0378R6831R1292r4751j64905l3072Q9955R2640R4995J58419J75869
$$ 209938 129560 226391 317683 222932 58027 24955 114910 207550 302545 460964 636833
39459F36833J07383N2639K9177o6056k06724j97687J9519K33326K30363K4590
$$ 636833 744216 796855 826032 759976 553252 355565 375084 608410 838773 863363
39449H63363k40656m37180m50683k36228N5012J79429Q2305q2704k03249k61906
$$ 863363 622707 185527 -265156 -501384 -446372 -266943 -184638 -267342 -470591 -732497
39439g32497j74903J17064L84971K99045m2086j56209J08450L14431J15858k11032
$$ -732497 -907400 -790336 -405365 -106320 -148406 -304615 -196165 118266 234124 23092
39429B3092k44778o6416k3406j25806j28858k5578J522l866J41910L32587K79082
$$ 23092 -221686 -288102 -311508 -437314 -566172 -591750 -590228 -594094 -452184 -119597 159485
39418A59485K7150p3962N1315R3160r7136k67323k09912o5941m955M8667J52089
$$ 159485 186635 112673 163988 257148 160012 -107311 -317223 -383164 -388119 -339452 -187363
39407a87363J26241j25956l37999k19868R7001K54317J83415J22712J78839J78683
$$ -187363 -61122 -187078 -525077 -744945 -647944 -393627 -210212 -87500 91339 270022
39397B70022j122k06712k16988l0069J64532K10987J01716o8184j75176j27500
$$ 270022 268900 62188 -154800 -184869 -20337 190650 292366 224182 49006 -78494
39387g8494N9925K35330K23680J9238j75537j65381Q632J30572Q0820n9070j71055
$$ -78494 -18569 216761 440441 459679 284142 118761 127393 257965 338785 279715 108660
39376A08660k29078k20922r9493R1048J82704J05151J5518O5583J65729J52180
$$ 108660 -120418 -341340 -440833 -349785 -167081 -61930 -46412 19171 184900 337080
39366C37080O8315O7784J29976J07517p73o3707o5159r4326j20277l8421P5622
$$ 337080 405395 473179 603155 710672 709899 646192 581033 486707 366430 328009 403631
39355D03631M7236n7379K296J85446J46065j94165m07402j42716L29546M57172
$$ 403631 450867 393488 395784 581230 727295 533130 125728 -16988 312558 769730
39345G69730J16117l02700m07712j59260K11577M09565K53728j52413m61744m40801
$$ 769730 885847 583147 175435 16175 227752 637317 891045 738632 276888 -163913
39335a63913k18471m5079O4416K33385L82632K82961m8786k80645j85304O3578
$$ -163913 -382384 -427463 -363047 -129662 252970 535931 487145 206500 21196 84774
39325H4774J31017o2321k72034k27161P4012L59084L67732J41941l2948o199M4176
$$ 84774 215791 153470 -118564 -345725 -271713 87371 455103 597044 564096 557897 602073
$$ [...]
##END NTUPLES=NMR SPECTRUM
##END=
