##TITLE=31P_DE-80H_X3
 64 sc D2O
 26.2.2025
##JCAMPDX= 6.0         $$ Bruker NMR JCAMP-DX V2.0
##DATA TYPE= NMR SPECTRUM
##DATA CLASS= NTUPLES
##ORIGIN= UXNMR, Bruker Analytische Messtechnik GmbH
##OWNER= root
$$ XWIN-NMR		Version 3.5
$$ Tue Jul 29 11:26:48 2025 Russian Standard Time (UT+4h)  Yarkov@DPX200
##.OBSERVE FREQUENCY= 81.013821
##.OBSERVE NUCLEUS= ^31P
##.ACQUISITION MODE= SIMULTANEOUS
##.ACQUISITION SCHEME= undefined
##.AVERAGES= 64
##.DIGITISER RES= 17
##SPECTROMETER/DATA SYSTEM= spect
##.PULSE SEQUENCE= zgpg30
##.SOLVENT NAME= D2O
##.SHIFT REFERENCE= (INTERNAL, D2O, 0, 198.062)
##AUDIT TRAIL= $$ (NUMBER, WHEN, WHO, WHERE, WHAT)
$$ ##TITLE= Audit trail, XWIN-NMR		Version 3.5
$$ ##JCAMPDX= 5.01
$$ ##ORIGIN= Bruker BioSpin GmbH
$$ ##OWNER= Yarkov
$$ C:/Bruker/XWIN-NMR/data/yarkov2/nmr/P31/2/pdata/1/auditp.txt
$$ ##AUDIT TRAIL=  $$ (NUMBER, WHEN, WHO, WHERE, WHAT)
(   1,<2025-07-29 11:24:53.57 +0400>,<Yarkov>,<DPX200>,
      <created by zg, POWCHK disabled, PULCHK disabled
       configuration hash MD5:
       00 E9 B6 7A A2 85 ED C7 34 08 36 98 17 FE 4E 26
       data hash MD5: 32K
       A5 58 68 75 C8 00 52 C7 0D 74 25 71 36 E0 9B 03>)
(   2,<2025-07-29 11:26:01.70 +0400>,<Yarkov>,<DPX200>,
      <Start of raw data processing
       efp BC_mod = 2 LB = 1.5 FT_mod = 6 PKNL = 1 PHC0 = 1662.243 PHC1 = 49.15953 SI = 64K 
       data hash MD5: 64K
       55 97 2C A0 A4 7E 48 8F 89 DB F1 24 00 71 F3 C6>)
$$ ##END=
$$ 
$$ hash MD5
$$ 1B 41 19 5A 7E B1 AB 5A CA 4A F6 34 10 7B 0E 07
##$RELAX= 
##$RELAX= 
##$RELAX= 
##$RELAX= 
##$RELAX= 
##$RELAX= 
##$RELAX= 
##$RELAX= 
$$ Bruker specific parameters
$$ --------------------------
##$DU= <C:/Bruker/XWIN-NMR>
##$EXPNO= 2
##$NAME= <P31>
##$PROCNO= 1
##$TYPE= <nmr>
##$USER= <yarkov2>
##$AMP= (0..31)
100 100 100 100 100 100 100 100 100 100 100 100 100 100 100 100 100 100 
100 100 100 100 100 100 100 100 100 100 100 100 100 100 
##$AQSEQ= 0
##$AQ_mod= 1
##$AUNM= <au_zg>
##$AUTOPOS= <>
##$BF1= 81.014009
##$BF2= 200.13
##$BF3= 200.13
##$BF4= 200.13
##$BF5= 200.13
##$BF6= 200.13
##$BF7= 200.13
##$BF8= 200.13
##$BYTORDA= 1
##$CFDGTYP= 0
##$CFRGTYP= 5
##$CHEMSTR= <none>
##$CNST= (0..31)
1 1 145 1 1 1 1 1 1 1 1 1 1 1 1 1 1 1 1 1 1 1 1 1 1 1 1 1 1 1 1 1 
##$CPDPRG= <waltz16>
##$CPDPRG1= <>
##$CPDPRG2= <waltz16>
##$CPDPRG3= <>
##$CPDPRG4= <mlev>
##$CPDPRG5= <mlev>
##$CPDPRG6= <mlev>
##$CPDPRG7= <mlev>
##$CPDPRG8= <mlev>
##$CPDPRGB= <>
##$CPDPRGT= <>
##$D= (0..31)
0 1 0 0 0 0 0 0 0 0.06 0 0.03 2e-05 3e-06 0 0 0.0002 0 0 0 0 0 0 0 0 0 
0 0 0 0 0 0 
##$DATE= 1753773893
##$DBL= (0..7)
120 120 120 11 120 120 24 19 
##$DBP= (0..7)
150 150 150 150 150 150 150 150 
##$DBP07= 0
##$DBPNAM0= <>
##$DBPNAM1= <>
##$DBPNAM2= <>
##$DBPNAM3= <>
##$DBPNAM4= <>
##$DBPNAM5= <>
##$DBPNAM6= <>
##$DBPNAM7= <>
##$DBPOAL= (0..7)
0.5 0.5 0.5 0.5 0.5 0.5 0.5 0.5 
##$DBPOFFS= (0..7)
0 0 0 0 0 0 0 0 
##$DE= 6
##$DECBNUC= <off>
##$DECIM= 4
##$DECNUC= <off>
##$DECSTAT= 4
##$DIGMOD= 1
##$DIGTYP= 9
##$DL= (0..7)
0 0 52 120 120 21 21 25 
$$ [...]
##$SUBNAM2= <"">
##$SUBNAM3= <"">
##$SUBNAM4= <"">
##$SUBNAM5= <"">
##$SUBNAM6= <"">
##$SUBNAM7= <"">
##$SUBNAM8= <"">
##$SUBNAM9= <"">
##$SW= 400.765351723535
##$SWIBOX= (0..15)
0 1 3 0 0 0 0 0 0 0 0 0 0 0 0 0 
##$SW_h= 32467.5324675325
##$TD= 32768
##$TD0= 1
##$TE= 0
##$TE2= 300
##$TE3= 300
##$TEG= 300
##$TL= (0..7)
0 120 53 12 22 120 120 120 
##$TP= (0..7)
150 150 150 150 150 150 150 150 
##$TP07= 0
##$TPNAME0= <>
##$TPNAME1= <>
##$TPNAME2= <>
##$TPNAME3= <>
##$TPNAME4= <>
##$TPNAME5= <>
##$TPNAME6= <>
##$TPNAME7= <>
##$TPOAL= (0..7)
0.5 0.5 0.5 0.5 0.5 0.5 0.5 0.5 
##$TPOFFS= (0..7)
0 0 0 0 0 0 0 0 
##$TUNHIN= 0
##$TUNHOUT= 0
##$TUNXOUT= 0
##$USERA1= <user>
##$USERA2= <user>
##$USERA3= <user>
##$USERA4= <user>
##$USERA5= <user>
##$V9= 5
##$VALIST= <valist>
##$VCLIST= <CCCCCCCCCCCCCCC>
##$VD= 0
##$VDLIST= <DDDDDDDDDDDDDDD>
##$VPLIST= <PPPPPPPPPPPPPPP>
##$VTLIST= <TTTTTTTTTTTTTTT>
##$WBST= 1024
##$WBSW= 4
##$XGAIN= (0..3)
0 0 0 0 
##$XL= 0
##$YL= 0
##$YMAX_a= 2173
##$YMIN_a= -313
##$ZGOPTNS= <>
##$ZL1= 120
##$ZL2= 120
##$ZL3= 120
##$ZL4= 120
##$ABSF1= 0
##$ABSF2= 0
##$ABSG= 0
##$ABSL= 0
##$ALPHA= 0
##$AQORDER= 0
##$ASSFAC= 0
##$ASSFACI= 0
##$ASSFACX= 0
##$ASSWID= 0
##$AUNMP= <proc_1d>
##$AZFE= 0.1
##$AZFW= 0.5
##$BCFW= 0
##$BC_mod= 2
##$BYTORDP= 0
##$COROFFS= 0
##$CY= -3
##$DATMOD= 1
##$DC= 0
##$DFILT= <>
##$DTYPP= 0
##$F1P= 0
##$F2P= 0
##$FCOR= 1
##$FTSIZE= 65536
##$FT_mod= 6
##$GAMMA= 0
##$GB= 0
##$INTBC= 1
##$INTSCL= 9.790993e-09
##$ISEN= 30
##$LB= 1.5
##$LEV0= 0
##$LPBIN= 0
##$MAXI= 10000
##$MC2= 0
##$MEAN= 0
##$ME_mod= 0
##$MI= 50
##$NCOEF= 0
##$NC_proc= -14
##$NLEV= 6
##$NOISF1= 182.463
##$NOISF2= 159.3651
##$NSP= 0
##$NTH_PI= 0
##$NZP= 0
##$OFFSET= 198.0616
##$PC= 4
##$PHC0= 1662.243
##$PHC1= 49.15953
##$PH_mod= 1
##$PKNL= yes
##$PPARMOD= 0
##$PSCAL= 0
##$PSIGN= 0
##$REVERSE= no
##$SF= 81.0140089999434
##$SI= 65536
##$SIGF1= 159.3651
##$SIGF2= -187.1042
##$SINO= 113.3802
##$SIOLD= 16384
##$SREGLST= <1H.CDCl3>
##$SSB= 0
##$STSI= 65536
##$STSR= 0
##$SW_p= 32467.5324675325
##$SYMM= 0
##$S_DEV= 0
##$TDeff= 32768
##$TDoff= 0
##$TI= <>
##$TILT= no
##$TM1= 0
##$TM2= 0
##$TOPLEV= 0
##$USERP1= <user>
##$USERP2= <user>
##$USERP3= <user>
##$USERP4= <user>
##$USERP5= <user>
##$WDW= 1
##$XDIM= 65536
##$YMAX_p= 240257503
##$YMIN_p= -500510520
$$ End of Bruker specific parameters
$$ ---------------------------------
##NTUPLES= NMR SPECTRUM
##VAR_NAME=  FREQUENCY,     SPECTRUM/REAL,   SPECTRUM/IMAG
##SYMBOL=    X,             R,               I
##VAR_TYPE=  INDEPENDENT,   DEPENDENT,       DEPENDENT
##VAR_FORM=  AFFN,          ASDF,            ASDF
##VAR_DIM=   65536,         65536,           65536
##UNITS=     HZ,            ARBITRARY UNITS, ARBITRARY UNITS
##FACTOR=    0.49542278885378, 1,            1
##FIRST=     16045.7642231865, 0,            0
##LAST=      -16421.768244346, 0,            0
##MIN=       -16421.768244346, -500510520,   0
##MAX=       16045.7642231865, 240257503,    0
$$ Real data points
##PAGE= N=1
##DATA TABLE= (X++(R..R)), XYDATA
$$ [...]
$$ plain form
7274 -4678867 -2660968 -4991824 -9296112 -9850111 -5857832 -2243613 -2733780 -6288519 -10536012
7265 -10536012 -14860253 -18903076 -20757821 -18186175 -10550202 517435 10982965 15553478
7257 15553478 11383850 1271898 -8114786 -11480157 -8200395 -2033269 1221650 -2024551
7249 -2024551 -8986397 -12795188 -11583372 -12155535 -20201931 -29999288 -30750006 -21979631 -14599518
7240 -14599518 -15538199 -19371950 -18353204 -13175505 -8732771 -5564320 -1984275 -67271
7232 -67271 -2454410 -6067312 -5771755 -2630640 -2320505 -6381641 -10730050 -12051710 -10243672
7223 -10243672 -5360207 2080577 8091959 8375546 4711386 2667176 2793738 170338
7215 170338 -6485840 -11649904 -10876123 -6161599 -1243763 2965506 5696498 4389631 -1450325
$$ packed form
7274d678867K017899k330856m304288n53999L992279L614219m90167l554739m247493
7265a0536012m324241m042823j854745K571646P635973J1067637J0465530M570513
7257A5553478m169628j0111952r386684l365371L279762O167126L254919l246201
7249b024551o961846l808791J211816n72163q046396r797357p50718Q770375P380113
7240a4599518r38681l833751J018746N177699M442734L168451L580045J917004
7232f7271k387139l612902K95557L141115L10135m061136m348409j321660J808038
7223a0243672M883465P440784O011382K83587l664160k044210J26562k623400
7215A70338o656178n164064P73781M714524M917836M209269K730992j306867n839956
$$ plain form
7206 -1450325 -8905303 -16408226 -24640462 -30420540 -26618639 -12829416 120716 2505662
7198 2505662 -2357806 -4957703 -3734675 -4497674 -8933498 -12711171 -14395320 -17849209
7190 -17849209 -24473911 -29898061 -30345089 -26823959 -21339425 -14284136 -7774752 -6485542
7182 -6485542 -11692231 -17823890 -18413713 -13826850 -10542202 -13447976 -20290954 -23756754
7174 -23756754 -19121945 -9846687 -3924944 -4061700 -4772509 -1501543 1815804 -613994
7166 -613994 -5904547 -6053545 -710065 1744444 -3333534 -11055618 -15760932 -18005144 -19260756
7157 -19260756 -16765845 -9144725 -1988108 -1809419 -7640778 -13784329 -18039858 -21834882
7149 -21834882 -24288617 -22056309 -15168315 -8675461 -7526773 -12104836 -18908246 -23836041
$$ packed form
7206a450325p454978p502923q232236n780078L801901J3789223J2950132K384946
7198B505662m863468k599897J223028p62999m435824l777673j684149l453889
7190a7849209o624702n424150m47028L521130N484534P055289O509384J289210
7182f485542n206689o131659n89823M586863L284648k905774o842978l465800
7174b3756754M634809R275258N921743j36756p10809L270966L317347k429798
7166f13994n290553j48998N343480K454509n077978p722084m705314k244212j255612
7157a9260756K494911P621120P156617J78689n831359o143551m255529l795024
7149b1834882k453735K232308O887994O492854J148688m578063o803410m927795
$$ plain form
7141 -23836041 -24987624 -23606665 -22271855 -22205549 -23377896 -26155506 -29848469 -30541096 -25231826
7132 -25231826 -18384372 -18304795 -25222414 -29643800 -25850471 -19778033 -18051228 -16536793
7124 -16536793 -8392513 1805234 2779353 -6316270 -13964432 -12396765 -6356773 -3340283
7116 -3340283 -3521651 -3668142 -4360455 -7640088 -11354491 -11055041 -5944016 303559 3376242
7107 3376242 1189343 -4943851 -10025291 -8466865 -28838 8452112 9263042 1341408
7099 1341408 -9202896 -15260045 -14820822 -11710301 -10735814 -12156383 -11995997 -8206466 -4108113
7090 -4108113 -3957533 -7877635 -14028368 -22524009 -32487317 -38010384 -33677829 -23269502
7082 -23269502 -16179937 -14997189 -13739540 -9478529 -7620993 -12230245 -18583003 -20752401
$$ packed form
7141b3836041j151583J380959J334810O6306j172347k777610l692963o92627N309270
7132b5231826O847454P9577o917619m421386L793329O072438J726805J514435
7124a6536793Q144280J0197747R74119r095623p648162J567667O039992L016490
7116c340283j81368j46491o92313l279633l714403K99450N111025O247575L072683
7107C376242k186899o133194n081440J558426Q438027Q480950Q10930p921634
7099A341408j0544304o057149M39223L110521R74487j420569J60386L789531M098353
7090d108113J50580l920102o150733q495641r963308n523067M332555J0408327
7082b3269502P089565J182748J257649M261011J857536m609252o352758k169398
$$ plain form
7074 -20752401 -20672310 -23137898 -25950086 -22286486 -11344759 -565923 2674299 -2459920
7066 -2459920 -11481366 -18711197 -20924947 -20046687 -21442831 -27030552 -31754814 -29874601
7058 -29874601 -22747103 -16683107 -14873185 -15787012 -18300227 -23247737 -29523321 -33166331
7050 -33166331 -31858014 -27449786 -23053590 -20108465 -19089486 -20726129 -25211601 -31177440
7042 -31177440 -35720524 -35147874 -27412927 -15594095 -7081376 -6501150 -10793049 -14063649
7034 -14063649 -15273032 -17020831 -18555338 -15904066 -9181728 -3945134 -3616396 -5666258
7026 -5666258 -7375264 -9951762 -13470712 -12915648 -4761910 5727440 9836662 6572264
7018 6572264 2649919 1771357 333691 -4503411 -8527258 -6466393 -483309 2410388
$$ packed form
7074b0752401Q0091k465588k812188L663600J0941727J0778836L240222n134219
7066b459920r021446p229831k213750Q78260j396144n587721m724262J880213
7058b9874601P127498O063996J809922r13827k513215m947510o275584l643010
7050c3166331J308317M408228M396196K945125J018979j636643m485472n965839
7042c1177440m543084N72650P734947J1818832Q512719N80226m291899l270600
7034a4063649j209383j747799j534507K651272O722338N236594L28738k049862
7026e666258j709006k576498l518950N55064Q153738J0489350M109222l264398
7018F572264l922345q78562j437666m837102m023847K060865N983084K893697
$$ plain form
7010 2410388 -204770 -4280429 -6686529 -9342941 -14018461 -17196715 -14062424 -5911678
7002 -5911678 248827 -373369 -5461432 -9115352 -8375245 -5656720 -5912153 -11528237 -19203222
6993 -19203222 -22715615 -20196605 -17010801 -18523801 -21619188 -18362992 -8254432 -840433
6985 -840433 -3355812 -11013560 -14300684 -12137865 -11738671 -17024057 -23508683 -25486081 -23215279
6976 -23215279 -20771593 -19949625 -18670982 -14084300 -6043831 1708407 3898355 -1363958
6968 -1363958 -10253170 -17179380 -20202139 -20629217 -18809545 -14021379 -8229373 -5634293
6960 -5634293 -7042220 -8131804 -5477612 -1658028 -1708376 -6069085 -9926258 -9531375 -7165018
6951 -7165018 -8648008 -16034017 -23815655 -24186877 -16607722 -9693091 -11354503 -19302419
$$ packed form
7010B410388k615158m075659k406100k656412m675520l178254L134291Q150746
7002e911678O160505o22196n088063l653920P40107K718525k55433n616084p674985
6993a9203222l512393K519010L185804j513000l095387L256196J0108560P413999
6985h40433k515379p657748l287124K162819L99194n285386o484626j977398K270802
6976b3215279K443686Q21968J278643M586682Q040469P752238K189948n262313
6968a363958q889212o926210l022759m27078J819672M788166N792006K595080
6960e634293j407927j089584K654192L819584n0348m360709l857173L94883K366357
6951g165018j482990p386009p781638l71222P579155O914631j661412p947916
$$ plain form
6943 -19302419 -25096695 -26047497 -27539040 -32929936 -37209977 -34150745 -25406687 -17832911
6935 -17832911 -14257579 -11891972 -8990897 -7994537 -10759208 -14385795 -14424405 -10694622 -7512284
6926 -7512284 -8154139 -10805622 -11028057 -7508007 -3665503 -3024678 -4723393 -5419129 -4576668
6917 -4576668 -5262998 -9680586 -16394356 -22491588 -26083303 -25955678 -21647724 -15768127 -13841046
6908 -13841046 -18944976 -27318657 -31632810 -28454139 -20789284 -13434746 -7684255 -1586040
6900 -1586040 5276464 8865501 4381446 -6647113 -15424790 -14943376 -8743987 -6645742
6892 -6645742 -11772954 -16760135 -14675528 -8648452 -6597109 -10235029 -14820222 -17757635
6884 -17757635 -21142639 -25472603 -26726861 -22268105 -15691988 -12494494 -12988765 -12610811
$$ packed form
6943a9302419n794276r50802j491543n390896m280041L059232Q744058P573776
6935a7832911L575332K365607K901075R96360k764671l626587l8610L729783L182338
6926g512284o41855k651483k22435L520050L842504O40825j698715o95736Q42461
6917d576668o86330m417588o713770o097232l591715J27625M307954N879597J927081
6908a3841046n103930q373681m314153L178671P664855P354538N750491O098215
6900a586040O862504L589037m484055j1028559q777677M81414O199389K098245
6892f645742n127212m987181K084607O027076K051343l637920m585193k937413
6884a7757635l385004m329964j254258M458756O576117L197494m94271L77954
$$ plain form
6876 -12610811 -8563909 -3654347 -3019883 -8195037 -15076834 -17796250 -14601977 -9601480
6868 -9601480 -8297772 -11882625 -16749808 -19210250 -19342323 -19891830 -22425921 -25418327 -26165130
6859 -26165130 -24381325 -23267279 -25846194 -30197184 -30353243 -23447179 -14284884 -10204310
6851 -10204310 -12071970 -13464253 -9278149 -2102969 1780636 504061 -2038782 -2093726
6843 -2093726 -285437 898374 1580242 4125115 8620640 10988173 7130260 -1674889
6835 -1674889 -9105638 -10047758 -5839788 -2845078 -6101798 -14517418 -22061552 -23778502
6827 -23778502 -20830845 -18956305 -21319044 -24224730 -21977896 -15156171 -10730844 -13231583
6819 -13231583 -19231361 -22765038 -23224773 -24350727 -27199286 -28541914 -26340899 -22759472
$$ packed form
6876a2610811M046902M909562O34464n175154o881797k719416L194273N000497
6868i601480J303708l584853m867183k460442j32073n49507k534091k992406p46803
6859b6165130J783805J114046k578915m350990j56059O906064R162295M080574
6851a0204310j867660j392283M186104P175180L883605j276575k542843n4944
6843b093726J808289J183811O81868K544873M495525K367533l857913q805149
6835a674889p430749r42120M207970K994710l256720q415620p544134j716950
6827b3778502K947657J874540k362739k905686K246834O821725M425327k500739
6819a3231583n999778l533677m59735j125954k848559j342628K201015L581427
$$ plain form
6811 -22759472 -20204306 -17549178 -12881765 -8155373 -7879292 -13035557 -18769223 -19587001
6803 -19587001 -15776620 -12930672 -15155707 -20575419 -24511972 -25426191 -25603603 -26878594
6795 -26878594 -28476363 -29208542 -28975985 -27354834 -23611969 -19448909 -18631227 -21662067 -23652572
6786 -23652572 -20364424 -13791793 -8258212 -3578819 2912929 9020108 8623350 1014211
6778 1014211 -6175666 -6042728 -559749 3077981 1011915 -5353392 -12989430 -18819213
6770 -18819213 -19398956 -13511920 -5266368 -1173954 -3238582 -7359366 -9234922 -9125853
6762 -9125853 -9253533 -9121643 -6584180 -2629758 -1482164 -4898657 -9189417 -10007485 -8065344
6753 -8065344 -7229171 -8275434 -8381474 -6841663 -7009568 -10778085 -14789460 -15075839 -12799280
$$ packed form
6811b2759472K555166K655128M667413M726392K76081n156265n733666q17778
6803a9587001L810381K845948k225035n419712l936553r14219j77412j274991
6795b6878594j597769p32179K32557J621151L742865M163060Q17682l030840j990505
6786b3652572L288148O572631N533581M679393O491748O107179l96758p609139
6778A014211p189877J32938N482979L637730k066066o365307p636038n829783
6770a8819213n79743N887036Q245552M092414k064628m120784j875556J09069
6762i125853j27680J31890K537463L954422J147594l416493m290760q18068J942141
6753h065344Q36173j046263j06040J539811j67905l768517m011375k86379K276559
$$ plain form
6744 -12799280 -11937289 -13140491 -13746449 -13008735 -13395640 -16403726 -20191290 -22111800 -21479281
6735 -21479281 -19456877 -17889899 -18146873 -19633889 -20150639 -19157463 -18992209 -20651088 -20813217
6726 -20813217 -16746425 -11911805 -11629150 -14617130 -14908890 -11845366 -11388134 -16354068 -22174578
6717 -22174578 -24771519 -26008797 -27821191 -27462070 -23607852 -21458229 -25395116 -30764408
6709 -30764408 -29782283 -22756785 -16587289 -14049808 -11737486 -8072892 -6288640 -8294847
6701 -8294847 -11371090 -12768649 -13105411 -13511121 -13270050 -11991818 -10903184 -10433915 -9115164
6692 -9115164 -6025073 -2255974 335591 -311359 -6396395 -17365791 -27605423 -31237470
6684 -31237470 -29420908 -28471254 -30243461 -29565613 -22881696 -14145116 -9062884 -8050290
$$ packed form
6744a2799280Q61991j203202o05958P37714l86905l008086l787564j920510O32519
6735b1479281K022404J566978k56974j487016n16750R93176J65254j658879j62129
6726b0813217M066792M834620K82655k987980k91760L063524M57232m965934n820510
6717b2174578k596941j237278j812394L59121L854218K149623l936887n369292
6709c0764408R82125P025498O169496K537481K312322L664594J784252k006207
6701h294847l076243j397559l36762m05710K41071J278232J088634M69269J318751
6692i115164L090091L769099K591565o46950o085036j0969396j0239632l632047
6684c1237470J816562R49654j772207O77848O683917Q736580N082232J012594
$$ plain form
6676 -8050290 -8819655 -12107371 -19747095 -29019408 -33854464 -31526314 -24868794 -18066410
6668 -18066410 -13067766 -10147104 -9453476 -11101933 -14588582 -18343948 -20157455 -19364782
6660 -19364782 -18443634 -20016897 -22057421 -19711266 -13331650 -10420482 -16288437 -26379065
6652 -26379065 -32249550 -32410490 -32029662 -33653668 -34221778 -31292085 -26607648 -22135826 -17228532
6643 -17228532 -11694214 -7981439 -8043691 -10546204 -12742001 -12974149 -10730512 -7173496 -6204996
6634 -6204996 -11137603 -18769740 -20737606 -13294068 -2482797 2944191 462667 -7023263
6626 -7023263 -16818013 -26801623 -33240319 -33767279 -31309010 -30157316 -29093020 -23520672
6618 -23520672 -13947532 -6582793 -4615039 -4461770 -2790712 -2153710 -6135408 -12596661
$$ packed form
6676h050290p69365l287716p639724r272313m835056K328150O657520O802384
6668a8066410M998644K920662O93628j648457l486649l755366j813507P92673
6660a9364782R21148j573263k040524K346155O379616K911168n867955j0090628
6652b6379065n870485j60940L80828j624006n68110K929693M684437M471822M907294
6643a7228532N534318L712775o2252k502513k195797k32148K243637L557016R68500
6634f204996m932607p632137j967866P443538J0811271N426988k481524p485930
6626g023263r794750r983610o438696n26960K458269J151694J064296N572348
6618b3520672R573140P364739J967754J53269J671058O37002l981698o461253
$$ plain form
6610 -12596661 -15825271 -13539542 -8605173 -5213291 -5914812 -10959782 -17874358 -22555086
6602 -22555086 -22915347 -20709471 -18393931 -15827639 -11890656 -7443107 -4127999 -1654906
6594 -1654906 1137284 3724287 5006724 5823768 7538608 8931548 7275549 2006008
6586 2006008 -4965017 -11656521 -16471487 -17896258 -16836726 -17570100 -22535557 -27675625
6578 -27675625 -27489311 -23425117 -21713418 -23432667 -23222991 -18619679 -13805172 -11954132
6570 -11954132 -10659975 -8375943 -8796177 -13945618 -18618217 -17490280 -13010124 -9982764
6562 -9982764 -6772836 594929 8906756 10934279 6776647 3517869 3509978 1437173 -5371251
6553 -5371251 -11800361 -13419673 -13248882 -15688280 -19011640 -18717951 -14597906 -9982138 -6745597
$$ packed form
6610a2596661l228610K285729M934369L391882p01521n044970o914576m680728
6602b2555086l60261K205876K315540K566292L936983M447549L315108K473093
6594a654906K792190K587003J282437Q17044J714840J392940j655999n269541
6586B006008o971025o691504m814966j424771J059532p33374m965457n140068
6578b7675625J86314M064194J711699j719249K09676M603312M814507J851040
6570a1954132J294157K284032m20234n149441m672599J127937M480156L027360
6562i982764L209928P367765Q311827K027523m157632l258778p891k072805o808424
6553e371251o429110j619312J70791k439398l323360K93689M120045M615768L236541
$$ plain form
6544 -6745597 -5025479 -5509502 -8097301 -9961577 -8437829 -4785233 -2475391 -3032233 -5783016
6535 -5783016 -9961404 -14452829 -16981429 -16243855 -13824409 -11940022 -10690493 -9452545
6527 -9452545 -8922690 -9121386 -7364455 -1638261 5210975 8143399 6282514 3523767 3112187
6518 3112187 4620925 6341036 7694598 8478608 7846568 5050217 250126 -5553175 -10762402
6509 -10762402 -14033359 -15651107 -16859254 -17065407 -13994635 -8320881 -5286464 -8472530
6501 -8472530 -14231103 -16474786 -15485301 -17021737 -22983420 -28212056 -27902400 -23759594 -20472390
6492 -20472390 -19216519 -17237134 -12217119 -5293140 -507233 -1416226 -6881174 -10988873
6484 -10988873 -9617720 -6105162 -6816009 -11941028 -15735676 -16073790 -17518109 -22697424
$$ packed form
6544f745597J720118m84023k587799j864276J523748L652596K309842n56842k750783
6535e783016m178388m491425k528600P37574K419446J884387J249529J237948
6527i452545N29855j98696J756931N726194O849236K932424j860885k758747m11580
6518C112187J508738J720111J353562P84010o32040k796351m800091n803301n209227
6509a0762402l270957j617748j208147k06153L070772N673754L034417l186066
6501h472530n758573k243683R89485j536436n961683n228636L09656M142806L287204
6492b0472390J255871J979385N020015O923979M785907r08993n464948m107699
6484a0988873J371153L512558p10847n125019l794648l38114j444319n179315
$$ plain form
6476 -22697424 -26975411 -26120434 -24089298 -27162589 -33592753 -35642620 -30688998 -24233561
6468 -24233561 -21660401 -22129410 -21688890 -18309616 -12447162 -5913700 -1704668 -2402414 -7272920
6459 -7272920 -12624413 -15849143 -17538500 -19178075 -20515723 -19888060 -15990393 -9179764
6451 -9179764 -2036726 1887255 1238301 -2004892 -5959547 -11669123 -19861262 -26624197
6443 -26624197 -26558407 -20131066 -13920859 -12957264 -16271061 -20371516 -23114937 -23295501 -20722123
6434 -20722123 -18172339 -18911556 -20517106 -16263784 -5639582 1924418 -1314566 -10632508
6426 -10632508 -15977610 -16403603 -19493613 -27673916 -33803912 -32176410 -26305042 -21965518
6418 -21965518 -18504075 -12187290 -4057168 1307870 2760933 2896116 2114137 -2558615
$$ packed form
6476b2697424m277987Q54977K031136l073291o430164k049867M953622O455437
6468b4233561K573160m69009M40520L379274N862454O533462M209032o97746m870506
6459g272920n351493l224730j689357j639575j337648O27663L897667O810629
6451i179764P143038L923981o48954l243193l954655n709576q192139o762935
6443b6624197O5790O427341O210207R63595l313797m100455k743421j80564K573378
6434b0722123K549784p39217j605550M253322J0624202P564000l238984r317942
6426a0632508n345102m25993l090010q180303o129996J627502N871368M339524
6418b1965518L461443O316785Q130122N365038J453063J35183p81979m672752
$$ plain form
6410 -2558615 -11938231 -21927319 -27906956 -29431630 -29401724 -30658884 -34284610 -38967003 -40791606
6401 -40791606 -36011464 -26041650 -17892723 -17233150 -22294043 -27220170 -30141965 -34021176
6393 -34021176 -39430016 -41259246 -35422460 -25674607 -19837804 -20615588 -23931666 -25722057
6385 -25722057 -26087619 -26079391 -24814509 -22180874 -20913153 -22558446 -23753549 -20507969 -14842929
6376 -14842929 -12594525 -14495593 -14173707 -7050881 2530734 6470210 3075058 -1744684
6368 -1744684 -2844755 -1585488 -2211401 -5702725 -9720779 -12962351 -16471578 -20664661
6360 -20664661 -23843153 -24837665 -25045249 -25993194 -26330830 -23634064 -18480339 -13992611 -11308030
6351 -11308030 -8529004 -5142518 -4284694 -8142089 -13371367 -14488306 -11060938 -8325826
$$ packed form
6410b558615r379616r989088n979637j524674K9906j257160l625726m682393j824603
6401d0791606M780142R969814Q148927O59573n060893m926127k921795l879211
6393c4021176n408840j829230N836786R747853N836803p77784l316078j790391
6385b5722057l65562Q228J264882K633635J267721j645293j195103L245580N665040
6376a4842929K248404j901068L21886P122826R581615L939476l395152m819742
6368a744684j100071J259267o25913l491324m018054l241572l509227m193083
6360b0664661l178492r94512k07584r47945l37636K696766N153725M487728K684581
6351a1308030K779026L386486Q57824l857395n229278j116939L427368K735112
$$ plain form
6343 -8325826 -10395612 -15574052 -19341332 -19852976 -18993085 -19141328 -20424447 -21139552 -20218121
6334 -20218121 -18849781 -19176993 -21221753 -22023589 -18723679 -12002225 -5747367 -3897659
6326 -3897659 -7864919 -15380786 -20870637 -19305262 -12070874 -7021377 -9369310 -14058403
6318 -14058403 -11582767 -903276 8643439 9611174 5624043 5275577 10625437 15856332
6310 15856332 15462660 9822748 3008324 -1884822 -4548698 -6056494 -6305857 -3345776
6302 -3345776 3392664 9485242 8130313 -2118645 -14691003 -22027498 -23136932 -22139193
6294 -22139193 -21859627 -22129963 -22833097 -24860733 -28028047 -30522855 -30505845 -26977184 -20391604
6285 -20391604 -14314241 -14388318 -22136834 -30786318 -31216025 -22409270 -12826082 -10815281 -16378955
$$ packed form
6343h325826k069786n178440l767280n11644Q59891j48243j283119p15105R21431
6334b0218121J368340l27212k044760q01836L299910O721454O254858J849708
6326c897659l967260p515867n489851J565375P234388N049497k347933m689093
6318a4058403K475636J0679491R546715R67735l987131l48466N349860N230895
6310A5856332l93672n639912o814424m893146k663876j507796k49363K960081
6302c345776O738440O092578j354929j0248958j2572358p336495j109434R97739
6294b2139193K79566k70336p03134k027636l167314k494808J7010L528661O585580
6285b0391604O077363p4077p748516q649484m29707Q806755R583188K010801n563674
$$ plain form
6276 -16378955 -22975273 -24737840 -20928127 -15538794 -13722118 -17152642 -22295749 -24500878
6268 -24500878 -23561473 -23170343 -25101119 -26957992 -26631795 -26034238 -28121967 -31777338 -32194682
6259 -32194682 -26511343 -17655843 -11741398 -11693450 -14304363 -14669146 -12852253 -13555530 -18707970
6250 -18707970 -24144686 -26212770 -27962518 -33961221 -41233341 -41591051 -33062433 -23141032
6242 -23141032 -19173431 -20733042 -23831412 -27618140 -32890669 -37364613 -37117945 -31751052
6234 -31751052 -24970306 -20532102 -19516949 -20682570 -21756479 -21104726 -19258767 -17960317
6226 -17960317 -17418749 -16324449 -14773165 -14274116 -13939267 -10224002 -2667885 3346720 2797453
6217 2797453 -2230124 -5413128 -4481714 -3363661 -6483748 -13563960 -20370946 -23344223
$$ packed form
6276a6378955o596318j762567L809713N389333J816676l430524n143107k205129
6268b4500878R39405L91130j930776j856873L26197N97557k087729l655371m17344
6259c2194682N683339Q855500N914445M7948k610913l64783J816893p03277n152440
6250a8707970n436716k068084j749748n998703p272120l57710Q528618R921401
6242b3141032L967601j559611l098370l786728n272529m473944K46668N366893
6234c1751052O780746M438204J015153j165621j073909O51753J845959J298450
6226a7960317N41568J094300J551284M99049L34849L715265P556117O014605n49267
6217B797453n027577l183004R31414J118053l120087p080212o806986k973277
$$ plain form
6209 -23344223 -23481666 -25559842 -32059550 -38322222 -37114368 -28709031 -22082436 -23765245
6201 -23765245 -29778602 -32133396 -29249530 -25140185 -21676138 -17750500 -14303755 -13827155
6193 -13827155 -15155164 -14435080 -11570533 -10421358 -12108082 -13660856 -14604952 -19172923
6185 -19172923 -29130728 -39011405 -42097592 -38034188 -31242381 -24407026 -17091450 -9260537
6177 -9260537 -2821140 118107 -1313195 -6426296 -12688193 -16694057 -16984162 -15427746
6169 -15427746 -14888995 -16199065 -18065561 -19002654 -18676769 -18198130 -19330989 -22256528 -24258598
6160 -24258598 -22644516 -19147531 -18649661 -22365751 -25202972 -22267152 -15795133 -12476130
6152 -12476130 -14969957 -19443550 -21600892 -21915723 -23361522 -26131768 -27082860 -24078613
$$ packed form
6209b3344223j37443k078176o499708o262672J207854Q405337O626595j682809
6201b3765245o013357k354794K883866M109345L464047L925638L446745M76600
6193a3827155j328009P20084K864547J149175j686724j552774r44096m567971
6185a9172923r957805r880677l086187M063404O791807O835355P315576P830913
6177i260537O439397K939247j431302n113101o261897m005864k90105J556416
6169a5427746N38751j310070j866496r37093L25885M78639j132859k925539k002070
6160b4258598J614082L496985M97870l716090k837221K935820O472019L319003
6152a2476130k493827m473593k157342l14831j445799k770246r51092L004247
$$ plain form
6144 -24078613 -18959189 -15611266 -16293042 -20572810 -26565912 -31628770 -32772187 -28957577
6136 -28957577 -23241527 -20092664 -19718040 -17746700 -11965492 -6185296 -4667936 -5630209
6128 -5630209 -4324649 -570608 1584137 673506 -1034770 -3132128 -7838967 -13543529
6120 -13543529 -13542562 -5117611 4435734 5683147 -1470397 -8824954 -11011172 -10694006 -12447265
6111 -12447265 -16039519 -18303140 -19166548 -22237634 -28768390 -33486154 -29375280 -16930348
6103 -16930348 -5596792 -3449463 -7481205 -7963754 -1535348 4787435 3251325 -5794921
6095 -5794921 -16469826 -23971550 -25557833 -19472302 -7881977 1611635 2453276 -3675564
6087 -3675564 -9742310 -11931144 -11311225 -8794119 -4214148 -504556 -2832473 -11418822
$$ packed form
6144b4078613N119424L347923o81776m279768n993102n062858j143417L814610
6136b8957577N716050L148863L74624J971340N781208N780196J517360r62273
6128e630209J305560L754041K154745r10631j708276k097358m706839n704562
6120a3543529R67Q424951R553345J247413p153544p354557k186218L17166j753259
6111a2447265l592254k263621q63408l071086o530756m717764M110874J2444932
6103a6930348J1333556K147329m031742m82549O428406O322783j536110r046246
6095e794921j0674905p501724j586283O085531J1590325R493612Q41641o128840
6087c675564o066746k188834O19919K517106M579971L709592k327917q586349
$$ plain form
6079 -11418822 -19737050 -22449590 -21363322 -20705108 -20340067 -17930453 -15116245 -16141178
6071 -16141178 -20867654 -24268459 -23917989 -23566186 -27066701 -32457361 -35321029 -35201526 -34432967
6062 -34432967 -32279805 -25580477 -15686093 -9530706 -11193772 -16127392 -17005442 -12638332
6054 -12638332 -7716376 -5888033 -6852855 -8866054 -10370724 -10134569 -9237918 -11580441 -18392102
6045 -18392102 -23782098 -21037601 -12611664 -7723794 -9775324 -13005286 -13178845 -13923497
6037 -13923497 -18548920 -22717498 -21369406 -17569773 -17358511 -19486107 -17830655 -11882075
6029 -11882075 -7084253 -5326916 -2708028 2172070 4703328 1810799 -2448557 -2456816 1429809
6020 1429809 4513806 4828592 5426993 10094651 18329672 24552748 22660524 12617960
$$ packed form
6079a1418822q318228k712540J086268O58214L65041K409614K814208j024933
6071a6141178m726476l400805L50470L51803l500515n390660k863668J19503P68559
6062c4432967K153162O699328R894384O155387j663066m933620q78050M367110
6054a2638332M921956J828343r64822k013199j504670K36155Q96651k342523o811661
6045a8392102n389996K744497Q425937M887870k051530l229962j73559p44652
6037a3923497m625423m168578J348092L799633K11262k127596J655452N948580
6029a1882075M797822J757337K618888M880098K531258k892529m259356q259L886625
6020A429809L083997L14786N98401M667658Q235021O223076j892224j0042564
$$ plain form
6012 12617960 1800881 -2341667 -261406 1733110 533625 -992720 -599886 -978541
6004 -978541 -4860266 -9735922 -11394042 -10601717 -12112683 -17426505 -22127354 -21498794 -16588251
5995 -16588251 -13076754 -14834359 -19829106 -22521944 -19572571 -12810858 -7300335 -7419522
5987 -7419522 -14213108 -24637218 -32973200 -34919734 -31362942 -26648371 -22652069 -17202492
5979 -17202492 -9653135 -4442200 -5788365 -11397506 -15420386 -15834153 -14600284 -12163058
5971 -12163058 -7252683 -1834058 -495317 -3725039 -6761212 -6653312 -5674659 -5879258 -5483534
5962 -5483534 -3732872 -4366608 -9587172 -14238072 -11498295 -2564008 4545829 5181685 2225573
5953 2225573 -222614 -2652435 -7596251 -14267204 -18479461 -17225492 -11803089 -6285876
$$ packed form
6012A2617960j0817079m142548K080261J994516j199485j526345L92834l78655
6004i78541l881725m875656j658120P92325j510966n313822m700849O28560M910543
5995a6588251L511497j757605m994747k692838K949373O761713N510523j19187
5987g419522o793586j0424110q335982j946534L556792M714571L996302N449577
5979a7202492P549357N210935j346165n609141m022880m13767J233869K437226
5971a2163058M910375N418625J338741l229722l036173J07900R78653k04599L95724
5962e483534J750662o33736n220564m650900K739777Q934287P109837O35856k956112
5953B225573k448187k429821m943816o670953m212257J253969N422403N517213
$$ plain form
5945 -6285876 -3252916 -1171827 3505218 11453798 18721374 20702140 16792815 9754273
5937 9754273 1624655 -7239017 -15172376 -18384943 -15122721 -8960931 -5349494 -5363976 -5672204
5928 -5672204 -5077686 -7519148 -15894592 -25601558 -28782700 -24449583 -19591133 -19288593 -20598511
5919 -20598511 -18696918 -14558268 -12523803 -13529072 -15273435 -16832731 -18543209 -19041795
5911 -19041795 -17030685 -14685741 -14921508 -16749460 -17913424 -20000721 -24959731 -28298034
5903 -28298034 -23326798 -12117671 -4353348 -3985647 -4886544 -2081637 791233 -770868
5895 -770868 -4338519 -5806970 -6362492 -8440765 -9751887 -7243302 -3025454 -914452 -762079
5886 -762079 -1228385 -4075074 -10235656 -15710759 -17299096 -18435760 -23019924 -27656318 -27499335
$$ packed form
5945f285876L032960K081089M677045P948580P267576J980766l909325p038542
5937I754273q129618q863672p933359l212567L262222O161790L611437j4482l08228
5928e672204N94518k441462q375444r706966l181142M333117M858450L02540j309918
5919b0598511J901593M138650K034465j005269j744363j559296j710478m98586
5911a9041795K011110K344944k35767j827952j163964k087297m959010l338303
5903b8298034M971236J1209127P764323L67701r00897K804907K872870j562101
5895g70868l567651j468451n55522k078273j311122K508585M217848K111002J52373
5886g62079m66306k846689o160582n475103j588337j136664m584164m636394J56983
$$ plain form
5877 -27499335 -25924415 -29416610 -35351023 -34783562 -26906532 -20923064 -22273077 -25999539
5869 -25999539 -26195480 -23821938 -21800354 -19634636 -17074236 -17152997 -21192871 -25371727 -26045366
5860 -26045366 -24472428 -23023962 -20774264 -16356017 -11771629 -10025502 -11535158 -15052256
5852 -15052256 -19081401 -20644791 -16517004 -8029401 -1025604 1115110 638576 -102123
5844 -102123 -2313306 -6149785 -7854359 -5749624 -4419161 -7979685 -13102715 -13958411 -10624396
5835 -10624396 -6915386 -2952871 3451765 9712326 9708805 2401437 -6288921 -10937374 -11638062
5826 -11638062 -11310488 -12178104 -15296653 -19700943 -21661578 -18344378 -12192997 -8019946
5818 -8019946 -6256170 -3692147 -707516 -1923134 -8176615 -13584785 -13642931 -11482106 -12216808
$$ packed form
5877b7499335J574920l492195n934413N67461P877030N983468j350013l726462
5869b5999539j95941K373542K021584K165718K560400p8761m039874m178856o73639
5860b6045366J572938J448466K249698M418247M584388J746127j509656l517098
5852a5052256m029145j563390M127787Q487603P003797K140714m76534p40699
5844a02123k211183l836479j704574K104735J330463l560524n123030q55696L334015
5835a0624396L709010L962515O404636O260561l521p307368q690358m648453p00688
5826a1638062L27574q67616l118549m404290j960635L317200O151381M173051
5818h019946J763776K564023K984631j215618o253481n408170n8146K160825p34702
$$ plain form
5809 -12216808 -15029438 -15633551 -13935610 -13937130 -16954557 -19870617 -20455179 -20077267 -19789974
5800 -19789974 -17465754 -11417863 -4584313 -2043964 -4982337 -9591626 -12093921 -12709383
5792 -12709383 -13757124 -15545718 -15945343 -13573326 -9811461 -7332671 -7459543 -9136942
5784 -9136942 -9961253 -8518358 -6465761 -7514554 -12727399 -17563840 -16353792 -9878117
5776 -9878117 -5054503 -5642721 -7091854 -4056169 6319 -3834319 -17494913 -32060784
5768 -32060784 -38162106 -36085230 -32823237 -32124508 -31363380 -27328116 -21366541 -17600884
5760 -17600884 -17935302 -20392798 -21994351 -22092765 -22172254 -22687045 -21445159 -16345958 -9320059
5751 -9320059 -5960855 -10418354 -20988150 -30880067 -33211586 -26226917 -15134159 -8490623
$$ packed form
5809a2216808k812630o04113J697941j520l017427k916060n84562L77912K87293
5800a9789974K324220O047891O833550K540349k938373m609289k502295o15462
5792a2709383j047741j788594l99625K372017L761865K478790j26872j677399
5784i136942q24311J442895K052597j048793n212845m836441J210048O475675
5776i878117M823614n88218j449133L035685M062488l840638j3660594j4565871
5768c2060784o101322K076876L261993O98729P61128M035264N961575L765657
5760a7600884l34418k457496j601553r8414p9489n14791J241886N099201P025899
5751i320059L359204m457499j0569796r891917k331519O984669J1092758O643536
$$ plain form
5743 -8490623 -10720876 -17451946 -19653745 -13095208 -2399575 4758620 5502579 2482018
5735 2482018 -1234228 -5324431 -10684875 -16993311 -22282290 -23868560 -19995405 -12042657
5727 -12042657 -4904514 -3202174 -6475470 -9562409 -8395300 -4093318 -677066 -403748
5719 -403748 -2712455 -6295079 -9932804 -11648574 -9419529 -3740505 1667076 2647685 -2196896
5710 -2196896 -11070325 -20570400 -27102424 -27871779 -22126646 -11953668 -1522970 4840032
5702 4840032 4643261 -1284219 -8655911 -12292061 -10493320 -6956397 -7211935 -12758361 -19418355
5693 -19418355 -21833794 -18990788 -14909508 -14365604 -18451039 -24122519 -27590442 -27978232
5685 -27978232 -27703887 -29263650 -31843094 -31713608 -26473709 -18528504 -13272276 -13238827 -14956954
$$ packed form
5743h490623k230253o731070k201799O558537J0695633P158195P43959l020561
5735B482018l716246m090203n360444o308436n288979j586270L873155P952748
5727a2042657P138143J702340l273296l086939J167109M301982L416252K73318
5719d03748k308707l582624l637725j715770K229045N679024N407581R80609m844581
5710b196896q873429r500075o532024p69355N745133J0172978J0430698O363002
5702D840032j96771n927480p371692l636150J798741L536923k55538n546426o659994
5693a9418355k415439K843006M081280N43904m085435n671480l467923l87790
5685b7978232K74345j559763k579444J29486N239899P945205N256228L3449j718127
$$ plain form
5676 -14956954 -13048113 -7235891 -3225656 -5627664 -12038011 -16387301 -16722294 -16296178
5668 -16296178 -17190231 -16967485 -13292994 -8278111 -5256791 -3804667 -1585870 496925
5660 496925 -812299 -5443400 -9282987 -9930261 -9744019 -11762834 -15414426 -18077062 -18765651
5651 -18765651 -18336029 -17477702 -16246256 -14664533 -12527660 -9491733 -6355332 -5243143
5643 -5243143 -7341685 -11020830 -13041549 -11413264 -7095517 -3506715 -3721601 -6759810
5635 -6759810 -7569064 -3133544 2188854 1225423 -5753736 -9894319 -4981043 4377671 9133523
5626 9133523 6868974 2159660 -1531420 -5021054 -9298598 -13330719 -16627248 -20141032
5618 -20141032 -23793065 -26252512 -27631581 -29099326 -29394132 -25683431 -19263253 -16402906
$$ packed form
5676a4956954J908841N812222M010235k402008o410347m349290l34993M26116
5668a6296178q94053K22746L674491N014883L021320J452124K218797K082795
5660D96925j309224m631101l839587o47274J86242k018815l651592k662636o88589
5651a8765651M29622Q58327J231446J581723K136873L035927L136401J112189
5643e243143k098542l679145k020719J628285M317747L588802k14886l038209
5635f759810q09254M435520N322398r63431o979159m140583M913276R358714M755852
5626I133523k264549m709314l691080l489634m277544m032121l296529l513784
5618b0141032l652033k459447j379069j467745k94806L710701O420178K860347
$$ plain form
5610 -16402906 -20912058 -28967714 -34319365 -35914288 -36480560 -35477483 -28817784 -16557225
5602 -16557225 -6405438 -6250203 -14729555 -22134245 -20620538 -11522002 -2383909 971146
5594 971146 -1808888 -7622790 -12764415 -14124386 -10601999 -4627335 -556138 -500204 -3230380
5585 -3230380 -7640037 -14443434 -22686478 -27767013 -26636373 -23127890 -23680695 -28232284
5577 -28232284 -29906556 -24527237 -16126522 -10974521 -9638494 -7945229 -3739625 394048
5569 394048 578367 -4165427 -11016659 -15806306 -16931667 -17059140 -19785172 -24818456 -28687903
5560 -28687903 -30215446 -31866283 -34589040 -35433499 -33061905 -31738225 -35371601 -40307485
5552 -40307485 -39569436 -33123735 -28068234 -28360221 -30355649 -30338492 -30504404 -33466660 -35419989
$$ packed form
5610a6402906m509152q055656n351651j594923n66272J003077O659699J2260559
5602a6557225J0151787J55235q479352p404690J513707R098536R138093L355055
5594I71146k780034n813902n141625j359971L522387N974664M071197N5934k730176
5585c230380m409657o803397q243044n080535J130640L508483n52805m551589
5577b8232284j674272N379319Q400715N152001J336027J693265M205604M133673
5569C94048J84319m743794o851232m789647j125361j27473k726032n033284l869447
5560b8687903j527543j650837k722757q44459K371594J323680l633376m935884
5552d0307485P38049O445701N055501k91987j995428J7157j65912k962256j953329
$$ plain form
5543 -35419989 -30470138 -19784268 -10983185 -8694882 -10398688 -12131335 -13592127 -15523206
5535 -15523206 -15974835 -12903023 -8700829 -8345607 -12911050 -17704407 -17843467 -13863964 -10366190
5526 -10366190 -10036615 -10784516 -9227969 -5803021 -4876877 -9448923 -16971491 -21766867 -21194469
5517 -21194469 -17838640 -15419572 -14437655 -13022893 -10500914 -8043482 -6354869 -4892621
5509 -4892621 -3760283 -4659605 -9007610 -15959866 -23027815 -28178004 -30908727 -31687133 -30733708
5500 -30733708 -27431561 -21337142 -14037887 -9010715 -8404246 -10543572 -12080001 -12077563 -12054660
5491 -12054660 -12377979 -11439671 -9209665 -8865898 -12943591 -19518530 -24103759 -24201311 -20418221
5482 -20418221 -14451477 -8136091 -3818932 -3527449 -7526664 -14586456 -23050039 -30625473
$$ packed form
5543c5419989M949851J0685870Q801083K288303j703806j732647j460792j931079
5535a5523206m51629L071812M202194L55222m565443m793357j39060L979503L497774
5526a0366190L29575p47901J556547L424948R26144m572046p522568m795376N72398
5517b1194469L355829K419068R81917J414762K521979K457432J688613J462248
5509d892621J132338q99322m348005o952256p067949n150189k730723p78406R53425
5500c0733708L302147O094419P299255N027172O06469k139326j536429K438K2903
5491a2054660l23319R38308K230006L43767m077693o574939m585229r7552L783090
5482b0418221N966744O315386M317159K91483l999215p059792q463583p575434
$$ plain form
5474 -30625473 -34333110 -32675783 -27616824 -22954772 -21004356 -21823654 -24537986 -27634390
5466 -27634390 -28970894 -27844270 -26526288 -27296685 -28268679 -25078215 -17240340 -10033882
5458 -10033882 -8717349 -12902733 -18092831 -21057211 -21895584 -21929046 -21708030 -21293506 -21177593
5449 -21177593 -22022777 -23439619 -23544546 -20689046 -16001275 -13108578 -14247380 -17398667
5441 -17398667 -18365522 -14726523 -6512812 5230689 17775181 25781935 25036702 17722986
5433 17722986 10593500 6842597 3127474 -3842170 -11543296 -15501653 -15958613 -16593295
5425 -16593295 -18150172 -17740160 -14303026 -10574089 -8709888 -7813369 -7701905 -11466710 -20590299
5416 -20590299 -29642177 -30708518 -23514096 -16776214 -17339034 -21511740 -20869228 -14266599
$$ packed form
5474c0625473l707637J657327N058959M662052J950416q19298k714332l096404
5466b7634390j336504J126624J317982p70397r71994L190464P837875P206458
5458a0033882J316533m185384n190098k964380q38373l3462K21016M14524J15913
5449b1177593q45184j416842j04927K855500M687771K892697j138802l151287
5441a7398667r66855L638999Q213711J1743501J2544492Q006754p45233p313716
5433A7722986p129486l750903l715123o969644p701126l958357m56960o34682
5425a6593295j556877M10012L437134L728937J864201Q96519J11464l764805r123589
5416b0590299r051878j066341P194422O737882n62820m172706O42512O602629
$$ plain form
5408 -14266599 -8889699 -9513442 -12303930 -11631667 -8415541 -7616383 -10412079 -13597792 -15245192
5399 -15245192 -16135666 -16035455 -13504422 -10218840 -10820138 -16268703 -20767209 -17929245 -7954175
5390 -7954175 3212584 9869433 10050013 5322717 -506439 -3871435 -4711630 -6392825
5382 -6392825 -11098932 -16811237 -20442748 -22230388 -24660991 -28095933 -30028578 -28566021
5374 -28566021 -24644492 -20496981 -17249272 -14340449 -10577737 -5735840 -1518356 -504532
5366 -504532 -3548605 -8546791 -12146014 -12224571 -8596701 -2397885 4230710 8215947 6455150
5357 6455150 -2107825 -14290992 -23182482 -23487941 -17663486 -14117450 -16982364 -20628688
5349 -20628688 -18358749 -13688809 -16280054 -27081152 -35210679 -32163008 -22460785 -16092207
$$ packed form
5408a4266599N376900o23743k790488O72263L216126P99158k795696l185713j647400
5399a5245192q90474J00211K531033L285582o01298n448565m498506K837964R975070
5390g954175J1166759O656849J80580m727296n829156l364996q40195j681195
5382f392825m706107n712305l631511j787640k430603l434942j932645J462557
5374b8566021L921529M147511L247709K908823L762712M841897M217484J013824
5366e04532l044073m998186l599223p8557L627870O198816O628595L985237j760797
5357F455150q562975j2183167q891490l05459N824455L546036k864914l646324
5349b0628688K269939M669940k591245j0801098q129527L047671R702223O368578
$$ plain form
5341 -16092207 -16052147 -18776153 -22397347 -27770471 -33371516 -35614567 -34178217 -32419248
5333 -32419248 -32574874 -34225634 -36834946 -39859264 -40707492 -36540012 -28439044 -20852475
5325 -20852475 -16960888 -16968206 -19821506 -23433997 -24365818 -21075862 -16847008 -15857991 -17167848
5316 -17167848 -16525452 -13196973 -10291589 -8796827 -6697771 -4572240 -6459779 -13205613
5308 -13205613 -19577661 -20426986 -16149148 -10208739 -4987811 -2030829 -2503739 -4882265
5300 -4882265 -5590567 -4373088 -5493866 -10799326 -15306055 -13600719 -7849656 -5109530
5292 -5109530 -8343466 -14201802 -18661633 -20799728 -21182672 -20269182 -19137060 -18993686 -18981628
5283 -18981628 -16495270 -10680662 -4213607 -675229 -1110988 -4100847 -8593431 -15114027
$$ packed form
5341a6092207M0060k724006l621194n373124n601045k243051J436350J758969
5333c2419248j55626j650760k609312l024318q48228M167480Q100968P586569
5325b0852475L891587p318k853300l612491r31821L289956M228854R89017j309857
5316a7167848O42396L328479K905384J494762K099056K125531j887539o745834
5308a3205613o372048q49325M277838N940409N220928K956982m72910k378526
5300d882265p08302J217479j120778n305460m506729J705336N751063K740126
5292e109530l233936n858336m459831k138095l82944R13490J132122J43374J2058
5283a8981628K486358N814608O467055L538378m35759k989859m492584o520596
$$ plain form
5275 -15114027 -23231114 -28915674 -27218577 -18840771 -11438077 -11455621 -16405276 -18995338
5267 -18995338 -17463652 -16446210 -17729011 -16998915 -12406263 -9711803 -13598150 -18734475
5259 -18734475 -16320862 -6949312 57876 -722763 -5607922 -9599145 -12612771 -15752253
5251 -15752253 -17297711 -16162103 -15098966 -16307834 -16856900 -12812036 -5881289 -1375391
5243 -1375391 -510019 541247 3612253 5236269 2355516 -2365802 -4149176 -2774859
5235 -2774859 -1938307 -2839597 -2358966 1753416 7420349 11772810 15210179 19068568 21232679
5226 21232679 17917018 9603018 1612136 -2334547 -4340867 -8347109 -13949939 -16679638
5218 -16679638 -13900186 -8359236 -5268321 -6757351 -9990296 -10821155 -8704142 -6990089
$$ packed form
5275a5114027q117087n684560J697097Q377806P402694j7544m949655k590062
5267a8995338J531686J017442j282801P30096M592652K694460l886347n136325
5259a8734475K413613R371550P007188p80639m885159l991223l013626l139482
5251a5752253j545458J135608J063137j208868n49066M044864O930747M505898
5243a375391Q65372J051266L071006J624016k880753m721318j783374J374317
5235b774859Q36552r01290M80631M112382N666933M352461L437369L858389K164111
5226B1232679l315661q314000p990882l946683k006320m006242n602830k729699
5218a6679638K779452N540950L090915j489030l232945q30859K117013J714053
$$ plain form
5210 -6990089 -8338237 -11561956 -14153646 -16000704 -18120807 -19134353 -16665831 -12130534
5202 -12130534 -10127906 -11897610 -13037442 -9741594 -4077702 -429051 462528 548113 -268866
5193 -268866 -3921856 -10061229 -15775132 -19316304 -21048544 -20788570 -17513759 -12320992 -8578482
5184 -8578482 -7799054 -7779651 -6345561 -4799652 -5596952 -8014850 -8592535 -5692077 -1612543
5175 -1612543 484121 437952 702822 2575004 4329504 3845566 1975498 1652655 3818145
5166 3818145 6012896 5443870 1682523 -4331099 -11593282 -17641939 -18429036 -13147170 -8106816
5157 -8106816 -11456916 -23054642 -33181337 -33411133 -26041206 -20047411 -19769222 -21271904
5149 -21271904 -19352161 -14237049 -9979853 -8915002 -9823769 -10246496 -8817197 -6213951
$$ packed form
5210f990089j348148l223719k591690j847058k120103j013546K468522M535297
5202a2130534K002628j769704j139832L295848N663892L648651Q91579Q5585q16979
5193b68866l652990o139373n713903l541172j732240K59974L274811N192767L742510
5184h578482P79428J9403J434090J545909p97300k417898n77685K900458M079534
5175a612543K096664m6169K64870J872182J754500m83938j870068l22843K165490
5166C818145K194751n69026l761347o013622p262183o048657p87097N281866N040354
5157h106816l350100j1597726j0126695k29796P369927N993795K78189j502682
5149b1271904J919743N115112M257196J064851r08767m22727J429299K603246
$$ plain form
5141 -6213951 -5306161 -9219481 -17210415 -23411448 -22474554 -16356064 -12478703 -14564051 -18568205
5132 -18568205 -19259308 -17427938 -17502686 -20382484 -22513138 -21202089 -17353938 -13099380 -9696885
5123 -9696885 -7799136 -7150578 -6137891 -4215676 -4213235 -8880275 -15369452 -17183276 -12374452
5114 -12374452 -6030049 -3523303 -5141346 -8826668 -13982818 -19967196 -24402511 -25986193
5106 -25986193 -26072249 -24888073 -19742822 -10512429 -3429205 -4586163 -11698985 -16879023
5098 -16879023 -15980054 -10768157 -3774868 3217241 6321407 1771620 -7506075 -13021767
5090 -13021767 -10899161 -6621393 -6931151 -10788747 -11720526 -6403744 2530383 10394411
5082 10394411 13869962 11722971 5220980 -2379592 -8763771 -14405695 -19919184 -23150172
$$ packed form
5141f213951R07790l913320p990934o201033R36894O118490L877361k085348m004154
5132a8568205o91103J831370p4748k879798k130654J311049L848151M254558L402495
5123i696885J897749O48558J012687J922215K441m667040o489177j813824M808824
5114a2374452O344403K506746j618043l685322n156150n984378m435315j583682
5106b5986193q6056J184176N145251R230393P083224j156958p112822n180038
5098a6879023Q98969N211897O993289O992109L104166m549787r277695n515692
5090a3021767K122606M277768l09758l857596r31779N316782Q934127P864028
5082A0394411L475551k146991o501991p600572o384179n641924n513489l230988
$$ plain form
5074 -23150172 -21814769 -18149385 -17211349 -19887294 -20908592 -15584576 -6104489 1059247
5066 1059247 2426699 -64965 -2783752 -4105753 -4824953 -6955377 -11748874 -16965605
5058 -16965605 -17104580 -9456912 589222 4493484 1500682 -186323 4650410 10325749
5050 10325749 8694460 1193129 -3919124 -3943203 -3999414 -6998670 -8645932 -4721209 2355982
5041 2355982 7340600 8375618 6644837 3568135 1093709 1294893 2747054 470445
5033 470445 -7447709 -15993232 -19111109 -16980707 -14366205 -14072596 -15326671 -16774826 -17786321
5024 -17786321 -17906102 -17463699 -17503404 -17462572 -15124551 -10791103 -8659381 -11327717 -15587644
5015 -15587644 -16779071 -14935394 -13387843 -13591256 -14774409 -16541860 -18148165 -17146065
$$ packed form
5074b3150172J335403L665384R38036k675945j021298N324016R480087P163736
5066A059247J367452k491664k718787j322001p19200k130424m793497n216731
5058a6965605j38975P647668J0046134L904262k992802j687005M836733N675339
5050A0325749j631289p501331n112253k4079n6211k999256j647262L924723P077191
5041B355982M984618J035018j730781l076702k474426K01184J452161k276609
5033D70445p918154q545523l117877K130402K614502K93609j254075j448155j011495
5024a7786321j19781M42403l9705M0832K338021M333448K131722k668336m259927
5015a5587644j191427J843677J547551k03413j183153j767451j606305J002100
$$ plain form
5007 -17146065 -12671920 -8578500 -9408830 -14189455 -17559232 -16169570 -11182180 -5781834
4999 -5781834 -3020158 -4594336 -8969607 -12193913 -12729697 -13157384 -15145278 -16555379 -16568115
4990 -16568115 -18996008 -25754215 -31488342 -30868891 -27577913 -28864380 -33739740 -34450766
4982 -34450766 -28562926 -21738462 -18313502 -16491656 -14334512 -14240138 -19032921 -27543928
4974 -27543928 -35433083 -37910330 -32625403 -23085857 -17128145 -18029952 -20139194 -18085034
4966 -18085034 -15749566 -18645545 -21821885 -15908536 -3383139 2621487 -3537743 -13824472
4958 -13824472 -20346327 -24697220 -29938236 -33072007 -30690271 -24646943 -17668177 -9937677
4950 -9937677 -3426487 -2368106 -5809666 -7117961 -4805830 -6104917 -15006640 -24346610
$$ packed form
5007a7146065M474145M093420q30330m780625l369777J389662M987390N400346
4999e781834K761676j574178m375271l224306n35784m27687j987894j410101j2736
4990a6568115k427893o758207n734127O19451L290978j286467m875360p11026
4982c4450766N887840O824464L424960J821846K157144R4374m792783q511007
4974b7543928p889155k477247N284927R539546N957712r01807k109242K054160
4966a8085034K335468k895979l176340N913349J2525397O004626o159230j0286729
4958a3824472o521855m350893n241016l133771K381736O043328O978766P730500
4950i937677O511190J058381l441560j308295K312131j299087q901723r339970
$$ plain form
4942 -24346610 -25669191 -20487069 -15672387 -13422326 -12188634 -12805432 -17009708 -22652291
4934 -22652291 -25622542 -24748999 -21676989 -18190468 -15489846 -13280749 -9150632 -2770383
4926 -2770383 348417 -4451957 -11720390 -11828772 -5726026 -3548141 -7994427 -11225580
4918 -11225580 -10699672 -14495920 -25541442 -33789026 -31687785 -25579430 -23485007 -22982230
4910 -22982230 -20104710 -18777672 -21092820 -19128743 -8166611 1488429 -1932704 -14457219
4902 -14457219 -24344351 -29217337 -33417465 -36017964 -33789746 -29562016 -26406848 -20244645
4894 -20244645 -8440967 2319640 6815678 10334227 16664004 18756019 12848340 8177286
4886 8177286 9415123 5582882 -7551989 -12803254 174538 12118527 5199096 -4540377
$$ packed form
4942b4346610j322581N182122M814682K250061J233692o16798m204276n642583
4934b2652291k970251Q73543L072010L486521K700622K209097M130117O380249
4926b770383L118800m800374p268433j08382O102746K177885m446286l231153
4918a1225580N25908l796248j1045522q247584K101241O108355K094423N02777
4910b2982230K877520J327038k315148J964077J0962132R655040l421133j2524515
4902a4457219r887132m872986m200128k600499K228218M227730L155168O162203
4894b0244645J1803678J0760607M496038L518549O329777K092015n907679m671054
4886H177286J237837l832241j3134871n251265J2977792J1943989o919431r739473
$$ plain form
4878 -4540377 2524783 9763453 -4422146 -19638143 -15499784 -43857029 -179106597 -383064382
4870 -383064382 -500510520 -434122759 -264150752 -141571065 -111639436 -106687429 -75978108
4863 -75978108 -42010363 -33427433 -35323200 -25971482 -13192604 -11005096 -13869799 -13400392
4855 -13400392 -14591903 -19742155 -18517288 -7620135 -607061 -5906358 -12925862 -11158972
4847 -11158972 -6313608 -6637643 -9059343 -9944317 -14947816 -26594421 -34810016 -31212410
4839 -31212410 -22029804 -16656067 -13763291 -8802395 -5402185 -8554944 -14250745 -15628725
4831 -15628725 -12909047 -9194495 -3502700 4065081 7283178 2084226 -6535523 -13449609
4823 -13449609 -22267762 -36790628 -50123922 -52180532 -43928624 -35262860 -31719824 -31097714
$$ packed form
4878d540377P065160P238670j4185599j5215997M138359k8357245j35249568k03957785
4870c83064382j17446138O6387761J69972007J22579687K9931629M952007L0709321
4863g5978108L3967745Q582930j895767R351718J2778878K187508k864703M69407
4855a3400392j191511n150252J224867J0897153P013074n299297p019504J766890
4847a1158972M845364l24035k421700q84974n003499j1646605q215595L597606
4839c1212410R182606N373737K892776M960896L400210l152759n695801j377980
4831a5628725K719678L714552N691795P567781L218097n198952q619749o914086
4823a3449609q818153j4522866j3333294k056610Q251908Q665764L543036O22110
$$ plain form
4815 -31097714 -30341682 -28142108 -22852735 -14810011 -9080055 -9794230 -13434957 -13478519 -10176811
4806 -10176811 -10258430 -17855329 -30123655 -40662629 -43723840 -37271768 -25917596 -18659402
4798 -18659402 -19684107 -23453359 -22373082 -16278803 -10092535 -5593730 -1364505 1454005
4790 1454005 -70162 -4768100 -8238386 -9965801 -14154105 -22131641 -28551666 -27609453
4782 -27609453 -20251907 -12886291 -10284958 -11404319 -11657753 -8175384 -2538973 1327262
4774 1327262 1167218 -2097402 -5600411 -6050435 -1763185 4321358 5351457 -1906476 -11417934
4765 -11417934 -14596823 -12147786 -13139943 -21363016 -29393436 -29256449 -22865678 -17450825
4757 -17450825 -15608384 -15010045 -14190915 -13380481 -12287216 -11705579 -14772474 -22121500 -28343200
$$ packed form
4815c1097714P56032K199574N289373Q042724N729956p14175l640727m3562L301708
4806a0176811q1619p596899j2268326j0538974l061211O452072J1354172P258194
4798a8659402j024705l769252J080277O094279O186268M498805M229225K818510
4790A454005j524167m697938l470286j727415m188304p977536o420025R42213
4782b7609453P357546P365616K601333j119361k53434L482369N636411L866235
4774A327262j60044l264620l503009m50024M287250O084543J030099p257933r511458
4765a1417934l178889K449037r92157q223073q030420J36987O390771N414853
4757a7450825J842441N98339Q19130Q10434J093265N81637l066895p349026o221700
$$ plain form
4748 -28343200 -28070752 -23464640 -20859800 -21891432 -22915660 -21675982 -19401940 -17287473
4740 -17287473 -15842687 -16952876 -21542381 -25650864 -24068896 -18105364 -14643524 -16587389
4732 -16587389 -19033953 -16508876 -9838505 -3760314 -955199 -580310 -422707 1128537
4724 1128537 3486191 3337115 -2458291 -12970237 -24150564 -33562686 -41427752 -47061802
4716 -47061802 -48172167 -44957844 -41198243 -39153414 -36718229 -32315169 -29231416 -30845378
4708 -30845378 -33585826 -29836440 -17982799 -5031660 1950638 2819029 694814 -4258391
4700 -4258391 -12943688 -21811849 -24881685 -21154425 -15174992 -9927203 -4618721 -664030
4692 -664030 -2903233 -10730024 -14487820 -7623873 2158440 2339641 -6619012 -12751959 -11442456
$$ packed form
4748b8343200K72448M606112K604840j031632j024228J239678K274042K114467
4740a7287473J444786j110189m589505m108483J581968N963532L461840j943865
4732a6587389k446564K525077O670371O078191K805115L74889J57603J551244
4724A128537K357654j49076n795406j0511946j1180327r412122p865066n634050
4716d7061802j110365L214323L759601K044829K435185M403060L083753j613962
4708c0845378k740448L749386J1853641J2951139O982298Q68391k124215m953205
4700d258391q685297q868161l069836L727260N979433N247789N308482L954691
4692f64030k239203p826791l757796O863947R782313J81201q958653o132947J309503
$$ plain form
4683 -11442456 -11997197 -22293642 -36462510 -43441944 -40589335 -32934071 -25128484 -20496472
4675 -20496472 -22541280 -30092496 -34999902 -31829226 -26482573 -27992543 -34963208 -38235412
4667 -38235412 -34628969 -29002253 -23520245 -14537090 -1704741 8542459 11831087 11228938
4659 11228938 10420727 7763712 1083777 -6969876 -12739220 -16469829 -19188890 -18456274
4651 -18456274 -11957081 -2898626 2477608 1418592 -4224179 -11299425 -16512662 -16409943
4643 -16409943 -10491364 -3906017 -3470608 -10294798 -18241617 -19987214 -13621124 -3818478
4635 -3818478 2479041 2284393 -758334 -1066041 1158461 -525186 -9858854 -21316543
4627 -21316543 -25835671 -21655076 -15644677 -14002114 -15380154 -14537980 -9810403 -4313025
$$ packed form
4683a1442456n54741j0296445j4168868o979434K852609P655264P805587M632012
4675b0496472k044808p551216m907406L170676N346653j509970o970665l272204
4667c8235412L606443N626716N482008Q983155J2832349J0247200L288628o02149
4659A1228938q08211k657015o679935q053653n769344l730609k719061P32616
4651a8456274O499193R058455N376234j059016n642771p075246n213237J02719
4643a6409943N918579O585347M35409o824190p946819j745597O366090R802646
4635c818478O297519j94648l042727l07707K224502j683647r333668j1457689
4627b1316543m519128M180595O010399J642563j378040Q42174M727577N497378
$$ plain form
4619 -4313025 -917310 1086799 3485426 5221669 3330052 -2119285 -6432940 -5515475
4611 -5515475 -1196873 1353004 846892 999520 3810024 5598280 2239286 -4467244 -9095409
4602 -9095409 -9849939 -10127429 -13284015 -18927560 -24556322 -28107826 -28294640 -24898397 -19839076
4593 -19839076 -16212342 -15342266 -16136115 -17633552 -20114473 -23006392 -24216569 -23111655
4585 -23111655 -21896322 -22001061 -21430661 -18704358 -17379247 -22139797 -30807477 -35268504
4577 -35268504 -31833829 -26150239 -24991911 -27137757 -26732949 -22959336 -20663953 -21845660
4569 -21845660 -22325925 -18804971 -14637612 -15019004 -18962411 -20100388 -15131020 -8231030
4561 -8231030 -5811495 -8509232 -10237781 -5397183 4335681 11871963 12831454 9365656
$$ packed form
4619d313025L395715K004109K398627J736243j891617n449337m313655R17465
4611e515475M318602K549877n06112J52628K810504J788256l358994o706530m628165
4602i095409p54530k77490l156586n643545n628762l551504j86814L396243N059321
4593a9839076L626734Q70076p93849j497437k480921k891919j210177J104914
4585b3111655J215333j04739N70400K726303J325111m760550q667680m461027
4577c5268504L434675N683590J158328k145846M04808L773613K295383j181707
4569b1845660m80265L520954M167359l81392l943407j137977M969368O899990
4561h231030K419535k697737j728549M840598R732864P536282R59491l465798
$$ plain form
4553 9365656 5275245 726814 -5293064 -10142819 -10078213 -6751045 -5858643 -8684881 -10162328
4544 -10162328 -7054666 -2903079 -1769250 -1758389 639821 3081108 -118912 -8857322
4536 -8857322 -15464625 -13067920 -3232457 5419759 5174810 -3675744 -12875643 -14494953
4528 -14494953 -9634257 -6659905 -10331164 -16436736 -18877091 -17394268 -14704758 -10429600
4520 -10429600 -3386689 2977200 3637551 -688689 -4825297 -7097971 -10599230 -16480681
4512 -16480681 -21127383 -20861047 -15455022 -6618188 3208347 10513418 13019518 12189828
4504 12189828 9875716 3842899 -8250708 -21590405 -27671954 -25596820 -23124680 -24758706
4496 -24758706 -25531920 -19745871 -9952672 -3237676 -3130756 -8792875 -17732085 -25313830
$$ packed form
4553I365656m090411m548431o019878m849755O4606L327168Q92402k826238j477447
4544a0162328L107662M151587J133829J0861K398210K441287l200020q738410
4536h857322o607303K396705R835463Q652216k44949q850554r199899j619310
4528a4494953M860696K974352l671259o105572k440355J482823K689510M275158
4520a0429600P042911O363889O60351m326240m136608k272674l501259n881451
4512a6480681m646702K66336N406025Q836834R826535P305071K506100q29690
4504A2189828k314112o032817j2093607j3339697o081549K075134K472140j634026
4496b4758706p73214N786049R793199O714996J06920n662119q939210p581745
$$ plain form
4488 -25313830 -25728723 -18327026 -10490094 -10127483 -17122364 -25068721 -28964435 -28213569 -24764997
4479 -24764997 -21819675 -22422472 -26251863 -29339881 -28950398 -26390830 -23367392 -19158351
4471 -19158351 -13889938 -10616215 -10706350 -10951786 -9207725 -9127923 -14439196 -21666743 -23984536
4462 -23984536 -20200064 -14928932 -11918929 -12279806 -17097844 -25751594 -32879378 -33279356
4454 -33279356 -29618641 -29454762 -34418638 -38140340 -35703422 -29422192 -23490301 -18115613
4446 -18115613 -11771967 -5499341 -2040688 -2864965 -7752572 -15351532 -23016009 -27919551
4438 -27919551 -29015473 -26562386 -20489925 -11629441 -3435855 956808 2646005 4151892
4430 4151892 3606547 -3317963 -15551222 -25852153 -29016037 -26366512 -21317751 -15737327
$$ packed form
4488b5313830m14893P401697P836932L62611o994881p946357l895714P50866L448572
4479b4764997K945322o02797l829391l088018L89483K559568L023438M209041
4471a9158351N268413L273723r0135k45436J744061P9802n311273p227547k317793
4462b3984536L784472N271132L010003l60877m818038q653750p127784l99978
4454c3279356L660715J63879m963876l721702K436918O281230N931891N374688
4446a8115613O343646O272626L458653q24277m887607p598960p664477m903542
4438b7919551j095922K453087O072461Q860484Q193586M392663J689197J505887
4430D151892n45345o924510j2233259j0300931l163884K649525N048761N580424
$$ plain form
4422 -15737327 -12201326 -14039995 -20052324 -24034665 -23084963 -22235011 -27293320 -36887920
4414 -36887920 -45054207 -47739939 -43057079 -29761164 -10988887 3978398 8006512 4494911
4406 4494911 2196028 3615848 4342164 2042046 -1103815 -4840770 -12165232 -22134773
4398 -22134773 -27836362 -25075565 -18416127 -14951204 -15691203 -16658318 -15539484 -13603845
4390 -13603845 -13052929 -15518733 -21315370 -27496765 -28884786 -24088741 -18261758 -16327850
4382 -16327850 -15812554 -11202620 -3878615 -1503088 -6795783 -13015597 -13570609 -11250258
4374 -11250258 -13241532 -19725277 -22813833 -16860848 -5761925 1450882 40887 -6801287
4366 -6801287 -12435693 -13335691 -11159812 -9256265 -8516266 -7725896 -6915856 -7590637 -9167155
$$ packed form
4422a5737327L536001j838669o012329l982341R49702Q49952n058309r594600
4414c6887920q166287k685732M682860J3295915J8772277J4967285M028114l511601
4406D494911k298883J419820P26316k300118l145861l736955p324462r969541
4398b2134773n701589K760797O659438L464923p39999r67115J118834J935639
4390a3603845N50916k465804n796637o181395j388021M796045N826983J933908
4382a6327850N15296M609934P324005K375527n292695o219814n55012K320351
4374a1250258j991274o483745l088556N952985J1098923P212807j409995o842174
4366f801287n634406q99998K175879J903547P39999P90370Q10040o74781j576518
$$ plain form
4357 -9167155 -8485817 -5074047 -4029077 -9910516 -19223935 -23309502 -18887305 -11997500
4349 -11997500 -10526690 -15881728 -23121814 -26414929 -22993614 -14547272 -6737061 -5252132
4341 -5252132 -10277793 -16223177 -18241387 -17210767 -16855232 -18218738 -19369631 -18978041 -17474499
4332 -17474499 -15296505 -12267112 -8669855 -5485081 -3657821 -3871611 -6299674 -9777942
4324 -9777942 -12227054 -12859873 -13127988 -14838901 -18310836 -22599931 -26090564 -26966797 -25345735
4315 -25345735 -24747017 -28083652 -31941501 -29389264 -19911484 -11302112 -8749457 -7608540
4307 -7608540 -1954691 4616796 3611908 -5926131 -16879654 -24428293 -29626367 -33042672
4299 -33042672 -32493118 -28664335 -26472017 -28284513 -30733229 -30293879 -27400017 -23188142
$$ packed form
4357i167155O81338L411770J044970n881439r313419m085567M422197O889805
4349a1997500J470810n355038p240086l293115L421315Q446342P810211J484929
4341e252132n025661n945384k018210J030620L55535j363506j150893L91590J503542
4332a7474499K177994L029393L597257L184774J827260k13790k428063l478268
4324i777942k449112o32819k68115j710913l471935m289095l490633q76233J621062
4315b5345735N98718l336635l857849K552237R477780Q609372K552655J140917
4307g608540N653849O571487j004888r538039j0953523p548639n198074l416305
4299c3042672N49554L828783K192318j812496k448716M39350K893862M211875
$$ plain form
4291 -23188142 -17042358 -9847417 -5338893 -5547860 -8551978 -12782021 -19351624 -27619486
4283 -27619486 -32827320 -31677138 -26989044 -23643326 -22903612 -23660317 -25935200 -29476462
4275 -29476462 -31456887 -29287561 -24110351 -18836018 -14694889 -12071288 -12218934 -15395512
4267 -15395512 -19625582 -23840314 -29546998 -36684497 -41003301 -39202830 -34078881 -30754205
4259 -30754205 -29940201 -28620679 -25378031 -21303182 -17401429 -14549960 -14119589 -15423304
4251 -15423304 -15047478 -12181615 -11378032 -15578954 -19956948 -18612755 -14363030 -14476138 -18298313
4242 -18298313 -17432860 -8804995 188911 1628367 -4309445 -12939657 -21117051 -26655467
4234 -26655467 -27196402 -23547690 -20254838 -19594142 -18431989 -13791692 -7848392 -4261101
$$ packed form
4291b3188142O145784P194941M508524k08967l004118m230043o569603q267862
4283b7619486n207834J150182M688094L345718P39714p56705k274883l541262
4275b9476462j980425K169326N177210N274333M141129K623601j47646l176578
4267a5395512m230070m214732n706684p137499m318804J800471N123949L324676
4259c0754205Q14004J319522L242648M074849L901753K851469M30371j303715
4251a5423304L75826K865863Q03583m200922m377994J344193M249725j13108l822175
4242a8298313Q65453Q627865Q993906J439456n937812q630212q177394n538416
4234b6655467n40935L648712L292852O60696J162153M640297N943300L587291
$$ plain form
4226 -4261101 -2891333 -1610952 -703750 -2073535 -5881708 -10603933 -14839933 -17310048
4218 -17310048 -17130235 -15468593 -14278724 -12308912 -6223306 2498713 6495603 1734473
4210 1734473 -6459802 -10786317 -11438193 -12985271 -15141478 -13272449 -6851352 -1002208
4202 -1002208 721337 -239711 -1985681 -5162839 -9929238 -14185767 -17081755 -21204969
4194 -21204969 -28789256 -37388155 -41332253 -37256118 -27811549 -20020699 -18849524 -21598113
4186 -21598113 -20648591 -13379240 -6420912 -6893852 -12562131 -15794176 -14905981 -14652405 -16129946
4177 -16129946 -14465110 -8827107 -6959866 -14756683 -26829098 -33141827 -31245711 -26212674
4169 -26212674 -21314460 -15263109 -7915962 -2748877 -2489393 -6194435 -11744791 -18319941
$$ packed form
4226d261101J369768J280381R07202j369785l808173m722225m236000k470115
4218a7310048J79813J661642J189869J969812O085606Q722019L996890m761130
4210A734473q194275m326515o51876j547078k156207J869029O421097N849144
4202a002208J723545r61048j745970l177158m766399m256529k895988m123214
4194b1204969p584287q598899l944098M076135R444569P790850J171175k748589
4186b1598113R49522P269351O958328m72940n668279l232045Q88195K53576j477541
4177a6129946J664836N638003J867241p796817j2072415o312729J896116N033037
4169b6212674M898214O051351P347147N167085K59484l705042n550356o575150
$$ plain form
4161 -18319941 -25406326 -31443242 -34300971 -32265423 -25239077 -16213170 -10112811 -9154107
4153 -9154107 -10628299 -11213431 -11502200 -13665719 -17028289 -19581078 -21605787 -23494653 -22724589
4144 -22724589 -19168864 -20993647 -36035979 -56387327 -61576556 -42134279 -12345494 6637523
4136 6637523 9790562 6917407 4672112 977734 -4703907 -7532963 -6635253 -8896797
4128 -8896797 -18113576 -26950174 -26095698 -17466796 -11740567 -14302163 -19572055 -19717291 -14317323
4119 -14317323 -9575371 -10791647 -17608797 -25163765 -28123968 -24192845 -15273507 -5815107
4111 -5815107 279494 1624560 -933510 -5529625 -9903672 -11938105 -11246172 -10502506 -13518677
4102 -13518677 -20577558 -26780663 -27139712 -22904606 -20292504 -22549307 -25974231 -25019794
$$ packed form
4161a8319941p086385o036916k857729K035548P026346R025907O100359R58704
4153i154107j474192n85132k88769k163519l362570k552789k024709j888866P70064
4144b2724589L555725j824783j5042332k0351348n189229J9442277K9788785J8983017
4136F637523L153039k873155k245295l694378n681641k829056Q97710k261544
4128h896797r216779q836598Q54476Q628902N726229k561596n269892j45236N399968
4119a4317323M741952j216276o817150p554968k960203L931123Q919338R458400
4111e815107O094601J345066k558070m596115m374047k034433O91933P43666l016171
4102a3518677p058881o203105l59049M235106K612102k256803l424924R54437
$$ plain form
4094 -25019794 -18857969 -11248083 -6221257 -5764027 -9211093 -12412032 -10093442 -2363562
4086 -2363562 3434874 1234924 -5583332 -9270742 -9005853 -10873484 -17047776 -22065398
4078 -22065398 -21540753 -18103969 -15657047 -13426495 -9683906 -6541590 -6363405 -7105362 -5933471
4069 -5933471 -4336388 -4736335 -4768228 -560565 5776705 7504257 1856108 -7274692 -15067485
4060 -15067485 -19848854 -21456965 -20047262 -17500548 -16470712 -17068709 -17359699 -17477325 -19932532
4051 -19932532 -25131919 -29792932 -30883032 -28475664 -23960633 -18255736 -12692673 -8820272
4043 -8820272 -6128133 -2548655 1627538 3045082 31839 -4426969 -6395005 -5767151
4035 -5767151 -5427312 -7104699 -10021146 -12870588 -15542026 -18912173 -23343197 -27163821
$$ packed form
4094b5019794O161825P609886N026826M57230l447066l200939K318590P729880
4086b363562N798436k199950o818256l687410K64889j867631o174292n017622
4078b2065398N24645L436784K446922K230552L742589L142316J78185p41957J171891
4069e933471J597083l99947l1893M207663O337270J727552n648149r130800p792793
4060a5067485m781369j608111J409703K546714J029836n97997k90990j17626k455207
4051a9932532n199387m661013j090100K407368M515031N704897N563063L872401
4043h820272K692139L579478M176193J417544l013243m458808j968036O27854
4035e767151L39839j677387k916447k849442k671438l370147m431024l820624
$$ plain form
4027 -27163821 -27399701 -23509077 -19616320 -20374887 -24534988 -25665016 -20294959 -12586256
4019 -12586256 -9313928 -12435752 -18279946 -21991350 -20787026 -14541638 -5629340 2220089
4011 2220089 6348427 6362452 2982637 -2719662 -8652693 -12543543 -14462452 -16359217 -18052252
4002 -18052252 -16465121 -10854929 -6095952 -7596053 -14446992 -20735013 -22769177 -21899995
3994 -21899995 -20445692 -18099746 -13614190 -8207815 -5675270 -8926358 -16376062 -22067918
3986 -22067918 -20691551 -13038389 -5113275 -1200867 196835 2261778 4224762 2674730
3978 2674730 -2815957 -8527194 -10971540 -10048027 -7707585 -5553670 -4282129 -4141423 -5363561
3969 -5363561 -8331924 -12781959 -16874643 -18801964 -19583939 -21309193 -21575178 -14361486 -130280
$$ packed form
4027b7163821k35880L890624L892757p58567m160101j130028N370057P708703
4019a2586256L272328l121824n844194l711404J204324O245388Q912298P849429
4011B220089M128338J4025l379815n702299n933031l890850j918909j896765j693035
4002a8052252J587131N610192M758977j500101o850939o288021k034164Q69182
3994b1899995J454303K345946M485556N406375K532545l251088p449704n691856
3986b2067918J376367P653162P925114L912408J397702K064943J962984j550032
3978B674730n490687n711237k444346R23513K340442K153915J271541J40706j222138
3969e363561k968363m450035m092684j927321p81975j725254k65985P213692J4231206
$$ plain form
3960 -130280 9610456 4599893 -9673715 -17669972 -13662835 -7228521 -7054858 -8874404
3952 -8874404 -5308556 248661 -1435677 -10902054 -19776143 -23462229 -24964965 -25772633
3944 -25772633 -22164516 -13650580 -7182570 -7859610 -11137706 -9886892 -4892283 -2354907
3936 -2354907 -4221028 -7595592 -11691706 -18020170 -23998753 -24055379 -18976669 -17124396 -22631129
3927 -22631129 -28309702 -25492489 -16437155 -10663948 -11730739 -14552809 -14830467 -13753403
3919 -13753403 -12112516 -6919329 2083658 7645678 2218574 -12224883 -26058063 -32324068
3911 -32324068 -31151474 -25308506 -16855037 -9014247 -6069279 -8217818 -9835577 -6512130
3903 -6512130 -1715639 -2373024 -8760845 -13384005 -10738700 -4014110 113929 -172840 -2168277
$$ packed form
3960a30280R740736n010563j4273608p996257M007137O434314J73663j819546
3952h874404L565848N557217j684338r466377q874089l686086j502736q07668
3944b5772633L608117Q513936O468010o77040l278096J250814M994609K537376
3936b354907j866121l374564m096114o328464n978583n6626N078710J852273n506733
3927b2631129n678573K817213R055334N773207j066791k822070k77658J077064
3919a3753403J640887N193187R002987N562020n427104j4443457j3833180o266005
3911c2324068J172594N842968Q453469P840790K944968k148539j617759L323447
3903f512130M796491o57385o387821m623160K645305O724590M128039k86769j995437
$$ plain form
3894 -2168277 -4835827 -9962865 -17420974 -23542269 -25389622 -23661913 -20295210 -15977223
3886 -15977223 -11289836 -7674562 -5881443 -5891369 -9256079 -17999329 -29517252 -36710939
3878 -36710939 -36198970 -32500553 -30379486 -27447577 -19899632 -11559517 -9343592 -11656783
3870 -11656783 -10243220 -3993179 -1731327 -8414452 -17033531 -19181986 -16607532 -15927300
3862 -15927300 -17375597 -16285863 -12463455 -10529066 -12092009 -14036384 -14443408 -14814533
3854 -14814533 -16171991 -17554385 -18676333 -20038383 -20374315 -18066191 -15151445 -15670117
3846 -15670117 -19627347 -22845175 -23474708 -24175501 -26518341 -27847509 -26240596 -24693207
3838 -24693207 -26850149 -30990492 -31838027 -27356338 -20901943 -16886655 -16400531 -17389747 -17964100
$$ packed form
3894b168277k667550n127038p458109o121295j847353J727709L366703M317987
3886a5977223M687387L615274J793119r926l364710q743250j1517923p193687
3878c6710939N11969L698417K121067K931909P547945Q340115K215925k313191
3870a1656783J413563O250041K261852o683125q619079k148455K574454O80232
3862a5927300j448297J089734L822408J934389j562943j944375m07024l71125
3854a4814533j357458j382394j121948j362050l35932K308124K914746n18672
3846a5670117l957230l217828o29533p00793k342840j329168J606913J547389
3838b4693207k156942m140343q47535M481689O454395M015288M86124r89216n74353
$$ plain form
3829 -17964100 -18925192 -22669871 -29072539 -33300052 -29813957 -18954870 -7582141 -2146620
3821 -2146620 -2630987 -4407296 -4536322 -4439522 -6890710 -11998904 -16684932 -17771468 -15355720
3812 -15355720 -12857488 -13441180 -16698829 -19303348 -18524809 -14606387 -10255480 -8321571
3804 -8321571 -9135577 -9599483 -6214744 280340 5257512 6341404 6316894 7413648 6141662
3795 6141662 -1245997 -10285322 -11909214 -4877293 1846909 1164987 -3768387 -6682494
3787 -6682494 -8012620 -11937406 -17307692 -18323967 -13419152 -7605023 -5272664 -5315726 -4739617
3778 -4739617 -3198434 -1917691 -1051381 -506365 -1447896 -4498438 -7411397 -6846533 -2472680
3769 -2472680 2236800 3560850 853231 -3886725 -8644160 -12764517 -16265069 -18920392
$$ packed form
3829a7964100r61092l744679o402668m227513L486095J0859087J1372729N435521
3821b146620m84367j776309j29026R6800k451188n108194m686028j086536K415748
3812a5355720K498232n83692l257649k604519P78539L918422M350907J933909
3804h321571q14006m63906L384739O495084M977172J083892k4510J096754j271986
3795F141662p387659r039325j623892P031921O724202o81922m933374k914107
3787f682494j330126l924786n370286j016275M904815N814129K332359m3062N76109
3778d739617J541183J280743Q66310N45016r41531l050542k912959N64864M373853
3769b472680M709480J324050k707619m739956m757435m120357l500552k655323
$$ plain form
3761 -18920392 -20380133 -20627206 -19981278 -19126989 -19454953 -22561799 -28315496 -33575362 -34118345
3752 -34118345 -28718120 -21040496 -16642831 -17512985 -19875735 -18446015 -13034469 -9047893
3744 -9047893 -9859005 -10975983 -5840642 3413754 6839675 214307 -8285836 -9447581
3736 -9447581 -5822674 -6208165 -10874220 -11539211 -5907167 -2650417 -8640606 -19174459
3728 -19174459 -25992779 -28639935 -31475417 -34178688 -32855551 -28354037 -26017777 -27237653
3720 -27237653 -27637353 -24835266 -22633810 -25189473 -30727040 -33420201 -29261102 -18723176
3712 -18723176 -6055094 2592393 2771282 -4214125 -11833765 -14369704 -11792526 -8101263
3704 -8101263 -6428139 -7172124 -9639602 -13217228 -16660593 -17902989 -15914666 -12586913
$$ packed form
3761a8920392j459741k47073O45928Q54289l27964l106846n753697n259866n42983
3752c4118345N400225P677624M397665q70154k362750J429720N411546L986576
3744i047893q11112j116978N135341R254396L425921o625368q500143j161745
3736i447581L624907l85491m666055o64991N632044L256750n990189j0533853
3728a9174459o818320k647156k835482k703271J323137M501514K336260j219876
3720b7237653l99700K802087K201456k555663n537567k693161M159099J0537926
3712a8723176J2668082Q647487J78889o985407p619640k535939K577178L691263
3704h101263J673124p43985k467478l577626l443365j242396J988323L327753
$$ plain form
3696 -12586913 -11664692 -14993282 -20215487 -23270727 -23162536 -22779162 -24385737 -26098499 -24671219
3687 -24671219 -20700408 -18432710 -20101648 -22834246 -22520983 -19022540 -15408559 -12892736
3679 -12892736 -9476619 -4452990 -1213752 -2472283 -4323608 63002 9687723 13655373
3671 13655373 4047424 -12210788 -20013423 -13849809 -3172626 769694 -2576477 -6654460
3663 -6654460 -8361407 -9518657 -10615545 -9228524 -4773494 -188278 2278529 3595352
3655 3595352 4880832 4632279 1177053 -3715514 -6102090 -4687934 -2731181 -4404995
3647 -4404995 -10016288 -15756177 -17936387 -16272298 -12697329 -8502698 -3983508 99844
3639 99844 2297468 1193204 -4480004 -14669081 -25213226 -28835280 -22691129 -13366006
$$ packed form
3696a2586913R22221l328590n222205l055240J08191L83374j606575j712762J427280
3687b4671219L970811K267698j668938k732598L13263L498443L613981K515823
3679a2892736L416117N023629L239238j258531j851325M386610R624721L967650
3671A3655373r607949j6258212p802635O163614J0677183L942320l346171m077983
3663f654460j706947j157250j096888J387021M455030M585216K466807J316823
3655C595352J285480k48553l455226m892567k386576J414156J956753j673814
3647d404995n611293n739889k180210J664089L574969M194631M519190M083352
3639I9844K197624j104264n673208j0189077j0544145l622054O144151R325123
$$ plain form
3631 -13366006 -9914302 -12965768 -15933615 -16293957 -18665127 -25242998 -30445154 -28790260
3623 -28790260 -22174693 -15083378 -8152029 -1482548 1117435 -2289491 -6205851 -4888525
3615 -4888525 -1979382 -5262035 -13732822 -18134038 -14386077 -8896361 -9039734 -14645169
3607 -14645169 -20873030 -24239713 -23542466 -19015527 -12782062 -7371087 -2944184 1370059
3599 1370059 3948738 2351036 -1952007 -5017201 -6426080 -9084705 -13163452 -15609573
3591 -15609573 -16065716 -17547821 -20366111 -21446065 -21149353 -24137518 -30642758 -33292427
3583 -33292427 -26915340 -16490746 -10830700 -12369011 -17382817 -22357444 -25330526 -24091974
3575 -24091974 -18256882 -11542520 -7919834 -6826394 -5389991 -3626341 -4167391 -8384598
$$ packed form
3631a3366006L451704l051466k967847l60342k371170o577871n202156J654894
3623b8790260O615567P091315O931349O669481K599983l406926l916360J317326
3615d888525K909143l282653q470787m401216L747961N489716j43373n605435
3607a4645169o227861l366683O97247M526939O233465N410975M426903M314243
3599A370059K578679j597702m303043l065194j408879k658625m078747k446121
3591a5609573m56143j482105k818290j079954K96712k988165o505240k649669
3583c3292427O377087J0424594N660046j538311n013806m974627k973082J238552
3575b4091974N835092O714362L622686J093440J436403J763650n41050m217207
$$ plain form
3567 -8384598 -15610508 -24322205 -31265705 -31781980 -24838953 -16353364 -13822640 -18238113
3559 -18238113 -24152647 -26947967 -27141732 -27759953 -29787605 -30602199 -26414563 -17236280 -9353486
3550 -9353486 -10098947 -19163608 -28159469 -30217116 -26512205 -21519123 -16390950 -10612344
3542 -10612344 -6012480 -4029205 -1712896 4107951 10102963 9079405 -841135 -13652166
3534 -13652166 -21823015 -22055270 -15853339 -8414841 -6488362 -13171444 -24132883 -31713790
3526 -31713790 -32831954 -30496707 -28312991 -26691471 -24391480 -20823729 -16265557 -11631041
3518 -11631041 -8184391 -6593425 -7151468 -11189426 -19430607 -27920297 -30071272 -25700426
3510 -25700426 -23092479 -27189451 -30575056 -23458752 -9210885 -921893 -3428184 -8158404
$$ packed form
3567h384598p225910q711697o943500n16275O943027Q485589K530724m415473
3559a8238113n914534k795320j93765o18221k027652q14594M187636R178283P882794
3550i353486p45461r064661q995861k057647L704911M993082N128173N778606
3542a0612344M599864J983275K316309N820847N995012j023558r920540j2811031
3534a3652166q170849k32255O201931P438498J926479o683082j0961439p580907
3526c1713790j118164K335247K183716J621520K299991L567751M558172M634516
3518a1631041L446650J590966n58043m037958q241181q489690k150975M370846
3510b5700426K607947m096972l385605P116304J4247867Q288992k506291m730220
$$ plain form
3502 -8158404 -7209115 -3442883 -2904250 -4919854 -5135968 -3010922 -886774 487539 537412
3493 537412 -3655043 -13063371 -21972077 -22843604 -15568850 -7928029 -6896359 -12557052 -20348147
3484 -20348147 -26024947 -27727673 -25870810 -22650085 -20522691 -19870644 -18542608 -14721707
3476 -14721707 -10205878 -9353554 -13446154 -17341100 -14779865 -7270976 -3746538 -9220956
3468 -9220956 -17726117 -20470571 -17628956 -16252876 -18432256 -18726998 -13946979 -8532161
3460 -8532161 -7439987 -9186968 -9733033 -9276675 -11037728 -15688061 -20678266 -23889979 -25303345
3451 -25303345 -25803915 -26042170 -25884278 -24427522 -21565715 -19052357 -17933737 -15998141 -11422947
3442 -11422947 -8099876 -11871809 -20712820 -24789966 -18965435 -9640899 -5429078 -6196965
$$ packed form
3502h158404R49289L766232N38633k015604k16114K125046K124148J374313M9873
3493E37412m192455r408328q908706q71527P274754P640821J031670n660693p791095
3484b0348147n676800j702726J856863L220725K127394O52047J328036L820901
3476a4721707M515829Q52324m092600l894946K561235P508889L524438n474418
3468i220956q505161k744454K841615J376080k179380k94742M780019N414818
3460h532161J092174j746981n46065M56358j761053m650333m990205l211713j413366
3451b5303345n00570k38255J57892J456756K861807K513358J118620J935596M575194
3442a1422947L323071l771933q841011m077146N824531R324536M211821p67887
$$ plain form
3434 -6196965 -6251256 -3880308 -1431586 1303455 6882752 13842287 16419816 11838966 4028266
3425 4028266 -1074400 -1461998 206700 -11452 -3332563 -6641664 -5866786 -1706819 252099
3416 252099 -3489388 -10213922 -15838583 -20100812 -23514214 -23183677 -17064191 -9838225 -8522616
3407 -8522616 -13299636 -18239552 -20207943 -21053194 -21272845 -18309122 -12569398 -8862035 -9170591
3398 -9170591 -9285415 -5857515 -2217784 -3238509 -7880134 -11069144 -10715039 -8867041 -7279107
3389 -7279107 -5542861 -3241132 -1088366 136031 -81281 -2466571 -7167079 -12736230
3381 -12736230 -17129162 -19317213 -19121577 -16558369 -12714777 -10235505 -11053459 -13955760
3373 -13955760 -15984645 -16123722 -16141736 -17768233 -20596083 -23392491 -26207327 -29806392 -33203111
$$ packed form
3434f196965n4291K370948K448722K735041N579297O959535K577529m580850p810700
3425D028266n102666l87598J668698k18152l321111l309101P74878M159967J958918
3416B52099l741487o724534n624661m262229l413402L30537O119486P225966J315609
3407h522616m777020m939916j968391q45251k19651K963723N739724L707363l08556
3398i170591j14824L427900L639731j020725m641625l189010L54105J847998J587934
3389g279107J736246K301729K152766J224397k17312k385290m700508n569151
3381a2736230m392932k188051J95636K563208L843592K479272q17954k902301
3373a3955760k028885j39077j8014j626497k827850k796408k814836l599065l396719
$$ plain form
3364 -33203111 -33176385 -27444136 -18223963 -11491538 -11877094 -18564140 -26563971 -31379961 -31861006
3355 -31861006 -29544319 -26860267 -25920112 -27435475 -29925743 -30582978 -27707742 -22557524
3347 -22557524 -18836566 -19933618 -25649487 -31418159 -32040785 -27029042 -21128497 -18633784
3339 -18633784 -18729753 -18075649 -16261335 -15677465 -16511161 -15371762 -10015157 -2924140 1385755
3330 1385755 904229 -3478543 -10354547 -18272231 -24570772 -26328210 -23229132 -17925822
3322 -17925822 -12625990 -6793704 1357 4063343 -195296 -12699257 -25334825 -30133871
3314 -30133871 -28115234 -26321174 -27226444 -26163190 -19877568 -12067092 -7655425 -6344987
3306 -6344987 -5804883 -7107144 -11743134 -16216492 -15783045 -12308245 -12401786 -17931756 -24018709
$$ packed form
3364c3203111K6726N732249R220173O732425l85556o687046p999831m815990m81045
3355c1861006K316687K684052R40155j515363k490268o57235K875236N150218
3347b2557524L720958j097052n715869n768672o22626N011743N900545K494713
3339a8633784r5969O54104J814314N83870q33696J139399N356605P091017M309895
3330A385755m81526m382772o876004p917684o298541j757438L099078N303310
3322a7925822N299832N832286O795061M061986m258639j2503961j2635568m799046
3314c0133871K018637J794060r05270J063254O285622P810476M411667J310438
3306f344987N40104j302261m635990m473358M33447L474800r3541n529970o086953
$$ plain form
3297 -24018709 -26689689 -26676934 -24648901 -19033499 -11319708 -7794050 -11631684 -17220673
3289 -17220673 -17053090 -11690839 -8201188 -10074878 -13385751 -13315226 -10780277 -10645969 -14759837
3280 -14759837 -18769540 -16893742 -9477931 -3658802 -4935477 -10295505 -13017107 -12460157
3272 -12460157 -13825198 -18453222 -20889109 -17814883 -13748894 -13728682 -15398882 -13743911
3264 -13743911 -9933604 -9299868 -12631434 -15637587 -16336890 -17287385 -20162488 -23089720 -24477606
3255 -24477606 -25610535 -28187371 -31974618 -35430294 -36511454 -33525027 -27836762 -24310758
3247 -24310758 -25351442 -26164295 -20995334 -12779436 -9905243 -13291626 -14537082 -9225454
3239 -9225454 -3935231 -5088896 -8046113 -4632842 3533828 7888615 6533962 6124062
$$ packed form
3297b4018709k670980J2755K028033N615402P713791L525658l837634n588989
3289a7220673J67583N362251L489651j873690l310873P0525K534949J34308m113868
3280a4759837m009703J875798P415811N819129j276675n360028k721602N56950
3272a2460157j365041m628024k435887L074226M065989K0212j670200J654971
3264a3743911L810307O33736l331566l006153o99303r50495k875103k927232j387886
3255b4477606j132929k576836l787247l455676j081160K986427N688265L526004
3247b4310758j040684q12853N168961Q215898K874193l386383j245456N311628
3239i225454N290223j153665k957217L413271Q166670M354787j354653m09900
$$ plain form
3231 6124062 10298787 14563848 14541042 12170953 10605369 8828730 5209326 1621913 -310915
3222 -310915 -3346751 -10291835 -18115700 -21043241 -17993673 -12868351 -8803326 -6295375
3214 -6295375 -5976236 -8621870 -12357531 -13994983 -13705651 -14788274 -18273171 -21215977 -20820473
3205 -20820473 -16709191 -8943442 1523637 9316217 7022957 -5704232 -19634650 -26052467
3197 -26052467 -25704033 -24111953 -22225270 -17144162 -9171080 -1888180 3385098 7188639
3189 7188639 6880933 -1230796 -13948570 -21864909 -20342393 -14663272 -11815450 -12197705
3181 -12197705 -12646590 -12804372 -13844959 -14338871 -12556752 -10930721 -13174687 -17720155 -18781901
3172 -18781901 -14421408 -9516035 -9305573 -13022436 -15946335 -15887307 -15195498 -16575692 -18766437
$$ packed form
3231F124062M174725M265061k2806k370089j565584j776639l619404l587413j932828
3222c10915l035836o945084p823865k927541L049568N125322M065025K507951
3214f295375L19139k645634l735661j637452K89332j082623l484897k942806L95504
3205b0820473M111282P765749J0467079P792580k293260j2727189j3930418o417817
3197b6052467L48434J592080J886683N081108P973082P282900N273278L803541
3189G188639l07706q111729j2717774p916339J522516N679121K847822l82255
3181a2197705m48885j57782j040587m93912J782119J626031k243966m545468j061746
3172a8781901M360493M905373K10462l716863k923899N9028O91809j380194k190745
$$ plain form
3163 -18766437 -17468164 -10184483 892909 11073376 17133272 18393429 15437025 9895910
3155 9895910 4785942 2369384 1317072 -1839052 -7965104 -13952481 -16273606 -13839850
3147 -13839850 -7567044 -203228 3139363 -1672932 -12010151 -19370792 -18579634 -13552896
3139 -13552896 -11527891 -14202211 -17671637 -19112513 -19808099 -21939605 -25120149 -26628598
3131 -26628598 -24265804 -19335880 -16595442 -19457031 -25442036 -29259073 -30300588 -32806674
3123 -32806674 -37812877 -40449442 -37767245 -33584919 -31591487 -29231778 -23959594 -20345362
3115 -20345362 -23477513 -28814078 -27084992 -17951698 -10707271 -11440073 -16987390 -22231223
3107 -22231223 -26004201 -28084663 -27126250 -24240061 -23317634 -25552957 -28242738 -30213054
$$ packed form
3163a8766437J298273P283681J1077392J0180467O059896J260157k956404n541115
3155I895910n109968k416558j052312l156124o126052n987377k321125K433756
3147a3839850O272806P363816L342591m812295j0337219p360641P91158N026738
3139a3552896K025005k674320l469426j440876o95586k131506l180544j508449
3131b6628598K362794M929924K740438k861589n985005l817037j041515k506086
3123c2806674n006203k636565K682197M182326J993432K359709N272184L614232
3115b0345362l132151n336565J729086R133294P244427p32802n547317n243833
3107b2231223l772978k080462R58413K886189R22427k235323k689781j970316
$$ plain form
3099 -30213054 -33068979 -35886920 -34979897 -31048295 -30030828 -33766083 -36131492 -32228237
3091 -32228237 -25221179 -19640719 -14291710 -7795541 -5470918 -12915303 -25925664 -34074199
3083 -34074199 -32476249 -23945792 -12029345 726698 8950455 7207618 -1925129 -8883216
3075 -8883216 -8210239 -3776238 -1572061 -2405368 -3805471 -4449509 -3880672 -1639853 364831
3066 364831 -2122756 -10063287 -18014516 -20083177 -17298399 -15780302 -18757467 -23801133
3058 -23801133 -27399262 -28434387 -26290614 -19176741 -7174979 4747452 10051665 7265043
3050 7265043 1195651 -2910224 -4245415 -4600621 -4413439 -3387452 -3438440 -7354263 -14391559
3041 -14391559 -20328296 -22657555 -22998879 -23395152 -23151397 -21228520 -19404478 -20520207 -24689721
$$ packed form
3099c0213054k855925k817941R07023L931602J017467l735255k365409L903255
3091c2228237P007058N580460N349009O496169K324623p444385j3010361q148535
3083c4074199J597950Q530457J1916447J2756043Q223757j742837r132747o958087
3075h883216O72977M434001K204177q33307j400103o44038N68837K240819K004684
3066C64831k487587p940531p951229k068661K784778J518097k977165n043666
3058b3801133l598129j035125K143773P113873J2001762J1922431N304213k786622
3050G265043o069392m105875j335191l55206J87182J025987n0988l915823p037296
3041a4391559n936737k329259l41324l96273K43755J922877J824042j115729m169514
$$ plain form
3032 -24689721 -29176008 -31356235 -30662559 -28546004 -27318869 -27659600 -26683957 -20720483 -11192815
3023 -11192815 -5069075 -7122148 -13769849 -17352205 -15155108 -11352241 -10747239 -13358251
3015 -13358251 -15304258 -13130618 -6977443 -485502 2514458 1529482 -1129017 -4057884
3007 -4057884 -7580142 -10501017 -9578170 -4369489 361455 24566 -4161277 -7762980 -9326854
2998 -9326854 -10926262 -14385093 -20183207 -28371602 -37052952 -41531957 -39002171 -33247006
2990 -33247006 -30872969 -33415327 -36802145 -38051506 -38423213 -39681581 -40915925 -39981348
2982 -39981348 -35663055 -28286772 -20432000 -16453088 -18539917 -23724958 -27377140 -28710859
2974 -28710859 -29953740 -31450247 -31303159 -28845432 -24618056 -18038046 -9425992 -3233137
$$ packed form
3032b4689721m486287k180227O93676K116555J227135l40731R75643N963474R527668
3023a1192815O123740k053073o647701l582356K197097L802867O05002k611012
3015a3358251j946007K173640O153175O491941K999960r84976k658499k928867
3007d057884l522258k920875R22847N208681M730944l36889m185843l601703j563874
2998i326854j599408l458831n798114q188395q681350m479005K529786N755165
2990c3247006K374037k542358l386818j249361l71707j258368j234344R34577
2982c9981348M318293P376283P854772L978912k086829n185041l652182j333719
2974b8710859j242881j496507J47088K457727M227376O580010Q612054O192855
$$ plain form
2966 -3233137 -4099179 -9976503 -14084580 -13332873 -9734005 -4497960 2441375 7061118 3580785
2957 3580785 -5661440 -10389052 -5941450 497964 1526839 180960 2821823 7429918
2949 7429918 6788780 -281367 -8574815 -15352983 -22062482 -27701112 -27674516 -21081358 -14000056
2940 -14000056 -12768316 -16615817 -19050308 -15478538 -8318274 -4473806 -7625503 -13976997
2932 -13976997 -17578540 -18660246 -22192055 -27826540 -27656111 -17701375 -6240100 -4762877
2924 -4762877 -13603894 -22383722 -23005987 -16733840 -9461248 -5547970 -6501401 -10986484 -15163363
2915 -15163363 -16278208 -16297282 -19283305 -25485792 -30854295 -31968398 -28757887 -23049249
2907 -23049249 -17156392 -13149812 -11051590 -8895884 -6705377 -8065053 -14757357 -22624589
$$ packed form
2966c233137q66042n877324m108077P51707L598868N236045O939335M619743l480333
2957C580785r242225m727612M447602O439414J028875j345879K640863M608095
2949G429918o41138p070147q293448o778168o709499n638630K6596O593158P081302
2940a4000056J231740l847501k434491L571770P160264L844468l151697o351494
2932a3976997l601543j081706l531809n634485J70429R954736J1461275J477223
2924d762877q841017q779828o22265O272147P272592L913278r53431m485083m176879
2915a5163363j114845j9074k986023o202487n368503j114103L210511N708638
2907b3049249N892857M006580K098222K155706K190507j359676o692304p867232
$$ plain form
2899 -22624589 -26673651 -27416143 -27473964 -25158707 -17853955 -9476462 -6961231 -9924170 -11334097
2890 -11334097 -8823935 -7836802 -12155307 -18432252 -22265478 -23269265 -22046703 -18702632
2882 -18702632 -16717680 -21327180 -30785341 -36019596 -32779794 -27280214 -25273458 -22920982
2874 -22920982 -15054372 -5972460 -3569238 -6923930 -8403489 -5754787 -3807874 -5136342
2866 -5136342 -6812496 -6773620 -6702305 -7633575 -8331802 -8956733 -11263639 -14247446 -14295887 -10586712
2856 -10586712 -6000825 -2143144 1830764 4715342 2821340 -4220482 -11965613 -17567123
2848 -17567123 -23106442 -29862308 -33716298 -30206324 -21204922 -12716017 -7980430 -6101587
2840 -6101587 -5711697 -6321003 -6856408 -6241921 -5531823 -7060353 -11244778 -15830777 -18114935
$$ packed form
2899b2624589m049062p42492n7821K315257P304752Q377493K515231k962939j409927
2890a1334097K510162R87133m318505o276945l833226j003787J222562L344071
2882a8702632J984952m609500r458161n234255L239802N499580K006756K352476
2874b2920982P866610R081912K403222l354692j479559K648702J946913j328468
2866e136342j676154L8876P1315r31270o98227o24931k306906k983807m8441L709175
2856a0586712M585887L857681L973908K884578j894002p041822p745131n601510
2848a7567123n539319o755866l853990L509974R001402Q488905M735587J878843
2840f101587L89890o09306n35405O14487P10098j528530m184425m585999k284158
$$ plain form
2831 -18114935 -16577447 -11136191 -3858951 935799 -273463 -6323606 -12118772 -14086187
2823 -14086187 -13697060 -14679795 -17793476 -19869366 -17947572 -12923935 -8238469 -5843220
2815 -5843220 -4998355 -4934548 -6612203 -10548463 -14504918 -15643462 -14564007 -14950729 -18851571
2806 -18851571 -24004033 -26184225 -22778800 -14268163 -4451896 719283 -2281892 -9760218
2798 -9760218 -13432347 -9800907 -4077030 -2296713 -2991425 -1192089 2000080 646308
2790 646308 -5189614 -7235819 -962651 6325305 4996466 -3101606 -7207646 -2855149
2782 -2855149 2434582 32092 -9216457 -18561803 -24997127 -30532344 -36010158 -38915644
2774 -38915644 -38089783 -36973739 -39806795 -45629955 -47983152 -41475024 -28529989 -18438374
$$ packed form
2831a8114935J537488N441256P277240M794750j209262o050143n795166j967415
2823a4086187L89127r82735l113681k075890J921794N023637M685466K395249
2815e843220Q44865O3807j677655l936260l956455j138544J079455l86722l900842
2806a8851571n152462k180192L405425Q510637R816267N171179l001175p478326
2798i760218l672129L631440N723877J780317o94712J799336L192169j353772
2790F46308n835922k046205O273168P287956j328839q098072m106040M352497
2782b855149N289731k402490r248549r345346o435324n535217n477814k905486
2774c8915644Q25861J116044k833056n823160k353197O508128J2945035J0091615
$$ plain form
2766 -18438374 -18364227 -25827349 -32012573 -32180823 -29777938 -29657045 -31336152 -31749836 -31153185
2757 -31153185 -31719076 -32074481 -28313374 -20389372 -13082973 -9932998 -9966147 -11092490 -12768648
2748 -12768648 -14135401 -13575807 -12021616 -12926804 -16593554 -18189561 -14515668 -9544784
2740 -9544784 -9505537 -14952951 -21633425 -26910368 -30505747 -30324754 -23537622 -12873673 -6803712
2731 -6803712 -10619409 -20073965 -26356971 -25719665 -22232656 -22242581 -27874957 -35463908 -39250712
2722 -39250712 -36891746 -31577316 -27988082 -26495815 -23391494 -17193755 -11597084 -9721488
2714 -9721488 -8034836 -641211 10495464 14796074 5400333 -11403898 -23473111 -27328489
2706 -27328489 -29691274 -34912754 -38022584 -33524398 -24989891 -19938271 -18942570 -16811647
$$ packed form
2766a8438374P4147p463122o185224j68250K402885J20893j679107m13684N96651
2757c1153185n65891l55405L761107P924002P306399L149975l3149j126343j676158
2748a2768648j366753N59594J554191r05188l666750j596007L673893M970884
2740i544784L9247n447414o680474n276943l595379J80993O787132J0663949O069961
2731f803712l815697r454556o283006O37306L487009r925n632376p588951l786804
2722c9250712K358966N314430L589234J492267L104321O197739N596671J875596
2714i721488J686652P393625J1136675M300610r395741j6804231j2069213l855378
2706b7328489k362785n221480l109830M498186Q534507N051620R95701K130923
$$ plain form
2698 -16811647 -12722213 -11447793 -14168577 -15648735 -12966533 -10554503 -13033256 -18386228
2690 -18386228 -22145097 -23617213 -23675790 -20659467 -13394657 -5027726 830867 4905009
2682 4905009 8986554 11396479 10615751 9733364 11227565 10605072 2496765 -9027401 -14143123
2673 -14143123 -10674264 -6211962 -6582610 -9567928 -11077248 -10409992 -7759405 -3277378
2665 -3277378 -520414 -4049571 -11304579 -13736351 -8873321 -4246232 -5707152 -9067142
2657 -9067142 -8280325 -5160998 -4720940 -6534304 -7713327 -9891022 -15792653 -22204144 -23789985
2648 -23789985 -21499398 -19961069 -18623544 -13353099 -5903879 -3636023 -9008760 -16551908
2640 -16551908 -21657100 -25518784 -29282308 -30177226 -27167760 -24721679 -26242321 -28085712
$$ packed form
2698a6811647M089434J274420k720784j480158K682202K412030k478753n352972
2690a8386228l758869j472116n8577L016323P264810Q366931N858593M074142
2682D905009M081545K409925p80728q82387J494201o22493q108307j1524166n115722
2673a4143123L468859M462302l70648k985318j509320O67256K650587M482027
2665c277378K756964l529157p255008k431772M863030M627089j460920l359990
2657i067142P86817L119327M40058j813364j179023k177695n901631o411491j585841
2648b3789985K290587J538329J337525N270445P449220K267856n372737p543148
2640a6551908n105192l861684l763524q94918L009466K446081j520642j843391
$$ plain form
2632 -28085712 -25508120 -21741881 -25025988 -36856248 -48552918 -51441620 -46831153 -42683414
2624 -42683414 -42102906 -39463126 -29421167 -16270559 -9956890 -13323898 -18135847 -15763070
2616 -15763070 -7871789 -2981350 -5160020 -10672872 -14787526 -17247114 -20101968 -23335627
2608 -23335627 -24338508 -20755688 -13552861 -7401049 -6372891 -8407333 -7040411 -870022
2600 -870022 2586379 -2953177 -11801239 -12459614 -3297104 5489179 6519507 4204198 5856755
2591 5856755 10661067 13028323 12393276 13081489 16155490 17355524 13523863 6646199 231362
2582 231362 -5135926 -10680249 -15737666 -17729392 -16152063 -14858440 -18443182 -26349024
2574 -26349024 -32607404 -32440845 -27120624 -20841296 -15567008 -11903359 -12167508 -17592994
$$ packed form
2632b8085712K577592L766239l284107j1830260j1696670k888702M610467M147739
2624d2683414N80508K639780J0041959J3150608O313669l367008m811949K372777
2616a5763070P891281M890439k178670n512852m114654k459588k854854l233659
2608b3335627j002881L582820P202827O151812J028158k034442J366922O170389
2600h70022L456401n539556q848062o58375R162510Q786283J030328k315309J652557
2591E856755M804312K367256o35047O88213L074001J200034l831661o877664o414837
2582B31362n367288n544323n057417j991726J577329J293623l584742p905842
2574b6349024o258380J66559N320221O279328N274288L663649k64149n425486
$$ plain form
2566 -17592994 -23905551 -25363396 -23004611 -23047569 -26760153 -28680064 -26609078 -25977904 -30417205
2557 -30417205 -34783650 -33099823 -27809501 -24672939 -23237468 -19988769 -17266530 -19849514
2549 -19849514 -23894608 -18927759 -2839502 12965603 16954304 10336623 3050649 1602075
2541 1602075 4820422 8104184 7434918 836563 -10420703 -22041627 -29734501 -31939828
2533 -31939828 -29819017 -26372938 -25361753 -28091268 -30710093 -28055136 -21259717 -17749473
2525 -17749473 -21670393 -28022182 -29096239 -23381343 -14846636 -6871169 -1308960 -640290
2517 -640290 -5246435 -9750865 -7980819 -1701092 1164300 -2167482 -5638575 -4089070
2509 -4089070 -1069419 -3139978 -10805216 -19677739 -27182249 -32872581 -34653978 -30814867
$$ packed form
2566a7592994o312557j457845K358785m2958l712584j919911K070986O31174m439301
2557c0417205m366445J683827N290322L136562J435471L248699K722239k582984
2549a9849514m045094M966849J6088257J5805105L988701o617681p285974j448574
2541A602075L218347L283762o69266o598355j1257266j1620924p692874k205327
2533c1939828K120811L446079J011185k729515k618825K654957O795419L510244
2525a7749473l920920o351789j074057N714896Q534707P975467N562209O68670
2517f40290m606145m504430J770046O279727K865392l331782l471093J549505
2509d089070L019651k070559p665238q872523p504510n690332j781397L839111
$$ plain form
2501 -30814867 -24910489 -22555240 -23082310 -20376066 -13285848 -8981109 -12768214 -19843526
2493 -19843526 -21670497 -16802060 -10639360 -7418145 -7688080 -11730098 -19617409 -28079455
2485 -28079455 -32249213 -31032870 -27017431 -21532426 -14374875 -8145826 -7139959 -10580667
$$ packed form
2501c0814867N904378K355249n27070K706244P090218M304739l787105p075312
2493a9843526j826971M868437O162700L221215k69935m042018p887311q462046
2485b8079455m169758J216343M015439N485005P157551O229049J005867l440708
$$ [...]
##END NTUPLES=NMR SPECTRUM
##END=
