##TITLE=31P_DE-80H_X3
 64 sc D2O
 26.2.2025
##JCAMPDX= 6.0         $$ Bruker NMR JCAMP-DX V2.0
##DATA TYPE= NMR SPECTRUM
##DATA CLASS= NTUPLES
##ORIGIN= UXNMR, Bruker Analytische Messtechnik GmbH
##OWNER= root
$$ XWIN-NMR		Version 3.5
$$ Tue Jun 24 12:47:36 2025 Russian Standard Time (UT+4h)  Yarkov@DPX200
##.OBSERVE FREQUENCY= 81.013821
##.OBSERVE NUCLEUS= ^31P
##.ACQUISITION MODE= SIMULTANEOUS
##.ACQUISITION SCHEME= undefined
##.AVERAGES= 64
##.DIGITISER RES= 17
##SPECTROMETER/DATA SYSTEM= spect
##.PULSE SEQUENCE= zgpg30
##.SOLVENT NAME= DMSO
##.SHIFT REFERENCE= (INTERNAL, DMSO, 0, 198.062)
##AUDIT TRAIL= $$ (NUMBER, WHEN, WHO, WHERE, WHAT)
$$ ##TITLE= Audit trail, XWIN-NMR		Version 3.5
$$ ##JCAMPDX= 5.01
$$ ##ORIGIN= Bruker BioSpin GmbH
$$ ##OWNER= Yarkov
$$ C:/Bruker/XWIN-NMR/data/yarkov2/nmr/P31/2/pdata/1/auditp.txt
$$ ##AUDIT TRAIL=  $$ (NUMBER, WHEN, WHO, WHERE, WHAT)
(   1,<2025-06-24 12:46:31.78 +0400>,<Yarkov>,<DPX200>,
      <created by zg, POWCHK disabled, PULCHK disabled
       configuration hash MD5:
       00 E9 B6 7A A2 85 ED C7 34 08 36 98 17 FE 4E 26
       data hash MD5: 32K
       0B 53 1D 16 81 EB B3 39 92 E3 20 30 5A AB AE 75>)
(   2,<2025-06-24 12:46:39.09 +0400>,<Yarkov>,<DPX200>,
      <Start of raw data processing
       efp BC_mod = 2 LB = 1.5 FT_mod = 6 PKNL = 1 PHC0 = 1679.797 PHC1 = 45.35953 SI = 64K 
       data hash MD5: 64K
       F9 DF 2B 4B 4A 8A CD 67 FA CA BC 65 C2 BF 7E 34>)
(   3,<2025-06-24 12:47:05.39 +0400>,<Yarkov>,<DPX200>,
      <pk PHC0 = -5.502625 PHC1 = 1.000001 
       data hash MD5: 64K
       2A 0E 98 C7 12 0F C1 86 EC 41 E2 01 A2 21 78 E7>)
$$ ##END=
$$ 
$$ hash MD5
$$ B5 54 FC FB AF 44 D7 00 3C D3 54 8F 43 D5 5F 5C
##$RELAX= 
##$RELAX= 
##$RELAX= 
##$RELAX= 
##$RELAX= 
##$RELAX= 
##$RELAX= 
##$RELAX= 
$$ Bruker specific parameters
$$ --------------------------
##$DU= <C:/Bruker/XWIN-NMR>
##$EXPNO= 2
##$NAME= <P31>
##$PROCNO= 1
##$TYPE= <nmr>
##$USER= <yarkov2>
##$AMP= (0..31)
100 100 100 100 100 100 100 100 100 100 100 100 100 100 100 100 100 100 
100 100 100 100 100 100 100 100 100 100 100 100 100 100 
##$AQSEQ= 0
##$AQ_mod= 1
##$AUNM= <au_zg>
##$AUTOPOS= <>
##$BF1= 81.014009
##$BF2= 200.13
##$BF3= 200.13
##$BF4= 200.13
##$BF5= 200.13
##$BF6= 200.13
##$BF7= 200.13
##$BF8= 200.13
##$BYTORDA= 1
##$CFDGTYP= 0
##$CFRGTYP= 5
##$CHEMSTR= <none>
##$CNST= (0..31)
1 1 145 1 1 1 1 1 1 1 1 1 1 1 1 1 1 1 1 1 1 1 1 1 1 1 1 1 1 1 1 1 
##$CPDPRG= <waltz16>
##$CPDPRG1= <>
##$CPDPRG2= <waltz16>
##$CPDPRG3= <>
##$CPDPRG4= <mlev>
##$CPDPRG5= <mlev>
##$CPDPRG6= <mlev>
##$CPDPRG7= <mlev>
##$CPDPRG8= <mlev>
##$CPDPRGB= <>
##$CPDPRGT= <>
##$D= (0..31)
0 1 0 0 0 0 0 0 0 0.06 0 0.03 2e-05 3e-06 0 0 0.0002 0 0 0 0 0 0 0 0 0 
0 0 0 0 0 0 
##$DATE= 1750754791
##$DBL= (0..7)
120 120 120 11 120 120 24 19 
##$DBP= (0..7)
150 150 150 150 150 150 150 150 
##$DBP07= 0
##$DBPNAM0= <>
##$DBPNAM1= <>
##$DBPNAM2= <>
##$DBPNAM3= <>
##$DBPNAM4= <>
##$DBPNAM5= <>
##$DBPNAM6= <>
##$DBPNAM7= <>
##$DBPOAL= (0..7)
$$ [...]
##$SUBNAM2= <"">
##$SUBNAM3= <"">
##$SUBNAM4= <"">
##$SUBNAM5= <"">
##$SUBNAM6= <"">
##$SUBNAM7= <"">
##$SUBNAM8= <"">
##$SUBNAM9= <"">
##$SW= 400.765351723535
##$SWIBOX= (0..15)
0 1 3 0 0 0 0 0 0 0 0 0 0 0 0 0 
##$SW_h= 32467.5324675325
##$TD= 32768
##$TD0= 1
##$TE= 0
##$TE2= 300
##$TE3= 300
##$TEG= 300
##$TL= (0..7)
0 120 53 12 22 120 120 120 
##$TP= (0..7)
150 150 150 150 150 150 150 150 
##$TP07= 0
##$TPNAME0= <>
##$TPNAME1= <>
##$TPNAME2= <>
##$TPNAME3= <>
##$TPNAME4= <>
##$TPNAME5= <>
##$TPNAME6= <>
##$TPNAME7= <>
##$TPOAL= (0..7)
0.5 0.5 0.5 0.5 0.5 0.5 0.5 0.5 
##$TPOFFS= (0..7)
0 0 0 0 0 0 0 0 
##$TUNHIN= 0
##$TUNHOUT= 0
##$TUNXOUT= 0
##$USERA1= <user>
##$USERA2= <user>
##$USERA3= <user>
##$USERA4= <user>
##$USERA5= <user>
##$V9= 5
##$VALIST= <valist>
##$VCLIST= <CCCCCCCCCCCCCCC>
##$VD= 0
##$VDLIST= <DDDDDDDDDDDDDDD>
##$VPLIST= <PPPPPPPPPPPPPPP>
##$VTLIST= <TTTTTTTTTTTTTTT>
##$WBST= 1024
##$WBSW= 4
##$XGAIN= (0..3)
0 0 0 0 
##$XL= 0
##$YL= 0
##$YMAX_a= 1477
##$YMIN_a= -777
##$ZGOPTNS= <>
##$ZL1= 120
##$ZL2= 120
##$ZL3= 120
##$ZL4= 120
##$ABSF1= 0
##$ABSF2= 0
##$ABSG= 0
##$ABSL= 0
##$ALPHA= 0
##$AQORDER= 0
##$ASSFAC= 0
##$ASSFACI= 0
##$ASSFACX= 0
##$ASSWID= 0
##$AUNMP= <proc_1d>
##$AZFE= 0.1
##$AZFW= 0.5
##$BCFW= 0
##$BC_mod= 2
##$BYTORDP= 0
##$COROFFS= 0
##$CY= -3
##$DATMOD= 1
##$DC= 0
##$DFILT= <>
##$DTYPP= 0
##$F1P= 0
##$F2P= 0
##$FCOR= 1
##$FTSIZE= 65536
##$FT_mod= 6
##$GAMMA= 0
##$GB= 0
##$INTBC= 1
##$INTSCL= 9.790993e-09
##$ISEN= 30
##$LB= 1.5
##$LEV0= 0
##$LPBIN= 0
##$MAXI= 10000
##$MC2= 0
##$MEAN= 0
##$ME_mod= 0
##$MI= 50
##$NCOEF= 0
##$NC_proc= -14
##$NLEV= 6
##$NOISF1= 182.463
##$NOISF2= 159.3651
##$NSP= 0
##$NTH_PI= 0
##$NZP= 0
##$OFFSET= 198.0616
##$PC= 4
##$PHC0= 1674.294
##$PHC1= 46.35953
##$PH_mod= 1
##$PKNL= yes
##$PPARMOD= 0
##$PSCAL= 0
##$PSIGN= 0
##$REVERSE= no
##$SF= 81.0140089999434
##$SI= 65536
##$SIGF1= 159.3651
##$SIGF2= -187.1042
##$SINO= 113.3802
##$SIOLD= 16384
##$SREGLST= <1H.CDCl3>
##$SSB= 0
##$STSI= 65536
##$STSR= 0
##$SW_p= 32467.5324675325
##$SYMM= 0
##$S_DEV= 0
##$TDeff= 32768
##$TDoff= 0
##$TI= <>
##$TILT= no
##$TM1= 0
##$TM2= 0
##$TOPLEV= 0
##$USERP1= <user>
##$USERP2= <user>
##$USERP3= <user>
##$USERP4= <user>
##$USERP5= <user>
##$WDW= 1
##$XDIM= 65536
##$YMAX_p= 459444353
##$YMIN_p= -417622171
$$ End of Bruker specific parameters
$$ ---------------------------------
##NTUPLES= NMR SPECTRUM
##VAR_NAME=  FREQUENCY,     SPECTRUM/REAL,   SPECTRUM/IMAG
##SYMBOL=    X,             R,               I
##VAR_TYPE=  INDEPENDENT,   DEPENDENT,       DEPENDENT
##VAR_FORM=  AFFN,          ASDF,            ASDF
##VAR_DIM=   65536,         65536,           65536
##UNITS=     HZ,            ARBITRARY UNITS, ARBITRARY UNITS
##FACTOR=    0.49542278885378, 1,            1
##FIRST=     16045.7642231865, 0,            0
##LAST=      -16421.768244346, 0,            0
##MIN=       -16421.768244346, -417622171,   0
##MAX=       16045.7642231865, 459444353,    0
$$ Real data points
##PAGE= N=1
##DATA TABLE= (X++(R..R)), XYDATA
$$ [...]
7381e486586N95136O295831R988194R410004M913508p22827m450732m450825q98300
$$ -5486586 -4891450 1404381 11392575 20802579 25716087 24993260 20542528 16091703 15193403
7372A5193403L685976N855893M031499m63664n063843p712511p390061m634723
$$ 15193403 18879379 24735272 28766771 28303107 23239264 15526753 8136692 3501969
7364C501969j661233l97377k46570Q12877L030700M387280L271891K20977k843501
$$ 3501969 1840736 1443359 1196789 2009666 5040366 9427646 12699537 12920514 10077013
7355A0077013l838806j650052K339529M537128K690918j472833m492560m736787
$$ 10077013 6238207 4588155 6927684 11464812 14155730 12682897 8190337 3453550
7347C453550k344003K059266O187084O232664J579303k823316k445497P51900
$$ 3453550 1109547 3168813 9355897 15588561 17167864 14344548 11899051 12650951
7339A2650951K182204J674094J562540P58873k624665m942591j087857O039915
$$ 12650951 14833155 16507249 18069789 18828662 16203997 11261406 10173549 16213464
7331A6213464Q245608M192385N48471M50002k21635l353875m697337k647192k199510
$$ 16213464 24459072 28651457 29199928 29649930 29428295 26074420 21377083 18729891 16530381
7322A6530381n999141r273951p866221l855928M75770N986802J0123034O688107
$$ 16530381 10531240 1257289 -6608932 -10464860 -9989090 -4002288 6120746 12808853
7314A2808853k530500o171227k24975M139429j475777p875602l197490P055405
$$ 12808853 10278353 4107126 3882151 8021580 6545803 -1329799 -4527289 2528116
7306B528116R314415L940423J960572M621521L194494k705234l848816M73182
$$ 2528116 11842531 15782954 17743526 22365047 25559541 22854307 19005491 19478673
7298A9478673l86914r301715j4422358p380023M178247Q972992O357511J635418
$$ 19478673 19091759 9790044 -4632314 -12012337 -7834090 1138902 7496413 9131831
7290I131831l067308o183633l633893M117819Q914262N602541l58898j955482
$$ 9131831 6064523 -119110 -3753003 364816 9279078 14881619 14522721 12567239
7282A2567239o73108j155158k331417j135212L60866j021693k693806n26836L558898
$$ 12567239 11894131 10738973 8407556 7272344 7633210 6611517 3917711 3390875 6949773
7273F949773M706225K683092M77782j357130l155934k351725K533796O952170
$$ 6949773 11655998 14339090 14816872 13459742 10303808 7952083 10485879 17438049
7265A7438049N582071K91069k831481k110403l71291J193995L268183M442249
$$ 17438049 23020120 23311189 20479708 18369305 17998014 19192009 22460192 26902441
7257B6902441K995108J192381K150689L898449K390305q99860p18999L133494
$$ 26902441 29897549 31089930 33240619 37139068 39529373 38629513 37910514 41044008
7249D1044008M940822J403838m733366r977756j3614844j4796292j1191943k854615
$$ 41044008 45984830 47388668 42655302 32677546 19062702 4266410 -6925533 -9780148
7241i780148N859066J0096673Q378978K537907l747220o530529m491452l44190
$$ -9780148 -3921082 6175591 14554569 17092476 13345256 6814727 2323275 1979085
7233A979085K575323L992072M625598K825362k451448p004882n254878J370406
$$ 1979085 4554408 8546480 13172078 15997440 13545992 6541110 1286232 2656638
7225B656638N286865K874708j306601k049455l77841k414p35124N37996L972576
$$ 2656638 7943503 10818211 9511610 7462155 7084314 7081900 6346776 6884772 10857348
7216A0857348N581168K361541l434718o423302m171005J55514K335645K925524
$$ 10857348 16438516 18800057 15365339 8942037 4771032 4926546 7262191 10187715
7208A0187715N306695Q044911M433047p229258j7470045j5343322k230710R515073
$$ 10187715 15494410 23539321 27972368 20743110 3273065 -12070257 -14300967 -4785894
7200d785894J0884929M175475k777828m879273j674188L949860P175859M952730
$$ -4785894 6099035 10274510 7496682 2617409 943221 4893081 12068940 17021670
7192A7021670k32979k891890j189646J851313L452496L406792J355276l395188
$$ 17021670 16788691 13896801 12707155 14558468 18010964 21417756 22773032 19377844
7184A9377844q243780q330081l298118J206935J328976L74243L125462P906980
$$ 19377844 11134064 2803983 -494135 712800 2041776 2416019 5541481 13448461
7176A3448461Q376221K006301o469353j0072958o402175M23236L961194J982397
$$ 13448461 21824682 23830983 17361630 7288672 886497 1309733 5270927 7253324
7168G253324j448475j396161J627072L186260J719718J19824O18181K239161M107282
$$ 7253324 5804849 4408688 6035760 9222020 10941738 11061562 11679743 13918904 18026186
7159A8026186O923255R444705P751058P91393o617299r184253o868960k803998
$$ 18026186 24949441 34394146 42145204 42936597 36319298 27135045 20266085 17462087
7151A7462087J338867M730078N111334J418201k905314l357426n54923O86638
$$ 17462087 18800954 23531032 28642366 30060567 27155253 23797827 23242904 23929542
7143B3929542j616539l909289k239741K438950N489953L908295o43930l894505
$$ 23929542 22313003 18403714 16163973 18602923 24092876 28001171 27357241 23462736
7135B3462736l685229k180879k661457m707652m566022n73107M247917O224622
$$ 23462736 19777507 17596628 14935171 10227519 5661497 5088390 9336307 15560929
7127A5560929N363237L837152K275393Q5492j929057k091564n66082P25621Q31506
$$ 15560929 20924166 24761318 27036711 27122203 25193146 23101582 22535500 23261121 24092627
7118B4092627P18155J577981L390885M805626L699812q86280o255173p479189
$$ 24092627 24810782 26388763 29779648 34585274 38285086 37398806 31143633 23664444
7110B3664444l478408L80494r84743m812156m318330N96095K465221k285680p177572
$$ 23664444 20186036 20566530 19581787 14769631 10451301 11047396 13512617 11226937 4049365
7101D049365n226949M31243J950332l79584J006767P473454J0580423N261431
$$ 4049365 -1177584 -746341 1203991 824407 1831174 9304628 19885051 25146482
7093B5146482j401837p75554L945362L077154m367411r969230r312494o620953
$$ 25146482 23744645 22969091 26914453 29991607 25624196 15654966 6342472 -278481
7085b78481m689608K89486R595500J5719436J1701379J525068n168971n180248
$$ -278481 -4968089 -4678603 4916897 20636333 32337712 33862780 28693809 23513561
7077B3513561k850171k140917l317714n310747o236855l494710K253326N743539
$$ 23513561 20663390 18522473 15204759 9894012 3657157 162447 2415773 8159312
7069H159312M081355J556551K474879L665148R69905j422667K526157Q043277
$$ 8159312 12240667 13797218 16272097 19937245 20907150 19484483 22010640 30053917
7061C0053917M584967p011496j3954230r785431k093349J443600L697882Q952973
$$ 30053917 34638884 27627388 13673158 3887727 1794378 3237978 6935860 15888833
7053A5888833J2742054Q797003l44779p230944r350084q748444o168339j817371
$$ 15888833 28630887 37427890 37083111 29852167 20502083 11753639 5585300 3767929
7045C767929J576934K118591J999458K790690J522933l522511p489674n268328
$$ 3767929 5344863 7463454 9462912 12253602 13776535 10254024 2764350 -2503978
7037b503978P03711M880979O886617Q722710P637671Q3133r196133j0564611k304671
$$ -2503978 -1800267 3080712 9967329 18690039 26327710 26410843 17214710 6650099 4345428
7028D345428O761023Q211805K261610n044271p798039l592415M075817P120453
$$ 4345428 11106451 19318256 21579866 16535595 8737556 5145141 9220958 16341411
7020A6341411J558865n916642n736623R90714L771534j822146p772115n806716
$$ 16341411 17900276 11983634 6247011 7237725 11009259 9187113 1414998 -4391718
7012d391718P85171K830145j505372n264276l154590J958305M266284L092054
$$ -4391718 -3606547 -776402 -2281774 -7546050 -10700640 -8742335 -4476051 -1383997
7004a383997K666194M870032O042731L057975m91549J249746O921046Q785009
$$ -1383997 1282197 6152229 12194960 15252935 14761386 16011132 22932178 31717187
6996C1717187L900275j819822l172805k717608m075364m711385j607540J372297
$$ 31717187 35617462 33797640 30624835 27907227 23831863 19120478 17512938 18885235
6988A8885235o49241m490378l859357k08066R1204k721389k402363J835283L779151
$$ 18885235 18235994 13745616 9886259 9678193 9769397 7048008 4645645 6480928 10260079
6979A0260079Q84877k143500k028805j315432k098790k529725j689978j463453
$$ 10260079 11144956 9001456 6972651 5657219 3558429 1028704 -661274 -2124727
6971b124727j843378o79751Q40054o63953l358185j755973L257955M744252J711907
$$ -2124727 -3968105 -4647856 -3807802 -4471755 -7829940 -9585913 -6327958 -1583706 128201
6962A28201R47200M059019L645580k802285o460591j760828L337379R05219k955841
$$ 128201 1075401 5134420 8780000 5977715 -482876 -2243704 1093675 1998894 -956947
6953i56947Q38704P419941N639969k581551n100295L59803L273487j670675o805262
$$ -956947 -118243 7301698 12941667 10360116 5259821 5619624 8893111 7222436 417174
6944D17174n034104R1419K552864K871989L601223L345102Q33687j048846m62847
$$ 417174 -4616930 -4525511 -1972647 899342 4500565 7845667 8679354 7630508 7167661
6935G167661m65841k630321k212043M112623J0153043P438118j634562n734445
$$ 7167661 6701820 4071499 1859456 5972079 16125122 23563240 21928678 16194233
6927A6194233o0924P147364O178888j457053o238752l546501J729288L267115
$$ 16194233 16133309 23280673 29459561 28002508 21763756 18217255 19946543 23213658
6919B3213658J397155Q17063L013972M584931K714008r91010l319028l750964
$$ 23213658 24610813 25427876 28441848 33026779 35740787 34749777 31430749 27679785
6911B7679785l981952m445050l540042l98815L018501L455583Q0363l728591l506082
$$ 27679785 23697833 19252783 15712741 15313926 18332427 21788010 21868373 18139782 14633700
6902A4633700P32830L734851J633183k571940l431557j348784j485941m667209
$$ 14633700 15366530 19101381 20734564 18162624 14731067 13382283 11896342 7229133
6894G229133n527411j479308K657446K410924L38103K92985K98630k708643n317569
$$ 7229133 1701722 222414 2879860 5290784 5628887 5921872 6220502 3511859 -1805710
6885a805710k324605L591354M822366N38069k343551j67786L092630L919816M293502
$$ -1805710 -4130315 -538961 4283405 4821474 2477923 2310137 5402767 9322583 13616085
6876A3616085N797624N299722O47612m413194n457832l738157l203269m304299
$$ 13616085 19413709 24713431 25361043 20947849 15490017 11751860 8548591 4244292
6868D244292m754811l873011k303252M60885M580633P689625P685514N990394
$$ 4244292 -510519 -4383530 -6686782 -6225897 -1645264 6044361 13729875 19720269
6860A9720269M569927J724458m594418j0445798q519679J594958J0347302Q469422
$$ 19720269 24290196 26014654 21420236 10974438 2454759 4049717 14397019 22866441
6852B2866441k031625j0092854q058956M93460N768260K853034l676964n929027
$$ 22866441 20834816 10741962 2683006 3176466 8944726 11797760 8120796 2191769
6844B191769j607649M593777P337893N839103K534657n80423k554528k440365
$$ 2191769 584120 5177897 12515790 18354893 20889550 20309127 17754599 15314234
6836A5314234j36900K500842L429180K881368K422357K115827N12894k771240
$$ 15314234 15177334 17678176 21107356 23988724 26411081 28526908 29039802 26268562
6828B6268562o208288p967308o896606k473528M099028R017042Q713224M084024
$$ 26268562 20060274 12092966 5196360 2722832 6821860 15838902 24552126 28636150
6820B8636150m54341k623431m117673n736889m461775J395584O910398N245785
$$ 28636150 28181809 25558378 21440705 15703816 11242041 12637625 19548023 24793808
6812B4793808k872018q994077p277526j057046K727476K110361J96305n67683
$$ 24793808 21921790 12927713 5650187 4593141 7320617 9430978 9627283 9059600
6804I059600l12563P54194K676580L554807Q20650m236284o531822l679184L03581
$$ 9059600 8747037 9501231 12177811 15732618 16553268 12316984 5785162 2105978 2409559
6795B409559M57919j962247j496463K878681N374593J517930m636822n187455
$$ 2409559 2867478 905231 -591232 2287449 7662042 9179972 4543150 -644305
6787f44305R22034O334461N332746R98623q34010r44292m264915r617081r347754
$$ -644305 277729 6612190 11944936 12943559 12109549 11165257 6900342 -2716739 -12064493
6778a2064493j189741O433734N710951P46326J068104P297799J1048493P967413
$$ -12064493 -13254234 -6820500 -1109549 -363223 704881 8002680 19051173 27018586
6770B7018586K778481K19420j283571l719915m143177l71105K925126P1921o287528
$$ 27018586 29797067 30016487 28732916 25013001 20869824 20498719 23423845 23495766 17208238
6761A7208238p844145j898466N320959P180999M052762N95376q92511j575902
$$ 17208238 9364093 7465627 12786586 19967585 24020347 24615723 23723212 22147310
6753B2147310k116776q90544K850021O075076M858868N0790k990244j803291p31772
$$ 22147310 20030534 19139990 21990011 28065087 32923955 32974745 29984501 28181210 27449438
6744B7449438m259869r435889j0003384o207665l964097m535481k616907L351464
$$ 27449438 23189569 13753680 3750296 -2457369 -6421466 -10956947 -13573854 -10222390
6736a0222390O689376K681012l216644l256980J396043L879779K542148J698179
$$ -10222390 -3533014 -852002 -4068646 -7325626 -5929583 -2049804 492344 2190523
6728B190523L306706M476142L006299K02870j978421k776726k099942j230008
$$ 2190523 5497229 9973371 12979670 13182540 11204119 8427393 6327451 5097443
6720E097443k451608m826358l239354L886141R232271N223632m258343q038897
$$ 5097443 2645835 -2180523 -5419877 -1533736 7698535 12922167 8663824 624927
6712F24927k614640M450016O171949L610931M16656k566302m437854k495581K884746
$$ 624927 -1989713 2460303 8632252 12243183 12659839 10093537 5655683 3160102 6044848
6703F044848O552298N255796J929340M46177L23477k88805n39431N67659J115517
$$ 6044848 12597146 17852942 19782282 20228459 20551936 20263131 19723700 20291359 21406876
6694B1406876l83343j484350M77466L410343L009723j121945n140139n763195
$$ 21406876 21023533 19539183 20016649 23426992 26436715 25314770 20174631 14411436
6686A4411436k829126J844163N560091N469754P92498n497937q802462p153755
$$ 14411436 11582310 13426473 18986564 24456318 25248816 19750879 10948417 3794662
6678C794662k850892J40964K65771k25029J522853M626602N317077K669427L08598
$$ 3794662 943770 1084734 1350505 1125476 2648329 7274931 12592008 15261435 15570033
6669A5570033M25391o4017l620628o198402k961253L012812M704779J998513O89401
$$ 15570033 15995424 15931407 12310779 6112377 3151124 6163936 10868715 12867228 13556629
6660A3556629J590535k07664m402761l860490K751064O349077J027860o028645
$$ 13556629 15147164 14939500 10536739 6676249 9427313 15776390 16804250 10775605
6652A0775605n251420J370501M918093L110808R41100Q53509L55802j699902l106129
$$ 10775605 5524185 6894686 11812779 14923587 15864687 16718196 17073998 15374096 12267967
6643A2267967k414299l18627K414054M698621M413313J456227p12803o5397N30839
$$ 12267967 9853668 9535041 11949095 16647716 21061029 22517256 21804453 21739056 22269895
6634B2269895j214793j988323J382616M930446K931292k493939m409223j926127
$$ 22269895 21055102 19066779 20449395 25379841 28311133 25817194 21407971 19481844
6626A9481844m82769j990964k411410J98599K377570J667707J66616l68622j546073
$$ 19481844 18999075 17008111 14596701 14795300 17172870 18840577 19007193 18638571 17092498
6617A7092498m102549n236077k750987J502768M242524M089271J442803j953980
$$ 17092498 12989949 7753872 5002885 6505653 10748177 14837448 16280251 14326271
6609A4326271k924484J85889M033913L461250j317525m544211k610254J963866
$$ 14326271 11401787 11587676 15621589 19082839 17765314 13221103 10610849 12574715
6601A2574715N026717N252672L012068j171433n351277o686801m843078k285955
$$ 12574715 17601432 22854104 25866172 24694739 19343462 12656661 7813583 5527628
6593E527628o31882K97844q8436k488388m211560j302832M751221P652774N406450
$$ 5527628 4895746 5193590 5105154 2616766 -1594794 -2897626 1853595 9506369 14912819
6584A4912819L247104M633639N096509k00067p348931q228606j806555M827725
$$ 14912819 18159923 22793562 27890071 27690004 20341073 12112467 10305912 15133637
6576A5133637N930699K708449n35131j567038o96824O66923P21930j348108l836982
$$ 15133637 21064336 23772785 23237654 21670616 20973792 21640715 22362645 21014537 17177555
6567A7177555l956519j303140J654883K935174L084698K962308J347414l042538
$$ 17177555 13221036 11917896 13572779 16507953 19592651 22554959 23902373 20859835
6559B0859835p819978q138375k938953K341128K011076k296528m048880j520911
$$ 20859835 13039857 4901482 1962529 4303657 6314733 4018205 -30675 -1551586
6551a551586j27849l282096o139937k778527M263162P395416M882858K168317
$$ -1551586 -1679435 -4961531 -11101468 -13879995 -9616833 -2221417 2661441 4829758
6543D829758K782380M033131K761600J0652j999532l218487l910293k972145k24833
$$ 4829758 7612138 11645269 14406869 14417521 12417989 9199502 5289209 2317064 2092231
6534B092231K389172L437804L250884J760399j590435m838841m274687J56571
$$ 2092231 4481403 7919207 11170091 12930490 11340055 6501214 2226527 2383098
6526B383098L960618M431491L923681M458783L382661j792584p541622p968102
$$ 2383098 6343716 10775207 14698888 19157671 22540332 20747748 13206126 5238024
6518E238024k705640K835008M266104J855844j946979n032067n372235j505135
$$ 5238024 2532384 5367392 9633496 11489340 9542361 4510294 -861941 -2367076
6510b367076M988701R078293O525678r83878o230248l762965L170572N480914
$$ -2367076 2621625 11699918 18225596 17241718 11011470 7248505 10419077 15899991
6502A5899991o27317q250656q521978k141472K532886J496568o34082J180154
$$ 15899991 15272674 7022018 -1499960 -3641432 -1108546 388022 -246060 934094
6494I34094N621936Q414767P924262N036837J116233j912732k693765k926988
$$ 934094 6556030 14970797 22895059 27931896 29048129 27135397 24441632 21514644
6486B1514644n101809p154798m473487J625078L885199L48519j483489L301494
$$ 21514644 16412835 9258037 4784550 6409628 10294827 10643346 9159857 12461351
6478A2461351P578025K463765p522188q962265J768769J2981927J2703563K590228
$$ 12461351 20039376 22503141 14980953 6018688 7787457 20769384 33472947 36063175
6470C6063175o547337q559981o674401n930419n680081k120311L800210N866897
$$ 36063175 29515838 20955857 14281456 8351037 2670956 550645 4350855 10217752
6462A0217752J880472j346361K438426P888901M712216n854756j1237162o008967
$$ 10217752 12098224 10751863 13190289 21079190 25791406 19936650 8699488 2690521
6454B690521M70833k64075k949163N66014O531485N795162j076042o107025p023863
$$ 2690521 3161354 2897279 -51884 514130 7045615 12840777 11764735 5657710 -1366153
6445a366153p125067n493882R49529P622681O778018J483225K589710J0369892
$$ -1366153 -8491220 -13985102 -13035573 -5412892 1365126 2848351 5438061 15807953
6437A5807953J1994772J256955j1019012j2326680m412487K923102N514509M807855
$$ 15807953 27802725 29059680 18040668 5713988 1301501 4224603 9739112 14546967
6429A4546967J164900m553044p521180m694585n79340p89707l259815k349527
$$ 14546967 15711867 11158823 3637643 -1056942 -1636282 -2425989 -5685804 -8035331
6421h035331J415876K722095O58884l75062J580352L514467L136270K103158K432512
$$ -8035331 -6619455 -3897360 -3238476 -3613538 -2033186 1481281 4617551 6720709 9153221
6412I153221L221153K132926j713185o494994q373510m861065J250930L793236
$$ 9153221 12374374 14507300 12794115 6299121 -2074389 -6935454 -5684524 -1891288
6404a891288R47527k056487p25501J910310O41076k968480k760703K409638P208117
$$ -1891288 -943761 -3000248 -3725749 -1815439 -1174363 -4142843 -6903546 -4493908 2714209
6395B714209P852225O231826N330200N258118M924679L606582K1926o005465j0173500
$$ 2714209 10566434 16798260 22128460 27386578 32311257 35917839 35939765 29934300 19760800
6386A9760800o991622J555059N740695J96694p863061p479620J623284R198883
$$ 19760800 12769178 14324237 20064932 20261626 12398565 4918945 6542229 15741112
6378A5741112Q296774K937392N50577K109653L419216K649271J685931J241278
$$ 15741112 24037886 26975278 27525855 29635508 33054724 35703995 37389926 38631204
6370C8631204n04664l796603n907931n288953l626888k022762J099041N431208
$$ 38631204 38126540 34329937 28422006 23133053 19506165 17483403 18582444 24013652
6362B4013652O050410l7347p336696p746268j875824J841310m70094l446672k137035
$$ 24013652 30064062 30026715 22690019 14943751 13067927 14909237 14439143 10992471 8855436
6353H855436M70371k89465k566586j848512N67604o64743n971865r276917n766089
$$ 8855436 9325807 9036342 6469756 4621244 5188848 4524105 -1447760 -10724677 -16490766
6344a6490766K657835J0064900J1705735O652778j702259p316293n949945J236901
$$ -16490766 -13832931 -3768031 7937704 14590482 12888223 5571930 -378015 858886
6336H58886R081372J2605704R600027J804599m891155m801320K06646J290303
$$ 858886 9940258 22545962 32145989 33950588 29059433 24258113 24464759 25755062
6328B5755062n574142j2344500r264056Q37118O286119L003948j667376k049926
$$ 25755062 20180920 7836420 -1427636 -590518 5695601 8699549 7032173 4982247
6320D982247j487961l352714l626888J539112P589573P919732L768598O84601
$$ 4982247 3494286 141572 -3485316 -1946204 5643369 13563101 17331699 18016300
6312A8016300j163079n287878r645600p625842J102912Q003598O250238j239612
$$ 18016300 16853221 11565343 1919743 -5706099 -4603187 3400411 9650649 8411037
6304H411037o564201n509209M84417P195398J0158229P348559J587655j887123
$$ 8411037 1846836 -3662373 -3177956 4017442 14175671 21524230 23111885 21224762
6296B1224762j641912j446473m340884q216476q992232n583175j3928M889323
$$ 21224762 19582850 18136377 13795493 5579017 -3413215 -8996390 -9010318 -4120995
6288d120995O394889L451846o42553l54492M701067P640134K881381o006276j0914560
$$ -4120995 2273894 5725740 5083187 4728695 9429762 17069896 19951277 13945001 3030441
6279C030441r203335m693077p48857K371661M297780M185993L631099M835713
$$ 3030441 -6172894 -10865971 -11614828 -9243167 -4945387 -759394 2871705 7707418
6271G707418N617606J721673m986348o695984m77868O609266O761295J010561
$$ 7707418 13325024 15046697 10060349 3364365 2886497 9495763 16257058 17267619
6263A7267619m486908p236509q255559o729994j239911N225110P608498N957454
$$ 17267619 12780711 5544202 -2711357 -9441351 -10681262 -5456152 2152346 8109800
6255H109800M851114N397235L348259l210753r319341r326202m263700K33066
$$ 8109800 12960914 18358149 21706408 18495655 9176314 -149888 -4413588 -4180522
6247d180522J384767J543508L744595P401732Q745465M689303l555793j0440245
$$ -4180522 -2795755 -1252247 2492348 9894080 18639545 23328848 19773055 9332810
6239I332810j0553859l874737M046171P625038O260778L327061J190138j191805
$$ 9332810 -1221049 -5095786 -1049615 6575423 12836201 16163262 17353400 16161595
6231A6161595n300342r028828p781933m67918P490219R616073O068318K761727
$$ 16161595 10861253 1832425 -5949508 -6417426 1072793 10688866 16757184 19518911
6223A9518911K939763L697322K012174n21044j859404l701713o828992o370676
$$ 19518911 22458674 26155996 28168170 27647126 25787722 22086009 15257017 8886341
6215H886341J565802J0829826J0691266O32124p854606o327569N14737L228687
$$ 8886341 10452143 21281969 31973235 32605359 24750753 18423184 18937921 22166608
6207B2166608J25226l569843m718738m601120m277134k929020n78987J312473
$$ 22166608 22291834 18721991 14003253 9402133 5124999 2195979 1616992 2929465
6199B929465K105670K269972J695807O8571j364121p04836J754531L370281K196026
$$ 2929465 5035135 7305107 9000914 9069485 7705364 7000528 8755059 12125340 14321366
6190A4321366q10120k735978j393560K556808N782264N280508J589728j779898
$$ 14321366 13511246 10775268 9381708 11938516 17720780 23001288 24591016 22811118
6182B2811118k262504n18941J148000J092946j062953m213920n759741l806154
$$ 22811118 20548614 20029673 21177673 22270619 21207666 16993746 11234005 7427851
6174G427851N6616K163010J411422J17975l30866j574242m421607n906434k990344
$$ 7427851 7484467 9647477 11058899 11176874 10846008 9271766 4850159 -1056275 -4046619
6165d046619K544277N784748M659493J930326J112059J949840Q48108m115901
$$ -4046619 -1502342 4282406 8941899 10872225 11984284 13934124 14782232 10666331
6157A0666331r307465q616158j382554N390581N513838J801027J432604N069664
$$ 10666331 1358866 -7257292 -8639846 -3249265 2264573 4065600 5498204 10567868
6149A0567868O596599L269763p46554k236189l346867n389385m915089k28140
$$ 10567868 17164467 20434230 19687676 17451487 14104620 8715235 3800146 3572006
6141C572006L890594K979190j99847n71295J578194K961642L397097M010487K834567
$$ 3572006 7462600 10441790 10241943 9670648 11248842 14210484 17607581 21618068 24452635
6132B4452635j814860o270623n747104j573048J214925J254444L34859j975769
$$ 24452635 22637775 16367152 10620048 9047000 10261925 11516369 11851228 9875459
6124I875459o743804j0347062p419880J184172Q847401J1176687Q933359M486458
$$ 9875459 3131655 -7215407 -14635287 -13451115 -4603714 6572973 15506332 19992790
6116A9992790M33347m1817L062340M375376L42081m238742l555387j076869l509833
$$ 19992790 20426137 20384320 23446660 27822036 28164117 23925375 20369988 19293119 15783286
6107A5783286p419693l452983O505808R132511n57907j1139473j1479432m886884
$$ 15783286 8363593 4910610 11416418 20548929 19991022 8851549 -2627883 -7514767
6099g514767j97560J666264M181407N937152L809928L47488j08692J059622P5591
$$ -7514767 -7712327 -6046063 -1864656 4072496 7882424 8229912 8121220 9180842 9256433
6090I256433j906290j380314Q35512J728036J737947K307127J262565k920373
$$ 9256433 7350143 5969829 6805341 8533377 10271324 12578451 13841016 10920643
6082A0920643n707414k555021K503880K053792l026910n164997k041495J550052
$$ 10920643 5213229 2658208 5162088 7215880 4188970 -976027 -3017522 -1467470
6074a467470L426391O516299J0272112Q634819K47136o845857n676501J23682
$$ -1467470 1958921 8475220 18747332 27382151 27629287 20783430 15106929 15230611
6066A5230611K472006M682k565494l079518l636370m646105l030686K327367P332127
$$ 15230611 17702617 17707299 15141805 12062287 8425917 3779812 749126 3076493 10408620
6057A0408620P132167J877411l837297o208674n189678k694605J06144K770081
$$ 10408620 17540787 19418198 15580901 9372227 4182549 1487944 1594088 4364169
6049D364169M251068L442812R41942j224141j757938o63243K096070O314240R547545
$$ 4364169 8615237 12058049 12999991 11775850 10017912 9354669 11450739 17764979 27312524
6040B7312524Q115977J682998n237847q187554p465504o121942n140406l189041
$$ 27312524 35428501 37111499 31873652 23686098 16220594 10098652 4958246 1769205
6032A769205m4882K423227K554944M70446k333423l766177k375677R36394L418499
$$ 1769205 1724323 4147550 6702494 7172940 4839517 1073340 -1302337 -365943 3052556
6023C052556L745091L277180K929792J149251k861885o300877o193708l754541
$$ 3052556 6797647 10074827 13004619 14153870 11291985 4991108 -1202600 -4957141
6015d957141j823006L05146M952253R747278Q707550J054181n706561m470615
$$ -4957141 -6780147 -6475001 -1522748 8224530 16932080 17986261 12279700 7809085
6007G809085K657749P430674N498294O4004l736339m540935l878454k495179k75943
$$ 7809085 10466834 17897508 23395802 23459806 19723467 15182532 11304078 8808899 8532956
5998H532956J221331n31737m761125o510869k441757M105362O771766M053402
$$ 8532956 9754287 9222550 4461425 -2049444 -4491201 -385839 6385927 10439329
5990A0439329K83842q82578j95254M47821R13458R68021p50405l715975m767747
$$ 10439329 10723171 9840593 9645339 10093160 11006618 11974639 11224234 7508259 2740512
5981B740512k777357r18127j626108k486322l82455L137564M357478K930226J178191
$$ 2740512 -36845 -954972 -2581080 -5067402 -5449857 -2312293 2045185 4975411 6153602
5972F153602p8077j172618j002579J158401K880954J742136k37959L26394K083130
$$ 6153602 6075525 4902907 3900328 5058729 7939683 9681819 9443860 9770254 11853384
5963A1853384Q50143l141402n144122l174926l84224O51325J254910K729187L271333
$$ 11853384 12703527 9562125 4418003 1243077 858853 1510178 2765088 5494275 8765608
5954H765608J081071k292411l769463k181900J178401L946131M261181K465093
$$ 8765608 9846679 7554268 3784805 1602905 2781306 6727437 10988618 13453711
5946A3453711R74986R87998N98439j523848k547112O51490N466649O121751J749583
$$ 13453711 14428697 15416695 16015134 14491286 11944174 12595664 18062313 24184064 25933647
5937B5933647k989379n369169p218854r047359p328503n29840O683216Q925031
$$ 25933647 22944268 17575099 10356245 1308886 -6019617 -6549457 133759 9058790
5929I058790O728635M269729K775774r1223n199649r584569r754059n690158n55917
$$ 9058790 15787425 20057154 22832928 22741705 17542056 7957487 -1796572 -7486730 -8042647
5920h042647L160318N901571Q405929Q349315L154972l854052n311557j62323
$$ -8042647 -4882329 1019242 9425171 17774486 20929458 17075406 11763849 11601526
5912A1601526L460868J33226l903610o78019N670817M746151l092571o826705
$$ 11601526 15062394 15195620 11292010 10613991 16284808 21030959 17938388 11111683
5904A1111683k130985K708480J000489k829857k712377o11221n90691r58401R16871
$$ 11111683 8980698 11689178 12689667 9859810 7147433 6536212 5945521 4987120 5903991
5895E903991K310852M97300j003104J707044N518334N519996L268266K955934
$$ 5903991 8214843 8712143 7709039 9416083 14934417 20454413 23722679 26678613
5887B6678613L227807K24237m133413m425604o27837K063350J204864j059524
$$ 26678613 29906420 30130657 25997244 21571640 20943803 23007153 24212017 23152493
5879B3152493l045090m815879n397837l754712j455070j9761K279972O370679
$$ 23152493 20107403 15291524 9893687 6138975 4683905 4664144 6944116 13314795
5871A3314795Q252451M807999N38214J256243L702324J10343q041362j0384858
$$ 13314795 21567246 26375245 26913459 28169702 31872026 31982369 23941007 13556149
5863A3556149k897976O079025P825866L653660k31592j776383k594209l177409
$$ 13556149 10658173 16737198 24563064 28216724 27985132 26208749 23614540 20437131
5855B0437131k937696k190848j216889L63540J780396J350117o93929k582980
$$ 20437131 17499435 15308587 14091698 14455238 16235634 17585751 16891822 14308842
5847A4308842m198543o059026n689431m04229O113604O457133K84306m016734
$$ 14308842 10110299 4051273 -1638158 -2042387 4071217 10528350 10812656 6795922
5839F795922j074609M305294N251244K218487j69618n86438k94386R13704K947242
$$ 6795922 5721313 10026607 15277851 17496338 17326720 16740282 16445896 17359600 20306842
5830B0306842K888934q11591m346233l462727J6777J103358j114111l530266m285424
$$ 20306842 23195776 22384185 18037952 14575225 14592002 15695360 14581249 11050983 6765559
5821F765559l572425j063203K991964N608493M283011J015138p39479j267086
$$ 6765559 3193134 2129931 5121895 10730388 15013399 16028537 15289058 14021972
5813A4021972k625706l833012l050561k310072m056225m849760K52503P870868
$$ 14021972 11396266 7563254 4512693 2202621 -1853604 -6703364 -6450861 1420007
5805A420007R224186L852272J461617O682660J0669919M116410q155480j3625787
$$ 1420007 10644193 14496465 15958082 22640742 33310661 37427071 29271591 15645804
5797A5645804q877161j517350K442435M173864M778669J335437o323239j1453679
$$ 15645804 6768643 5251293 7693728 11867592 16646261 17981698 11658459 204780
5789B04780q086131P38281O784144O308870K210318j395425k620167q92917L328999
$$ 204780 -7881351 -7143070 -358926 5949944 8160262 6764837 4144670 3251753 6580752
5780F580752P623744R110071P182029L128580j913096o330825p049695k912925
$$ 6580752 14204496 23314567 30496596 33625176 31712080 25381255 18331560 15418635
5772A5418635J895972K189006p58900j004242K467107L780523l70361n371970
$$ 15418635 17314607 19503613 18744713 17740471 20207578 23988101 23617740 18245770
5764A8245770o183415m470364l635144k161548J878896M325194P90678l986645
$$ 18245770 12062355 7591991 3956847 1795299 3674195 7999389 8790067 4803422
5756D803422j541189O615407R908027M226892k502136l024114n29983j052590
$$ 4803422 3262233 9877640 19785667 24012559 21510423 18486309 17956326 16903736
5748A6903736l233007j892219K924503O531519O318182L166227j126259l912090
$$ 16903736 13670729 11778510 14703013 21234532 27552714 30718941 29592682 25680592
5740B5680592k405774J742878K293991k805591o773169l649029J804097J181657
$$ 25680592 23274818 25017696 27311687 24506096 17732927 14083898 15887995 17069652
5732A7069652m083082n320237j059261J192331j550923k661832K099640O628385
$$ 17069652 12986570 7666333 6607072 7799403 6248480 3586648 5686288 12314673
5724A2314673M382024r94438k190959j02944r44163m459338l722531L355574R916962
$$ 12314673 16696697 15702259 13511300 13408356 12464193 8004855 4282324 7637898 17554860
5715A7554860R488723L672265k032496n396182p179279p126158m126062J056319
$$ 17554860 27043583 30715848 28683352 23287170 16107891 8981733 4855671 5911990
5707E911990O004589Q721213P852585K829001l762450o077680j161459N721781
$$ 5911990 11916579 20637792 28490377 31319378 27556928 21479248 20317789 26039570
5699B6039570O239590k96470n920905n092776j967078l365191q549602j0884937
$$ 26039570 32279160 31982690 26061785 20969009 19001931 15636740 7087138 -3797799
5691c797799p358548j155600M220069P955576R006292N730549n4118l410345k669936
$$ -3797799 -11156347 -12311947 -8091878 -136302 8869990 14600539 14546421 11136076 8466140
5682H466140j286912j456205o62379K647018M952886L388657J204397K413430
$$ 8466140 7179228 5723023 5060644 7707662 12660548 16049205 17253602 19667032
5674A9667032M600219K926011j468903l520516k788123k991815m053304k256465
$$ 19667032 24267251 27193262 25724359 22203843 19415720 16423905 12370601 10114136
5666A0114136J352928R14126l697040m227282L721155J2441872J1824499K585766
$$ 10114136 11467064 12381190 8684150 4456868 8178023 20619895 32444394 35030160
5658C5030160o098572q702654p037468m228725j353255N64342O46287M92253K144307
$$ 35030160 28931588 20228934 13191466 8962741 7609486 8173828 8820115 9312368 11456675
5649A1456675L777401J732067k915694m392187k14766M722677M247997j487421
$$ 11456675 15234076 16966143 14050449 9658262 9443496 14166173 18414170 16926749
5641A6926749o675845o610573k050004K473565L642725K517874K273232K888823
$$ 16926749 10250904 3640331 1590327 4063892 7706617 10224491 12497723 15386546
5633A5386546O02078n503539r470024n407079L324939P620961N199919L216310
$$ 15386546 15988624 10485085 1015061 -4392018 -1067079 6553882 11753801 14970111
5625A4970111O556987J0233777P655045Q87520l353946m155670n820616q647848
$$ 14970111 21527098 31760875 39415920 40303440 36949494 32793824 26973208 18325360
5617A8325360p764847j776520M025052N301223M209476M416600N054645L399285
$$ 18325360 10560513 8783993 12809045 18110268 22319744 26736344 31790989 35190274
5609C5190274K73702j467564j887229l187597m871311l813394L85117L548163
$$ 35190274 35463976 33996412 32109183 28921586 24050275 20236881 20621998 24170161
5601B4170161J991245k568294m859742k039471L375813O457852N058422J571499
$$ 24170161 26161406 23593112 18733370 16693899 20069712 26527564 31585986 33157485
5593C3157485n66212j196587k707786n187693n026044j14435N690275O433972
$$ 33157485 32591273 31394686 28686900 23499207 18473163 18358728 24049003 30482975
5585C0482975J855874j854447J64575N431051P384033L060660m201523q978157
$$ 30482975 32338849 30484402 30648977 36080028 43464061 46524721 42323198 33345041
5577C3345041r035030o274234l550339j528569R56590L938228N102123K487433
$$ 33345041 24310011 18035777 14485438 12956869 13913459 17851687 22953810 25441243
5569B5441243k451815o012360o315253m738767l167805j539993R41371L501440
$$ 25441243 22989428 16977068 10661815 5923048 2755243 1215250 2156621 5658061
5561E658061M381484L500860K920580L813703M016517M63824n636792q342900
$$ 5658061 10039545 13540405 16460985 20274688 24291205 24755029 19118237 10775337
5553A0775337l909706L158337M471180j633536p648158o586849k96168M739442
$$ 10775337 6865631 10023968 14495148 12861612 5213454 -1373395 -1669563 3069879
5545C069879O294169O729056O944614N441241K641478R12032J8846k642525o611933
$$ 3069879 9364048 16093104 23037718 28478959 31120437 32032469 32051315 29408790 22796857
5536B2796857p903332n217805k111722j329297j290601j66711P77726K56941n06214
$$ 22796857 14893525 9675720 7563998 6234701 4944100 4777389 5555115 5812056 5305842
5527E305842o26489j062260j177668J616390O144098O599555J190766l566223
$$ 5305842 4679353 3617093 2439425 4055815 10199913 16799468 17990234 14424011
5519A4424011k045862K030019K294716J79311J202727M376175L871786m51580
$$ 14424011 12378149 14408168 16702884 16882195 18084922 22461097 26332883 25881303
5511B5881303k763124j141021L82077q6755k63845n46629m280881r104856o942938
$$ 25881303 23118179 21977158 22359235 22272480 22008635 21462006 17181125 8076269 1133331
5502A133331L265273J0820823O873679l548179r160870o878538k179905Q68071
$$ 1133331 4398604 15219427 22093106 18544927 9384057 2505519 325614 1193685
5494A193685K812612M082550L569105J666730J18237r17049k235216k952518j737202
$$ 1193685 4006297 8088847 11657952 13324682 13442919 12525870 10290654 7338136 5600934
5485E600934L65111J352326J403003J860657K384797J700613j70850k531672m861763
$$ 5600934 5966045 7318371 8721374 10582031 12966828 14667441 14496591 11964919 7103156
5476G103156n176378p42836O734403J0327537O289425j56358k059284l23941l46464
$$ 7103156 1926778 1183942 7918345 18245882 24535307 24378949 22319665 21995724 21649260
5467B1649260k260065j817402O79892L75137k985213l602510R04354N386669N131791
$$ 21649260 19389195 17571793 18251685 18626822 15641609 12039099 12943453 18330122 23461913
5458B3461913K033889k38957j925795m291227n338206k545125K719504O666226
$$ 23461913 25495802 25256845 23331050 19039823 13701617 11156492 13875996 20542222
5450B0542222O986178L476241k417811o832190n530508P87838N942744N308146
$$ 20542222 27528400 31004641 28586830 21754640 16224132 17011970 22954714 28262860
5442B8262860Q28861k834429m056369l920373l343354l201173m544021o232168
$$ 28262860 29091721 26257292 22200923 18280550 14937196 11736023 7192002 959834
5434I59834n245930j640702K98115j427885k844777m72681K580720J740907j405067
$$ 959834 -4286096 -5926798 -5628683 -7056568 -9901345 -10374026 -7793306 -6052399 -7457466
5425g457466k253871j041721j022297p51613M275699J2291567J5019821Q850458
$$ -7457466 -9711337 -10753058 -11775355 -12526968 -8251269 4040298 19060119 27910577
5417B7910577K56218k806641k51485K286192J073163l269239p891117r426866
$$ 27910577 28166795 25360154 25108669 27394861 28468024 25198785 17307668 7880802
5409G880802n979004J25466L649436K557494N04399J169944K927223K267587J84475
$$ 7880802 1901798 2027264 5676700 8234194 8738593 9908537 12835760 15103347 15287822
5400A5287822Q33918M416276N696967J021824o101135q801972n057253L36218
$$ 15287822 16121740 20538016 26234983 27256807 21155672 12353700 7296447 7632665
5392G632665K286268J653544K907553O594314P637900K570843m538488o557393
$$ 7632665 9918933 11572477 14480030 21074344 28712244 31283087 26744599 20187206
5384B0187206k214425K937880M016800J745868m52526r58262l79914j7515j071204
$$ 20187206 17972781 20910661 24927461 26673329 26220803 25262541 24882627 24865112 23793908
5375B3793908l443352m749132k721923R71817J943062j197278n045042o198706
$$ 23793908 20350556 15601424 12879501 13851318 15794380 14597102 9552060 3353354
5367C353354n001084l362051j706618M60769L388391P428413J1821968J2736486
$$ 3353354 -1647730 -5009781 -6716399 -6255630 -2867239 4561174 16383142 29119628
5359B9119628O605829l353728q738705o390452k376740k489294m151065k517653
$$ 29119628 35725457 32371729 23633024 17242572 14865832 12376538 8225473 5707820
5351E707820M71878j31401k839570j633985L924764P577008N496908M67016l651237
$$ 5707820 6179698 6048297 3208727 1574742 5499506 13076514 18573422 19040438 15389201
5342A5389201o081613o715491m401885P73659O737843J1296656J2114055O714162
$$ 15389201 9307588 2592097 -1809788 -1036129 5701714 16998370 29112425 35826587
5334C5826587l045282q928248n293982J512968O78912o867450r263093j906378
$$ 35826587 32781305 23853057 18559075 20072043 20750955 13883505 4620412 2714034
5326B714034N668413M938660K08423q54991O92822M10142J18097K906865M591401
$$ 2714034 8382447 13321107 13529530 12674539 13367361 13777503 13895600 16802465 21393866
5317B1393866J94502n602274m843854M11769K125344Q83521M088139J0266371
$$ 21393866 21588368 15986094 11142240 11554009 13679353 14562874 18651013 28917384
5309B8917384Q875461j494985p970106k432894N764867M543710k745037m336106
$$ 28917384 37792845 36297860 28327754 25894860 31659727 36203437 33458400 29122294
5301B9122294J093381M207018J009505k210930p99497Q65286k652114q942838
$$ 29122294 30215675 34422693 35432198 33221268 32421771 33287057 30634943 21692105
5293B1692105j1118735o590972Q31347N626147N142358R56827k764197l094062
$$ 21692105 10573370 3982398 4813745 10439892 15582250 16539077 13774880 10680818
5285A0680818j108583J3470q26054k116226k733227k722565j286215K441363N815565
$$ 10680818 9572235 9585705 8759651 6643425 3910198 1187633 -98582 2342781 8158346
5276H158346L995115k749405o814727k386585N865542Q415024L959909N67732
$$ 8158346 12153461 9404056 2589329 202744 6068286 14483310 18443219 19010951
5268A9010951K770272M373032j573466j0920297j3216493n952943L061369P246810
$$ 19010951 21781223 26154255 24580789 13660492 443999 -5508944 -2447575 4799235
5260D799235Q004032Q260879O323345M09488n827404p488000m872153j192091
$$ 4799235 12803267 21064146 27387491 27796979 21969575 14481575 9609422 8417331
5252H417331K815652O815476O763218j64065q148812p881099M70432O574915L771002
$$ 8417331 11232983 18048459 24811677 24647612 16498800 8617701 9088133 15663048 19434050
5243A9434050l187057o667742n734900l309125J06069M423892O304272L543467
$$ 19434050 16246993 9579251 3844351 535226 641295 5065187 11369459 14912926
5235A4912926N406J96608J402101k192120q878824j0204017l180002M907105O441547
$$ 14912926 14918332 15114940 16517041 14324921 5446097 -4757920 -7937922 -3030817 3410730
5226C410730K860002N12671J321772K256520J865774K240051M350449N532333
$$ 3410730 6270732 6783403 8105175 10361695 12227469 14467520 18817969 24350302
5218B4350302L278408r78414l923359m709372m958070n149280l832040j016835
$$ 24350302 27628710 26650296 22726937 18017565 13059495 7910215 4078175 3061340
5210C061340M17466j372707l886472l438133k79769K349476L272661L897942M115592
$$ 3061340 3478806 2106099 -1780373 -5218506 -5498275 -3148799 123862 4021804 8137396
5201H137396J967103j858836l616397k347372j850715m128240n004485l12103
$$ 8137396 10104499 8245663 4629266 2281894 431179 -3697061 -8701546 -9013649
5193i013649O650894Q651871L969515k106801m507410l181675q96947K86394M9376
$$ -9013649 -2362755 6289116 10258631 8151830 3644420 462745 -434202 -147808 -98432
5184i8432k77947R91499L062828K595618j346338m575979l252158L60050J813833
$$ -98432 -376379 615120 3677948 6273566 4927228 351249 -2900909 -2540859 -727026
5175g27026J755411L754373O608946N596589J171210p29347J740812L381610P90108
$$ -727026 1028385 4782758 11391704 16988293 18159503 17430156 19170968 22552578 23342686
5166B3342686k469309k567977r36366N79622L679598P979197P642709j54248q572258
$$ 23342686 20873377 18305400 17369034 17948656 21628254 29607451 37250160 37095912 28523654
5157B8523654r814924o061373m200639l869048o2330M956140L248270m918658
$$ 28523654 18708730 12647357 8446718 4577670 4515340 9471480 12719750 7801092
5149G801092r293972m507584K535230M125950K157160J692106J663972j019767
$$ 7801092 -1492880 -6000464 -3465234 660716 2817876 4509982 6173954 5154187
5141E154187l700137j942356K283402L610789K033715J820878L355050K771029
$$ 5154187 1454050 -488306 1795096 5405885 7439600 9260478 12615528 15386557
5133A5386557r39033m524979n920995n702083l648650O97730M724154N683140
$$ 15386557 14447524 9922545 4001550 -1700533 -5349183 -4651453 72701 5755841
5125E755841N925939Q649963R726862K467172r342882j3527558p264226j827727
$$ 5755841 11681780 20331743 30058605 32525777 23182895 9655337 2391111 563384
5117E63384m423632o525260Q56082J0236872Q505789j777373o205137r99851K910241
$$ 563384 -3860248 -10385508 -9529426 707446 9213235 7435862 1230725 230874 3141115
5108C141115q29244m695553j713049K895411J583861l046541l723998j96498K413524
$$ 3141115 2311871 -2383682 -4096731 -1201320 382541 -2664000 -6387998 -6584496 -4170972
5099d170972K734692L426805N025732N619361M718934K512603k405150r607707
$$ -4170972 -1436280 1990525 7016257 12635618 17354552 19867155 17462005 7854298
5091G854298j3567877r461549q85125L665777J538171j742570q62042L095654
$$ 7854298 -5713579 -15175128 -16060253 -12394476 -10856305 -12598875 -13460917 -10365263
5083a0365263N661521M652859J612303l32398O55141L362125M955994M581384
$$ -10365263 -4703742 -50883 1561420 1229022 1884163 5246288 10202282 14783666
5075A4783666L811038K969461J85230m262965o491962m763338k868458m038166
$$ 14783666 18594704 21564165 21749395 17486430 10994468 6231130 3362672 -675494
5067f75494n239310k235272L044468N607776N008926M056113K636120n56605k420543
$$ -675494 -5914804 -8150076 -5105608 502168 5511094 9567207 12203327 11646722 9226179
5058I226179Q05115N491992M532681r66141k645790J457987L454196j357382o876487
$$ 9226179 10031294 15523286 20055967 19089826 16444036 17902023 21356219 19998837 13122350
5049A3122350o335867k248474k89222J73379K439762M447637K107466k400814
$$ 13122350 6786483 4538009 4248787 4422166 6861928 11309565 13417031 11016217
5041A1016217l167609R0644K037403N86793n66951J171234L520088L826670K639775
$$ 11016217 7848608 7939252 9976655 10563448 9996497 11167731 14687819 18514489 21154264
5032B1154264R68743j877924n276732n671040j405293L044089J660332m799314
$$ 21154264 22123007 20245083 14968351 9297311 7892018 10936107 12596439 7797125
5024G797125q862341n649067J147012M726173L889604K677251K882263J875536
$$ 7797125 -1065216 -6714283 -5567271 -841098 3048506 5725757 8608020 10483556
5016A0483556j490359l732176j971384J525206L069588K534322J374193r55448
$$ 10483556 8993197 5261021 3289637 4814843 7884431 10418753 11792946 10837498
5008A0837498m561838o142699l185516J209444K398539P64629n31245j416807
$$ 10837498 6275660 132961 -3052555 -1843111 555428 1320057 788812 -627995
5000f27995k773757j620742M252101R309783O424387j398111m535249j307286
$$ -627995 -3401752 -5022494 -770393 8539390 14963777 13565666 9030417 7723131
4992G723131R61164l51983L39701M503067N450292J030975r88736L572436P081134
$$ 7723131 8684295 8332312 8672013 13175080 18625372 19656347 18667611 22240047 29321181
4983B9321181L140735j904013M5028M620821K477726n165206r432423p933426
$$ 29321181 32461916 30557903 30602931 35223752 37701478 32536272 23103849 15170423
4975A5170423n450422l627490k66242K991784K044985j376347j446290K165319
$$ 15170423 9720001 6092511 5826269 8818053 10863038 9486691 8040401 10205720
4967A0205720M191569K654019M39523j255177l577629m665757j231118M387867
$$ 10205720 14397289 17051308 17490831 16235654 12658025 7992268 6761150 11149017
4959A1149017N845841J861909k768226n242789p149224q444008n882787R76545
$$ 11149017 16994858 18856767 16088541 10845752 3696528 -4747480 -10630267 -9653722
4951i653722P613631R870807P541023K585813k386994m613713l877161l123723
$$ -9653722 -2040091 7830716 15371739 17957552 15570558 10956845 7079684 3955961
4943C955961l038570K47455P232130J0008753K676561p777429j0185556n075072
$$ 3955961 917391 1164846 8396976 18405729 21082290 13304861 3119305 -1955767
4935a955767j512541j333369J142111N104548K801544n395473q873846l409932
$$ -1955767 -3468308 -4801677 -3659566 1444982 4246526 -1148947 -10022793 -13432725
4927a3432725K391501K076473R17265M200775P011112L899810m17031P69036M355006
$$ -13432725 -11041224 -8964751 -8047486 -3846711 3164401 7064211 6647180 7416216 11771222
4918A1771222L291991q61018q83332L371771M287640j540717p810685o867943
$$ 11771222 15063213 14202195 13318863 16690634 20978274 19437557 11626872 4758929
4910D758929P28419P410681P739826M008214J756766J553772o60046m857309n068603
$$ 4758929 5487348 12898029 20637855 24646069 26402835 27956607 27296561 22439252 17370649
4901A7370649L85118L954449K27554m812830l908119o75558j529077k772415J671450
$$ 17370649 17755767 21710216 21937770 17124940 13216821 12541263 11012186 8239771 9911221
4892I911221O472512L542349j890987n50975K028888m368586j1918764n991606
$$ 9911221 16383733 19926082 18035095 17484120 19513008 15144422 3225658 -2765948
4884b765948N614911K747559j0117410r390385M442999O739515l312396J192488
$$ -2765948 2848963 5596522 -4520888 -13911273 -9468274 -2728759 -6041155 -4848667
4876d848667J9044710J3969344j1043426Q068428R4146497J56853068R6970868
$$ -4848667 14196043 28165387 17121961 25190389 119336886 276189954 373160822
4869C73160822m5545759j29646995r3934910j8740910M481543j4478427j8548195
$$ 373160822 327615063 197968068 104033158 85292248 89773791 75295364 56747169
4862E6747169j820961K146587j0752114j5399091o922351k533154m373125L72578
$$ 56747169 54926208 57072795 46320681 30921590 23999239 21466085 17092960 17465538
4854A7465538Q789462N477073p261235j1651541m416476J074062K05996Q88659
$$ 17465538 26255000 31732073 24470838 12819297 8402821 9476883 9682879 10571538
4846A0571538L882750J953701k369840O75443Q464333Q872055K047129l73715
$$ 10571538 14454288 16407989 14038149 14713592 23177925 32049980 34097109 33723394
4838C3723394K874571J817750l589509k392187N132948N123125n582252j2798894
$$ 33723394 36597965 38415715 34826206 32434019 37566967 42690092 37107840 24308946
4830B4308946q749457l459973m858203n739027j21804M281418J309965r25346
$$ 24308946 15559489 12099516 7241313 1502286 1380482 5661900 6971865 6046519
4822F046519M799957J0126229N522125j740033N86887Q266056P386626k123123
$$ 6046519 10846476 20972705 26494830 24754797 25341684 33607740 40994366 38871243
4814C8871243o326672j0262N484584M38449r149693j1494572n238292R10950J009647
$$ 38871243 32544571 32534309 38018893 38457342 29307649 17813077 12574785 13485735 14495382
4805A4495382j597423n38413M437901O955801K444804n441761r253625p027032
$$ 14495382 12897959 12359546 16797447 23753248 26198052 20756291 11502666 4475634
4797D475634l214495r20475J508999M975767O362255L884429J039510J218150
$$ 4475634 1261139 340664 1849663 6825430 13187685 17072114 18111624 19329774
4789A9329774K069823l05926m342290n119564k193883n87866l482987p239788
$$ 19329774 21399597 21093671 16751381 11631817 9437934 8850068 5367081 -1872707
4781a872707n425372K932320J0355589P917880l695805j2633393q944253K695095
$$ -1872707 -7298079 -4365759 5989830 13907710 10211905 -2421488 -11365741 -8670646
4773h670646Q773512M694271m96775J336362O099307N428682l54702l819545j356725
$$ -8670646 102866 4797137 4300362 5636724 11736031 17164713 16810011 12990466 11633741
4764A1633741L567942O116555M195390j399027o945858p840618l995027n04432
$$ 11633741 15201683 21318238 25513628 24114601 17168743 9328125 5333098 4828666
4756D828666L9957J463174N953759P755198J968001n182442m171707K679236M396977
$$ 4828666 4868623 6331797 12285556 20040754 22008755 16826313 12654606 15333842 19730819
4747A9730819j255873m923863j611633K067128P03941o44172L384154Q038190
$$ 19730819 18474946 13551083 11939450 14006578 14710519 14066347 17450501 25488691
4739B5488691O299301J70044m310314p370041j1636300j3051089o326201L520332
$$ 25488691 31787992 31958036 27647722 20277681 8641381 -4409708 -10735909 -7215577
4731g215577O255996K034463P52288N424545P938697M062213Q98334L844442O616846
$$ -7215577 -959581 1074882 1827170 7251715 15190412 19252625 20150959 23995401 30612247
4722C0612247K056480n618398q326954p109256p738184q630354m167450L020195
$$ 30612247 32668727 27050329 18723375 11614119 3875935 -4754419 -8921869 -5901674
4714e901674M724360J405927K225294R227344J2548052N564267m580226p486931
$$ -5901674 -1177314 228613 2453907 11681251 24229303 29793570 25213344 17726413
4706A7726413l349567K55503K09662l33374R62591K705095K965823J559368j38728
$$ 17726413 14376846 14632349 14842011 14508637 15471228 18176323 21142146 22701514 22562786
4697B2562786J03456K902187M683122J209642n309102p647648l891647k83738
$$ 22562786 22666242 25568429 30251551 31461193 26152091 18504443 14612796 14329058
4689A4329058q50484j197101K586668O020155M054965L61132M30258R98868l646831
$$ 14329058 13478574 12281473 14868141 20888296 24943261 25304393 25734651 26733519 23086688
4680B3086688r089233o149048L126164P073525K361866j781295M21182K986347
$$ 23086688 13997455 7848407 10974571 18048096 20409962 18628667 19049849 22036196
4672B2036196M04724k862078j784264l13933l418918o866842l772849L821194
$$ 22036196 22440920 19578842 17794578 17480645 14061727 7194885 3422036 7243230
4664G243230Q438579Q370024P171535N119422k03237o512460q528156o707518
$$ 7243230 15681809 24051833 31223368 36342790 36139553 29627093 21098937 14391419
4656A4391419o330706p506973m212001M771433J1666894J0263444M473758J586900
$$ 14391419 8060713 553740 -3658261 1113172 12780066 23043510 27517268 29104168
4648B9104168J827056L45119l520934n386886l486833j350335j660561k183466
$$ 29104168 30931224 31276343 27755409 22368523 18881690 17531355 15870794 13687328
4640A3687328k88229K018754J116108k094150k985525J13886L550189L483477
$$ 13687328 13399099 15417853 16533961 14439811 11454286 11568172 15118361 18601838
4632A8601838N50710j938495k097829k22082K375274L557589J540841k178048
$$ 18601838 19152548 17214053 15116224 14894142 17269416 20827005 22367846 20189798
4624B0189798l343522p27961J112484k007900p341477q652723m344575J974889
$$ 20189798 16846276 16118315 17230799 15222899 7881422 -771301 -5115876 -3140987
4616c140987P104909R568299P243864k9318o232131m460331L072003P178278M719291
$$ -3140987 3963922 13532221 20776085 20746767 14514636 10054305 13126308 20304586 25023877
4607B5023877J791533K045906P69991m874775q317512l440716M603178O664572
$$ 25023877 26815410 28861316 29631307 24756532 16439020 12998304 17601482 24266054
4599B4266054K921274L98247P93983M9538j896740n99084L506672M265043J19474
$$ 24266054 27187328 27585575 28379558 28429096 26532356 25933272 29439944 33704987 33824461
4590C3824461k748895l51703L137541K869652N34218j69311m7674j627937l977447
$$ 33824461 31075566 30723863 33861404 36731056 37265274 37095963 37048289 35420352 31442905
4581C1442905n189419o605015r298434r137338j597705R448432J4030629Q226862
$$ 31442905 26253486 19648471 10350037 1212699 -385006 9063426 23094055 31320917
4573C1320917j032578n130037l360947p76784l15364j001163j597083j694676
$$ 31320917 30288339 25158302 21797355 21020571 20705207 19704044 18106961 16412285
4565A6412285j97415L101050M844679J517126m134466n124519l09812K916235
$$ 16412285 16214870 19315920 24160599 25677725 21543259 16418740 16108928 19025163
4557A9025163o39808n626437l813817L668642Q184298N526526n98879n798406
$$ 19025163 18385355 12758918 8945101 12613743 20798041 26324567 25725688 19927282
4549A9927282q729630p908360k199433M363246N230930O07417k587657j731053
$$ 19927282 11197652 3289292 1089859 5453105 10684035 11291452 8703795 6972742
4541F972742j792861m727262m158616L701759J1154115Q509295k259316j0470175
$$ 6972742 5179881 452619 -3705997 -4238 11149877 19659172 17399856 6929681
4533F929681j0033348l653339L160265O342282M137996q92017l045901q23567
$$ 6929681 -3103667 -6757006 -3596741 2745541 6883537 5991520 2945619 2122052
4525B122052M15992k869337o261794n186167k770874k800507j021498P167051
$$ 2122052 2538044 -331293 -6593087 -11779254 -14550128 -17350635 -18372133 -11205082
4517a1205082J5392922J3616391L639877l751200m934351n154229n521205j216526
$$ -11205082 4187840 17804231 21444108 17692908 12758557 7604328 2083123 866597
4509H66597O376270Q494365L065550j378563L32729K716640O95649k185597j856554
$$ 866597 7242867 15737232 18802782 17424219 17756948 20473588 21169237 18983640 17127086
4500A7127086p86237j308837m22420K911302L418482j312341m983756k541294
$$ 17127086 16340849 15032012 14609592 17520894 20939376 19627035 14643279 12101985
4492A2101985J145719m69695n128778o667266m620631j889048J738870O530036
$$ 12101985 13247704 12778009 7649231 981965 -3638666 -5527714 -3788844 2741192
4484B741192Q299001M336204m68929m98243J677158K00026m157069o021782l990419
$$ 2741192 11040193 15376397 14907468 14409225 16086383 16286409 12129340 6107558 2117139
4475B117139o07630K793448N040536K925342l361624o809081k637600L505804
$$ 2117139 1509509 4302957 9343493 12268835 8907211 2098130 -539470 2966334
4467B966334L892040O52737P65951L465070K758479n03648M5584M209326N150953
$$ 2966334 6858374 7511111 8277062 11742132 14500611 13996963 14042547 18251873 23402826
4458B3402826J371979j365841p97170r93937l029459k483009J272179K465499
$$ 23402826 24774805 23408964 22611794 21617857 18588398 16105389 17377568 19843067
4450A9843067r36457k884355O13436M367921K291033k891777l861032Q52315N544637
$$ 19843067 18906610 16022255 16635691 21003612 23294645 20402868 16541836 17394151 22938788
4441B2938788M915502k21645m391892l567139J71547J532990J41747J516098P044224
$$ 22938788 27854290 27632645 23240753 19673614 19845161 21378151 21519898 23035996 30080220
4432C0080220Q939728J559919p782603q392161k333272o7539k880667k618131
$$ 30080220 39019948 40579867 32797264 24405103 22071831 22004292 19123625 16505494
4424A6505494J730727J622429m423051o234502N91469O013562J811188n305661
$$ 16505494 18236221 19858650 15435599 9201097 9792566 15806128 17617316 12311655
4416A2311655n782916k000931r24452j008992K428245N997026M020225N8775J117644
$$ 12311655 6528739 4527808 3603356 2594364 5022609 11019635 15039860 15098635 16216279
4407A6216279M625308K915338k368631k497994K935235M814247m61410n656628
$$ 16216279 20841587 23756925 21388294 18890300 21825535 26639782 26178372 20521744
4399B0521744m803875j131031M52402P54249K188912L614830L259543K024937
$$ 20521744 15717869 14586838 15039240 15793489 17982401 21597231 24856774 26881711
4391B6881711P39184j642423m506704m517950r17219J899746K19651l470409l852709
$$ 26881711 27620895 25978472 21471768 16953818 16036599 17936345 18155996 14685587 10832878
4382A0832878K36020M769712N452754J931321k396941l961964k607259j254545
$$ 10832878 11068898 15838610 21291364 23222685 20825744 16863780 14256521 13001976
4374A3001976j673195k257555j278209J12238O90992K371637O585755R428939
$$ 13001976 11328781 9071226 7793017 7905255 8596247 10967884 17553639 26982578
4366B6982578N609682l252215r476864r005430n358707k835700p84457K788885
$$ 26982578 32592260 29340045 19863181 10857751 5499044 2663344 1878887 4667772
4358D667772N891239M507970j670636p989119q889692k780492N862601R469419
$$ 4667772 10559011 15066981 13396345 5407226 -3482466 -6262958 -400357 9069062
4350I069062M758327k849301m937035k46687M383312L762702O22200O2997K007349
$$ 9069062 13827389 10978088 6041053 5794366 10177678 13940380 14562580 14625577 16632926
4341A6632926K956935K302092K207904K509521M83962l931907o801363n582800
$$ 16632926 19589861 21891953 24099857 26609378 27093340 23161433 16360070 10777270
4333A0777270k726005j719489j853086L27350N534877J0497059J1858151Q871092
$$ 10777270 8051265 6331776 4478690 4806040 10340917 20837976 32696127 41567219
4325D1567219K454435n461011j1206576j1331470o802584k373614k08596K357616
$$ 41567219 44021654 38560643 27354067 16022597 9220013 6846399 6637803 8995419
4317H995419O466915P767850L312778j701322o20153L928490L717314j819864
$$ 8995419 15462334 23230184 26542962 24841640 24221487 28149977 31867291 30047427
4309C0047427m666798j328172K046918L95341k754303k768825j515349k300750
$$ 30047427 25380629 24052457 26099375 26494716 23740413 20971588 19456239 17155489
4301A7155489l539718k914074k192169k535865o90806M445661P326713M273753
$$ 17155489 13615771 10701697 8509528 5973663 5282857 9728518 17055231 21328984
4293B1328984O85027K448016N814008M184672k86858j447749r59162m483460r187725
$$ 21328984 22014011 24462027 30276035 34460707 34173849 32726100 31766938 27283478 18095753
4284A8095753o894709J385394N833545L157345R6718J5718k393511r256665j2933728
$$ 18095753 11201044 12586438 18419983 21577328 21674046 21689764 19296253 10039588 -2894140
4275b894140p122650L225007Q767645O828379J220872l682623m873427j510168
$$ -2894140 -10016790 -6791783 1975862 8804241 10025113 6342490 1469063 -41105
4267d1105K898950L366636N95288N28475N162337R326204Q505908M329043M37882
$$ -41105 2857845 6224481 6819769 7348244 12510581 21836785 30342693 34671736 35109618
4258C5109618j594214r25070J971870K502667l346803j0689947j0269032k647687
$$ 35109618 33515404 32590334 34562204 37064871 33718068 23028121 12759089 10111402
4250A0111402J503856k181782n372776j323626M842039O182359M536041L804634
$$ 10111402 11615258 9433476 4060700 2737074 7579113 13761472 18297513 22102147
4242B2102147J620171l953473p310310l769629J672502K692779J881996L558049
$$ 22102147 23722318 19768845 12458535 8688906 10361408 13054187 14936183 18494232
4234A8494232L633716k377776p615898k996511O061934N789976m515197j0844383
$$ 18494232 22127948 19750172 12134274 9137763 15199697 20989673 16474476 5630093
4226E630093n446642L180750M939268K009127K287528O587404Q972821O022140
$$ 5630093 183451 3364201 8303469 10312596 12600124 19187528 28160349 34182489
4218C4182489N73334k598029k171664j346828l487499o698372n387342J313458
$$ 34182489 34755823 32157794 29986130 28639302 25151803 18453431 13066089 14379547
4210A4379547O819976O156279L235728L920365O004364L162192l687586o758277
$$ 14379547 21199523 27355802 30591530 34511895 40516259 43678451 39990865 33232588
4202C3232588k702795L282623N244775K705742j725930o021210q492866p344696
$$ 33232588 30529793 33812416 39057191 41762933 40037003 34015793 25522927 18178231
4194A8178231k210222M805855R606272Q102654M96931o424796n682934N93749
$$ 18178231 15968009 20773864 30380136 38482790 38979721 32554925 26871991 27465740
4186B7465740L810411J549563J3530K125905K751363l74823j401640K093734L057827
$$ 27465740 31276151 32825714 32839244 34965149 37716512 37341689 35940049 38033783 41091610
4177D1091610k049016n266563j276549J884079k640110o797178j841153M795846
$$ 41091610 39042594 33776031 32499482 34383561 31743451 24946273 23105120 27900966
4169B7900966K567942k260681K373339J1631523J1367466K329397k671049j015198
$$ 27900966 30468908 28208227 30581566 42213089 53580555 55909952 53238903 52223705
4161E2223705n47972k082524p70192n9561m833223o864781K104570J1186301P913920
$$ 52223705 51675733 49593209 48823017 48763456 43930233 37065452 39170022 50356323 58270243
4152E8270243L849822J3362955K0131429L273472j6301773p829402k040405o0848146
$$ 58270243 62120065 75483020 95614449 98887921 82586148 74756746 72716341 11868195
4144A1868195j61391941j87449801q0648624O4061340J15216273O8386497K2011197
$$ 11868195 -149523746 -336973547 -417622171 -353560831 -238344558 -169958061 -147946864
4137a47946864K5663728L7197382K0830528K080752P234925J6672688Q468703
$$ -147946864 -122283136 -85085754 -64255226 -62174474 -54939549 -38266861 -29798158
4130b9798158k035433L067320R631590J188158q976935l761915O591113N924577
$$ -29798158 -31833591 -28766271 -19134681 -17946523 -26923458 -30685373 -24094260 -18169683
4122a8169683J411657N637603J0104046K496799o961400k105705J0049961J1307344
$$ -18169683 -16758026 -11120423 -1016377 1480422 -5480978 -7586683 2463278 13770622
4114A3770622K401162k034915J46330p29858n467998o217182l028396k520841
$$ 13770622 16171784 14136869 14283199 13553341 8085343 1868161 -1160235 -3681076
4106c681076l746253r47579L563628L560031J446268L089249N184435J397678
$$ -3681076 -7427329 -8374908 -4811280 -1251249 195019 3284268 8468703 9866381
4098I866381m161373l586998j88985k440002p563173o116267P57912L784192K342269
$$ 9866381 5705008 2118010 1929025 -510977 -8074150 -14190417 -13432505 -9648313 -7306044
4089g306044L468626O108463K281252o185231p700271M40030P506356O177437
$$ -7306044 -3837418 2271045 4552297 -1632934 -9333205 -8893175 -1386819 4790618
4081D790618J258468j408546k803851l912451k017320K036317K437287j746974
$$ 4790618 6049086 4640540 1836689 -2075762 -4093082 -2056765 380522 -1366452
4073a366452l909503o58812K970740K657027J332602K572811M219074K711045
$$ -1366452 -5275955 -5934767 -2964027 -307000 1025602 3598413 7817487 10528532
4065A0528532j460831n664341p986642o656284j545788K946639K086859j531060
$$ 10528532 9067701 3403360 -4583282 -11239566 -12785354 -9838715 -7751856 -9282916
4057i282916o60209N462334R203025N277689k590070p385584o013709n8730N499124
$$ -9282916 -9943125 -4480791 4722234 9999923 7409853 24269 -5989440 -6048170 -549046
4048e49046M551950l287082q961384m124941N984834Q392305Q00491n836607m469428
$$ -549046 4002904 715822 -8245562 -12370503 -6385669 2006636 2807127 -3029480 -7498908
4039g498908r11699k029150n111751m557582q22362L121103P089134R905222P278149
$$ -7498908 -8410607 -10439757 -15551508 -20109090 -20931452 -17810349 -10721215 -815993 6462156
4030F462156n12362n151306r56018O334088P631455K497464k922520n196289m600349
$$ 6462156 5949794 798488 -157530 6176558 13808013 16305477 13382957 8186668 3586319
4021C586319j245559L212597L759402j455973n988302l073886M065352O650853
$$ 3586319 2340760 5553357 9312759 7856786 1868484 -1205402 2859950 9510803
4013I510803K857050j109969j229265n8506p87794k809147m175817m124497k461149
$$ 9510803 12367853 11257884 10028619 9970113 9182319 6373172 2197355 -1927142 -4388291
4004d388291L02045K344113K911025M095529O939900P634985K214660o139942
$$ -4388291 -4086246 -1742133 1168892 5264421 12204321 19839306 22053966 15914024
3996A5914024r771192o538622k010128p13668j79931L813402R754444J1701196
$$ 15914024 6142832 -395790 -2405918 -3119586 -3299517 513885 10268329 21969525
3988B1969525O796874j218307o129351n461479k041047m3947o63702k124161k555047
$$ 21969525 28766399 27548092 21418741 15957262 13916215 13872268 13208566 11084405 8529358
3979H529358j219895J921751N361859N690093J459201l155003k766612J227759
$$ 8529358 7309463 9231214 14593073 20283166 21742367 18587364 15820752 17048511
3971A7048511K247983j167269k958859K12372L094571O21142l585966l507604
$$ 17048511 19296494 18129225 15170366 15382738 18477309 19098451 15512485 12004881
3963A2004881n78456k34542k154786j415998K628511N701685N690761L982499
$$ 12004881 11426425 11191883 9037097 7621099 10249610 15951295 21642056 25624555
3955B5624555Q75073l860520o826401m220163J234941L298832J678737J250938
$$ 25624555 26499628 22639108 15812707 11592544 12827485 16126317 17805054 19055992
3947A9055992K219243l16489n851517o831394p68147M663550L385443j02038M36742
$$ 19055992 21275235 20958746 15107229 8275835 7507688 12171238 15556681 15454643 15891385
3938A5891385K079967j567317q487595j0234423l726058N657332J1517830J1462089
$$ 15891385 17971352 16404035 7916440 -2317983 -6044041 -386709 11131121 22593210
3930B2593210O095694j528317o248412n414807k590819k691338m880148m690600
$$ 22593210 28688904 27160587 20912175 15497368 12906549 10215211 5335063 644463
3922F44463j513094J174298J796333J492671n7256l732374o397590l634565K554132
$$ 644463 -868631 305667 2102000 3594671 3537415 -194959 -6592549 -10227114 -7672982
3913g672982N192829K508356J43325J629898L593000L102545K711299M158350
$$ -7672982 -2480153 28203 171528 1801426 5394426 8496971 11208270 15366620
3905A5366620L832474j82927k682986N78509M628478K538269l225933m952816
$$ 15366620 19199094 19016167 16333181 16911690 21540168 24078437 20852504 15899688
3897A5899688k151807q88251k351455j776667J093702M31139m524998o127460
$$ 15899688 13747881 12859630 10508175 8731508 9825210 10256349 5731351 -396109
3889c96109l72389N799920M784963p00080l155493j601746n55947j320347j117527
$$ -396109 -768498 5031422 9816385 9116305 5960812 4359066 3803119 2482772 1365245
3880A365245R02547K574633K673769J566741p42935l373238l364163J85799L056844
$$ 1365245 2267792 4842425 7516194 9082935 8340000 4966762 1602599 1788398 4845242
3871D845242J534828j246409J43225M534935N804530K300272j528934k624137
$$ 4845242 6380070 5133661 5276886 9811821 15616351 17916623 16387689 13763552
3863A3763552k354796j712528N48353L726767M402613J463179k362212m898740
$$ 13763552 11408756 9696228 10244581 13971348 18373961 19837140 17474928 12576188
3855A2576188o150159n193837o58830M804607O040801K935626J116960L324171
$$ 12576188 6426029 1232192 573362 5377969 11418770 14354396 15471356 18795527
3847A8795527N605092M482689K298711K094123K130276o05551n229253q578719
$$ 18795527 24400619 28883308 31182019 33276142 35406418 34800867 29571614 20992895
3839B0992895q678025m520325L163790Q879002N949529l498035q312599k751272
$$ 20992895 12314870 7794545 10958335 19837337 25786866 22288831 13976232 11224960
3831A1224960M984582M647242j510995l973056j160335J57682k350354l295423
$$ 11224960 16209542 20856784 19345789 15372733 14212398 14370080 12019726 8724303
3823H724303J0618K492260k70591m890683n252160p71529L764149M311402J122728
$$ 8724303 8734921 11227181 10956590 6065907 813747 42218 3806367 8117769 9240497
3814I240497k481872l378374j198046J902431L822721L721730Q73084m677732
$$ 9240497 6758625 3380251 2182205 4084636 7907357 11629087 12502171 7824439
3806G824439r464253q710748l296653l0371j631190j715675M925656J2211773
$$ 7824439 -1639814 -10350562 -13647215 -13677586 -15308776 -17024451 -12098795 112978
3798A12978J0605939J665030m032694k080053J559497J654939J36155l85968j432211
$$ 112978 10718917 12383947 8351253 6271200 7830697 9485636 9621791 9235823 7803612
3789G803612l851783m818780k967041j040870n94345N99330L127423L466920J29437
$$ 7803612 3951829 -866951 -3833992 -4874862 -5469207 -4869877 -1742454 1724466 1853903
3780A853903k971979k721902j300423r38112M56610M008522N459376J727293k361969
$$ 1853903 -1118076 -3839978 -5140401 -6078513 -5621903 -1613381 3845995 5573288 3211319
3771C211319m62344M995931N878527O16065l411308n61176N691641Q242346N209120
$$ 3211319 2748975 7744906 13623433 14239498 10828190 10267014 15958655 24201001 29410121
3762B9410121N33264j975669k397629l035114n000282p168700p768095n991312
$$ 29410121 29943385 27967716 25570087 22534973 17534691 10365991 2597896 -3393416
3754c393416k106929K582894N275619L246805k152558n130032k345163J396074
$$ -3393416 -5500345 -2917451 2358168 5604973 3452415 -1677617 -4022780 -2626706
3746b626706j091103q281933j0135378j149560J1585690J6587147J0910893J516540
$$ -2626706 -3717809 -11999742 -22135120 -23284680 -11698990 4888157 15799050 17315590
3738A7315590l885383l652520q92291J210179J823311J677322J234473N36152
$$ 17315590 13430207 9777687 8885396 10095575 11918886 13596208 14830681 15366833
3730A5366833N70544K537576M629275K603875l626266p260940l083369M048436
$$ 15366833 15937377 18474953 23104228 25708103 22081837 14820897 11737528 15785964
3722A5785964N215386J18597l368686j531709J388578K350917L830013O618332
$$ 15785964 21001350 21119947 17751261 16219552 17608130 19959047 23789060 30407392
3714C0407392O649734K708652k30503M73659N10199k953025n618396m286691l494098
$$ 30407392 37057126 39765778 39535275 40008934 40519133 37566108 31947712 27661021 24166923
3705B4166923p345485j1166693q569316j467377L963691O153571O166528K699518
$$ 24166923 16821438 5654745 -2914571 -4381948 -418257 5735314 11901842 14601360
3697A4601360l246292m636843J832850P912401N489593L53959K615185Q450112
$$ 14601360 11355068 6718225 8551075 16463476 21953069 22307028 24922213 33372325
3689C3372325N693021m808380r147915k710307K918580l88455n010635k039724
$$ 33372325 39065346 34256966 25109051 22398744 25317324 24928869 19918234 17878510
3681A7878510L966673L868386j133036l060026r9097K563794J418787k628833
$$ 17878510 21845183 25713569 24580533 21520507 21421410 23985204 25403991 22775158
3673B2775158p505119j0508150q144354j93527Q063736J1169842Q791542L433149
$$ 22775158 15270039 4761889 -3382465 -3575992 4487744 15657586 24449128 27882277
3665B7882277l390728r721260j1864010q305253k085414L368973P400796R107052
$$ 27882277 24491549 14770289 2906279 -5398974 -7484388 -4115415 3285381 12392433
3657A2392433O149774o4759l074621K20291M099777J913528m282572p288427n017482
$$ 12392433 18542207 18477448 15402827 15623118 19722895 21636423 17353851 10065424 5047942
3648E047942j744607j042141k460972m042408l998609r39570M271519Q154619
$$ 5047942 3303335 2261194 -199778 -4242186 -8240795 -9180365 -4908846 3245773
3640C245773Q531679O680448L669159j640891q043182j0206103n954806p80408
$$ 3245773 11777452 18457900 22127059 20486168 12442986 2236883 -3717923 -4498331
3632d498331L62874J007634N849410R982175N163002n204140q299314l42260P508510
$$ -4498331 -4135457 -3127823 2721587 12703762 17866764 12662624 4363310 4021050 11529560
3623A1529560N457642j882799m686823k679633k622879n564704n717461j245918
$$ 11529560 16987202 15104403 10417580 7737947 5115068 -449636 -6167097 -7413015
3615g413015K076736J84944k528365J46095O617794R502852O011195J400114J017378
$$ -7413015 -5336279 -5151335 -7679700 -7533605 -915811 8587041 14598236 15998350 17015728
3606A7015728L074721K315116j826631m874341m286476k521065k446797l524728
$$ 17015728 20090449 22405565 20578934 15704593 11418117 8897052 6450255 2925527
3598B925527m288515n328222p086590o931489j735431P120359J3757134J3313085
$$ 2925527 -1362988 -6691210 -13777800 -20709289 -22444720 -15324361 -1567227 11745858
3590A1745858O632001n79528l086558q09445K194396L351494L911241M432563
$$ 11745858 18377859 17798331 14711773 13902328 16096724 19448218 23359459 27792022
3582B7792022J858374m661317q655033m102696L615237L475115m326630p584790
$$ 27792022 29650396 24989079 16334046 12231350 15846587 19321702 14995072 7410282
3574G410282r81430N241426J650136n584263n404167Q32315L770746J906860J084259
$$ 7410282 6428852 11670278 13320414 7736151 2331984 3164299 6935045 8841905 9926164
3565I926164J811673o10360m766301l881220J879314M959971L195081K183397
$$ 9926164 11737837 11127477 6361176 2479956 4359270 9319241 12514322 14697719
3557A4697719L384746J208874m950142p067422j718608L463039K584305R94301
$$ 14697719 18082465 19291339 14341197 7273775 5555167 9018206 11602511 12596812
3549A2596812M562592Q247353M540068l262273n955579k273082J305879J566520
$$ 12596812 17159404 25406757 29946825 26684552 20728973 18455891 19761770 21328290
3541B1328290P05652n44501l603538o628509n930980k797249k239686m622067
$$ 21328290 22033942 21489441 17885903 11257394 5326414 2529165 289479 -4332588
3533d332588m735175j35809N123321O529006M319798J152660j654529l861641
$$ -4332588 -9067763 -9203572 -4080251 2448755 6768553 7921213 6266684 2405043
3525B405043m923703m243636j604453K384558N218840L870047n49041k152157
$$ 2405043 -2518660 -6762296 -8366749 -5982191 -763351 3106696 2557655 405498
3517D05498K146813P058999N670325l42830l054135K08223M094792M246671K603693
$$ 405498 2552311 9611310 15281635 14938805 11884670 12092893 16187685 20434356 23038049
3508B3038049J951918R69857k277175o115453p501391n570418j154621M087447
$$ 23038049 24989967 25959824 23682649 17567196 10065805 4495387 3340766 7428213
3500G428213O747398L828229k264986m908734j754103K014327J601133o51548
$$ 7428213 14175611 18003840 15738854 10830120 9076017 11090344 12691477 12039929
3492A2039929k92252J595862J010982j511446j878466L42598J218191j078792
$$ 12039929 11747677 13343539 14354521 12843075 10964609 11307207 12525398 11446606
3484A1446606l878499m561810l329287r12727K424543M906872M360068K239657
$$ 11446606 7568107 3006297 -322990 -1235717 1188826 6095698 10455766 12695423
3476A2695423K231936L609301J136825n798638r494815m176848M538277O916406
$$ 12695423 14927359 18536660 19673485 13874847 4380032 203184 4741461 11657867
3468A1657867L000737J466121N313418P370319K412169m188682m890084r98408
$$ 11657867 14658604 16124725 21438143 28808462 31220631 27031949 22141865 21143457
3460B1143457R47033o30354k767947n384823j0098438j2915830p175132M718611
$$ 21143457 22090490 21460136 18692189 13307366 3208928 -9706902 -16882034 -12163423
3452a2163423J1005522N761673k780951m087965P63762L509266K030474R98070
$$ -12163423 -1157901 4603772 1822821 -2265144 -1501382 2007884 4038358 5036428
3444E036428J559917p13664o626949r546196m072553N994628J1632804Q262223
$$ 5036428 6596345 5882681 -744268 -10290464 -14363017 -8368389 3264415 11526638
3436A1526638l59122o211733m378397J941014M285056q55318o357717l333587
$$ 11526638 11167516 4955783 577386 2518400 6803456 5948138 -409579 -3743166
3428c743166N734864R224918K304060o717649q751905n326268k572026m19411
$$ -3743166 1991698 11216616 13520676 6803027 -1948878 -7275146 -9847172 -10266583
3420a0266583M639966J0240164J0344697N439266K417170L866890M746695J308029
$$ -10266583 -5626617 4613547 14958244 20397510 22814680 26681570 31428265 32736294
3412C2736294l195221m294417k396832k47645J012708M28839l509777q830238
$$ 32736294 29541073 25246656 22849824 22602179 23614887 24043726 20533949 11703711
3404A1703711r630418l653070L438967N532026M112447M012900M775657K611442
$$ 11703711 2073293 -1579777 1859190 7391216 11503663 15516563 20292220 22903662
3396B2903662j441189k598728q65450j106333l919069l864753R17911M394773
$$ 22903662 21462473 18863745 17998295 16891962 12972893 9108140 10026051 14420824
3388A4420824J819148k828976l561519j450746r64835j156502K338781Q367833
$$ 14420824 16239972 13410996 9849477 8398731 7433896 6277394 8616175 16984008
3380A6984008J0574911O783506J711829q19569k593949n730104p809091n699180
$$ 16984008 27558919 34342425 36054254 35234685 32640736 26910632 19101541 13402361
3372A3402361q48848K668541L252334K164327P49221m7628R44240L336459L895441
$$ 13402361 12553513 15222054 18474388 20638715 21387936 21340308 22284548 25621007 29516448
3363B9516448M9852n642709p349791k845548L492489N451138J440945m645680
$$ 29516448 29566300 23923591 16573800 13728252 17220741 22671879 24112824 19467144
3355A9467144p982162o918727k841788K333304P085922R380525P267078J571034
$$ 19467144 11484982 4566255 1724467 4057771 11143693 20524218 27791296 29362330
3347B9362330l808990o112454o746428p840065p479836k249319N876378R819855
$$ 29362330 25553340 19440886 12694458 4854393 -2625443 -4874762 1001616 10821471
3339A0821471O244515M26422k84612M614851Q986801P533136R13410n393082n902221
$$ 10821471 17065986 17492408 17207796 21822647 30809448 38342584 39255994 33862912 27960691
3330B7960691l44121M894106K874054n047021r590066n040120K998881M915807
$$ 27960691 27616570 32510676 35384730 30337709 20747643 15707523 18706404 23622211
3322B3622211n63638n889146n055981K16663M325347L648033j569567p507981
$$ 23622211 23058573 17169427 12113446 12330109 16655456 20303489 18733922 11225941
3314A1225941q629453k655778N756959R266163O083466J129655r65706n39369
$$ 11225941 2596488 -59290 5697669 14963832 21047298 22176953 21211247 20671878
3306B0671878j48218p43905j694762j740392P61496N540448Q080757L586214n585973
$$ 20671878 20523660 19779755 18084993 16344601 17106097 22646545 30727302 34313516 28727543
3297B8727543j0713893p123664n5451K540292l67840l704485l872128j796941
$$ 28727543 18013650 10889986 10834535 13374827 13006987 9302502 5430374 3633433
3289C633433j59827q51298l828341n859605k314348O644739J3508970J0949560
$$ 3633433 3473606 2622308 -1206033 -7065638 -9379986 -2735247 10773723 21723283
3281B1723283R16040p545220q869641n418690j739584Q73980K857282L626363
$$ 21723283 22639323 15094103 6224462 805772 -933812 -59832 2797450 6423813
3273F423813K942977K444729L388296M582892M528785L961100M154283M112802
$$ 6423813 9366790 11811519 15199815 19782707 24311492 28272592 32426875 36539677
3265C6539677J974251j457976l104565j649523Q39278J704266L79999k151811
$$ 36539677 38513928 37055952 33951387 32301864 33141142 34845408 35225407 33073596
3257C3073596m766636o252241n768932m471029m864077o880732o671819k077351
$$ 33073596 28306960 22054719 16285787 11814758 6950681 69949 -6601870 -8679221
3249h679221K653526K024944j679985n33544O502163R981520L430416n625714
$$ -8679221 -6025695 -4000751 -5680736 -6214280 287883 10269403 13699819 8074105
3241H074105n601495J952620M723986j330103n865499m86536Q299681R300746
$$ 8074105 2472610 4425230 9149216 7819113 1953614 1467078 9766759 19067505
3233A9067505K954228j299363r9460Q64511j759151l740453j718916M23979k058798
$$ 19067505 22021733 20722370 20622910 21487421 19728270 15987817 14268901 14692880 12634082
3224A2634082o770423p309866k053102M209555O383444L804015o26445l631753
$$ 12634082 5863659 -1446207 -3499309 710246 7093690 10897705 10271260 6639507
3216F639507l860735k488949j606106j565990r03486N99726Q10301r86929j261965
$$ 6639507 2778772 289823 -1316283 -2882273 -3785759 -3186033 -2375732 -3362661 -4624626
3207d624626L366758R605789R723237J773717o401025o758834j761920m72240
$$ -4624626 -1257868 8347921 18071158 19844875 13443850 6685016 4923096 4450856
3199D450856m971132p050590o62138Q145505Q989146J534642m380547k343054
$$ 4450856 -520276 -7570866 -8233004 -87499 8901647 10436289 6055742 3712688
3191C712688L349362N515008L540928J661737J807319K332739J803526M50915
$$ 3712688 7062050 12577058 16117986 17779723 19587042 21919781 23723307 24174222
3183B4174222j031328j471721P12349M863967O874402L516202k911530o989393
$$ 24174222 23142894 21671173 22383522 27247489 34121891 37638093 34726563 27737170
3175B7737170o425147l203417N47119M367800P140044O448784J694041m164857
$$ 27737170 21312023 18108606 18655725 23023525 30163569 36612353 38306394 34141537
3167C4141537p237021o154997k660384J85877L64920j516441l135257l462729
$$ 34141537 26904516 20749519 18089135 18275012 18639932 17123491 13988234 10525505
3159A0525505l694613m225465k813434J830364O409438O459402K590884l67549
$$ 10525505 6830892 2605427 -208007 1622357 8031795 14491197 17082081 16714532
3151A6714532l24991j09926j999112m029473l646862j770401n65223N57166L615841
$$ 16714532 16389541 16279615 14280503 10251030 6604168 4833767 4268544 4825710 8441551
3142H441551P751210R249377O271501J491894j114272j025610j093414k717272
$$ 8441551 16192761 25442138 31713639 33205533 32091261 31065651 29972237 27254965
3134B7254965l255149j95524L584668K499051l437566p383532n107854j394975
$$ 27254965 23999816 23804292 27388960 29888011 26450445 19066913 13959059 12564084
3126A2564084k702236o710990n310832L065250J0519420J0210476M363235m87935
$$ 12564084 9861848 3150858 -2159974 905276 11424696 21635172 25998407 25510472
3118B5510472j859404j843138k292471k907587l022567k914009l236631l732691
$$ 25510472 23651068 21807930 19515459 16607872 13585305 10671296 7434665 3701974
3110C701974k634555J370722N661353M827371j762418o415305k279304N816978
$$ 3701974 1067419 2438141 8099494 12926865 11164447 4749142 2469838 8286816
3102H286816O499268k216050r666085p287910O51276M911785L475907O73985q37290
$$ 8286816 14786084 12570034 2903949 -4383961 -3732685 1179100 4655007 5328992 4491702
3093D491702j171308M25238M367553P629612O769575K928376r568q03386r78049
$$ 4491702 3320394 3745632 8113185 15742797 22512372 25440748 25431180 24627794 23649745
3084B3649745j351549j875613l079631m352371k973911J587654M814206K606398
$$ 23649745 22298196 20422583 17342952 12990581 10016670 11604324 16418530 19024928
3076A9024928k547835n007671l408787l56450K835518N938732O436730K296142
$$ 19024928 16477093 11469422 8060635 7704185 10539703 16478435 22915165 25211307
3068B5211307k941909l683701m07708J393021J8364p84677P41591J742533J111175
$$ 25211307 22269398 18585697 18177989 19571010 19589374 18804697 19546288 21288821 22399996
3059B2399996K345012P142411J0949684Q426800M58237o918835q658837m559882
$$ 22399996 24745008 31887419 42837103 51263903 51722140 44803305 36144468 31584586
3051C1584586Q79856K011245k096976n642355l130370K487297L407521j746697
$$ 31584586 32464442 34475687 32378711 26736356 23605986 26093283 29500804 27754107
3043B7754107o282228n985027m612877n988318o858063k424283N334751J0008998
$$ 27754107 21471879 15486852 10873975 4885657 -1972406 -4396689 938062 10947060
3035A0947060Q861542M282787q79112n463658q651423r697813q493132m839348
$$ 10947060 19808602 24091389 23212277 17748619 9097196 -600617 -9093749 -13933097
3027a3933097J188574O957067Q296474N002165K274594L758908O048793L848741
$$ -13933097 -12744523 -5787456 2509018 7511183 9785777 13544685 19593478 23442219
3019B3442219j707963m450019k035194R81690k86440m616559o514472l134233
$$ 23442219 21734256 17284237 15249043 16230733 15944293 11327734 4813262 1679029
3011A679029K303634M432202K270630l3255L84946R95309q53352j711022L084789
$$ 1679029 3982663 8414865 10685495 10652240 11037186 12032495 11179143 9468121 12552910
3002A2552910R708255Q642397j519181j0573561j0146627l682883J175907L211884
$$ 12552910 22261165 30903562 29384381 18810820 8664193 4981310 6157217 9369101
2994I369101M686108M031960p00351n286233m311285j01568R70725j014602o19267
$$ 9369101 14055209 18087169 17386818 12100585 7789300 7687732 8658457 7643855 7024588
2985G024588K794358M397697L243623L881162P406348Q780614N407832J305764
$$ 7024588 9818946 14216643 17460266 21341428 28747776 37528390 42936222 44241986
2977D4241986l03171k143839o822681j1029859j0232101n319188o38976J574973
$$ 44241986 43938815 41794976 34972295 23942436 13710335 8391147 7752171 9327144
2969I327144J540736l16116k548340k086977K109506O353049O025529J135810
$$ 9327144 10867880 10551764 8003424 5916447 8025953 14379002 20404531 21540341
2961B1540341l898239n179442k784002j75529p60624m076299n809691l211366
$$ 21540341 17642102 12462660 9678658 9503129 8742505 4666206 -1143485 -4354851
2953d354851P93280J786352O02533J414164M029710L960137N88294j149098R59161
$$ -4354851 -3561571 -1775219 -1172686 241478 4271188 8231325 8819619 7670521 8629682
2944H629682K887955K071265K129001N503488P314442K537788n021672p419252
$$ 8629682 11517637 13588902 15717903 21221391 28535833 31073621 26051949 18632697
2936A8632697l545807O08345Q97016j286715l129042l325727j613597P38954J153215
$$ 18632697 15086890 15695235 16592251 15305536 12176494 8850767 7237170 7976124 9129339
2927I129339k74154N76556N296153Q328214M389408k467137m092793n70293N89710
$$ 9129339 8855185 9431741 14727894 23056108 27445516 24978379 20885586 20315293 20905003
2918B0905003l005787n450644l244510p69398j735340k508864J125318O124263
$$ 20905003 17899216 12448572 9204062 8434664 6699324 4190460 5315778 11440041
2910A1440041O664094K851039k25349J978J352486R61157j633254m606123n186725
$$ 11440041 18104135 20955174 20729825 20731803 22084289 23045446 21412192 16806069 11619344
2901A1619344k311824R98820M55438l214951m375600o97629K966502J943912j260129
$$ 11619344 9307520 10306340 10761778 7546827 3171227 2473598 5440100 7384012 6123883
2892F123883j573873O82777J705772J403241K704231M916798L851276j107843
$$ 6123883 4550010 5232787 6938559 8341800 11046031 15962829 19814105 18706262
2884A8706262n322368n455322l396897k224621j964415j178982J09203R84141
$$ 18706262 13383894 7928572 4531675 2307054 342639 -836343 -727140 257001
2876B57001J238925J077472O09534L15045O79714J157153Q50609J2854o03182
$$ 257001 1495926 2573398 3182932 3497977 4177691 5334844 6185453 6198307 5595125
2867E595125j201553j953433j668449J07364Q83713j722070n587460o205723k616729
$$ 5595125 4393572 2440139 771690 879054 1762767 40697 -5546763 -11752486 -14369215
2858a4369215K234178O097656Q255449O967828J607202l066689j242380M576969
$$ -14369215 -12135037 -6037381 2218068 9185896 10793098 7726409 6484029 11060998
2850A1060998N522166m33641m700231j021572N203858N787928J314239k665922
$$ 11060998 16583164 16149523 11449292 10427720 15631578 21419506 22733745 20067823
2842B0067823n311390q700566j0607964p299643j019390K861478M065194N593559
$$ 20067823 14756433 6055867 -4552097 -11851740 -12871130 -10009652 -5944458 -350899
2834c50899O208436K848424j494996j364141Q95108j740220p788557q016179q94020
$$ -350899 5857537 8705961 7210965 5846824 6741932 5001712 -2786845 -10803024 -11697044
2825a1697044L979663J510948r75415K778720O946914M071907k046457l251545
$$ -11697044 -7717381 -6206433 -7181848 -4403128 2543786 6615693 4569236 1317691
2817A317691l29844L62544j184938l9400L477873M740107M143860N905304Q066889
$$ 1317691 987847 1350391 165453 126053 3603926 8344033 12487893 18393197 26460086
2808B6460086L338832q381667j6569642j2550469L9197J0139634J0813405M127397
$$ 26460086 29798918 21417251 4847609 -7702860 -7663663 2475971 13289376 17416773
2800A7416773k319485k587078J692535L061341j887278o886154m408370L156739
$$ 17416773 15097288 12510210 14202745 17264086 15376808 8490654 4082284 7239023
2792G239023O939386M365706J151488R96376J222366j00632m01198J313604J369374
$$ 7239023 14178409 18544115 19695603 20691979 21914345 21813713 21412515 22726119 24095493
2783B4095493k090150n165562m356799j718931k88739R90262L769595N671058
$$ 24095493 22005343 16839781 12482982 10764051 10475312 11465574 15235169 20906227
2775B0906227L480495j701456o063714p625886o370410k291981L661896Q401373
$$ 20906227 24386722 22685266 16621552 8995666 2625256 333275 3995171 12396544
2767A2396544Q974305N289637r6533l454666j824301L375472N458902k46197q580234
$$ 12396544 21370849 26660486 26563953 23109287 21284986 24660458 30119360 29873163 21292929
2758B1292929r740374k714579L173032J733565k423341k827195l98853R30590
$$ 21292929 11552555 8837976 12011008 13744573 11321232 8494037 8095184 9025774
2750I025774J255048J679340L5553m087143n085132Q45988P585007O252536j943662
$$ 9025774 10280822 11960162 11995715 7908572 2823440 3669428 11254435 17506971 15563309
2741A5563309p157417m002208K984386O461295L831578j970342n428233l012065
$$ 15563309 8405892 4403684 7388070 13849365 17680943 15710601 10282368 7270303
2733G270303K469006M111083j54915m466907l783171r18333n82467j534564k55422
$$ 7270303 9739309 13850392 13695477 9228570 5445399 4527066 3944599 2410035 2154613
2724B154613K234432L337075M246628O143317N818471J827061m03652K602412
$$ 2154613 4389045 7726120 11972748 18116065 23934536 25761597 25357945 27960357
2716B7960357M432812q00113o225106k375677N421736M077424n637354j0112396
$$ 27960357 32393169 31593056 25367950 22992273 28414009 32491433 26854079 16741683
2708A6741683n330354k014169n668873p475759q70363O946025P593394L825513
$$ 16741683 11411329 9397160 3728287 -3747472 -4617835 2328190 9921584 13747097
2700A3747097J685737Q39946j1973J754026M907199K102890o759237r856395j551449
$$ 13747097 15432834 16272780 16260807 18014833 22922032 25024922 18265685 8409290 6857841
2691F857841N784229q3395j0936276j0118713K033022J0021701O790569O63113
$$ 6857841 12642070 12558675 1622399 -8496314 -6463292 3558409 10348978 11012091
2683A1012091m10897J938665M122494N817154N555845R22248m728457m488593
$$ 11012091 10601194 12539859 16662353 22479507 28035352 28957600 24229143 19740550
2675A9740550J021057K988977k483652q047735n513579L014792Q254266M864436
$$ 19740550 20761607 23750584 21266932 13219197 7705618 10720410 18974676 23839112
2667B3839112k961392n715623J336743J1142327J1030581j348176j3024220j1680719
$$ 23839112 20877720 15162097 16498840 27641167 38671748 37323572 24299352 12618633
2659A2618633j391318M875390L452834R21864L91771j477223m474252l572140
$$ 12618633 11227315 16102705 19555539 20477403 20869174 19391951 14917699 11345559
2651A1345559Q13490J877581j857022l718680o44392J821111j80333k704959k264121
$$ 11345559 12159049 14036630 12179608 8460928 7816536 9637647 9457314 6752355 4488234
2642D488234j439002j874002l36943L421414L707098n99907j527114N020790J0337269
$$ 4488234 3049232 1175230 838287 4259701 7966799 7366892 5839778 10860568 21197837
2633B1197837N573950l851471o139300p4473N535125N459168J798525k806633
$$ 21197837 26771787 22920316 16781016 16706543 22241668 27700836 29499361 26692728
2625B6692728o690717o228473j82522M807448J665232n743397p471131k471660
$$ 26692728 20002011 13773538 13591016 18398464 20063696 14320299 6849168 4377508
2617D377508Q87085q72573j858966J481773M181922K255762j30151J854104N786504
$$ 4377508 5264593 4392020 2533054 4014827 8196749 10452511 10322360 12176464 17962968
2608A7962968O892339N339657L475606P60092l097210m389196q23856K869202
$$ 17962968 24855307 30194964 33670570 34430662 31333452 26944256 26120400 28989602
2600B8989602J185557k954716k307963K726824L923153k075236q069216o483417
$$ 28989602 30175159 27220443 24912480 27639304 31562457 29487221 21418005 14934588
2592A4934588L04447M259588K642897m14728j522689j930320l310031l928309
$$ 14934588 15239035 19498623 22141520 21726792 20204103 18273783 14963752 11035443
2584A1035443j279605L624262O827423N658274J233423k729178l020230K39966
$$ 11035443 9755838 13380100 20207523 25865797 27099220 24370042 21349812 21589778
2576B1589778L336478K690610n50422j442792J933135M739775J223829o954354
$$ 21589778 24926256 27616866 27066444 25623652 27556787 32296562 33520391 26566037
2568B6566037j1737069q143673M57016P262165R017386O542965J465549m401219
$$ 26566037 14828968 6685295 7142311 14404476 23421862 29964827 31430376 27029157
2560B7029157p931807o495396j392235K745614L004420J340872J485942L440795
$$ 27029157 19097350 12601954 11209719 13955333 16959753 18300625 19786567 23227362
2552B3227362L030765k109174p829088p601650j335470L560711J764731k858628
$$ 23227362 26258127 24148953 16319865 8718215 7382745 10943456 12708187 9849559
2544I849559l271418O96659L615600L905638N173274P790564O584556j30596n832565
$$ 9849559 6578141 7274800 10890400 14796038 19969312 27759876 34344432 34213836 28381271
2535B8381271m960122j640110l176285q329893q988423k211298N913196Q837873
$$ 28381271 23421149 21781039 18604754 10274861 1286438 -924860 4988336 13826209
2527A3826209O505674K487807j122876l756032m689945l926203k956292k784099
$$ 13826209 20331883 22819690 21696814 17940782 13250837 9324634 6368342 3584243
2519C584243k330263j58536L008106M653942L296469N04335l59823J946333M297652
$$ 3584243 1253980 1095444 4103550 8757492 12053961 12558296 12198473 14144806 18442458
2510A8442458K583015k537275n799861m283156j189739o21075j661177r35032
$$ 18442458 21025473 18488198 12688337 8405181 7215442 6594367 4933190 3998158
2502C998158J510054K992773L053332K990911J760941k595295p652841p955739
$$ 3998158 5508212 8500985 11554317 14545228 16306169 13710874 6058033 -1897706
2494a897706k556302L420280N835631N459956L419718j727701q958594j1645033
$$ -1897706 -4454008 -1033728 4801903 10261859 13681577 11953876 2995282 -8649751
2486h649751m840599O555640J2112310P908845J41897l442781j873433N10160
$$ -8649751 -13490350 -6934710 5177600 13086445 13228342 9785561 7912128 8422288
2478H422288O69159n68937j343365j511094j789113j563013O67866M399684O276319
$$ 8422288 9091447 8522510 7179145 5668051 3878938 2315925 2983791 7383475 13659794
2469A3659794L623307j844869n588307n437317l497304k603557k775784k221360
$$ 13659794 17283101 15438232 9849925 4412608 915304 -1688253 -4464037 -6685397
2461f685397m01207J476626K540960L498611N429456P789721Q183716M720251
$$ -6685397 -7086604 -5609978 -3069018 429593 5859049 13648770 21832486 26552737
2453B6552737j343395o201298p205898m922622r79265M050510Q738201R032010
$$ 26552737 25209342 19008044 11802146 6879524 5900259 9950769 18688970 27720980
2445B7720980K342826o994024j0611703n809623J079353K961555M81101o51977
$$ 27720980 30063806 23069782 12458079 6648456 7727809 10689364 11170465 10518488
2437A0518488J630074L764686K615691m78412k698270l637648m158049l508974
$$ 10518488 12148562 15913248 18528939 18050527 15352257 11714609 7556560 4047586
2429D047586n61294K759907K637640r37304k580786J657882P785512Q088606J477165
$$ 4047586 3486292 6246199 8883839 7946535 5365749 7023631 14809143 22897749 24374914
2420B4374914m855699n241696k257575p56139J29525L679755P384900N222965
$$ 24374914 19519215 14277519 12019944 11263805 11393330 15073085 22457985 27680950
2412B7680950k042172n988120k313435K531729O10407o081649q865225m686288
$$ 27680950 25638778 19650658 17337223 19868952 20479359 14397710 5532485 846197
2404H46197O56498J559951l61448l52476K112826L442345J839507m04947p76362
$$ 846197 1502695 3062646 2701198 2348722 4461548 7903893 9743400 9338453 8562091
2395H562091J83849P31685O68545J48275k105145o081836p575296k797535M266395
$$ 8562091 8745940 9477625 10146170 10294445 8189300 2107464 -5467832 -8265367 -3998972
2386c998972N036791j295900m941530Q24029R199685R589086L000250q71252P86002
$$ -3998972 1037819 -258081 -5199611 -4375582 4824103 14413189 17413439 16542187 17328189
2377A7328189J325346k254364m062703m67577K660100n03360n777730n102044
$$ 17328189 18653535 16399171 12336468 11868891 14528991 14025631 8247901 3145857
2369C145857J887957Q386592R253663M244861m277550j1629591j1844858m079000
$$ 3145857 5033814 13420406 22674069 26918930 22641380 11011789 -833069 -4912069
$$ [...]
##END NTUPLES=NMR SPECTRUM
##END=
