##TITLE=31P_DE-80H_X3
 64 sc D2O
 26.2.2025
##JCAMPDX= 6.0         $$ Bruker NMR JCAMP-DX V2.0
##DATA TYPE= NMR SPECTRUM
##DATA CLASS= NTUPLES
##ORIGIN= UXNMR, Bruker Analytische Messtechnik GmbH
##OWNER= root
$$ XWIN-NMR		Version 3.5
$$ Fri May 16 14:18:56 2025 Russian Standard Time (UT+4h)  Yarkov@DPX200
##.OBSERVE FREQUENCY= 81.013821
##.OBSERVE NUCLEUS= ^31P
##.ACQUISITION MODE= SIMULTANEOUS
##.ACQUISITION SCHEME= undefined
##.AVERAGES= 64
##.DIGITISER RES= 17
##SPECTROMETER/DATA SYSTEM= spect
##.PULSE SEQUENCE= zgpg30
##.SOLVENT NAME= CDCl3
##.SHIFT REFERENCE= (INTERNAL, CDCl3, 0, 198.062)
##AUDIT TRAIL= $$ (NUMBER, WHEN, WHO, WHERE, WHAT)
$$ ##TITLE= Audit trail, XWIN-NMR		Version 3.5
$$ ##JCAMPDX= 5.01
$$ ##ORIGIN= Bruker BioSpin GmbH
$$ ##OWNER= Yarkov
$$ C:/Bruker/XWIN-NMR/data/yarkov2/nmr/P31/2/pdata/1/auditp.txt
$$ ##AUDIT TRAIL=  $$ (NUMBER, WHEN, WHO, WHERE, WHAT)
(   1,<2025-05-16 14:17:51.28 +0400>,<Yarkov>,<DPX200>,
      <created by zg, POWCHK disabled, PULCHK disabled
       configuration hash MD5:
       00 E9 B6 7A A2 85 ED C7 34 08 36 98 17 FE 4E 26
       data hash MD5: 32K
       65 C7 DA 04 ED 91 EE 2E C4 AC 54 66 C5 A5 1B 65>)
(   2,<2025-05-16 14:17:57.57 +0400>,<Yarkov>,<DPX200>,
      <Start of raw data processing
       efp BC_mod = 2 LB = 1.5 FT_mod = 6 PKNL = 1 PHC0 = 1783.64 PHC1 = 76.9595 SI = 64K 
       data hash MD5: 64K
       B1 F6 F3 75 8C 08 4B 80 26 88 5A 66 02 9B E2 C0>)
(   3,<2025-05-16 14:18:24.29 +0400>,<Yarkov>,<DPX200>,
      <pk PHC0 = -29.84975 PHC1 = 0 
       data hash MD5: 64K
       B6 E0 B7 4D 78 75 F9 CA BA 26 91 9A 2F 6F 88 15>)
$$ ##END=
$$ 
$$ hash MD5
$$ CD C2 D4 7A CC 8D B6 0B E3 7D 0C FD 3B A9 77 1B
##$RELAX= 
##$RELAX= 
##$RELAX= 
##$RELAX= 
##$RELAX= 
##$RELAX= 
##$RELAX= 
##$RELAX= 
$$ Bruker specific parameters
$$ --------------------------
##$DU= <C:/Bruker/XWIN-NMR>
##$EXPNO= 2
##$NAME= <P31>
##$PROCNO= 1
##$TYPE= <nmr>
##$USER= <yarkov2>
##$AMP= (0..31)
100 100 100 100 100 100 100 100 100 100 100 100 100 100 100 100 100 100 
100 100 100 100 100 100 100 100 100 100 100 100 100 100 
##$AQSEQ= 0
##$AQ_mod= 1
##$AUNM= <au_zg>
##$AUTOPOS= <>
##$BF1= 81.014009
##$BF2= 200.13
##$BF3= 200.13
##$BF4= 200.13
##$BF5= 200.13
##$BF6= 200.13
##$BF7= 200.13
##$BF8= 200.13
##$BYTORDA= 1
##$CFDGTYP= 0
##$CFRGTYP= 5
##$CHEMSTR= <none>
##$CNST= (0..31)
1 1 145 1 1 1 1 1 1 1 1 1 1 1 1 1 1 1 1 1 1 1 1 1 1 1 1 1 1 1 1 1 
##$CPDPRG= <waltz16>
##$CPDPRG1= <>
##$CPDPRG2= <waltz16>
##$CPDPRG3= <>
##$CPDPRG4= <mlev>
##$CPDPRG5= <mlev>
##$CPDPRG6= <mlev>
##$CPDPRG7= <mlev>
##$CPDPRG8= <mlev>
##$CPDPRGB= <>
##$CPDPRGT= <>
##$D= (0..31)
0 1 0 0 0 0 0 0 0 0.06 0 0.03 2e-05 3e-06 0 0 0.0002 0 0 0 0 0 0 0 0 0 
0 0 0 0 0 0 
##$DATE= 1747390670
##$DBL= (0..7)
120 120 120 11 120 120 24 19 
##$DBP= (0..7)
150 150 150 150 150 150 150 150 
##$DBP07= 0
##$DBPNAM0= <>
##$DBPNAM1= <>
##$DBPNAM2= <>
##$DBPNAM3= <>
##$DBPNAM4= <>
##$DBPNAM5= <>
##$DBPNAM6= <>
##$DBPNAM7= <>
##$DBPOAL= (0..7)
$$ [...]
##$SUBNAM2= <"">
##$SUBNAM3= <"">
##$SUBNAM4= <"">
##$SUBNAM5= <"">
##$SUBNAM6= <"">
##$SUBNAM7= <"">
##$SUBNAM8= <"">
##$SUBNAM9= <"">
##$SW= 400.765351723535
##$SWIBOX= (0..15)
0 1 3 0 0 0 0 0 0 0 0 0 0 0 0 0 
##$SW_h= 32467.5324675325
##$TD= 32768
##$TD0= 1
##$TE= 0
##$TE2= 300
##$TE3= 300
##$TEG= 300
##$TL= (0..7)
0 120 53 12 22 120 120 120 
##$TP= (0..7)
150 150 150 150 150 150 150 150 
##$TP07= 0
##$TPNAME0= <>
##$TPNAME1= <>
##$TPNAME2= <>
##$TPNAME3= <>
##$TPNAME4= <>
##$TPNAME5= <>
##$TPNAME6= <>
##$TPNAME7= <>
##$TPOAL= (0..7)
0.5 0.5 0.5 0.5 0.5 0.5 0.5 0.5 
##$TPOFFS= (0..7)
0 0 0 0 0 0 0 0 
##$TUNHIN= 0
##$TUNHOUT= 0
##$TUNXOUT= 0
##$USERA1= <user>
##$USERA2= <user>
##$USERA3= <user>
##$USERA4= <user>
##$USERA5= <user>
##$V9= 5
##$VALIST= <valist>
##$VCLIST= <CCCCCCCCCCCCCCC>
##$VD= 0
##$VDLIST= <DDDDDDDDDDDDDDD>
##$VPLIST= <PPPPPPPPPPPPPPP>
##$VTLIST= <TTTTTTTTTTTTTTT>
##$WBST= 1024
##$WBSW= 4
##$XGAIN= (0..3)
0 0 0 0 
##$XL= 0
##$YL= 0
##$YMAX_a= 64355
##$YMIN_a= -74428
##$ZGOPTNS= <>
##$ZL1= 120
##$ZL2= 120
##$ZL3= 120
##$ZL4= 120
##$ABSF1= 0
##$ABSF2= 0
##$ABSG= 0
##$ABSL= 0
##$ALPHA= 0
##$AQORDER= 0
##$ASSFAC= 0
##$ASSFACI= 0
##$ASSFACX= 0
##$ASSWID= 0
##$AUNMP= <proc_1d>
##$AZFE= 0.1
##$AZFW= 0.5
##$BCFW= 0
##$BC_mod= 2
##$BYTORDP= 0
##$COROFFS= 0
##$CY= -3
##$DATMOD= 1
##$DC= 0
##$DFILT= <>
##$DTYPP= 0
##$F1P= 0
##$F2P= 0
##$FCOR= 1
##$FTSIZE= 65536
##$FT_mod= 6
##$GAMMA= 0
##$GB= 0
##$INTBC= 1
##$INTSCL= 9.790993e-09
##$ISEN= 30
##$LB= 1.5
##$LEV0= 0
##$LPBIN= 0
##$MAXI= 10000
##$MC2= 0
##$MEAN= 0
##$ME_mod= 0
##$MI= 50
##$NCOEF= 0
##$NC_proc= -5
##$NLEV= 6
##$NOISF1= 182.463
##$NOISF2= 159.3651
##$NSP= 0
##$NTH_PI= 0
##$NZP= 0
##$OFFSET= 198.0616
##$PC= 4
##$PHC0= 1753.79
##$PHC1= 76.9595
##$PH_mod= 1
##$PKNL= yes
##$PPARMOD= 0
##$PSCAL= 0
##$PSIGN= 0
##$REVERSE= no
##$SF= 81.0140089999434
##$SI= 65536
##$SIGF1= 159.3651
##$SIGF2= -187.1042
##$SINO= 113.3802
##$SIOLD= 16384
##$SREGLST= <1H.CDCl3>
##$SSB= 0
##$STSI= 65536
##$STSR= 0
##$SW_p= 32467.5324675325
##$SYMM= 0
##$S_DEV= 0
##$TDeff= 32768
##$TDoff= 0
##$TI= <>
##$TILT= no
##$TM1= 0
##$TM2= 0
##$TOPLEV= 0
##$USERP1= <user>
##$USERP2= <user>
##$USERP3= <user>
##$USERP4= <user>
##$USERP5= <user>
##$WDW= 1
##$XDIM= 65536
##$YMAX_p= 348017806
##$YMIN_p= -30632064
$$ End of Bruker specific parameters
$$ ---------------------------------
##NTUPLES= NMR SPECTRUM
##VAR_NAME=  FREQUENCY,     SPECTRUM/REAL,   SPECTRUM/IMAG
##SYMBOL=    X,             R,               I
##VAR_TYPE=  INDEPENDENT,   DEPENDENT,       DEPENDENT
##VAR_FORM=  AFFN,          ASDF,            ASDF
##VAR_DIM=   65536,         65536,           65536
##UNITS=     HZ,            ARBITRARY UNITS, ARBITRARY UNITS
##FACTOR=    0.49542278885378, 1,            1
##FIRST=     16045.7642231865, 0,            0
##LAST=      -16421.768244346, 0,            0
##MIN=       -16421.768244346, -30632064,    0
##MAX=       16045.7642231865, 348017806,    0
$$ Real data points
##PAGE= N=1
##DATA TABLE= (X++(R..R)), XYDATA
$$ [...]
49207 1473026 1246012 1229557 1232352 837996 40232 -700713 -1021763 -1024335 -1011018 -1049280 -939563
49196 -939563 -541295 2930 395365 481538 365612 217937 44975 -240901 -559732 -667263
49186 -667263 -493199 -281852 -241179 -229038 -22852 235526 185540 -188796 -469950 -348420
49176 -348420 31570 365605 547567 584956 426774 114033 -75122 119821 621217 1110077
49166 1110077 1340415 1225107 779723 191170 -194377 -195110 -26668 -8968 -146845 -228678
49156 -228678 -217871 -255824 -364006 -469707 -671696 -1107035 -1558788 -1624367 -1366986 -1348798
49146 -1348798 -1793410 -2130204 -1723281 -749548 54640 312830 235981 61727 -220214 -521923
49136 -521923 -497478 37905 797502 1343061 1533177 1488170 1301668 1010675 733285 599633
49126 599633 572862 511219 387044 289219 225854 92569 -138265 -340491 -389093 -274495
49116 -274495 -28901 325266 685718 858952 750257 487371 263126 135933 80418 127571
49106 127571 295819 451183 426683 268275 179236 211001 205324 86944 2156 67867 187556
49095 187556 270736 446878 832577 1208611 1204770 788109 318729 78423 -37565 -269832
49085 -269832 -619896 -870246 -880305 -721921 -544883 -403241 -231481 36054 331973 469570
49075 469570 333560 34097 -197301 -248832 -180237 -47972 190602 539323 823525 792741
49065 792741 372988 -208210 -566262 -476788 -88418 226636 278104 229833 288720 361115
49055 361115 218232 -88616 -267041 -250619 -318881 -636074 -954060 -975496 -788925 -693446
49045 -693446 -751302 -788778 -738735 -688167 -617803 -390653 -58228 61464 -270588 -922828
49035 -922828 -1518890 -1753945 -1561944 -1103422 -648986 -384132 -284082 -227932 -193900 -231238
49025 -231238 -294790 -281447 -208072 -158792 -73446 161479 390220 273174 -173188 -434263
49015 -434263 -141327 379462 504442 105842 -364800 -494022 -296773 -39616 17774 -275596
49005 -275596 -801209 -1100863 -804376 -182812 82884 -203457 -475896 -227579 281742 477102
48995 477102 304817 165937 207730 190150 16531 -100432 -90477 -198683 -518869 -722082
48985 -722082 -515047 -109211 53542 -116407 -309548 -260520 -14738 200591 198961 -37205
48975 -37205 -321890 -406007 -257569 -136249 -292432 -671475 -1001561 -1064456 -792747 -265969
48965 -265969 234764 332030 -67555 -595480 -819312 -715318 -551059 -449903 -360199 -350846
48955 -350846 -582599 -983413 -1267679 -1312170 -1231361 -1073404 -782111 -515413 -610847 -1057347
48945 -1057347 -1334919 -1024141 -336859 177420 234356 -77223 -536706 -875303 -844768 -528283
48935 -528283 -427043 -898996 -1613342 -1903635 -1599649 -1151717 -946994 -900319 -817986 -781787
48925 -781787 -928074 -1098251 -1009593 -680297 -432306 -475048 -678564 -803111 -794609 -738873
48915 -738873 -618292 -304821 157283 436428 267487 -140603 -279915 26881 383741 327306
48905 327306 -101154 -459833 -453576 -177834 112559 271131 293802 242414 176009 94335 -38232
48894 -38232 -181843 -219905 -130237 -42489 -37104 -27429 35633 4977 -231533 -498053 -525288
48883 -525288 -300342 -25074 155710 171248 -70659 -500254 -739051 -500564 -74025 -24598
48873 -24598 -425205 -789076 -804441 -711880 -828420 -1089688 -1247135 -1194160 -933250 -543994
48863 -543994 -334235 -640949 -1261516 -1475870 -933563 -151906 220065 257085 402570 577588
48853 577588 286861 -465642 -988652 -760162 -23821 619377 844239 660025 167948 -490351
48843 -490351 -1109016 -1523462 -1668333 -1504681 -1052190 -522504 -212517 -181264 -194556 -44643
48833 -44643 243904 552208 784398 789531 438810 -75772 -279303 18466 382050 252381
48823 252381 -316473 -714556 -552231 -98729 131238 36 -195454 -144337 187565 628312
48813 628312 958525 963469 517825 -229857 -851853 -1003601 -782088 -567586 -514121 -395712
48803 -395712 -9695 486580 770577 704608 350642 -165524 -616030 -717937 -509817 -508253
48793 -508253 -1121965 -2012323 -2452812 -2286828 -2043489 -2029147 -1855207 -1157545 -316928 -1737
48783 -1737 -264569 -575032 -618357 -586522 -685966 -807701 -819251 -840011 -1015338 -1220926 -1194503
48772 -1194503 -868453 -439476 -169349 -195082 -458741 -736167 -782429 -528450 -132319 177066
48762 177066 277991 191693 24501 -87899 -43000 151395 364756 445297 355026 203033
48752 203033 120826 86401 -79358 -464098 -847685 -875088 -473279 52711 401982 585171
48742 585171 733823 790065 603734 224950 -145124 -442224 -738690 -983619 -997534 -744474
48732 -744474 -373347 33558 497104 887871 940944 646945 344956 255580 190775 -57706
48722 -57706 -313848 -308583 -168212 -241360 -541127 -728201 -622005 -379822 -145428 141379
48712 141379 501884 782346 871551 802919 554855 43970 -545319 -744601 -368159 143955
48702 143955 248312 1684 -74796 257874 687749 853669 818640 904738 1211480 1444852
48692 1444852 1227569 566949 -15152 49954 709775 1255018 1110892 509776 144487 283240
48682 283240 548406 526670 228192 -137093 -490439 -800391 -922844 -766763 -492086 -354399
48672 -354399 -425635 -579872 -656304 -546743 -254302 30805 55907 -179268 -383941 -377857
48662 -377857 -351432 -543482 -827501 -861362 -546459 -97009 277660 517459 583349 443648
48652 443648 213073 104042 208823 474838 853924 1272085 1486892 1241202 604557 -67660
48642 -67660 -560628 -942545 -1229125 -1221852 -862514 -478894 -399487 -487245 -352409 57499
48632 57499 388057 392095 206022 23722 -216679 -604613 -909896 -777205 -244988 224775
48622 224775 333398 310955 504224 807959 818185 465054 127977 74901 145269 138114 172736
48611 172736 407158 677684 742128 673708 668836 649255 458305 304289 519069 923728
48601 923728 966232 557083 235005 331656 492508 309429 -44895 -191931 -151786 -116332
48591 -116332 60395 602303 1214497 1303525 786150 210925 12721 45778 -32395 -253460
48581 -253460 -383496 -256973 72890 384762 432101 156325 -239372 -549278 -828498 -1211929
48571 -1211929 -1560877 -1565222 -1174700 -651477 -195661 189896 451641 446499 243525 141189
48561 141189 240075 284941 89012 -171149 -281831 -340207 -524576 -739100 -767286 -616369
48551 -616369 -436236 -234169 43936 255281 190810 -78852 -270854 -290772 -302835 -403302
48541 -403302 -500290 -555164 -662043 -794528 -737480 -420834 -97363 2217 4315 141575 295695
48530 295695 96622 -515630 -1111682 -1280620 -1121379 -1046742 -1215503 -1387763 -1332600 -1141503
48520 -1141503 -1023870 -969182 -817207 -592805 -533429 -730931 -934894 -836749 -437280 -230
48510 -230 286920 465752 655450 890006 1114190 1222647 1082657 640357 60328 -349588
48500 -349588 -450358 -444035 -624699 -985349 -1193760 -984771 -475385 -29396 115527 2
48490 2 -223490 -478633 -757361 -1019054 -1173635 -1152609 -980249 -796133 -784169 -996684 -1241189
48479 -1241189 -1248033 -995302 -761070 -790403 -1031646 -1291291 -1491766 -1602405 -1462057 -954454
48469 -954454 -321388 5935 -50239 -116358 76631 312929 255215 -53316 -321791 -484332
48459 -484332 -718057 -1045281 -1241434 -1190221 -1061987 -1028347 -1006130 -826115 -512452 -251739
48449 -251739 -178995 -312891 -610404 -946968 -1107080 -953586 -605811 -332930 -263778 -295246
48439 -295246 -273861 -146120 73740 327905 447152 224649 -299853 -745324 -771662 -508743
48429 -508743 -395834 -593018 -796785 -733351 -584845 -696085 -1009159 -1093254 -736689 -241671
48419 -241671 -31614 -156725 -325721 -296465 -69791 247227 601633 979542 1325700 1546450
48409 1546450 1577207 1412289 1075689 621524 213663 141063 588564 1329999 1806884 1668806
48399 1668806 1141882 690193 410911 24527 -563768 -1023172 -1039559 -731905 -434313 -262911
48389 -262911 -130830 -51631 -151178 -406910 -607533 -604723 -443250 -216596 52326 324279
48379 324279 447997 246794 -300915 -980191 -1454269 -1528788 -1338419 -1196065 -1208315 -1147849
48369 -1147849 -802141 -332596 -121302 -312465 -669700 -872067 -803767 -558163 -309611 -208193
48359 -208193 -275033 -369242 -351914 -272848 -264418 -259489 -7920 542736 1042123 1062938 572048
48348 572048 -43310 -397431 -456159 -459682 -582698 -739109 -717355 -442941 -41984 329023
48338 329023 604950 732529 611104 248142 -101033 -119359 233761 684252 949253 976491
48328 976491 878431 751423 602773 381222 61031 -244720 -289245 70150 648558 1085283
48318 1085283 1229633 1223848 1179241 975288 502741 -62527 -427632 -554916 -669755 -890816
48308 -890816 -1024921 -812027 -278084 256202 490261 385114 87860 -290006 -732260 -1184742
48298 -1184742 -1480382 -1463783 -1145452 -687319 -281120 -76270 -141375 -395639 -620807 -651930
48288 -651930 -558031 -561432 -787801 -1155221 -1479597 -1623369 -1584645 -1517039 -1602847 -1810766 -1854314
48277 -1854314 -1525838 -1003285 -653645 -583202 -591899 -551060 -565784 -700268 -796921 -719582 -592719
48266 -592719 -616383 -748162 -732664 -400004 169270 722985 1005643 925945 639181 392478
48256 392478 230214 -36060 -485333 -866862 -891904 -646911 -493707 -562042 -562775 -215850
48246 -215850 274503 354672 -251035 -1169711 -1731215 -1648384 -1232414 -927987 -798011 -584727
48236 -584727 -154217 317964 575868 524038 239689 -97535 -281518 -244530 -165460 -270547
48226 -270547 -533996 -748245 -864905 -1013461 -1146723 -966743 -359012 325940 611692 366208
48216 366208 -203714 -845772 -1367025 -1594392 -1450837 -1035191 -521434 -49650 240793 237864
48206 237864 10562 -232624 -424551 -673682 -938521 -969505 -752634 -683982 -1012425 -1396579
48196 -1396579 -1384228 -1097707 -1006506 -1173542 -1209010 -929234 -596678 -463706 -490215 -589410
48186 -589410 -768106 -910892 -782199 -397914 -99565 -110426 -278217 -381862 -417251 -433075
48176 -433075 -358692 -181384 -59456 -68681 -47863 113290 240554 146004 -49626 -107610 -44203
48165 -44203 -51049 -122581 -33886 290382 593735 560925 178831 -241160 -372009 -164709 172896
48154 172896 442378 591250 571620 273900 -224599 -540033 -415450 -149310 -206175 -467250
48144 -467250 -371239 126623 319661 -226092 -929298 -960040 -391350 -13193 -193303 -531498
48134 -531498 -622678 -572623 -601410 -613114 -422026 -86224 238887 547158 849658 989464
48124 989464 836715 547433 402234 464503 592448 705708 806572 777782 443701 -85613
48114 -85613 -377972 -169402 261681 427024 245301 64024 72156 6021 -402981 -944187
48104 -944187 -1170427 -996540 -743538 -603798 -377957 145199 782288 1113244 954874 556765
48094 556765 359858 592825 1049239 1267398 1003124 473694 27154 -307341 -709760 -1118756
48084 -1118756 -1252340 -1086914 -919562 -851506 -622972 -156478 155242 14343 -295861 -373104
48074 -373104 -321205 -444353 -574742 -279512 362717 773384 698689 499223 507062 584895
48064 584895 516003 391303 336578 210830 -105699 -382395 -324486 -25263 158333 70778
48054 70778 -159137 -413107 -697533 -976985 -1112349 -1017641 -772776 -567139 -581235 -863810
48044 -863810 -1245731 -1443426 -1341021 -1107922 -955126 -871414 -728558 -562806 -570709 -831252
48034 -831252 -1182375 -1401403 -1400850 -1231627 -1008928 -869536 -881997 -920352 -721799 -186374
48024 -186374 431188 768587 793692 829296 1062391 1202838 841141 71002 -519541 -536670
48014 -536670 -208708 18237 84366 268049 675761 1092514 1332239 1452347 1539105 1511124
48004 1511124 1282091 972501 797433 803718 848135 824195 805520 913616 1082469 1051795
47994 1051795 682623 237801 176912 602704 1075058 1112194 730641 297084 -18678 -352269
47984 -352269 -741377 -937171 -738876 -314060 -45865 -157941 -558324 -963740 -1136790 -1075368
47974 -1075368 -969264 -907764 -722981 -276339 206466 340814 81081 -269203 -536681 -832879
47964 -832879 -1159346 -1217897 -818925 -226160 121236 59424 -275195 -667924 -912669 -892609
47954 -892609 -763486 -855012 -1196638 -1366793 -1060425 -588309 -489719 -794265 -1016989 -825526
47944 -825526 -391847 -97130 -172169 -626485 -1254233 -1681356 -1660935 -1367626 -1178907 -1147682
47934 -1147682 -953087 -429878 136632 379298 278625 56539 -158939 -351768 -443050 -346705
47924 -346705 -160693 -94813 -197731 -321632 -375684 -436083 -530913 -486795 -149941 334228
47914 334228 652266 705509 662518 616866 442620 107304 -126779 -57852 85909 -43558
47904 -43558 -344220 -396522 -159674 -91974 -430227 -770049 -660971 -301530 -250042 -611966
47894 -611966 -913579 -749534 -222519 288418 516017 390885 -22686 -537465 -903791 -970766
47884 -970766 -771854 -449097 -137890 92722 242495 316993 260878 30242 -255235 -362695
47874 -362695 -212043 35073 220737 372825 548760 678210 717230 805250 1076409 1412104
47864 1412104 1551386 1377706 979926 536149 244112 221807 353999 391445 302805 309112
47854 309112 452528 443122 155391 -54465 145003 527983 671024 585259 550838 550936 375534
47843 375534 121397 49467 54245 -170736 -515157 -583898 -403097 -364515 -466069 -318175
47833 -318175 -11629 -204251 -1051789 -1768250 -1669078 -1036136 -484992 -70852 393773 652354
47823 652354 365247 -145673 -231805 133179 370123 204390 -30165 -33617 38839 -68843
47813 -68843 -334565 -586971 -737616 -770149 -703688 -641370 -703253 -885557 -1095856 -1276708
47803 -1276708 -1375982 -1299878 -1048920 -788932 -639615 -536685 -443715 -480556 -645245 -678927
47793 -678927 -493682 -455789 -856480 -1343915 -1357715 -954717 -656589 -560134 -216834 516551
47783 516551 1096885 1016432 466561 -7686 -186462 -223045 -272302 -375789 -573287 -869424
47773 -869424 -1136041 -1199434 -999511 -621499 -255426 -127672 -323169 -644901 -795213 -715920
47763 -715920 -600237 -580541 -601102 -602944 -608993 -588004 -452321 -242346 -112779 -105007 -148272
47752 -148272 -293538 -664181 -1122621 -1306804 -1133141 -968046 -1111966 -1370321 -1364371 -1060552
47742 -1060552 -733677 -540079 -385272 -164848 73396 224198 268345 296656 398901 498444
47732 498444 363660 -79795 -517541 -562324 -285845 -146291 -342920 -574326 -560048 -448379
47722 -448379 -471000 -497242 -252931 213273 595948 734125 670303 437969 84964 -185732
47712 -185732 -202441 -105416 -158620 -312468 -248212 122912 483652 506619 206301 -177688
47702 -177688 -454066 -555630 -514754 -457942 -492313 -527976 -356736 7858 220693 -19453
47692 -19453 -568536 -958193 -891769 -506031 -159525 -94936 -340213 -794866 -1272869 -1516279
47682 -1516279 -1347135 -869461 -406711 -165007 -61658 34872 48458 -144149 -412974 -495132
47672 -495132 -400243 -433638 -753562 -1136602 -1291269 -1213316 -1103438 -1092271 -1180303 -1310789
47662 -1310789 -1353852 -1124950 -580347 40861 373475 222988 -295364 -841775 -1090913 -1006063
47652 -1006063 -870733 -931062 -1075970 -1067561 -981095 -1067220 -1206505 -966421 -334986 74483
47642 74483 -168236 -697310 -899585 -737580 -615348 -698623 -828409 -930302 -1056838 -1137770
47632 -1137770 -1099942 -1118821 -1337461 -1470600 -1166811 -668837 -575595 -960525 -1283857 -1243505
47622 -1243505 -1133392 -1183910 -1111989 -639199 -7142 387126 536524 661530 783069 805045
47612 805045 802146 878367 888581 614844 123132 -308094 -518850 -516354 -331174 -75780 -36305
47601 -36305 -424066 -1056428 -1497353 -1507905 -1208287 -845019 -562486 -373207 -209940 -15540
47591 -15540 152687 186772 151408 279976 623309 887962 827068 633235 674868 934902
47581 934902 1011616 676297 156700 -200190 -324185 -369285 -424028 -421712 -290863 -85525
47571 -85525 74524 179383 377972 754960 1082742 978384 396687 -197459 -306247 57604
47561 57604 457933 565067 420419 249946 218744 351308 520672 517119 265093 -48186
47551 -48186 -187717 -165508 -173204 -283019 -401734 -474909 -521520 -487491 -305797 -119271 -184656
47540 -184656 -478679 -644548 -457374 -130417 667 -88497 -197573 -286841 -521852 -942297
47530 -942297 -1286143 -1223555 -702207 -30162 373167 347158 143889 163986 512517 890740
47520 890740 957243 684830 299622 5554 -115381 -71646 -17396 -233933 -810214 -1374612
47510 -1374612 -1417664 -931583 -459993 -388442 -449104 -162628 423604 764038 530804 -6678
47500 -6678 -364461 -346475 -69969 270401 488345 416433 42377 -408155 -656516 -607407
47490 -607407 -340086 22917 328330 405019 244650 90444 158451 323861 276682 -50943
47480 -50943 -421229 -631313 -684221 -607104 -358408 -7382 215531 183333 32030 -58681
47470 -58681 -100989 -201023 -356007 -471885 -492082 -423897 -326199 -309539 -412206 -447915 -179271
47459 -179271 284898 502481 241887 -221123 -521864 -668202 -828432 -888645 -588307 -5517
47449 -5517 443454 497067 279706 47630 -44364 78451 407701 776598 983629 1019079
47439 1019079 998003 896126 584781 132249 -185986 -235265 -152178 -58907 126794 487443
47429 487443 892758 1110913 1025724 703294 373404 334611 667856 1020862 925929 405541
47419 405541 1986 79889 354617 299596 -189207 -746158 -980878 -754557 -169808 457262
47409 457262 709406 417088 -120381 -458291 -514048 -542565 -637816 -540271 -49889 578957
47399 578957 855689 604345 124935 -214249 -389922 -604092 -845133 -821853 -437074 -94728
47389 -94728 -260645 -815139 -1172780 -1063050 -841850 -899731 -1109506 -1125524 -959248 -891285
47379 -891285 -949455 -865940 -553507 -281918 -287577 -464919 -568287 -526968 -426319 -319305
47369 -319305 -199543 -81168 11780 93784 175899 209626 133822 -44965 -249680 -368602
47359 -368602 -268141 152260 822668 1436058 1626306 1287942 701774 288882 231721 370921
47349 370921 454491 386639 192031 -125030 -524681 -801714 -727954 -368793 -84287 -130272
47339 -130272 -387523 -562120 -516997 -308627 -38564 184396 232954 74170 -141941 -214037
47329 -214037 -69684 244860 638970 930147 860812 365264 -237697 -519067 -403192 -195667
47319 -195667 -152996 -196471 -94313 213787 550124 690801 585939 419426 433390 658571
47309 658571 878789 920475 876339 921055 998355 875876 488043 48910 -201558 -235336
47299 -235336 -201652 -262168 -472520 -739003 -894110 -876754 -785073 -677737 -439415 2755
47289 2755 440111 587602 479747 423348 564557 742731 786760 696524 477815 78525
47279 78525 -379250 -558965 -319333 -9663 -118921 -668684 -1137017 -1024317 -407019 135923
47269 135923 161946 -125920 -148321 245212 495329 80844 -685232 -1019907 -741621 -472672
47259 -472672 -676436 -995498 -830647 -194421 384393 572795 494868 418389 476921 614955
47249 614955 597018 197267 -441744 -838356 -773924 -614939 -742272 -936447 -755807 -315626
47239 -315626 -161647 -440273 -731088 -737313 -624886 -564937 -445985 -245606 -225556 -470641
47229 -470641 -625518 -427651 -177534 -299230 -685154 -892657 -823740 -766749 -822385 -734813
47219 -734813 -382351 -77746 -182997 -620155 -948837 -848652 -398284 93716 431931 649263
47209 649263 794150 723494 266229 -434198 -968303 -1127184 -1091720 -1029810 -788866 -261462
47199 -261462 185374 65344 -521766 -963149 -937193 -734943 -676464 -634054 -390645 -130385
47189 -130385 -201397 -557973 -790492 -663265 -351207 -159706 -235946 -545211 -915247 -1091703
47179 -1091703 -947639 -666013 -538422 -567140 -472923 -153747 89155 -66105 -501493 -764213
47169 -764213 -580727 -121748 237720 316058 261506 349893 673979 1027893 1101517 776679
47159 776679 211426 -329288 -664903 -766287 -746039 -776400 -894702 -883094 -491115 178975
47149 178975 674134 676010 346339 70816 -4392 -14997 -61052 -63150 61171 231658 254923
47138 254923 -20468 -561380 -1088632 -1234197 -882663 -309083 123648 321240 395280 385778
47128 385778 269782 153322 172903 224643 77824 -218496 -342937 -189513 -38742 -102906
47118 -102906 -199435 -88707 120636 173472 83573 51561 93460 55051 -62784 -86652 14377
47107 14377 43480 -152086 -509855 -876476 -1131268 -1173012 -972190 -690533 -595533 -784962
47097 -784962 -1085637 -1242942 -1121009 -743569 -277842 26192 26418 -167833 -356896 -512288
47087 -512288 -707745 -845341 -720181 -396589 -233519 -401373 -618795 -557680 -302087 -160651
47077 -160651 -170368 -83153 192034 418420 367213 110260 -136710 -315857 -521400 -751858
47067 -751858 -823756 -583944 -133731 245161 391334 412491 480226 545271 382250 -74209
47057 -74209 -563452 -742424 -532651 -171851 20089 -117854 -495477 -830787 -851185 -526887
47047 -526887 -91134 214783 357783 413898 358640 119242 -202941 -373440 -353407 -399139
47037 -399139 -686908 -979813 -892177 -438879 -68785 -100850 -376714 -608361 -810251 -1101647
47027 -1101647 -1260987 -904361 -128927 436362 389804 22054 -205703 -306904 -531918 -753507
47017 -753507 -590622 -74431 297739 242259 8272 -98532 -115475 -157999 -113900 130540
47007 130540 430599 627662 823048 1101407 1176134 691603 -179813 -791135 -723118 -203758
46997 -203758 209180 171961 -247382 -726263 -963463 -904178 -749712 -715321 -813851 -922880
46987 -922880 -965303 -917822 -745490 -478669 -274160 -239724 -271387 -231090 -197449 -330580 -558026
46976 -558026 -648594 -583841 -596534 -800580 -1021166 -1067871 -971724 -865321 -812904 -854797 -1046013
46965 -1046013 -1325945 -1478690 -1347110 -1011029 -681925 -504762 -510171 -651669 -823247 -928873
46955 -928873 -981340 -1043695 -1054423 -839970 -349073 240863 694309 887768 801873 502724
46945 502724 173138 691 -24993 -54644 -90532 35414 327754 524699 482625 433380
46935 433380 639940 974467 1093436 913068 646563 440707 255270 107799 178710 577311
46925 577311 1151969 1611979 1758587 1580729 1223936 896235 734292 736803 846094 1035976
46915 1035976 1250779 1326996 1094734 548662 -147681 -789922 -1211245 -1320588 -1173645 -957350
46905 -957350 -813513 -731099 -675546 -704515 -829349 -874972 -650275 -195351 283512 639949
46895 639949 797584 658016 224281 -263779 -558676 -712619 -908459 -1055378 -876486 -393492
46885 -393492 32538 220034 377229 651679 810654 616185 268674 191906 509256 955130
46875 955130 1195224 1054017 560495 -25432 -341100 -278953 -127424 -173313 -281388 -100185
46865 -100185 398033 844128 924631 677450 319600 -7390 -253436 -374433 -328822 -132643
46855 -132643 78698 50502 -390088 -1045613 -1430611 -1306129 -965030 -772364 -622334 -194084
46845 -194084 394622 646481 404651 56478 -94694 -215540 -486047 -676032 -524134 -239607
46835 -239607 -227722 -485927 -648175 -535813 -324882 -217808 -260122 -455447 -766761 -1007334
46825 -1007334 -1005660 -879516 -876355 -952779 -830650 -504614 -340756 -548571 -882911 -1053389
46815 -1053389 -1128888 -1284504 -1395357 -1203031 -751013 -344293 -126398 36497 256419 439309
46805 439309 438774 239093 -37630 -200699 -99092 215491 476373 479652 311352 162203
46795 162203 34394 -137812 -173869 206607 887553 1336348 1219653 783665 465133 368500
46785 368500 336628 316415 353978 339538 76308 -383743 -723064 -743373 -585094 -482561
46775 -482561 -446605 -308473 -6488 297299 414290 386166 466736 806244 1215428 1356530
46765 1356530 1151364 843073 623766 405004 77095 -209460 -246533 -122212 -106633 -241206
46755 -241206 -316256 -255673 -231303 -312647 -274419 75691 564511 843455 802288 617073 458448
46744 458448 336980 235223 234689 432617 781216 1074144 1127002 973318 828199 811949
46734 811949 783505 557951 224401 64600 157681 274262 223917 101789 79251 146801
46724 146801 228171 376092 634064 818203 685190 280947 -93356 -243922 -201003 13440
46714 13440 462383 1033016 1327692 1030675 315585 -277717 -371311 -53423 335877 596483
46704 596483 767396 905823 927186 749729 497700 387385 411530 328315 44907 -177516
46694 -177516 -69145 244385 416044 374864 368928 499416 511917 198760 -216069 -325078
46684 -325078 -68750 214334 265346 220452 349736 625925 739803 537265 258842 236569
46674 236569 477951 725102 846908 918380 911123 642058 190616 39642 473585 1049539
46664 1049539 1070562 488363 -85780 -239179 -152173 -55790 182817 651409 993802 840016
46654 840016 392903 170174 290773 400914 243892 -66488 -344699 -565792 -722536 -716840
46644 -716840 -505458 -191151 85575 215204 103023 -227955 -537437 -591848 -486227 -502690
46634 -502690 -643159 -596425 -235276 167788 357801 425896 521667 529318 319152 94919
46624 94919 141295 363017 443279 392637 540121 936439 1157451 874514 322656 -33971
46614 -33971 -102304 -170184 -430975 -761607 -964205 -1014348 -1009013 -1003455 -979958 -918823 -842234
46603 -842234 -794984 -790666 -783536 -732393 -695535 -775263 -919252 -890168 -559933 -158720 -59008
46592 -59008 -330777 -691947 -916301 -1081531 -1325073 -1561151 -1618800 -1517024 -1377477 -1141922
46582 -1141922 -644548 4396 361895 133347 -420667 -718149 -453434 148073 636892
46573 636892 776437 649954 439026 207720 -79659 -413959 -713304 -931504 -1087532 -1155547
46563 -1155547 -1051985 -817053 -672008 -734617 -782679 -520780 -29833 308012 342414 331860
46553 331860 502731 702538 650605 314323 -138389 -558965 -801791 -705652 -349628 -151449
46543 -151449 -409325 -867869 -1052891 -934144 -886385 -1032151 -1045532 -703579 -258943 -77626
46533 -77626 -178537 -324103 -358354 -283301 -180122 -202685 -468652 -820049 -894223 -588066
46523 -588066 -233401 -122817 -98249 130103 472569 604452 477595 320452 208707 30662
46513 30662 -133765 -35360 236590 185511 -420796 -1136546 -1386569 -1175544 -919547 -780914
46503 -780914 -601687 -412326 -500034 -847035 -955828 -530482 407 40300 -301564 -373257
46493 -373257 31817 377114 224141 -115045 -101514 219493 380783 244915 86663 3418
46483 3418 -231191 -659046 -966979 -982828 -902663 -811730 -433208 302263 840445 645422
46473 645422 9694 -305122 -118355 21088 -254804 -613444 -590313 -246340 19144 28604
46463 28604 -83930 -173617 -224995 -275979 -382957 -606603 -914749 -1168300 -1288082 -1333910
46453 -1333910 -1331950 -1163910 -774173 -373386 -242611 -374813 -492593 -432575 -345158 -438173
46443 -438173 -638689 -638454 -263482 300856 696005 737949 514221 200267 -77302 -198466
46433 -198466 -68470 213171 363368 255030 115234 193385 360434 305222 53460 -40727
46423 -40727 151771 321971 185496 -124715 -304275 -285667 -194835 -81405 75898 207716
46413 207716 218991 160543 162810 244945 334898 419944 518434 536546 311526 -187087 -797187
46402 -797187 -1312393 -1638259 -1826728 -1990979 -2136153 -2070584 -1611271 -918688 -450475 -457741
46392 -457741 -677457 -684650 -417948 -156529 -71999 -42778 95920 323310 500092 533975
46382 533975 443737 342717 362853 528382 721839 820847 815874 762965 738438 895764 1376250
46371 1376250 2009262 2286373 1877636 1060596 385248 15570 -287865 -587901 -571314 -53997
46361 -53997 624397 938899 763315 427201 263095 254707 143378 -199620 -573178 -667858
46351 -667858 -465069 -275277 -315329 -429780 -392744 -297828 -369091 -502703 -351973 124308
46341 124308 526676 509385 152734 -227343 -392661 -243042 160247 520987 511381 175606
46331 175606 -102118 -144940 -227868 -606701 -1070248 -1213832 -983345 -698539 -634766 -772735
46321 -772735 -883090 -723657 -254061 240093 372316 103691 -195319 -218303 -39102 156360
46311 156360 366955 595376 646526 404147 111202 73201 237924 349555 345886 288086
46301 288086 69587 -422524 -955843 -1142801 -937874 -613297 -314556 -3684 232502 248109
46291 248109 197737 380500 678101 604291 26278 -603893 -896971 -973354 -1052588 -1030120
46281 -1030120 -779225 -523568 -540019 -730671 -825637 -804795 -790844 -718411 -478586 -267327
46271 -267327 -414234 -898754 -1347272 -1495945 -1383764 -1105773 -664252 -114927 366337 637705
46261 637705 680657 539041 313904 186882 268213 424744 423050 239619 73317 59837
46251 59837 132165 162312 98849 -23060 -79690 79903 413448 600254 378490 -101646
46241 -101646 -499494 -776569 -1135795 -1493819 -1447732 -915052 -402763 -347095 -478533 -205171
46231 -205171 539679 1201978 1304129 917929 442077 197477 293400 635374 949466 970039
46221 970039 709728 433580 324410 317837 303976 293893 286892 176654 -37052 -113363 115140
46210 115140 399154 325111 -110406 -467650 -459373 -293492 -286855 -408056 -437540 -376190 -389605
46199 -389605 -458879 -417099 -300294 -322444 -465333 -445879 -210911 -110140 -350984 -596270
46189 -596270 -433804 -15609 171124 42149 -20777 160664 290010 143613 -11956 159969
46179 159969 486467 471363 -27989 -605330 -799667 -568640 -213549 2776 50502 18007
46169 18007 -60198 -194731 -311149 -260689 -34210 134771 19863 -290879 -480809 -360611
46159 -360611 16060 523052 1004576 1186871 892135 416833 323589 670860 830775 385020
46149 385020 -158781 -21042 718799 1231050 1106497 784452 689132 572427 88274 -453045
46139 -453045 -431976 202553 901439 1287354 1503063 1753336 1925986 1858000 1680749 1634927
46129 1634927 1684017 1566378 1208684 878492 854775 1074560 1223552 1129575 925985 783736
46119 783736 617729 213956 -393924 -866580 -940077 -715449 -467601 -301256 -155694 -59071
46109 -59071 -158500 -475246 -805032 -937234 -858921 -671380 -416134 -96292 201939 358406
46099 358406 397135 488168 713281 930374 973306 914938 970403 1144714 1185395 993808 882010
46088 882010 1176377 1670099 1799184 1408592 1011341 1088638 1388988 1237505 433875 -491135
46078 -491135 -941550 -888170 -708763 -621473 -508008 -233610 84669 215415 103599 -111447
46068 -111447 -351744 -716584 -1243086 -1676631 -1698344 -1377325 -1153172 -1258984 -1373268 -1039423
46058 -1039423 -285433 411486 706773 695164 650297 688829 740007 668128 366901 -122961
46048 -122961 -546412 -632087 -416323 -234859 -319777 -515593 -470107 -26273 628327 1130664
46038 1130664 1229101 976117 661092 500862 424485 237052 -86240 -420392 -723105 -1014839
46028 -1014839 -1152832 -908576 -341326 158840 315714 243689 176883 156022 131113 143845
46018 143845 202241 155610 -80826 -307971 -265427 19943 289124 363371 243259 9232
46008 9232 -207268 -267886 -209180 -246873 -425512 -446782 -95782 339195 409174 158160 53603
45997 53603 285725 526663 459303 184273 -52527 -236122 -471137 -697475 -740318 -546501
45987 -546501 -218750 109496 327295 365910 282262 263215 440411 713289 807252 505853
45977 505853 -157384 -885999 -1321941 -1340602 -1141371 -990323 -924779 -802569 -570260 -323557
45967 -323557 -113991 153668 592498 1172351 1681004 1818991 1439800 776614 287912 158416
45957 158416 136511 29972 93918 597351 1230500 1414360 1113741 848471 893487 984187
45947 984187 912714 883459 1042353 1115071 832691 366643 25957 -179338 -362036 -418411
45937 -418411 -201370 167808 458200 622381 681381 536630 177875 -135853 -209010 -229385
45927 -229385 -443038 -700689 -674811 -377203 -107707 -1047 41488 73770 88596 188106
45917 188106 453712 734652 861703 947035 1153040 1317019 1187896 903568 807546 892909
45907 892909 885262 798574 894913 1107332 1050983 681417 410307 441292 515509 484396 581721
45896 581721 855926 869880 367787 -187652 -203829 225654 546899 548640 472064 469274 422095
45885 422095 274798 156588 131487 114664 75570 96035 198874 301626 348721 339141 246576
45874 246576 61522 -120400 -195142 -191637 -180054 -108429 97046 319113 336454 137809 -15004
45863 -15004 104371 405782 562785 360110 -37528 -197131 119719 647241 939898 985898
45853 985898 1206770 1747356 2118547 1838204 1160271 751517 767869 711771 233725 -372641
45843 -372641 -655770 -626071 -595079 -609468 -389611 200786 894610 1291237 1213420 730065
45833 730065 -15769 -862657 -1592044 -1993050 -1992030 -1651782 -1078147 -438467 -14191 -1943
45823 -1943 -205461 -179035 167641 359516 8613 -545153 -622044 -115070 410131 510854
45813 510854 327504 192625 232435 501317 1059608 1668774 1813175 1347167 791452 652090
45803 652090 751802 607428 180462 -189370 -374853 -506678 -574131 -463229 -309444 -335070
45793 -335070 -378108 -74195 481411 763860 606982 467461 713131 1083703 1114744 741219
45783 741219 202412 -349372 -833299 -1063083 -917342 -570480 -292108 -106096 127605 380489
45773 380489 445303 240439 -62008 -225948 -148046 132805 519246 922672 1274620 1466086
45763 1466086 1318107 732817 -105678 -815936 -1167647 -1240080 -1200667 -1091614 -928901 -836001
45753 -836001 -893455 -948132 -772382 -403771 -163449 -294251 -686526 -1020625 -1119521 -1091772
45743 -1091772 -1135749 -1270973 -1324324 -1167680 -878294 -616105 -427186 -266121 -152595 -162838
45733 -162838 -260140 -267713 -76541 189935 288462 122865 -137353 -231059 -107873 -5584
45723 -5584 -147375 -404956 -414254 -36511 474873 812429 906112 790015 443563 -34900
45713 -34900 -322637 -207263 123032 366130 518941 733277 934410 929638 787079 747973
45703 747973 820639 796731 619433 412463 213383 12214 -49797 92360 128446 -215217
45693 -215217 -562245 -276139 528934 1009715 755009 289040 194474 364456 460547 529637
45683 529637 724186 877496 813644 698653 667963 486714 13304 -374442 -294169 25720
45673 25720 129085 30763 33512 122307 72704 -52103 -32949 57884 34355 29153 235686
45662 235686 405842 161398 -329964 -546899 -381844 -177682 -101790 -43590 -49075 -268863
45652 -268863 -516383 -456314 -197025 -112690 -133189 138322 629612 843204 734722 775852
45642 775852 1015975 897899 261845 -273133 -294857 -196562 -342017 -386348 -12155 332943
45632 332943 131164 -322645 -474495 -483645 -825174 -1263822 -1121520 -434721 18823 -113085
45622 -113085 -336391 -207154 42722 51095 -52670 79469 485401 951748 1353186 1667809
45612 1667809 1817804 1707426 1338538 784773 141563 -450491 -851160 -1037212 -1086038 -1054108
45602 -1054108 -986157 -1000921 -1188984 -1420809 -1436583 -1185398 -948312 -1047380 -1477133 -1859252
45592 -1859252 -1778389 -1212750 -611750 -432398 -621059 -749640 -655929 -626318 -832388 -967970
45582 -967970 -733651 -377168 -370702 -739827 -1086282 -1138294 -918271 -498352 14405 338505
45572 338505 270711 41783 50332 295630 462458 495107 610711 748438 542095 -29044
45562 -29044 -449261 -336753 89698 417090 543565 567146 520553 451526 462366 463757 207380
45551 207380 -237415 -408468 -112044 218426 158907 -64327 24546 420113 783889 1085070
45541 1085070 1540305 2010479 2014201 1413913 663783 274446 359199 760908 1266068 1573013
45531 1573013 1375748 691717 -56476 -416722 -275399 136272 428251 276981 -285421
45522 -285421 -789206 -779221 -364707 -49699 -15408 58729 364876 582378 385012 -12274
45512 -12274 -177446 -110481 -173922 -477030 -703139 -550189 -50757 550278 965126 910310
45502 910310 301945 -501543 -923607 -786028 -503881 -531863 -814222 -957167 -774181 -436192
45492 -436192 -179299 -82479 -88323 -52502 191699 629789 959390 899532 598556 490502
45482 490502 704230 880075 684499 244025 -116221 -321347 -472877 -531693 -423325 -344703
45472 -344703 -569538 -961175 -1083412 -858196 -683975 -739657 -628367 -41588 617848 759833
45462 759833 503583 482650 836837 999405 602961 58830 -36701 322718 681911 732199
45452 732199 485005 86355 -217909 -131961 338333 739251 704847 481286 539787 809423
45442 809423 770210 274194 -240358 -441912 -513398 -676987 -782121 -670408 -557631 -674244
45432 -674244 -825552 -718075 -491876 -486145 -633637 -563770 -249667 -80042 -245966 -482397
45422 -482397 -519833 -409613 -262299 -25034 279440 398142 179298 -155374 -289765 -191174
45412 -191174 -26864 104047 148410 -6561 -369011 -701582 -780358 -690948 -653514 -684501
45402 -684501 -693073 -790460 -1155400 -1609972 -1688961 -1230188 -600768 -184861 100330 553731
45392 553731 1124998 1384157 1053695 369189 -156586 -217840 92308 474843 700869 722634
45382 722634 630808 563685 606061 718121 792271 811382 878459 1029616 1136360 1140774 1271883
45371 1271883 1766016 2395873 2596979 2168041 1563333 1320746 1456399 1648437 1772106
45362 1772106 1919487 2025373 1840297 1289203 608089 113931 13317 356358 932668
45353 932668 1287213 1152661 860802 1010770 1703020 2441980 2874710 3237096 3846129 4480320
45343 4480320 4622904 4171888 3559716 3175598 2949071 2594551 2085405 1731382 1813790 2241703
45333 2241703 2618189 2623500 2278890 1845746 1572239 1573729 1807088 2033914 1946671 1526724
45323 1526724 1181988 1304821 1765592 2105051 2178026 2282646 2626089 3014239 3202142 3243150
45313 3243150 3294570 3324490 3240868 3136894 3188477 3427705 3788930 4242275 4697585 4913796
45303 4913796 4741693 4405730 4336095 4702881 5237397 5525920 5419562 5171249 5190155 5614625
45293 5614625 6149310 6425923 6466446 6579261 6813786 6821578 6365230 5682388 5167438 4929780
45283 4929780 4866512 4943287 5139988 5269540 5115713 4691287 4200164 3841457 3760460 4001690
45273 4001690 4337242 4337662 3826477 3102939 2541113 2193404 1990582 2022544 2281130 2402299
45263 2402299 2108322 1714769 1706049 1923039 1715829 910794 94832 -184775 -43264 98349
45253 98349 95517 66640 87696 140535 192300 182610 94669 109412 469648 1106140 1621628
45242 1621628 1732101 1505149 1107082 604535 140398 10204 338347 854353 1180327
45233 1180327 1227171 1190264 1276229 1520592 1763305 1783355 1600707 1584514 1990252 2431853
45223 2431853 2219716 1312157 493453 383658 672183 664718 263460 -21737 144658 560014
45213 560014 863098 935242 880627 828151 803584 702919 430508 121344 89000 445923
45203 445923 932833 1253675 1404723 1527296 1645516 1752217 1952859 2279880 2537277 2582737
45193 2582737 2589597 2742524 2841740 2551505 1920796 1288730 757514 180644 -324913 -319124
45183 -319124 330077 1099526 1350075 1026179 603064 463925 553800 628262 636605 717478
45173 717478 864061 803552 380829 -67458 -48249 357568 500272 88456 -301029 -23226
45163 -23226 653426 904366 524572 144324 252368 589770 699366 579164 495873 522439
45153 522439 592104 751656 1037014 1267060 1242572 1025945 787839 508226 85675 -354870
45143 -354870 -543485 -439360 -286369 -260075 -242574 -11681 469100 1011108 1372937 1427827
45133 1427827 1221846 924456 706819 627888 622988 614176 639284 832579 1219111 1570476
45123 1570476 1608940 1383336 1261391 1438980 1643570 1524020 1187480 1080634 1404148 1913951
45113 1913951 2278277 2363675 2167492 1752194 1306186 1029490 900402 758929 611271 578422
45103 578422 557454 304398 -78881 -148171 232679 639832 714064 654376 792677 1035795
45093 1035795 1103379 1016549 929724 737848 331743 46625 308680 910565 1180417 892777
45083 892777 507917 439480 592340 771360 1044951 1437834 1676640 1563868 1295742 1101663
45073 1101663 847578 333373 -247821 -516359 -421799 -209343 6109 284430 573378 752513
45063 752513 931801 1331751 1846883 2109830 2070905 2125175 2488051 2801802 2638967 2132796
45053 2132796 1788240 1837350 2100820 2374518 2616334 2780454 2780312 2655180 2531543 2401867
45043 2401867 2185164 2008356 2119193 2449177 2588936 2353455 2073549 2110057 2345109 2432144
45033 2432144 2336938 2305175 2427666 2565810 2637187 2674630 2653987 2551780 2519203 2688823
45023 2688823 2852403 2677649 2233386 1916477 1825058 1635766 1222160 937668 1036626 1226560
45013 1226560 1155736 1031406 1320784 2009200 2573882 2636182 2292441 1823447 1401068 1122075
45003 1122075 1068852 1242801 1565417 1956989 2324000 2550335 2640642 2772883 3045125 3292705
44993 3292705 3357635 3396458 3645731 3992620 4113968 4003427 4005378 4279596 4554110 4506751
44983 4506751 4125455 3598002 3106803 2846478 2984381 3433206 3857621 4071026 4266426
44974 4266426 4701077 5299781 5745445 5876630 5855355 5998391 6538742 7493471 8683922
44965 8683922 9918053 11179045 12602923 14336069 16541381 19471421 23330011 28127749
44957 28127749 33982416 41528477 51471259 63284282 74513707 81837664 83095372 78461535
44949 78461535 69954856 60021290 50387007 41805182 34514108 28687340 24333876 20979198
44941 20979198 17903012 14872965 12358859 10804311 9932167 9044399 7819322 6500195
44933 6500195 5421265 4682947 4253639 4070468 3981982 3805718 3496069 3133964 2786786
44924 2786786 2505715 2360848 2303467 2120519 1748077 1473449 1517202 1568294 1171911 524414
44914 524414 362218 954880 1713777 2031108 2039165 2180933 2420000 2365309 1966170 1585867
44904 1585867 1451576 1466919 1565412 1830898 2186574 2334354 2149406 1838249 1553472 1143556
44894 1143556 502183 -86286 -249478 -38702 157898 158501 165352 389508 753630 1050179
44884 1050179 1206891 1298193 1431482 1701147 2121398 2525333 2673146 2559555 2469298 2608177
44874 2608177 2837039 2930808 2925300 2965156 2965060 2778729 2656541 3119616 4265966 5556707
44864 5556707 6479263 7120780 7861162 8803571 9844499 11078372 12694853 14522522 16054939
44855 16054939 16974022 17359516 17350054 16895057 15932259 14565279 12962020 11272841 9715323
44846 9715323 8514831 7656545 6893140 6100287 5433674 5036728 4807861 4593207 4403079
44837 4403079 4268104 4069838 3721213 3375878 3251361 3341453 3476366 3558633 3561942 3412457
44827 3412457 3078800 2699092 2429270 2250290 2107968 2117553 2376741 2668051 2644880 2290861
44817 2290861 1918455 1724968 1642910 1634347 1792028 2065095 2217416 2201629 2261134 2473105
44807 2473105 2507763 2123251 1634963 1526184 1749370 1805971 1463457 1005602 739274 626518
44797 626518 537591 544851 738969 973980 1054283 1049234 1161602 1335266 1263024 844267 422190
44786 422190 420787 848563 1310988 1485314 1436910 1415070 1452704 1319524 888082 408266
44776 408266 279640 566523 876656 797174 372822 46707 157192 612564 1078285 1347830
44766 1347830 1426991 1351151 1107310 765811 526833 514886 604644 582734 452373 433815
44756 433815 640033 899088 995923 990132 1141930 1531705 1891613 1884548 1486211 1019844
44746 1019844 834773 1008719 1361712 1692054 1941321 2144373 2293576 2315824 2172824 1920163
44736 1920163 1639297 1362910 1124998 1046906 1260194 1688105 1983057 1812566 1243974 758266
44726 758266 791227 1274729 1704927 1670411 1244517 838922 756171 950039 1159707 1180511
44716 1180511 1023190 899088 1047933 1492251 1947747 2059726 1757373 1310843 1029262
44707 1029262 990593 1087472 1214502 1326005 1397900 1443249 1531146 1707393 1915481 2047043
44697 2047043 2041993 1920966 1801732 1919791 2499558 3496369 4579551 5516557 6488221 7871711
44687 7871711 9799175 12099948 14550931 16896506 18671550 19374003 18943721 17823954
44679 17823954 16435392 14833520 13008855 11227392 9814468 8794073 8007965 7444700
44671 7444700 7166474 7012144 6690408 6170676 5730368 5589094 5697400 5894017 6063831
44662 6063831 6113924 5991968 5784064 5646340 5612085 5597059 5571764 5549742 5424559 5038873
44652 5038873 4440839 3864615 3427151 3054942 2730751 2556445 2508349 2398475 2183985 2054978
44642 2054978 2085004 2058255 1810099 1484729 1265515 1114410 1013341 1182565 1714756 2193396
44632 2193396 2078992 1402394 722644 433484 444820 535691 662527 833595 972747 1047366
44622 1047366 1149749 1354929 1624376 1880540 2048306 2038948 1849321 1645155 1574498 1556859
44612 1556859 1463746 1423004 1651286 2016312 2097416 1727622 1182716 789180 648341 787258
44602 787258 1209318 1665354 1735626 1345690 915323 809982 934675 1063843 1244411 1590302
44592 1590302 1959016 2166842 2329432 2677917 3201159 3756867 4359564 5035049 5531353
44583 5531353 5522845 5044449 4450608 4014520 3798785 3785053 3843364 3696683 3235397 2780140
44573 2780140 2724553 3003722 3230112 3266683 3334400 3639409 4241195 5185421 6353009 7245017
44563 7245017 7387817 6972755 6650210 6652098 6580030 6129137 5510571 4983512 4445676 3745250
44553 3745250 3016007 2448176 2047673 1828736 1911239 2222819 2439828 2416748 2327335 2228457
44543 2228457 1937777 1559155 1591916 2162944 2674500 2671324 2547236 2817037 3165393 2957767
44533 2957767 2359973 2117843 2380844 2583864 2485025 2491018 2818896 3120898 3212728 3471270
44523 3471270 4119983 4696429 4690717 4291774 4049286 4102408 4155526 3985682 3599805 3058924
44513 3058924 2470257 2031578 1832714 1727585 1578604 1462105 1472588 1535262 1588965 1721842
44503 1721842 1935651 2039980 2011660 2177557 2741251 3380589 3662785 3654659 3749225 4045658
44493 4045658 4290240 4327889 4226861 4010921 3631154 3180746 2810940 2466914 2035940 1714925
44483 1714925 1852725 2404648 2900907 3008690 2798868 2434462 1994371 1704557 1920399
44474 1920399 2645681 3377126 3664133 3585610 3482877 3489002 3555852 3688340 3851932 3831926
44464 3831926 3493891 3068647 2903195 3027768 3233332 3468614 3842742 4284799 4546765
44455 4546765 4595461 4703994 5048159 5451825 5661511 5675570 5646329 5601509 5439541 5144616
44445 5144616 4872966 4818873 5024152 5289415 5305253 4994129 4719736 4976017 5801578 6682979
44435 6682979 7142453 7223934 7236794 7248193 7138301 7023386 7213214 7700193 8061635 8034709
44425 8034709 7890394 8001314 8261187 8221162 7686387 6911879 6271462 5975527 6066478 6424537
44415 6424537 6752193 6774254 6505138 6169248 5885166 5633627 5491305 5587733 5782861 5716059
44405 5716059 5321616 5013166 5172990 5716702 6373816 7125536 8059391 9010727 9738641
44396 9738641 10353957 11169301 12118219 12697226 12586173 12024978 11427040 10856414 10080239
44387 10080239 9000494 7844211 6948185 6441609 6129781 5678852 4959479 4196314 3721616
44378 3721616 3626054 3736695 3860783 3899663 3781314 3489109 3171681 3036087 3084031 3102391
44368 3102391 2947084 2689637 2462288 2324854 2319386 2477445 2707266 2832014 2807661 2755166
44358 2755166 2723887 2605820 2384705 2298205 2591962 3193551 3755038 3986616 3894627 3740761
44348 3740761 3795336 4079124 4355170 4427380 4365011 4314003 4219124 3976944 3774097 3934120
44338 3934120 4411800 4782776 4815597 4721489 4726716 4755126 4715415 4755776 4982674 5222226 5329082
44327 5329082 5460654 5761530 6046766 6128974 6216505 6612502 7208635 7662800 7928064 8218153
44317 8218153 8580123 8910419 9300525 9947972 10781211 11588565 12482689 13810603 15616778
44308 15616778 17640270 19850921 22483645 25433430 28111563 30106891 31567183 32701305
44300 32701305 33311404 33106482 32136780 30610103 28575663 26116748 23598402 21360018
44292 21360018 19329593 17261208 15196758 13372129 11816768 10411825 9253612 8561310
44284 8561310 8209935 7725478 6862566 5916377 5323000 5161692 5209489 5315783 5494612 5679587
44274 5679587 5595579 4997834 4002149 3073517 2621268 2623466 2703204 2564782 2288397 2184173
44264 2184173 2424129 2864686 3214685 3349448 3423389 3623636 3849070 3781941 3321496 2764651
44254 2764651 2438037 2338182 2306174 2340654 2471925 2537580 2454130 2542429 3110017 3797915
44244 3797915 3901878 3377707 2929098 2937803 2928014 2414632 1713488 1443575 1669165 2052102
44234 2052102 2494991 3055928 3470254 3368896 2896595 2606565 2762652 3140601 3441264
44225 3441264 3509920 3261069 2816005 2610121 2912625 3344317 3354961 3057446 3009088 3246786
44215 3246786 3243456 2886714 2739578 3065600 3305675 2961573 2423550 2384596 2849280 3278082
44205 3278082 3423934 3473110 3527810 3472812 3310740 3213496 3244607 3341236 3525870 3841414
44195 3841414 4131830 4182476 4040687 3923224 3849642 3654148 3344782 3167302 3285892 3636291
44185 3636291 4108042 4629115 5028708 5052791 4628793 3993729 3501143 3367320 3566446 3855241
44175 3855241 3954418 3853452 3878798 4293711 4895341 5210611 5048672 4650979 4342984 4286404
44165 4286404 4549001 5114353 5757813 6188020 6425416 6816075 7557744 8422065 9060395
44156 9060395 9370440 9428408 9284172 9004232 8714694 8390610 7789061 6844136 5968558 5650410
44146 5650410 5832827 6017461 5957185 5902535 6110947 6462199 6715315 6845440 6899309 6764969
44136 6764969 6388521 6064147 6158477 6575103 6815200 6625281 6302634 6243657 6436365 6581481
44126 6581481 6536183 6416232 6353091 6370882 6489998 6772619 7223883 7748571 8233022 8618113
44116 8618113 8908447 9156752 9390992 9512248 9373411 9064943 8995998 9492440 10365439 11083265
44106 11083265 11357375 11354590 11330445 11303738 11184525 11009988 10900722 10909754 11039812 11307472
44096 11307472 11676099 12007134 12179428 12202076 12157195 12119770 12182403 12435273 12831548 13177384
44086 13177384 13361667 13528458 13939612 14718353 15768429 16871016 17841565 18695634 19669988
44077 19669988 20950031 22396881 23752170 25108475 26877151 29219884 31880185 34774608
44069 34774608 38378133 43201986 49235929 56388651 65268207 76933745 91793631 109068196
44061 109068196 127204408 144269519 157946059 165946194 167119129 162184916 153307250
44054 153307250 143138915 134186308 128374277 126582964 128710724 134562313 144608825 159674234
44046 159674234 180158971 205937887 236581304 270649766 304379759 331800302 347192451
44039 347192451 348017806 335760887 314359231 288010804 259889995 231872898 204813358
44032 204813358 179137534 155415353 134347786 116197116 100529454 86790404 74965683
44025 74965683 65340398 57694604 51166406 45031445 39289672 34313406 30225430 26885466
44017 26885466 24232866 22265547 20768008 19399766 18057315 16885557 15932548 15059796
44009 15059796 14219409 13539298 13038725 12493732 11707194 10728301 9701372 8692824 7797807
44000 7797807 7217518 7030482 7015807 6904815 6720378 6664415 6730293 6664470 6342071 5974671
43990 5974671 5841358 5939366 6015840 5874648 5542159 5170854 4901523 4824389 4948843 5149922
43980 5149922 5250057 5255978 5429747 5975872 6704493 7197065 7328816 7436557 7897001 8716409
43970 8716409 9640293 10493360 11257943 11949035 12570147 13092530 13358196 13147657 12485225
43961 12485225 11698074 10981682 10108468 8841046 7455276 6492788 6084991 5891926 5665892
43952 5665892 5477533 5359478 5138415 4752783 4403114 4229125 4107434 3914631 3751483
43943 3751483 3771058 3992007 4377388 4880873 5345037 5603064 5753083 6059593 6509176 6771929
43933 6771929 6701886 6542181 6501375 6473213 6341813 6205099 6088275 5795553 5297705 4930155
43923 4930155 4941006 5169261 5425849 5815042 6372608 6806318 7002336 7384951 8280015 9289498
43913 9289498 9872104 10223041 10913041 11905966 12717597 13468531 14960452 17577282 20829579
43904 20829579 24231959 28032467 32810361 38932548 46776081 56949405 69630266 83658288
43896 83658288 96514286 105257616 107740964 103546521 94159508 82074927 69459101 57564491
43888 57564491 47104762 38589451 32097099 27151205 23151831 19787389 16965671 14657148
43880 14657148 12921279 11757142 10807041 9568792 8039679 6755826 6029093 5579917
43872 5579917 5126381 4818556 4742496 4493406 3738956 2842750 2407083 2466454 2633515 2787064
43862 2787064 3057794 3311520 3237462 2893860 2645627 2588328 2513070 2396339 2406234 2433229
43852 2433229 2180223 1797148 1849195 2459862 3013169 2989546 2639404 2483569 2546188 2519244
43842 2519244 2407651 2512400 2865681 3127759 3096967 2998188 3154519 3587062 4064821 4422100
43832 4422100 4697576 4998039 5328383 5606955 5824790 6102313 6519047 6951326 7216968
43823 7216968 7378560 7737753 8450150 9279514 9865167 10158550 10446959 10966587 11661167
43814 11661167 12402354 13321874 14741039 16751405 19031648 21211683 23339633 25839437
43806 25839437 29041650 32904947 37149399 41419510 45266878 48229204 50082003 50844612
43798 50844612 50429352 48534889 45125592 40839111 36615688 32955289 29721352 26573693
43790 26573693 23365692 20199485 17352256 15129705 13580656 12385182 11209393 10093311
43782 10093311 9271937 8723159 8191443 7594132 7065110 6602477 6026364 5345015 4828946
43773 4828946 4609160 4477141 4187663 3710734 3111272 2462218 1969344 1880733 2136297 2378560
43763 2378560 2431326 2469084 2579402 2513945 2105481 1612220 1362754 1327953 1343655 1497273
43753 1497273 1928402 2429790 2625979 2449788 2120475 1758251 1358768 1063411 1083910 1359540
43743 1359540 1602634 1694680 1758596 1848613 1873460 1852401 1944704 2155396 2277430 2205874 2071961
43732 2071961 1994803 1942220 1922241 2061565 2358988 2567603 2472331 2134437 1752328 1444228
43722 1444228 1280911 1353668 1648282 1981374 2217147 2441821 2772780 3089713 3131627 2829792
43712 2829792 2399067 2089899 1946785 1837875 1676165 1569444 1697595 2004761 2115847
43703 2115847 1730689 1073128 718483 907628 1262311 1327844 1182714 1250933 1614799 1820226
43693 1820226 1432277 589834 -111822 -213537 216411 749221 1067123 1203690 1323388
43684 1323388 1403170 1305003 1111983 1115991 1362728 1467789 1118665 578558 389522 672087
43674 672087 1061138 1321027 1630540 2118985 2477234 2334431 1842902 1573692 1857926 2450824
43664 2450824 2850868 2788380 2398143 2051200 2024087 2225532 2269397 1924439 1432110 1222921
43654 1222921 1385183 1647583 1863938 2196753 2712272 3112285 3124398 2948879 3009703 3375683
43644 3375683 3751349 3999067 4316611 4820902 5273207 5398189 5265285 5168924 5288978 5652538
43634 5652538 6287521 7177980 8120117 8834644 9239220 9491479 9803866 10352932 11302095
43625 11302095 12692692 14289593 15736177 16949736 18238790 19974133 22268760 25021719
43617 25021719 28097895 31332090 34467240 37231321 39429665 40887692 41409833 40933507
43609 40933507 39662892 37913853 35860998 33548410 31078390 28616039 26232332 23930140
43601 23930140 21834415 20146135 18835697 17585906 16183089 14814719 13807030 13175240
43593 13175240 12630040 11970793 11261539 10619185 10037580 9491661 9051577 8778883 8597682
43584 8597682 8366222 8033917 7670471 7374377 7178640 7006947 6732418 6358612 6126626
43575 6126626 6312046 6885523 7499608 7852896 7942497 7928614 7924825 7993259 8151863 8264306
43565 8264306 8111351 7724087 7453091 7515571 7671089 7584850 7309315 7096951 6931997 6662172
43555 6662172 6462986 6657644 7075567 7136495 6715959 6411941 6698660 7282649 7645918 7820419
43545 7820419 8177239 8745886 9246583 9637317 10138610 10767492 11287080 11636625 12034719
43536 12034719 12607473 13238663 13842086 14486447 15189298 15859578 16511410 17289816 18233768
43527 18233768 19260917 20432322 21961887 23882151 25954416 28006442 30126898 32444099
43519 32444099 34973277 37805889 41202954 45347501 50215087 55831068 62441929 70281165
43511 70281165 79389011 89843924 101938917 115848761 131188356 146991470 161875566
43504 161875566 174022150 181347153 182305472 176771099 166038685 152003449 136446672
43497 136446672 120844152 106287699 93291453 81831205 71755384 63100403 55948509
43490 55948509 50126103 45212452 40837933 36886352 33406194 30405611 27793230 25499408
43482 25499408 23567245 22051632 20868296 19845139 18922775 18202856 17798083 17769167 18227432
43473 18227432 19307151 20928243 22759434 24594521 26649343 29266130 32344963 35251597
43465 35251597 37314025 38281680 38287471 37531197 36138214 34292084 32356247 30719140 29483203
43456 29483203 28420347 27337728 26371813 25726700 25215226 24376561 23076832 21644330 20280509
43447 20280509 18711848 16700565 14584669 12921037 11782199 10814356 9881593 9223160
43439 9223160 8980880 8967633 8967550 8936359 8842645 8629536 8409779 8380294 8443533 8240463 7710108
43428 7710108 7305678 7450027 8039645 8714801 9382838 10198881 11200443 12255898 13281769
43419 13281769 14232129 14899595 14979897 14395860 13419483 12432424 11644017 11039194 10506354
43410 10506354 9969243 9407870 8787133 8059634 7317640 6836032 6782635 6949212 7006708 6988242
43400 6988242 7201018 7632619 7840653 7593652 7239938 7185218 7363555 7565512 7943920 8717175
43390 8717175 9614494 10184677 10561856 11339925 12648565 13920878 14729384 15308583 15959723
43381 15959723 16407369 16182204 15365615 14515539 13983749 13695972 13567916 13778728 14534916
43372 14534916 15773278 17217554 18678076 20284865 22452015 25559324 29649361 34533265
43364 34533265 40142739 46433105 52719246 57412088 58908247 56848870 52315811 46834655
43356 46834655 41443057 36656376 32821989 30121877 28363627 27092618 25979573 24978780
43348 24978780 24095616 23131842 21760252 19840139 17595977 15442624 13655339 12258154
43340 12258154 11189238 10426830 9903155 9450597 8962976 8503925 8123652 7687220 7059589
43331 7059589 6350376 5759123 5275304 4785339 4372987 4170422 3973741 3457838 2833516
43322 2833516 2782843 3511362 4336025 4574620 4433597 4538125 4915294 5056849 4834743 4700616
43312 4700616 4943676 5341198 5679659 6076699 6557237 6803466 6655562 6473231 6635151
43303 6635151 6982655 7133542 7086143 7084674 7059481 6671108 5889944 5135535 4775219 4768453
43293 4768453 4854041 4832782 4608131 4184540 3723588 3440607 3370953 3350253 3247641 3107158
43283 3107158 3072249 3298407 3901204 4820209 5751760 6390990 6726682 6919050 6929137 6534997
43273 6534997 5762097 5034493 4759810 4932437 5260500 5525606 5685530 5751508 5717357 5556074
43263 5556074 5200086 4594928 3847208 3235848 2973805 2992308 3030321 2917518 2726663 2657767
43253 2657767 2790757 2966760 2960071 2770428 2636388 2705908 2843578 2885163 2910943 3054466
43243 3054466 3185394 3069862 2768182 2568942 2570926 2651900 2822405 3226646 3747262 4009846
43233 4009846 3904435 3735944 3715357 3683813 3528508 3470736 3665493 3873337 3852333 3759871
43223 3759871 3817345 3872574 3691990 3435384 3406902 3527907 3501313 3351125 3345766 3489704
43213 3489704 3545883 3496643 3526941 3584815 3429977 3146818 3157806 3643159 4331460 4927036
43203 4927036 5366436 5607420 5579323 5427978 5411383 5474188 5344849 5126577 5295707 5962633
43193 5962633 6650949 7039186 7406113 8040046 8725705 9213980 9701297 10326502 10623786
43184 10623786 10120479 9213253 8787336 9089249 9596637 9939314 10299160 10831679 11318010
43175 11318010 11617066 11978219 12630708 13413594 14049854 14480984 14701332 14548784 13937210
43166 13937210 13103903 12372421 11789627 11184028 10464561 9693855 8967147 8358013 7892260
43157 7892260 7480843 7004207 6544169 6352869 6471553 6589450 6473031 6340747 6542807
43148 6542807 7002243 7302329 7305715 7358619 7787445 8456936 8998011 9299896 9564491 9938809
43138 9938809 10303837 10479176 10496647 10547499 10697383 10791744 10701383 10548832 10543453 10626825 10476945
43127 10476945 9943995 9326890 9074761 9309144 9799381 10343348 10971749 11766079 12667245
43118 12667245 13548696 14350171 15045286 15565710 15845767 15880019 15671163 15195162 14494943
43109 14494943 13735039 13067658 12498305 11969853 11503752 11131882 10752052 10224583 9608754
43100 9608754 9139375 8945476 8946573 9048045 9242693 9452296 9501655 9412515 9508968 9967007
43090 9967007 10397871 10217972 9423703 8666008 8465167 8655595 8779182 8739543 8753591 8817478
43080 8817478 8621778 8049462 7434628 7146262 7115560 6999251 6702576 6472448 6448743 6378683
43070 6378683 5952013 5290461 4879191 5007289 5459084 5823840 5952081 5977773 6003467 5961922
43060 5961922 5800511 5644912 5680916 5911694 6096006 5951492 5428492 4770075 4265908 3964155
43050 3964155 3697209 3363556 3028692 2710122 2263601 1626491 1015682 698967 694376 886193
43040 886193 1281755 1870156 2342616 2325265 1899012 1550821 1565745 1799026 2095733 2522259
43030 2522259 3014030 3197726 2858725 2293958 1904523 1695884 1495188 1403668 1619904 1966562
43020 1966562 2029664 1740167 1449818 1421093 1567482 1726374 1880002 2033495 2126259 2149631
43010 2149631 2173541 2220014 2260956 2310625 2347124 2230608 1943357 1804687 2100859 2548798
43000 2548798 2540740 1973484 1417492 1336973 1562366 1751535 1968540 2460001 3140796 3684283
42990 3684283 3966147 4085371 4065254 3869287 3657250 3701180 4013179 4296793 4325631 4209446
42980 4209446 4242908 4586850 5088267 5349758 5069129 4418580 3956531 3992254 4172687 3939272
42970 3939272 3282667 2719975 2551744 2524650 2347248 2178751 2332470 2724077 2959250 2901349
42960 2901349 2830510 2990983 3256700 3395861 3465615 3704637 4105104 4349172 4231490 3938549
42950 3938549 3765526 3698566 3482324 3048418 2650432 2522513 2585215 2602322 2513470 2473324
42940 2473324 2596773 2775746 2776469 2495412 2116611 1990260 2297865 2846476 3267940 3412697
42930 3412697 3447653 3570922 3779501 3971528 4122258 4234597 4218215 3972426 3564225 3204776
42920 3204776 3036420 3013817 3012262 3012200 3141651 3504114 3958280 4155118 3894141 3388552 3047147
42909 3047147 3050031 3323903 3874870 4825856 6035080 6997680 7357784 7319610 7339384 7609008
42899 7609008 8087557 8812888 9783937 10624146 10803046 10276692 9565365 9071124 8629732
42890 8629732 7929254 7104165 6626652 6732000 7212665 7736926 8140710 8395484 8511182
42881 8511182 8587157 8840379 9437291 10291662 11096101 11580484 11728001 11740473 11817905 11991291
42871 11991291 12162472 12273399 12393817 12618442 12899282 13042689 12910791 12574699 12189810
42862 12189810 11759400 11160938 10416107 9739616 9207175 8565857 7596000 6540989 5893543
42853 5893543 5780226 5842641 5764525 5627958 5638328 5756230 5777350 5604340 5294845 4994152
42843 4994152 4931281 5286069 5910532 6371321 6440766 6368447 6486911 6740263 6827702 6645021
42833 6645021 6329939 6000392 5699734 5486311 5325319 5006207 4438569 3925932 3845934 4126182
42823 4126182 4338743 4269048 4087547 3990200 3997066 4123034 4423834 4795912 4991846 4910252
42813 4910252 4668455 4381187 4100739 3955505 4051088 4213059 4134463 3825099 3605113 3596748
42803 3596748 3561086 3339570 3110304 3047032 3042895 2968376 2921686 3008631 3114050 3102106 3034683
42792 3034683 3005310 2965852 2890105 2883407 2955313 2932705 2790725 2787728 3025439 3170447 2942912
42781 2942912 2623567 2670860 3018410 3205497 3120001 3140458 3497690 3912563 4007533 3766826
42771 3766826 3431410 3180233 3083205 3182471 3421911 3572747 3383503 2818207 2110519 1592788
42761 1592788 1453403 1603949 1782368 1818880 1774865 1798828 1920999 2049178 2090108 2002330
42751 2002330 1811196 1656260 1736086 2097844 2541841 2820663 2868969 2782314 2688260 2718339
42741 2718339 2950532 3239852 3249690 2830835 2263793 1950301 1965870 2095890 2194872 2279890
42731 2279890 2357099 2421414 2594080 2987767 3417026 3519829 3270898 3149531 3615531 4515152
42721 4515152 5171142 5069702 4370531 3693161 3445807 3476929 3431358 3278351 3268033 3466650
42711 3466650 3678890 3858473 4198394 4650395 4759688 4290290 3692050 3564558 3906070
42702 3906070 4296718 4583269 4880291 5061124 4847065 4399955 4247812 4497860 4629502
42693 4629502 4256674 3654212 3304717 3315816 3539761 3921998 4439584 4962891 5448823 6042375
42683 6042375 6755404 7304939 7544616 7808243 8485479 9423392 10088796 10217378 9981303
42674 9981303 9597641 9122575 8635345 8288131 8067276 7752737 7255958 6826552 6764214 7026814
42664 7026814 7301315 7450318 7704601 8289755 8966653 9180035 8735622 8118087 7947572
42655 7947572 8264384 8594489 8617210 8449190 8288477 8137131 7970435 7862653 7802168 7669665
42645 7669665 7560483 7819934 8516217 9156901 9255995 8991963 8946557 9303096 9684747 9788074
42635 9788074 9825305 10218872 11085431 12160019 13113801 13861366 14621496 15693825 17096293
42626 17096293 18432551 19225888 19389056 19255354 19139396 19006031 18641346 18032590 17424124
42617 17424124 16986961 16565410 15875745 14923508 14056391 13525873 13152178 12600906 11899992
42608 11899992 11450312 11528811 12002073 12569971 13081426 13538219 13989000 14536327 15304000
42599 15304000 16295154 17383093 18473382 19539398 20512808 21359540 22265263 23440540 24665807
42590 24665807 25374710 25360539 25065834 24926742 24750206 24077816 22906784 21635158 20444664
42581 20444664 19180309 17817685 16649475 15926792 15600416 15495774 15510161 15556852 15520209
42572 15520209 15385921 15294217 15347955 15392866 15060243 14119637 12867663 12048955 12122486 12605776
42562 12605776 12498634 11481124 10308022 9782975 9760479 9564652 9018362 8469460 8009131
42553 8009131 7351181 6508837 5959612 5949023 6130872 6142734 6126408 6386062 6845241 7163280
42543 7163280 7202796 7112039 7062019 7118304 7296441 7569248 7841459 8008597 8029704 7944600
42533 7944600 7882403 8007256 8335285 8654774 8776044 8796860 8937623 9192722 9388457 9534110
42523 9534110 9833334 10350418 10934644 11472969 11936907 12191055 12091746 11814605 11735424 11901873
42513 11901873 11966745 11758498 11565714 11681505 11980599 12158685 12137381 12032722 11934722 11883225
42503 11883225 11866944 11734996 11335861 10819715 10505000 10352299 9939483 9123470 8335515
42494 8335515 7982334 7941885 7958299 8158511 8770380 9613157 10302238 10770230 11194038 11576201
42484 11576201 11784115 11863008 11949599 12019593 12063397 12310177 12849285 13206632 12813205 11820222
42474 11820222 10926125 10397421 9798680 8788720 7659526 6856874 6376390 5916187 5352965
42465 5352965 4819471 4496815 4496580 4767788 5006762 4884302 4498113 4364424 4779887 5395690
42455 5395690 5639373 5417772 5188064 5406058 6076171 6810256 7206974 7188275 7022203 6984574
42445 6984574 6999673 6716435 5951819 4916308 3952619 3208601 2664578 2338204 2295878 2501018
42435 2501018 2774533 2926744 2898954 2788659 2738770 2772705 2764134 2626162 2479718 2519820
42425 2519820 2735771 2899193 2843634 2630876 2417192 2285645 2260467 2366363 2580085 2773073
42415 2773073 2775466 2518937 2140880 1940802 2126657 2534665 2723792 2481090 2120285 2102381
42405 2102381 2464854 2853727 3034581 3077961 3062931 2938020 2762034 2778517 3097394 3532784
42395 3532784 3894594 4207755 4477684 4478756 4026708 3317946 2760134 2551509 2623362 2899213
42385 2899213 3369601 3928389 4341748 4426742 4166821 3675816 3146101 2770922 2575911 2364313
42375 2364313 1976599 1577781 1516344 1881171 2366439 2641287 2711905 2811359 3034949 3241735
42365 3241735 3307687 3331493 3505894 3849338 4173093 4325844 4382390 4523611 4760513 4843574
42355 4843574 4473494 3616766 2633958 2055541 2131581 2590451 2943685 3032165 3105156 3325515
42345 3325515 3467886 3301718 3022070 2956256 2986030 2693056 2084868 1728731 1995808 2543915
42335 2543915 2822553 2823950 2994712 3524390 4048032 4080318 3542349 2802558 2298211 2154601
42325 2154601 2147423 2031120 1844738 1786811 1847600 1795526 1571924 1438004 1575310 1754894
42315 1754894 1623611 1188220 800857 742113 1003638 1421541 1843717 2177197 2387829 2450671
42305 2450671 2294774 1928746 1643610 1841552 2520406 3182395 3476831 3678525 4208783
42296 4208783 4901247 5174209 4833624 4254720 3776242 3375687 3024357 2895092 3009675
42287 3009675 3076926 2958141 2964884 3367454 3880475 4037375 3904554 3970650 4353383 4565551
42277 4565551 4205283 3520126 3036470 2859229 2652571 2237436 1882970 1900518 2169376 2274838
42267 2274838 2045234 1741322 1683137 1877895 2123529 2313706 2440668 2392299 2024250 1478261
42257 1478261 1175163 1334933 1666405 1718334 1438135 1185403 1244207 1538591 1844305 2059461
42247 2059461 2159585 2061563 1725455 1338981 1222651 1505431 1979927 2310002 2323181 2092770
42237 2092770 1824916 1718187 1857517 2144654 2339081 2250119 1930844 1657835 1686139 2009376
42227 2009376 2355841 2432245 2196342 1888690 1770585 1845039 1886849 1730135 1430769 1131246
42217 1131246 893017 733092 698823 775551 807528 665283 447035 369258 489552 673825
42207 673825 790364 778839 589303 269421 79343 252068 613579 737447 572674 602406
42197 602406 1178541 1980100 2436134 2500400 2644443 3142000 3724273 4020428 4042590 4047751
42187 4047751 4083439 3901892 3340224 2641165 2275964 2443256 2838627 2995212 2777259 2413553
42177 2413553 2119484 1909813 1794100 1894081 2243249 2663403 2965454 3099357 3012681 2613567
42167 2613567 2049324 1757037 1957970 2289470 2236663 1785444 1346893 1169657 1166128 1218556
42157 1218556 1274948 1172159 750315 187487 -118240 -62583 81012 150749 337431 815353
42147 815353 1418303 1827543 1867654 1534519 972863 501004 385915 496526 452116 202258
42137 202258 138802 503560 1039415 1428951 1721408 2043566 2220580 2062975 1796789 1803459
42127 1803459 2069232 2266443 2277411 2258140 2238926 2055611 1710059 1454514 1435114 1531552
42117 1531552 1630722 1786681 1985449 1991817 1618155 1017863 560731 486517 773901 1266865
42107 1266865 1810085 2279866 2580406 2673302 2632289 2643775 2877850 3325511 3821953 4247597
42097 4247597 4610175 4908736 5079290 5159050 5321732 5604488 5790631 5784790 5932284 6657022
42087 6657022 7881181 9158463 10356287 11799880 13640962 15491739 16951829 18201869
42079 18201869 19688649 21307939 22261696 21841022 20180673 18126345 16430793 15176111
42071 15176111 13965401 12549106 11112573 9941266 9007422 8076737 7120126 6360880 5902970
42062 5902970 5557232 5108525 4533803 3859803 3051099 2219115 1722458 1789179 2154521 2339265
42052 2339265 2222317 2071119 2045222 1992292 1804189 1660854 1727759 1832121 1693081 1361574
42042 1361574 1169759 1259063 1399418 1345918 1176797 1128670 1210491 1179196 912072 639866
42032 639866 691804 1062584 1363191 1247839 819067 532448 712663 1227903 1655665 1718435
42022 1718435 1522261 1393494 1521509 1774489 1863122 1664904 1333507 1064245 842375 541938
42012 541938 217745 94702 215213 307016 151690 -80788 -73437 176886 384202 389541
42002 389541 277700 105666 -165658 -419458 -401610 -132580 9299 -185172 -430052 -385272
41992 -385272 -142806 36167 201451 519661 800584 724628 473383 594016 1165069 1611207
41982 1611207 1532118 1251789 1263098 1522810 1671057 1662531 1741073 1913373 1859310 1385428
41972 1385428 678838 58209 -326563 -498251 -511122 -384815 -140610 108496 137482 -195367
41962 -195367 -698132 -951727 -763465 -376295 -134776 -108661 -163352 -205745 -177050 24631
41952 24631 387603 676532 702600 604464 647920 845024 988262 957909 761450 383029
41942 383029 -120539 -459803 -380478 -74114 7874 -216867 -337915 -31962 542903 1053052
41932 1053052 1388395 1561555 1463027 1001502 381360 -14904 -28763 133189 161756 -54183
41922 -54183 -389903 -651509 -729388 -616698 -348131 7458 303497 385064 281646 243061
41912 243061 473235 883146 1208890 1315918 1284334 1269442 1405697 1774030 2310285 2790823
41902 2790823 3039869 3091418 3034700 2834430 2492642 2242007 2291809 2458891 2372483 2038392
41892 2038392 1874246 2128680 2574057 2886097 3054277 3256731 3536840 3781033 3903328
41883 3903328 3942016 4059450 4477894 5287709 6298661 7215172 7950415 8629200 9371637
41874 9371637 10321057 11789426 13975573 16475417 18442482 19378697 19473751 19068164 18156283
41865 18156283 16621774 14629074 12515290 10530685 8885804 7777125 7129567 6577909
41857 6577909 5946026 5470868 5299618 5100015 4542243 3883875 3621110 3743996 3808588 3632278
41847 3632278 3422961 3240335 2825169 2077210 1315063 900991 868162 1014212 1114970 971513
41837 971513 511406 -35582 -269973 -47019 375372 661491 707379 599593 461553 400006
41827 400006 435037 429108 226375 -125566 -442652 -659671 -821536 -878871 -778630 -733795
41817 -733795 -1028135 -1477479 -1503419 -954361 -454397 -581249 -1011324 -960660 -311569 251091
41807 251091 257983 62319 184568 500247 525992 277021 292112 766801 1155727 900750
41797 900750 222055 -182055 -43758 271101 406077 407099 369800 137887 -350763 -734210
41787 -734210 -650068 -342313 -421426 -1017227 -1556179 -1496957 -960856 -422568 -35365 400794
41777 400794 888530 1041392 618329 15204 -90176 427373 950618 894579 427612 175744
41767 175744 390539 769666 1033720 1234341 1384019 1221856 636322 12499 -182062 45225
41757 45225 395206 832069 1552445 2467443 3122161 3206844 2865094 2421341 2042538 1753142
41747 1753142 1571662 1497572 1463551 1380062 1182335 839448 388922 -53380 -372599 -510924
41737 -510924 -448285 -266649 -251709 -684995 -1410903 -1869679 -1752610 -1362342 -1090525 -855663
41727 -855663 -422838 9464 41315 -268764 -486142 -461514 -406347 -356982 -114751 232121
41717 232121 270170 -114266 -540848 -719698 -795393 -958120 -1153060 -1351938 -1669156 -1991289
41707 -1991289 -1920109 -1339801 -653840 -211712 105611 471814 714145 656267 471166 328581
41697 328581 60696 -414483 -684585 -338043 381490 883318 991715 945688 827679 504413
41687 504413 54810 -226229 -255046 -199623 -104086 149629 493317 649593 525963 348767
41677 348767 343396 505086 716713 899530 1035396 1182488 1416726 1633679 1554806 1113809
41667 1113809 657700 527556 632148 715293 817866 1095196 1374291 1371017 1251288 1470080
41657 1470080 2043625 2459113 2389082 2074628 1895807 1951404 2186798 2567232 2960174 3150997
41647 3150997 3129272 3119070 3260471 3547312 4097485 5065152 6152873 6653834 6254427 5463046
41637 5463046 4955856 4788885 4581179 4230701 4045330 4252210 4733377 5289394 5946273
41628 5946273 6931266 8411074 10217927 11786077 12480078 12122287 11156259 10217839 9599470
41619 9599470 9166001 8676724 8088726 7578014 7295568 7098773 6629928 5784682 4969837
41610 4969837 4651323 4733017 4701087 4344915 3943942 3703208 3467171 3176678 3156612 3612570
41600 3612570 4179012 4357617 4172709 4005830 3963772 3827448 3523276 3220348 2971982 2653938
41590 2653938 2317523 2254985 2587320 3047170 3293009 3220392 2853954 2174201 1254678 422116
41580 422116 49170 207285 659242 1157003 1595102 1879468 1853921 1506755 1148539 1166521
41570 1166521 1558480 1888325 1819885 1549260 1528478 1858940 2194505 2230842 2054756 1958629
41560 1958629 2114199 2507348 3009381 3406785 3507582 3324859 3053750 2820632 2590635
41551 2590635 2350306 2188508 2126115 2057552 1940857 1847208 1754678 1552450 1366378 1576577
41541 1576577 2293714 3085100 3495436 3615215 3821276 4143356 4255669 3998183 3550718
41532 3550718 3123009 2781552 2561141 2453336 2295925 1962357 1660886 1758305 2292435 2945714
41522 2945714 3520177 4116576 4765756 5207061 5198941 4813614 4264795 3644948 2997809 2480569
41512 2480569 2259580 2307532 2404411 2290046 1820366 1119253 583047 534078 822861 982768
41502 982768 826372 623791 597019 570553 357557 196882 437384 939466 1185446 971344
41492 971344 642925 575380 708335 729233 501053 140747 -188986 -389807 -387641 -140318
41482 -140318 283129 698497 922449 901460 736142 570499 445097 288583 74268 -88235
41472 -88235 -104496 -84630 -246014 -624288 -1010858 -1201355 -1170929 -969282 -627992 -292361
41462 -292361 -264286 -680106 -1216924 -1366298 -1015671 -547806 -331110 -343910 -392216 -446682
41452 -446682 -559285 -622654 -473621 -165665 89098 204268 221770 70268 -397850 -1071642
41442 -1071642 -1540232 -1517638 -1134102 -693057 -316002 27618 297777 386144 264574 -23187
41432 -23187 -454879 -973027 -1391133 -1507371 -1303289 -936983 -581208 -359678 -367194 -602029
41422 -602029 -899878 -1070159 -1097838 -1096135 -1066418 -844491 -337867 277028 673657 679443 436609
41411 436609 258709 320105 492929 518309 316611 56330 -72457 -38671 98015 298412
41401 298412 511004 644627 674838 696163 785283 893168 938617 899084 732177 347001
41391 347001 -224753 -756691 -1069425 -1232935 -1383086 -1458708 -1298917 -896908 -362792 269894
41381 269894 973931 1526524 1631210 1268075 747837 401496 340383 475672 613953 577974
41371 577974 397425 322967 480872 613396 404058 -19300 -216671 -70115 32474 -265459
41361 -265459 -822408 -1176426 -1003373 -343838 423806 794714 559806 97904 31320 523491
41351 523491 1157511 1582666 1973875 2660126 3544873 4150954 4121424 3500079 2642373 2014926
41341 2014926 1952934 2411322 2991539 3317613 3316911 3090078 2696197 2210706 1821216 1653505
41331 1653505 1595653 1479412 1354823 1395389 1590964 1741073 1747078 1717400 1727261 1622273 1178452
41320 1178452 420416 -317018 -697677 -729909 -724063 -880932 -1035122 -906827 -502162 -95319
41310 -95319 125532 203326 238230 280671 399583 647516 925957 1058661 1002724 823653
41300 823653 529141 167413 1416 239141 626999 714301 528276 516930 757261 780747
41290 780747 384659 28683 76704 205266 52806 -44402 400642 1100430 1324730 976903
41280 976903 655161 711165 905386 1022456 1201011 1519478 1784182 1892299 1960867 1967684
41270 1967684 1712290 1277701 1079083 1260906 1459190 1366745 1134868 996324 904042 822680
41260 822680 978822 1459329 1886855 1897825 1698331 1732839 1990464 2089888 1958687 1954464
41250 1954464 2249085 2494093 2293288 1764065 1392830 1406890 1485821 1171413 487694 -3680
41240 -3680 143966 682922 959002 732392 416463 425431 605090 540126 195142 -61925
41230 -61925 17332 299644 522375 582912 551088 575008 825544 1396213 2177361 2882008
41220 2882008 3239474 3167389 2794419 2347726 1970972 1616464 1170917 705425 489912 686577
41210 686577 1128809 1505819 1691468 1784198 1886983 1980226 2007200 1992739 2054372 2312751
41200 2312751 2764172 3244276 3595779 3882973 4325037 4973010 5582067 5881359 5843514 5590203
41190 5590203 5176300 4630585 4102808 3754948 3522090 3172421 2648874 2201771 2086589
41181 2086589 2201387 2135304 1615605 871355 469017 724918 1342124 1753638 1798850 1875354
41171 1875354 2364800 3104523 3587900 3567626 3262308 2992493 2791721 2447222 1852881 1238742
41161 1238742 985244 1166437 1354111 1040137 263778 -374396 -404342 -2226 312713 293683
41151 293683 60615 -252775 -613405 -867586 -745723 -242963 215470 201354 -196671 -461805
41141 -461805 -264491 163001 351418 191468 38947 210689 555827 665811 401826 29648
41131 29648 -124368 35922 400816 747815 799955 445852 -17823 -104265 279872 689862
41121 689862 726766 540193 550681 870753 1251301 1469193 1514614 1467896 1412217 1429474 1519610
41110 1519610 1574238 1532708 1436299 1225630 715501 -27549 -537369 -486352 -162119 -46804
41100 -46804 -113032 15966 344824 487831 361999 334399 559163 701005 535552 338754
41090 338754 392376 550872 661593 1000176 1800838 2638980 2830343 2333402 1768544 1588971
41080 1588971 1701594 1909867 2213351 2502749 2410586 1775726 978879 513082 408982 372350
41070 372350 323388 436474 700463 841804 797430 921512 1474096 2128927 2314737 1963225
41060 1963225 1583682 1555198 1657368 1462179 955045 526540 458820 643853 777032 659255
41050 659255 326248 18739 486 278623 541371 504898 272363 191190 394570 669737
41040 669737 778097 723617 669722 736466 919537 1110922 1201415 1238684 1399142 1680374
41030 1680374 1778040 1513431 1240442 1460120 2082851 2504360 2463496 2353459 2505043 2633936
41020 2633936 2340439 1789393 1453593 1397852 1264315 880797 486707 356833 510393 799748
41010 799748 1029559 1005009 726831 535312 792363 1391880 1832765 1813799 1507153 1188816
41000 1188816 878560 499137 174232 139939 428184 800296 988897 922671 728235 583918
40990 583918 593187 768519 1079691 1460581 1790294 1962030 1980333 1890422 1636998 1201605
40980 1201605 911045 1282863 2334045 3308178 3441138 2850043 2291987 2147969 2100107
40971 2100107 1825779 1500981 1393704 1356547 1071443 595769 345362 599831 1230715 1868417
40961 1868417 2194929 2135552 1878659 1655017 1462899 1153532 822047 847165 1363560 1938016
40951 1938016 2057173 1781091 1584455 1633172 1595115 1211825 703259 437045 450821 519370
40941 519370 531025 559555 638523 699739 748294 896262 1135264 1222747 944187 435121 87148
40930 87148 107468 299319 353582 249560 229837 425971 677135 755376 635643 469988
40920 469988 394701 446210 583848 693463 626496 353199 65441 32252 340140 827971
40910 827971 1260357 1498182 1519689 1377504 1176841 1038199 1031524 1156304 1388342 1705888
40900 1705888 2047149 2281011 2281894 2060262 1792441 1670411 1705680 1726036 1603905 1440869
40890 1440869 1454766 1717867 2105490 2480427 2777638 2880245 2620409 2073575 1711320 1981327
40880 1981327 2698557 3090610 2609066 1580520 871703 935729 1368435 1465773 1062429 657390
40870 657390 767205 1355457 1963915 2238988 2175296 1935905 1643182 1368809 1159536 988776
40860 988776 776330 513544 288497 155740 90654 113289 310437 644148 895130 957597
40850 957597 1068902 1528799 2243681 2787364 2931628 2880531 2894102 2912728 2748591 2496186
40840 2496186 2474758 2759525 3019241 2942027 2650216 2494174 2514376 2364095 1825762 1168594
40830 1168594 810345 778979 761773 617960 540883 670637 845934 883426 847562 839712 741020
40819 741020 433800 110008 31792 74046 -134812 -611877 -916057 -741022 -301254 23195
40809 23195 160883 283021 491828 793081 1196383 1601716 1727030 1414243 923774 655333
40799 655333 610182 406867 -138333 -714426 -913429 -722044 -451708 -300459 -174880 66516
40789 66516 350405 456473 307929 108737 145125 486756 955494 1369187 1695878 1938677
40779 1938677 2025951 1936154 1810829 1774199 1713323 1431163 996598 743942 884773 1265725
40769 1265725 1541122 1462498 1018006 476676 299165 746582 1476568 1772287 1343218 688820
40759 688820 456581 644506 745904 543667 349970 425839 559672 420427 55859 -218456
40749 -218456 -263495 -183309 -32144 264006 673143 984758 1064835 1013710 967778 898905 752099
40738 752099 641955 691607 740164 487550 -4083 -216178 220180 979109 1345060 1008691
40728 1008691 325776 -204696 -448658 -534172 -508040 -332674 -102227 -1410 -33576 24843
40718 24843 328406 728104 912400 747881 425826 248726 269252 197939 -227039 -790649
40708 -790649 -906228 -284631 650420 1198399 1137265 828068 630105 505059 275010 11892
40698 11892 -26608 262705 713024 1067735 1178682 1076124 933774 937460 1124156 1363654
40688 1363654 1509527 1512152 1380702 1139655 874490 733365 816753 1106519 1505171 1858065
40678 1858065 1958900 1704471 1289324 1078506 1225723 1602950 2166779 3104918 4417192
40669 4417192 5624490 6242338 6408625 6678990 7247748 7731529 7742337 7308852 6624350
40660 6624350 5721718 4617082 3548133 2827625 2555000 2606524 2787692 2875362 2664070
40651 2664070 2155101 1629109 1396931 1526287 1869514 2229024 2408353 2276516 1948815
40642 1948815 1768449 1923497 2188739 2227223 2027867 1825001 1696909 1529648 1331808 1266329
40632 1266329 1322120 1246458 919813 556206 381243 314658 161818 -26376 -2903 321190
40622 321190 747412 1004510 972716 712817 387873 164427 108631 161489 246876 370503
40612 370503 560023 748780 800698 650307 369672 99964 -60410 -130064 -233918 -475531
40602 -475531 -795134 -1021049 -1096773 -1154411 -1277685 -1299550 -989911 -395516 174665 500239
40592 500239 629644 702075 776107 905352 1197790 1638413 1956656 1857191 1378174 894319
40582 894319 750575 973739 1331245 1566083 1556201 1350249 1116837 1015276 1061637 1125718
40572 1125718 1064536 834891 483207 79165 -315036 -637653 -812395 -748482 -399061 136642
40562 136642 617645 859864 914670 948322 962145 794219 443106 196930 290685 578637
40552 578637 760575 851308 1152643 1729003 2181920 2099712 1555945 982768 670869 592653
40542 592653 633405 739565 813206 700552 415578 226992 371450 750681 1031828 993196
40532 993196 668349 226129 -136944 -225204 43303 510017 903607 1135419 1329151 1529169
40522 1529169 1586040 1444009 1333045 1472250 1738438 1875643 1915723 2097646 2445076 2773353
40512 2773353 3098572 3618081 4185388 4263169 3660126 2908051 2526085 2253491 1518520 438140
40502 438140 -260374 -261949 13183 199940 481120 1024237 1477558 1459840 1171580 1048822
40492 1048822 1066487 862895 392660 -22021 -212508 -280250 -220177 106217 563565 757368
40482 757368 606258 516907 797284 1229187 1436740 1361314 1106402 608947 -171715 -922023
40472 -922023 -1219336 -1054312 -795678 -668872 -568624 -379443 -166446 16825 231910 458790
40462 458790 529624 386459 203820 116629 20088 -180292 -284713 -62 648407 1313701
40452 1313701 1700823 1765474 1582403 1240433 906515 793880 953489 1193498 1276200 1129604
40442 1129604 854020 630380 634672 890322 1152367 1098575 722314 377962 331465 449878
40432 449878 501136 569514 908304 1499202 2067359 2489608 2860265 3129309 3024764 2464453
40422 2464453 1751378 1188721 759061 379887 206059 379660 667346 695111 462893 296044
40412 296044 313814 289883 104489 14729 300290 846286 1274761 1388275 1321127 1299753
40402 1299753 1395396 1536068 1681612 1906819 2267808 2621545 2703410 2449115 2125990 2028017
40392 2028017 2131949 2196345 2118103 2017563 2026559 2174921 2449457 2788080 3061605 3249592
40382 3249592 3570622 4221854 5079857 5940945 6944764 8329157 9769699 10482425 10165870
40373 10165870 9389698 8800288 8374482 7781287 7042524 6361577 5624668 4619505 3558955
40364 3558955 2861219 2542676 2344891 2324066 2695871 3144922 3004054 2261620 1699367 1742268
40354 1742268 1826482 1353424 688265 581887 996554 1230252 1034930 882998 1085041 1306610
40344 1306610 1191543 951272 992930 1293930 1505541 1494608 1445883 1482600 1466448 1234785
40334 1234785 878888 687497 833830 1156570 1289140 1032625 556097 177419 26381
40325 26381 33561 147664 340860 429519 174372 -351913 -745433 -760220 -595088 -520482 -458837
40314 -458837 -215281 51990 -33119 -487192 -874719 -861882 -572101 -284287 -50977 208485
40304 208485 449432 554894 520443 397511 158099 -193438 -459950 -418654 -126794 125981
40294 125981 178940 160244 268921 528799 786378 859406 686456 411148 283240 377604
40284 377604 472774 338220 57161 -123711 -178598 -267592 -359600 -236877 63969 189589
40274 189589 26549 -26583 374318 960770 1212882 1078742 933815 937314 866403 594474
40264 594474 313524 172169 51940 -127453 -181393 43453 367465 497925 397461 234741
40254 234741 104444 5445 -6476 127934 299942 307473 109634 -125121 -219893 -129137 96449
40243 96449 357976 522277 503307 353255 195796 61511 -135993 -447105 -774955 -953494
40233 -953494 -925584 -832360 -892939 -1141350 -1312787 -1109757 -596480 -177620 -115503 -229908
40223 -229908 -204024 -30941 46138 -61390 -183029 -171750 -73668 13181 64960 65983 -30357
40212 -30357 -212000 -388433 -495726 -531996 -504612 -462178 -525537 -692170 -651346 -79382 830958
40201 830958 1440844 1398612 1015898 738214 571468 346279 250645 603388 1203415 1440143
40191 1440143 1143425 854859 1034624 1389040 1324398 810172 379711 352294 447539 264798
40181 264798 -137366 -339020 -122674 255798 395732 237970 97196 205001 380674 301688
40171 301688 -12149 -239072 -255266 -260180 -293856 -6325 778727 1546822 1585833 899230
40161 899230 189564 -59579 -29910 -17577 64224 361784 664523 706703 641047 813549
40151 813549 1215587 1545049 1707608 1841040 1874378 1523536 839598 353536 444521 850169
40141 850169 1049626 913634 716406 674547 768321 936777 1163591 1366420 1431210 1394286
40131 1394286 1410492 1499088 1482091 1234140 860761 561052 417960 383621 372040 296947
40121 296947 105131 -147304 -313981 -322821 -263619 -245530 -235103 -127403 73323 253417
40111 253417 347652 389210 407494 389109 359013 388693 480666 544244 534254 504983 464524 320783
40099 320783 105822 109928 548990 1141748 1298870 808794 96857 -328471 -462440 -628090
40089 -628090 -897617 -1003463 -787360 -430992 -163323 17474 196016 301816 205519 -39873
40079 -39873 -225783 -227649 -94124 74815 213678 264210 193711 72560 22785 37978 -37946
40068 -37946 -260250 -403523 -190441 311863 693407 664041 371977 155056 115574 122100
40058 122100 124482 196804 275050 151360 -171874 -399474 -383516 -384947 -647292 -937690 -856719
40047 -856719 -465175 -204210 -228737 -237918 -39066 128714 22084 -196208 -246710 -196453
40037 -196453 -328820 -675958 -961633 -972651 -774251 -568047 -504493 -642812 -970434 -1428800
40027 -1428800 -1946392 -2404572 -2576780 -2257345 -1542577 -846782 -504438 -441216 -336428 -1899
40017 -1899 503321 1003468 1316494 1349550 1216101 1145051 1165813 1052173 717578 438633
40007 438633 446144 510401 277531 -120459 -198177 168249 563214 635811 506845 420384 311974
39996 311974 -28807 -547566 -912059 -855201 -412483 124966 429023 380978 150825 -14805
39986 -14805 -52401 -36614 32865 191613 304190 173821 -99327 -140227 216905 700606
39976 700606 974349 1004080 906200 664589 229234 -252091 -540446 -585756 -524033 -438774
39966 -438774 -277339 4615 316202 458418 270271 -192666 -637582 -808345 -776006 -808607
39956 -808607 -968785 -1058656 -978968 -860836 -755411 -508174 -120809 64663 -186866 -606176
39946 -606176 -770287 -665417 -576370 -562173 -414235 -81163 227807 388366 497031 599563
39936 599563 561811 323738 76685 63817 323695 699923 1006231 1153131 1207990 1334636
39926 1334636 1583665 1777788 1717976 1445933 1155048 903166 604171 270963 49892 -10413
39916 -10413 -39856 -156985 -347963 -560637 -776980 -964025 -1070141 -1081476 -996075 -793830
39906 -793830 -540845 -418641 -480664 -505161 -326668 -180535 -378378 -720761 -671126 -170618
39896 -170618 169388 -117239 -719726 -1002937 -796271 -421172 -150701 7093 81859 19197
39886 19197 -183809 -404783 -489225 -355390 -74715 99753 -65712 -446828 -586967 -222114
39876 -222114 357232 642817 481608 124801 -173352 -372917 -526078 -665392 -815215 -950417
39866 -950417 -949416 -722264 -367292 -85942 23934 -5348 -114429 -224437 -223086 -84465
39856 -84465 63855 117003 143035 225700 287654 252262 249184 422572 635278 628751 410989
39845 410989 213178 116493 21815 -50195 21425 129336 14189 -251402 -260479 83760 331055
39834 331055 159666 -94109 29323 353499 346319 453 -140282 126201 292727 -93692
39824 -93692 -733674 -1018719 -913471 -952045 -1413662 -1922082 -1991934 -1668704 -1390658 -1370300
39814 -1370300 -1374853 -1104576 -567449 -2910 409567 640925 707913 641416 554826 597095
39804 597095 762485 827762 582796 116280 -218668 -174846 102247 242638 104998 -53145
39794 -53145 61952 347994 410012 85748 -329477 -467294 -332471 -226871 -348876 -640407
39784 -640407 -959374 -1216017 -1356692 -1381954 -1388891 -1455037 -1490241 -1363854 -1170009 -1162881 -1388822
39773 -1388822 -1597350 -1604144 -1521341 -1480538 -1350318 -985572 -616531 -652366 -1078728 -1354447
39763 -1354447 -1052296 -395356 48066 91421 106875 453303 940741 1020043 428706 -510523
39753 -510523 -1239342 -1473526 -1312264 -980428 -617003 -286842 -47896 60144 43025 -60817
39743 -60817 -189823 -264447 -235389 -125578 17540 183898 349112 398182 213879 -145532
39733 -145532 -450569 -511292 -327800 -46476 147011 113739 -134420 -404305 -503538 -454441
39723 -454441 -417794 -445538 -486007 -594946 -866219 -1109507 -929040 -301199 224384 175281
39713 175281 -223252 -408724 -284019 -248282 -491121 -710917 -642189 -483960 -590598 -987683
39703 -987683 -1412843 -1664615 -1703863 -1527808 -1143770 -623113 -54224 508656 972638 1193035
39693 1193035 1154916 1064059 1098191 1131520 873017 257932 -443108 -900630 -985641 -766393
39683 -766393 -405145 -104116 -16695 -106087 -143768 66764 465717 769930 728334 338401
39673 338401 -172153 -559278 -750453 -819156 -814846 -710333 -549029 -527001 -790143 -1187251
39663 -1187251 -1383854 -1249813 -986698 -810298 -680356 -500114 -433558 -732739 -1240237 -1379625
39653 -1379625 -842080 -85932 133266 -326089 -834958 -790936 -305870 39284 -93140 -546907
39643 -546907 -996645 -1258119 -1286815 -1090631 -720888 -253646 232686 592254 610991 251018
39633 251018 -154133 -197694 68825 150095 -246324 -813336 -1054524 -881113 -578936 -343367
39623 -343367 -131765 80908 182570 105099 -71298 -249348 -410910 -559574 -706152 -919355
39613 -919355 -1226768 -1440913 -1278380 -743424 -229928 -107949 -309816 -448621 -274646 93170
39603 93170 325091 165699 -372626 -975843 -1225790 -968538 -498033 -269504 -408608 -594137
39593 -594137 -457287 -5524 421812 565900 518171 561723 814192 1093543 1126787 827804
39583 827804 345348 -105839 -405676 -559552 -648535 -755647 -895458 -1019643 -1117636 -1254609
39573 -1254609 -1433502 -1491040 -1286152 -973907 -897596 -1148924 -1416059 -1375697 -1072643 -765131
39563 -765131 -547660 -335425 -118715 24127 152368 454904 952133 1386008 1485344 1217221
39553 1217221 746886 307134 143456 380539 822544 1048815 852151 460098 199518
39544 199518 101673 25046 18463 277471 771375 1185536 1286330 1130394 853487 474002
39534 474002 24196 -319797 -426653 -422559 -534877 -769978 -899136 -746247 -361217 78844
39524 78844 408169 503996 325462 -1179 -222117 -179812 12918 74720 -169512 -645628
39514 -645628 -1150039 -1553288 -1837461 -1963539 -1812254 -1335145 -705449 -201540 56251 151652
39504 151652 178256 163337 206588 471061 904059 1168067 1061811 854658 928940 1189840
39494 1189840 1163067 670215 58195 -321790 -522258 -727555 -892932 -906419 -868682 -917634
39484 -917634 -936629 -730446 -380070 -141592 -81854 -91465 -165925 -354135 -492120 -356221
39474 -356221 -84909 -67399 -350364 -547603 -466151 -413408 -653493 -941466 -934299 -757310
39464 -757310 -744036 -815859 -595095 -80985 241969 53389 -398261 -668040 -615845 -394150
39454 -394150 -169028 -40595 -102367 -399452 -855079 -1302286 -1546371 -1415573 -900004 -288478
39444 -288478 -15322 -259575 -767206 -1135136 -1199148 -1095401 -1033152 -1090930 -1200115 -1276971
39434 -1276971 -1358428 -1550041 -1786544 -1759591 -1262118 -548228 -122643 -169979 -433968 -680688
39424 -680688 -956743 -1255049 -1280528 -873484 -448844 -605095 -1318790 -1868346 -1635497 -739572
39414 -739572 212561 793298 1029136 1151741 1259833 1238599 940368 409558 -95320 -325454
39404 -325454 -259017 -64877 98553 193633 276461 445681 765524 1140479 1314850 1113958
39394 1113958 651858 181337 -214924 -622922 -1015565 -1192838 -1077322 -884806 -860219 -955210
39384 -955210 -924931 -703060 -534186 -702049 -1205599 -1745373 -1995613 -1859933 -1485947 -1091956
39374 -1091956 -817899 -702867 -712530 -757753 -754903 -707205 -666402 -592643 -361980 18724 323523
39363 323523 354318 185296 25000 -82362 -252706 -517683 -765210 -896659 -877272 -672618
39353 -672618 -331090 -90195 -152146 -343288 -266934 139775 477689 441200 242881 285807
39343 285807 603992 849207 715151 184358 -552235 -1249203 -1750430 -2110869 -2494675 -2864157
39333 -2864157 -2927094 -2530358 -1924456 -1443315 -1104445 -782871 -607374 -820757 -1305735 -1626448
39323 -1626448 -1589182 -1436482 -1396201 -1347580 -1092800 -708798 -427263 -327459 -325334 -341324 -318461
39312 -318461 -182920 50184 207952 145545 -52733 -185928 -193842 -163925 -120185 32947
39302 32947 326156 605588 666840 458668 109802 -211061 -417453 -512957 -552811 -632362
39292 -632362 -843605 -1141428 -1281207 -1043872 -565153 -264738 -329576 -444692 -241888 134527
39282 134527 212318 -120088 -464647 -507311 -405972 -421161 -474928 -347944 -101549 9509
39272 9509 -61692 -135723 -147224 -220535 -377074 -419738 -213225 90950 234456 164178 55495
39261 55495 66556 165817 219903 189259 161327 182795 164658 54308 10654 212276 512618
39250 512618 537646 201415 -125694 -108338 126534 250271 202444 145455 135986 146278 266269
39239 266269 534795 666563 337284 -287585 -707961 -790201 -887949 -1181302 -1355004 -1138789
39229 -1138789 -752416 -527326 -441802 -366758 -453002 -856438 -1303347 -1378181 -1113783 -861914
39219 -861914 -673750 -292358 237268 452753 111938 -467690 -898000 -1184660 -1469217 -1646981
39209 -1646981 -1574839 -1430402 -1495439 -1686645 -1632982 -1182625 -544968 52321 546572 847541
39199 847541 786102 413516 100011 96776 147525 -195494 -916597 -1470353 -1428924 -965068
39189 -965068 -554624 -384359 -271324 -63378 161918 324804 510590 778439 984771 962181
39179 962181 755183 524275 329065 176809 163415 331129 467707 331245 56821 28971
39169 28971 300278 468348 271565 -15191 -20026 164340 193020 64079 95826 336106
39159 336106 386347 -55514 -742745 -1142075 -1005379 -559298 -234595 -298306 -652656 -909501
39149 -909501 -742686 -234372 205114 309366 242272 340563 682471 1034747 1163727 1063692
39139 1063692 883063 733744 610142 444633 207811 -43644 -220791 -295512 -302142 -236951
39129 -236951 -11964 436318 1000309 1403000 1380012 898765 217913 -311354 -552550 -662248
39119 -662248 -815582 -931596 -802538 -451688 -159767 -76478 3627 330044 782244 957059
39109 957059 651839 111187 -241478 -229147 -43531 2377 -195727 -446974 -499697 -327805
39099 -327805 -123195 -20069 50594 171392 217973 -36241 -614346 -1230056 -1501583 -1249408
39089 -1249408 -629423 -16713 292440 306973 216000 35694 -447978 -1263653 -1956699 -1971755
39079 -1971755 -1309634 -563946 -258309 -352768 -484746 -485255 -476446 -577842 -733046 -834791
39069 -834791 -868895 -873448 -842761 -755458 -677164 -754438 -1055815 -1442927 -1662694 -1584217 -1298865
39058 -1298865 -976516 -698399 -475248 -343624 -340599 -409629 -417924 -270547 22524 345986
39048 345986 512205 395322 127000 60970 396238 892686 1112408 898175 451598 -8882
39038 -8882 -443133 -832841 -1068379 -1091567 -990860 -863079 -707165 -520131 -362778 -260977
39028 -260977 -171184 -103479 -139832 -274651 -395297 -482473 -647182 -888460 -1024870 -985457
39018 -985457 -941407 -980921 -894763 -535191 -179316 -207782 -549395 -795422 -796095 -758606 -743395
39007 -743395 -489784 86296 567695 490809 -68409 -633345 -937238 -1121048 -1348835 -1499539
38997 -1499539 -1353857 -925279 -441891 -48277 311744 672065 854454 666454 246361
38988 246361 10838 195070 610854 959799 1204747 1444842 1570847 1329952 721699 78513
38978 78513 -307808 -456111 -538257 -623514 -657399 -564986 -314318 18522 241228 252081 246697
38967 246697 492621 856798 842560 247287 -484097 -797516 -696541 -563302 -490468 -214574
$$ [...]
##END NTUPLES=NMR SPECTRUM
##END=
