##TITLE=31P_DE-80H_X3
 64 sc D2O
 26.2.2025
##JCAMPDX= 6.0         $$ Bruker NMR JCAMP-DX V2.0
##DATA TYPE= NMR SPECTRUM
##DATA CLASS= NTUPLES
##ORIGIN= UXNMR, Bruker Analytische Messtechnik GmbH
##OWNER= root
$$ XWIN-NMR		Version 3.5
$$ Mon May 19 14:24:53 2025 Russian Standard Time (UT+4h)  Yarkov@DPX200
##.OBSERVE FREQUENCY= 81.013821
##.OBSERVE NUCLEUS= ^31P
##.ACQUISITION MODE= SIMULTANEOUS
##.ACQUISITION SCHEME= undefined
##.AVERAGES= 64
##.DIGITISER RES= 17
##SPECTROMETER/DATA SYSTEM= spect
##.PULSE SEQUENCE= zgpg30
##.SOLVENT NAME= CDCl3
##.SHIFT REFERENCE= (INTERNAL, CDCl3, 0, 198.062)
##AUDIT TRAIL= $$ (NUMBER, WHEN, WHO, WHERE, WHAT)
$$ ##TITLE= Audit trail, XWIN-NMR		Version 3.5
$$ ##JCAMPDX= 5.01
$$ ##ORIGIN= Bruker BioSpin GmbH
$$ ##OWNER= Yarkov
$$ C:/Bruker/XWIN-NMR/data/yarkov2/nmr/P31/2/pdata/1/auditp.txt
$$ ##AUDIT TRAIL=  $$ (NUMBER, WHEN, WHO, WHERE, WHAT)
(   1,<2025-05-19 14:24:02.00 +0400>,<Yarkov>,<DPX200>,
      <created by zg, POWCHK disabled, PULCHK disabled
       configuration hash MD5:
       00 E9 B6 7A A2 85 ED C7 34 08 36 98 17 FE 4E 26
       data hash MD5: 32K
       CF 0E 09 A1 3F D6 4B 5F 33 7A 23 BE 9B 44 37 65>)
(   2,<2025-05-19 14:24:07.93 +0400>,<Yarkov>,<DPX200>,
      <Start of raw data processing
       efp BC_mod = 2 LB = 1.5 FT_mod = 6 PKNL = 1 PHC0 = 1753.79 PHC1 = 76.9595 SI = 64K 
       data hash MD5: 64K
       85 FB 1F 13 99 92 6B 94 02 A0 C2 E3 E5 43 E5 7A>)
(   3,<2025-05-19 14:24:26.79 +0400>,<Yarkov>,<DPX200>,
      <pk PHC0 = 3.117619 PHC1 = -3.799999 
       data hash MD5: 64K
       8A 4A 35 5A 0C A0 2A 6A 3A 61 6A FD 1B 0F 60 E6>)
$$ ##END=
$$ 
$$ hash MD5
$$ EB B2 D0 72 66 91 31 DF 83 5D 87 16 2D F6 CA 68
##$RELAX= 
##$RELAX= 
##$RELAX= 
##$RELAX= 
##$RELAX= 
##$RELAX= 
##$RELAX= 
##$RELAX= 
$$ Bruker specific parameters
$$ --------------------------
##$DU= <C:/Bruker/XWIN-NMR>
##$EXPNO= 2
##$NAME= <P31>
##$PROCNO= 1
##$TYPE= <nmr>
##$USER= <yarkov2>
##$AMP= (0..31)
100 100 100 100 100 100 100 100 100 100 100 100 100 100 100 100 100 100 
100 100 100 100 100 100 100 100 100 100 100 100 100 100 
##$AQSEQ= 0
##$AQ_mod= 1
##$AUNM= <au_zg>
##$AUTOPOS= <>
##$BF1= 81.014009
##$BF2= 200.13
##$BF3= 200.13
##$BF4= 200.13
##$BF5= 200.13
##$BF6= 200.13
##$BF7= 200.13
##$BF8= 200.13
##$BYTORDA= 1
##$CFDGTYP= 0
##$CFRGTYP= 5
##$CHEMSTR= <none>
##$CNST= (0..31)
1 1 145 1 1 1 1 1 1 1 1 1 1 1 1 1 1 1 1 1 1 1 1 1 1 1 1 1 1 1 1 1 
##$CPDPRG= <waltz16>
##$CPDPRG1= <>
##$CPDPRG2= <waltz16>
##$CPDPRG3= <>
##$CPDPRG4= <mlev>
##$CPDPRG5= <mlev>
##$CPDPRG6= <mlev>
##$CPDPRG7= <mlev>
##$CPDPRG8= <mlev>
##$CPDPRGB= <>
##$CPDPRGT= <>
##$D= (0..31)
0 1 0 0 0 0 0 0 0 0.06 0 0.03 2e-05 3e-06 0 0 0.0002 0 0 0 0 0 0 0 0 0 
0 0 0 0 0 0 
##$DATE= 1747650241
##$DBL= (0..7)
120 120 120 11 120 120 24 19 
##$DBP= (0..7)
150 150 150 150 150 150 150 150 
##$DBP07= 0
##$DBPNAM0= <>
##$DBPNAM1= <>
##$DBPNAM2= <>
##$DBPNAM3= <>
##$DBPNAM4= <>
##$DBPNAM5= <>
##$DBPNAM6= <>
##$DBPNAM7= <>
##$DBPOAL= (0..7)
$$ [...]
##$SUBNAM3= <"">
##$SUBNAM4= <"">
##$SUBNAM5= <"">
##$SUBNAM6= <"">
##$SUBNAM7= <"">
##$SUBNAM8= <"">
##$SUBNAM9= <"">
##$SW= 400.765351723535
##$SWIBOX= (0..15)
0 1 3 0 0 0 0 0 0 0 0 0 0 0 0 0 
##$SW_h= 32467.5324675325
##$TD= 32768
##$TD0= 1
##$TE= 0
##$TE2= 300
##$TE3= 300
##$TEG= 300
##$TL= (0..7)
0 120 53 12 22 120 120 120 
##$TP= (0..7)
150 150 150 150 150 150 150 150 
##$TP07= 0
##$TPNAME0= <>
##$TPNAME1= <>
##$TPNAME2= <>
##$TPNAME3= <>
##$TPNAME4= <>
##$TPNAME5= <>
##$TPNAME6= <>
##$TPNAME7= <>
##$TPOAL= (0..7)
0.5 0.5 0.5 0.5 0.5 0.5 0.5 0.5 
##$TPOFFS= (0..7)
0 0 0 0 0 0 0 0 
##$TUNHIN= 0
##$TUNHOUT= 0
##$TUNXOUT= 0
##$USERA1= <user>
##$USERA2= <user>
##$USERA3= <user>
##$USERA4= <user>
##$USERA5= <user>
##$V9= 5
##$VALIST= <valist>
##$VCLIST= <CCCCCCCCCCCCCCC>
##$VD= 0
##$VDLIST= <DDDDDDDDDDDDDDD>
##$VPLIST= <PPPPPPPPPPPPPPP>
##$VTLIST= <TTTTTTTTTTTTTTT>
##$WBST= 1024
##$WBSW= 4
##$XGAIN= (0..3)
0 0 0 0 
##$XL= 0
##$YL= 0
##$YMAX_a= 12615
##$YMIN_a= -30912
##$ZGOPTNS= <>
##$ZL1= 120
##$ZL2= 120
##$ZL3= 120
##$ZL4= 120
##$ABSF1= 0
##$ABSF2= 0
##$ABSG= 0
##$ABSL= 0
##$ALPHA= 0
##$AQORDER= 0
##$ASSFAC= 0
##$ASSFACI= 0
##$ASSFACX= 0
##$ASSWID= 0
##$AUNMP= <proc_1d>
##$AZFE= 0.1
##$AZFW= 0.5
##$BCFW= 0
##$BC_mod= 2
##$BYTORDP= 0
##$COROFFS= 0
##$CY= -3
##$DATMOD= 1
##$DC= 0
##$DFILT= <>
##$DTYPP= 0
##$F1P= 0
##$F2P= 0
##$FCOR= 1
##$FTSIZE= 65536
##$FT_mod= 6
##$GAMMA= 0
##$GB= 0
##$INTBC= 1
##$INTSCL= 9.790993e-09
##$ISEN= 30
##$LB= 1.5
##$LEV0= 0
##$LPBIN= 0
##$MAXI= 10000
##$MC2= 0
##$MEAN= 0
##$ME_mod= 0
##$MI= 50
##$NCOEF= 0
##$NC_proc= -8
##$NLEV= 6
##$NOISF1= 182.463
##$NOISF2= 159.3651
##$NSP= 0
##$NTH_PI= 0
##$NZP= 0
##$OFFSET= 198.0616
##$PC= 4
##$PHC0= 1756.908
##$PHC1= 73.15951
##$PH_mod= 1
##$PKNL= yes
##$PPARMOD= 0
##$PSCAL= 0
##$PSIGN= 0
##$REVERSE= no
##$SF= 81.0140089999434
##$SI= 65536
##$SIGF1= 159.3651
##$SIGF2= -187.1042
##$SINO= 113.3802
##$SIOLD= 16384
##$SREGLST= <1H.CDCl3>
##$SSB= 0
##$STSI= 65536
##$STSR= 0
##$SW_p= 32467.5324675325
##$SYMM= 0
##$S_DEV= 0
##$TDeff= 32768
##$TDoff= 0
##$TI= <>
##$TILT= no
##$TM1= 0
##$TM2= 0
##$TOPLEV= 0
##$USERP1= <user>
##$USERP2= <user>
##$USERP3= <user>
##$USERP4= <user>
##$USERP5= <user>
##$WDW= 1
##$XDIM= 65536
##$YMAX_p= 80008938
##$YMIN_p= -333316214
$$ End of Bruker specific parameters
$$ ---------------------------------
##NTUPLES= NMR SPECTRUM
##VAR_NAME=  FREQUENCY,     SPECTRUM/REAL,   SPECTRUM/IMAG
##SYMBOL=    X,             R,               I
##VAR_TYPE=  INDEPENDENT,   DEPENDENT,       DEPENDENT
##VAR_FORM=  AFFN,          ASDF,            ASDF
##VAR_DIM=   65536,         65536,           65536
##UNITS=     HZ,            ARBITRARY UNITS, ARBITRARY UNITS
##FACTOR=    0.49542278885378, 1,            1
##FIRST=     16045.7642231865, 0,            0
##LAST=      -16421.768244346, 0,            0
##MIN=       -16421.768244346, -333316214,   0
##MAX=       16045.7642231865, 80008938,     0
$$ Real data points
##PAGE= N=1
##DATA TABLE= (X++(R..R)), XYDATA
$$ [...]
7492d534983j528883J674879L042296K630827J067245j393614l389438k837857
$$ -4534983 -6063866 -4388987 -1346691 1284136 2351381 957767 -2431671 -5269528
7484e269528M2757K276368J839808M1674p41106K3989J249309J721649O38688
$$ -5269528 -5226771 -2950403 -1110595 -1068921 -1810027 -1786038 -536729 1184920 1823608
7475A823608j688972l150969j795835J040505J897073Q1103j447965j076909r42381
$$ 1823608 134636 -3016333 -4812168 -3771663 -1874590 -1793487 -3241452 -4318361 -5260742
7466e260742k355434k519985P75384M196728L057765j281153k994640k01357K903718
$$ -5260742 -7616176 -10136161 -9360777 -5164049 -2106284 -3387437 -6382077 -6583434 -3679716
7457c679716K778218J029295P38162J844017K228184R89400j140253k902920k860313
$$ -3679716 -901498 127797 865959 2709976 4938160 5927560 4787307 1884387 -975926
7448i75926l95521K707104L541593J701679m06343j388743k269347l163470j960738
$$ -975926 -1371447 1335657 4877250 6578929 6172586 4783843 2514496 -648974 -2609712
7439b609712J602242L781852J809717j457143j395764J700417L609275K640096
$$ -2609712 -1007470 2774382 4584099 3126956 1731192 3431609 7040884 9680980
7431I680980J036160L64592l74233j643977k194305j912969k389416l422621k384823
$$ 9680980 10717140 11081732 10707499 9063522 6869217 4956248 2566832 -855789 -3240612
7422c240612J185009L609493K133799p75244j104166Q91066J857662Q65372J11169
$$ -3240612 -2055603 1553890 3687689 2912445 1808279 2699345 4557007 5422379 5533548
7413E533548O19493Q17357j60389q31730p4010R81825R98926L48179l25706j545240
$$ 5533548 6153041 6970398 6810009 5978279 5904269 6886094 7885020 8233199 7907493 6362253
7403F362253l362037l940602j920804Q73242J476063Q6237k18454J669110K985612
$$ 6362253 3000216 -940386 -2861190 -1987948 -511885 -425648 -644102 1025008 4010620
7394D010620J365865j247368j308030R74354J857335l79733k946546k729289o21582
$$ 4010620 5376485 4129117 2821087 3795441 5652776 5273043 2326497 -402792 -1024374
7385a024374L36940l86673n80116P95012K019967J455460p5212p52443k56762
$$ -1024374 -687434 -1074107 -1654223 -859211 1160756 2616216 2541004 1788561 1531799
7376A531799K30442l16794j812769l047732k338923P28160L927118M258300J802791
$$ 1531799 1762241 1445447 -367322 -3415054 -5753977 -5025817 -1098699 3159601 4962392
7367D962392j2020R87976K766566K355333K41010r07838n45856m05600j026020
$$ 4962392 4950372 5938348 8704914 11060247 11301257 10393419 9847563 9441963 8415943
7358H415943j176890o89977q16312j346470m61644J627454K038184k03534j968174
$$ 8415943 7239053 6549076 5732764 4386294 3924650 5552104 7590288 7386754 5418580
7349E418580p53050J076443n6436k989039l339362j82997K670433K379522N46788
$$ 5418580 4665530 5741973 5685537 2696498 -642864 -825861 1844572 4224094 4770882
7340D770882j14520L63985L89808l47528j120103j736152k122232j524918K13078
$$ 4770882 4656362 5020347 5410155 5062627 3942524 2206372 84140 -1440778 -1227700
7331a227700J605837J415767O69867J002357J808804J172518q09350j962031j382266
$$ -1227700 378137 1793904 2463771 3466128 5274932 6447450 5638100 3676069 2293803
7322B293803n09614l06888K44937J640339K057547P4038k336014j948377J125888
$$ 2293803 1784189 1477301 1722238 3362577 5420124 5494162 3158148 1209771 2335659
7313B335659L264584J882820j602249l719484k535853R41685L738229L138906
$$ 2335659 5600243 7483063 5880814 2161330 -374523 567162 4305391 7444297
7305G444297p41391m397828m309316j132673J004499k05316k504789k520421j01572
$$ 7444297 6702906 2305078 -2004238 -3136911 -2132412 -2337728 -4842517 -7362938 -7464510
7296g464510K310361L178743K833545J865894N78390k81773K2541J006064J433490
$$ -7464510 -5154149 -1975406 858139 2724033 3302423 3020650 3043191 4049255 5482745
7287E482745Q57999l29346j879863l464133m041281k955361j224410k18067L68280
$$ 5482745 6340744 6011398 4131535 667402 -3373879 -6329240 -7553650 -7771717 -7403437
7278g403437J415116J980137N51845j500614q06410K879092N318138L154575j658844
$$ -7403437 -5988321 -4008184 -3456339 -4956953 -5763363 -2884271 2433867 5588442 3929598
7269C929598m656835m211843k066715j17730R72551R66596K72546N21799K704949
$$ 3929598 -727237 -4939080 -7005795 -7123525 -6150974 -5184378 -4911832 -4390033 -1685084
7260a685084M855866L754635o98478m680011m770250j680901J237114K086901
$$ -1685084 3170782 6925417 6226939 1546928 -3223322 -4904223 -3667109 -1580208
7252a580208J756124J636631J521906M54995j163690j676235o03188L28226m02033
$$ -1580208 175916 1812547 3334453 3789448 2625758 949523 346335 674561 272528
7243B72528j695280j419444K48416J120252N09590J09243Q89620J523769R45644
$$ 272528 -1422752 -2842196 -2593780 -1473528 -963938 -854695 34925 1558694 2504338
7234B504338J88418J86585j10027j501573k301644o72728K163966L413608K378052
$$ 2504338 2692756 2879341 2769314 1267741 -1033903 -1706631 457335 3870943 6248995
7225F248995M44085j489023l121793l282781j136827J654060K660089K129844
$$ 6248995 6693080 5204057 2082264 -1200517 -2337344 -683284 1976805 4106649
7217D106649J957110J793782l01442l273482l153052R35563M426859L169732j154992
$$ 4106649 6063759 7857541 7556099 4282617 1129565 2065128 6491987 9661719 8506727
7208H506727l965744l845573k749119j742195L3303K375886L100307J110548j509567
$$ 8506727 4540983 695410 -2053709 -3795904 -3762601 -1386715 1713592 2824140 1314573
7199A314573j826411L50312K342719J925188j15553j197654k65820J047424Q37924
$$ 1314573 -511838 -161526 2181193 4106381 3990828 2793174 2527354 3574778 4412702
7190D412702m86773r58833K31862J919395K607854J865805J97776j509338k472365
$$ 4412702 3925929 2967096 3198958 5118353 7726207 9592012 9789788 8280450 5808085
7181E808085k664554k699414k566924j440384M05983J002753l21404r40684J551200
$$ 5808085 3143531 444117 -2122807 -3563191 -3157208 -2154455 -2475859 -3416543 -1865343
7172a865343N098673N651768L085741R30426M22011q47712l582225m625906k160622
$$ -1865343 3233330 8885098 11970839 12901265 13323276 12475564 8893339 4267433 2106811
7163B106811R35485J592219R37228J091281P67848k030553n249678n072066j843714
$$ 2106811 3042296 4634515 5571743 6663024 7430872 5400319 150641 -4921425 -6765139
7154f765139L44894l51061j595178j100050M05279J106479N23813p36099j787006
$$ -6765139 -6420245 -6771306 -8366484 -9466534 -9061255 -7954776 -7430963 -8167062 -9954068
7145i954068j513089O13420L365988M669593L882051K230721J137000R66217J017017
$$ -9954068 -11467157 -10853737 -7487749 -2818156 1063895 3294616 4431616 5397833 6414850
7136F414850L1213k468789m749429m294390j574845k04696j696147k650179J32561
$$ 6414850 6446063 3977274 -772155 -5066545 -6641390 -6846086 -8542233 -11192412 -11059851
7127a1059851M197141M792876J862880o31891j206129j832895k764925j598891
$$ -11059851 -6862710 -2069834 -206954 -838845 -2044974 -3877869 -6642794 -8241685
7119h241685J610221L255353J941968Q46166K028288K687417K38466k612707j928161
$$ -8241685 -6631464 -3376111 -1434143 -587977 1440311 4127728 4366194 1753487 -174674
7110a74674Q96277J038639k489560n611336n088659k214186k0462N28371M91688
$$ -174674 721603 1760242 -729318 -6340654 -11429313 -13643499 -13663961 -13135590 -12643902
7101a2643902Q14290J421375J830855K004933K517355L665334M516642L705205
$$ -12643902 -11829612 -10408237 -8577382 -6572449 -4055094 -389760 4126882 7832087
7093G832087J422951m42099o20714K08264R15025J370425J564201O74989j693516
$$ 7832087 9255038 8812939 8192225 8400489 9315514 10685939 12250140 12925129 11231613
7084A1231613m226713m949556l043191P42593M412793N309445K266471k119642
$$ 11231613 7004900 2055344 -987847 -245254 4167539 9476984 11743455 9623813
7076I623813l515518j259002O20832o58471k464589j175991J781416K191282j45933
$$ 9623813 6108295 4849293 5470125 4811654 2347065 1171074 2952490 5143772 4997839
7067D997839j323614J17784J015994q54728k909189j696111J944024M221207L326225
$$ 4997839 3674225 3792009 4808003 3953275 1044086 -652025 1291999 5513206 8839431
7058H839431P19125j529739k523711k066143l80309J374940J625890L0844j983866
$$ 8839431 9558556 8028817 5505106 3438963 3058654 4433594 6059484 6090328 4106462
7049D106462k743378k083261j289991j425289k095511k113401j070029L54395
$$ 4106462 1363084 -720177 -2010168 -3435457 -5530968 -7644369 -8714398 -8360003
7041h360003J548205K503802K951056K159694M14533m90490M35391J519197O06742
$$ -8360003 -6811798 -4307996 -1356940 802754 1217287 726797 1162188 2681385 3288127
7032C288127j544799k201768q47820m69j173468k377153j177470J472496K461888
$$ 3288127 1743328 -458440 -1306260 -1306729 -2480197 -4857350 -6034820 -4562324 -2100436
7023b100436P35904j622000k295592j147809L69866R52741L06632p71512r02880
$$ -2100436 -1364532 -2986532 -5282124 -6429933 -6060067 -5107326 -4800694 -5572206 -6475086
7014f475086M92039K114067J952367r6578j676070p76708J564799K426185O44433
$$ -6475086 -5983047 -3868980 -1916613 -2013191 -3689261 -4465969 -2901170 -474985 169448
7005A69448j868874k767848k124533j707571k078152j836493Q14K125368K412293
$$ 169448 -1699426 -4467274 -6591807 -8299378 -10377530 -12214023 -12213209 -10087841 -7675548
6996g675548P32109p88524l63432J451108K703077K361927J099567R2090k09525
$$ -7675548 -6943439 -7731963 -8095395 -6644287 -3941210 -1579283 -479716 -387626 -597151
6987e97151l3643L12451N87647N94357M90946P48269J207790O79366j466943l608864
$$ -597151 -630794 -318343 269304 863661 1354607 2102876 3310666 3990032 2523089 -1085775
6977a085775l334581q60809P96244m4435j265546k28433K137000K855268J414678
$$ -1085775 -4420356 -5281165 -4484921 -4529356 -5794902 -6023335 -3886335 -1031067 383611
6968C83611j4670l49608n38647o89089M60562K397766K449109Q0880j444240J52195
$$ 383611 368941 19333 -519314 -1208403 -747841 1649925 4099034 4179914 2735674 2887869
6958B887869K437280J994627m10191j557847r54114p26957j279352p23622J326023
$$ 2887869 5325149 7319776 6909585 5351738 4397624 3670667 2391315 1667693 2993716
6949B993716K636991J666926m59820j849137j747005l50426J370567J707394P8401
$$ 2993716 5630707 7297633 6837813 4988676 3241671 2891245 4261812 5969206 6047607
6940F047607j455797q60521K87254r93009l637381l347118N07719L221869J836862
$$ 6047607 4591810 3731289 4018543 3025534 -611847 -3958965 -3451246 -229377 1607485
6931A607485m00091L49543K231443J164181k077578l024346n49570J856559J746744
$$ 1607485 1207394 1556937 3788380 4952561 2874983 -149363 -698933 1157626 2904370
6922B904370N83676L79584R58267J543376K159840K338854R24387j683510l270034
$$ 2904370 3488046 3867630 4825897 6369273 8529113 10867967 11792354 10108844 6838810
6913F838810k827020j754685j134230j59362J454669J975575M47661j149960p68270
$$ 6838810 4011790 2257105 1122875 963513 2418182 4393757 4841418 3691458 2923188
6904B923188M54541K51518r64879j152296l95468m79151j235757o90617R52539
$$ 2923188 3377729 3629247 2664368 1512072 1116604 637453 -598304 -1288921 -336382
6895c36382Q95034j650135l542686k129833R66049K509393J959976Q35370l37540
$$ -336382 558652 -1091483 -4634169 -6764002 -5797953 -3288560 -1328584 -493214 -830754
6886h30754j642713j685122R11582M335655M977507K244786o85505j428464j117292
$$ -830754 -2473467 -4158589 -3247007 1088648 6066155 8310941 7625436 6196972 5079680
6877E079680j663744k727358k883696j973056p21547O03234J749524J913952R70336
$$ 5079680 3415936 688578 -2195118 -4168174 -4889721 -4286487 -2536963 -623011 347325
6868C47325J55885K33097J12342j265064k794658k667836j141604o6486j56786
$$ 347325 503210 736307 848649 -416415 -3211073 -5878909 -7020513 -7086999 -7243785
6859g243785m59638k86389m1466j18479l26609n07105o53580m16829O14747K213096
$$ -7243785 -7703423 -7989812 -8031278 -8149757 -8476366 -8983471 -9637051 -10053880 -9439133 -7226037
6849g226037L709060M495694L880242J493851j263207j633875R70516L120372
$$ -7226037 -3516977 978717 4858959 6352810 5089603 3455728 4426244 7546616
6841G546616J321800k930059m629348j682182K637513M021652J709535j860607
$$ 7546616 8868416 5938357 1309009 -373173 2264340 6285992 7995527 6134920
6833F134920l991925l474483r82170J360472J814702Q43966K13934M96831Q31724
$$ 6134920 2142995 -1331488 -2313658 -953186 861516 1705482 1919416 2416247 3247971
6824C247971Q16999P98976M26160j027892k856842l530879l112829k749721j854641
$$ 3247971 4064970 4863946 5290106 4262214 1405372 -2125507 -5238336 -7988057 -9842698
6815i842698J210935N225496O273878L108084p67078k004941j432989j237014
$$ -9842698 -8631763 -3406267 2867611 5975695 5208617 3203676 1770687 533673
6807E33673j207060m44478j54994j542891k833141j623053J156365K657458K345737
$$ 533673 -673387 -1117865 -1272859 -2815750 -5648891 -7271944 -6115579 -3458121 -1112384
6798a112384J839893J528538M72624r04024j089659k74812j32199q68991j013963
$$ -1112384 727509 2256047 2728671 1824647 734988 460176 327977 -541014 -1554977
6789a554977j03471Q23257J361718J989755K211198R51025r63071j145733R37745
$$ -1554977 -1658448 -835191 526527 2516282 4727480 5678505 4715434 3569701 4507446
6780D507446K897055K325007p18040m210029n684911l669981N20734L011822J630829
$$ 4507446 7404501 9729508 9011468 4801439 -883472 -4553453 -4032719 -1020897 609932
6771F09932p73885j13768K536040K145173k434005o111311m566271J97326L569841
$$ 609932 -163953 -277721 2258319 4403492 1969487 -4141824 -8708095 -8510769 -4940928
6762d940928M310549L928234K769248K74265k249359k458098k75570K010378K741959
$$ -4940928 -630379 3297855 6067103 6341368 4092009 1633911 1358341 3368719 6110678
6753F110678K164333J108629J46673k05493R1336K45576j57905k22041P28534
$$ 6110678 8275011 9383640 9530313 9324820 9416156 9661732 9503827 9281786 10010320
6744A0010320J473768L70207k063794l754958l950569l722431l644738k808108
$$ 10010320 11484088 11854295 9790501 6035543 2084974 -1637457 -5282195 -8090303
6736h090303o59739J670001K784356K865729L144534L870278L712919J538396
$$ -8090303 -8750042 -7080041 -4295685 -1429956 1714578 5584856 9297775 10836171
6728A0836171j607861l082018j651408P17693J117899n45172j529935k56675J373521
$$ 10836171 9228310 6146292 4494884 5212577 6330476 5785304 4255369 3998694 5372215
6719E372215P91878j369603j981413K43378K667461J715986k565086n808978l858947
$$ 5372215 6164093 4794490 2813077 3056455 5723916 7439902 4874816 -934162 -4793109
6710d793109K131908O384494N082575Q78431r44988M91221J437385j30028j775644
$$ -4793109 -2661201 3723293 8805868 9684299 8739311 9230532 10667917 10537889 8762245
6701H762245j270808k61350r99208k431885k420852j493563j250037r64940Q04160
$$ 8762245 7491437 7230087 6230879 3798994 1378142 -115421 -1365458 -2330398 -1526238
6692a526238K724717K466498R07618P31127J544523O14745j673479j715313J105665
$$ -1526238 1198479 3664977 4572595 5303722 6848245 7462990 5789511 4074198 5179863
6683E179863K665983M23087k589681k655396p13226L41990O81537K008947L107535
$$ 5179863 7845846 8268933 5679252 3023856 2310630 2652620 3334157 5343104 8450639
6674H450639J287318k456419l860199j363876J721820J965236l467j322555p29465
$$ 8450639 9737957 7281538 3421339 2057463 3779283 5744519 5741052 4418497 3689032
6665C689032R61489K633345L478494K782233O57534j351890j643349n30212P1391
$$ 3689032 4650521 7283866 10762360 13544593 14202127 12850237 11206888 10676676 10748067
6656A0748067q79400k124560j721302K39110J389440j954k587751l535825k356430
$$ 10748067 9868667 7744107 6022805 6261915 7651355 7649401 5061650 1525825 -830605
6647h30605j493825k469019l230184j104538K762164M358962K104674j177460
$$ -830605 -2324430 -4793449 -8023633 -9128171 -6366007 -2007045 97629 -1079831
6639a079831k221223j174387l37004p55519j636295j997626j326689N75928K901427
$$ -1079831 -3301054 -4475441 -4812445 -5567964 -7204259 -9201885 -10528574 -9952646 -7051219
6630g051219L749253K336460N59328N17826J192354j6141k704525l350774m54560
$$ -7051219 -3301966 -965506 -406178 111648 1304002 1287861 -1416664 -4767438 -5221998
6621e221998L025097L784304K233525N85692p56262k338503l056233j562464P69319
$$ -5221998 -2196901 1587403 3820928 4406620 3650358 1311855 -1744378 -3306842 -2537523
6612b537523J444434P64032Q76773J363562l31456l661164m406682r65106K691959
$$ -2537523 -1093089 -329057 547716 1911278 1579822 -2081342 -6488024 -7453130 -4761171
6603d761171K847551J354726J779240L135723J843576j681802l172055j149017
$$ -4761171 -1913620 -558894 1220346 4356069 6199645 4517843 1345788 196771
6595A96771R25303J33685j905982k252667j022838l55892p84036q68498K78580
$$ 196771 1122074 1255759 -650223 -2902890 -3925728 -4281620 -5065656 -5934154 -5655574
6586e655574J810848K377344J596734K63575o09966r38279j403528j894736j121598
$$ -5655574 -3844726 -1467382 129352 392927 -217039 -1155318 -2558846 -4453582 -5575180
6577e575180J149768K632059J201224j736110k917869j797755o66364l57946P66300
$$ -5575180 -4425412 -1793353 -592129 -2328239 -5246108 -7043863 -7710227 -8068173 -7301873
6568g301873K882640L405252J292601o83800k67998P10154j39899j524239j184958
$$ -7301873 -4419233 -1013981 278620 -405180 -673178 36976 -102923 -1627162 -2812120
6559b812120l90608j524916k973221j221286K732188M139316J908014J43059J090476
$$ -2812120 -3202728 -4727644 -7700865 -8922151 -6189963 -2050647 -142633 426 1090902
6550A090902J650010n93366k511220m34696L411715M023110J158144q38254N9157
$$ 1090902 2740912 2147546 -363674 -798370 2613345 6636455 7794599 6956345 7015502
6541G015502J220477J76424k055853l415913l466999k447193l41688J736615J668682
$$ 7015502 8235979 8412403 6356550 2940637 -526362 -2973555 -3315243 -1578628 90054
6532I0054n27933j817049l01546J670993R21831j567769k026956L53786K151819
$$ 90054 -437879 -2254928 -2556474 -885481 36350 -1531419 -3558375 -3204589 -1052770
6523a052770O85827k375436l601992k081238M01775K121521K639027J959184J81946
$$ -1052770 -366943 -2742379 -6344371 -8425609 -8023834 -5902313 -3263286 -1304102 -1122156
6514a122156j892251k945981k329268o21917J024144J794284J693175J551064
$$ -1122156 -3014407 -5960388 -8289656 -8911573 -7887429 -6093145 -4399970 -2848906
6506b848906K292119L702056M186166K359252j209697m301046n010665l177015
$$ -2848906 -556787 3145269 7331435 9690687 8480990 4179944 -830721 -4007736
6498d007736k83415J577607J117508j041335k879079l046416j945411l80947J708879
$$ -4007736 -4291151 -2713544 -1596036 -2637371 -5516450 -8562866 -10508277 -10889224 -9180345
6489i180345M057838M858990K787104l91055j602941p48302n79610j962645k262311
$$ -9180345 -5122507 -263517 2523587 2132532 529591 -218711 -798321 -2760966 -5023277
6480e023277K55384L283201L859366K525951J525663Q60378p14687k217114j559115
$$ -5023277 -4767893 -1484692 2374674 4900625 6426288 7286666 6571979 4354865 2795750
6471B795750N05909J214107M67726Q65868K544708K085794j770576n081702m026699
$$ 2795750 3301659 4515766 4983492 5849360 8394068 10479862 8709286 3627584 -399115
6462c99115l55571J568720R23495J94271L98470L56682Q0472J048850K773811
$$ -399115 -754686 814034 1737529 1931800 2330270 2686952 2767424 3816274 6590085
6453F590085K541001l52284k924038k502082j63755J324209J111879J47352r96901
$$ 6590085 9131086 8778802 5854764 3352682 3188927 4513136 5625015 5772367 4775466
6444D775466k290588l180236l061914k286153j431285k63617J322361K168619
$$ 4775466 2484878 -695358 -3757272 -6043425 -7474710 -7738327 -6415966 -4247347
6436d247347J281973j74152j52768J185108J573411J42120j076764j11627J927281
$$ -4247347 -2965374 -3139526 -3292294 -2107186 -533775 -391655 -1468419 -1580046 347235
6427C47235K258043K30779j747960j265836J131875K680571J734914m18013j384330
$$ 347235 2605278 2836057 1088097 -177739 954136 3634707 5369621 4951608 3567278
6418C567278o57342J50645r3223n71796k41892K96272o6289q88868r23327l79085
$$ 3567278 2909936 3060581 2967358 2395562 2153670 2449942 2383653 1494785 571458 192373
6408A92373n34621j189643n84052J697495L719769L925036L044958K189748Q07473
$$ 192373 -342248 -1531891 -2115943 -418448 3301321 7226357 10271315 12461063 13268536
6399A3268536j860952m661122n665187m585429k536251l05255J569766K041196
$$ 13268536 11407584 6746462 1081275 -3504154 -6040405 -6345660 -4775894 -2734698
6391b734698Q47582j67997Q75505L032443L838758K933537J918460R97871j213636
$$ -2734698 -1887116 -2055113 -1179608 1852835 5691593 8625130 10543590 11541461 10327825
6382A0327825m224157n206076l159258p18743k65803p82270l94702M12886M55389
$$ 10327825 6103668 897592 -2261666 -2980409 -3246212 -4028482 -4423184 -4010298 -3554909
6373c554909N59751J789562K544134N97167k788144l907042j626735J418645K782412
$$ -3554909 -2995158 -1205596 1338538 1935705 -852439 -4759481 -6386216 -4967571 -2185159
6364b185159K751350K474669J978900J009822N5581m29719n84601m34030J04956
$$ -2185159 566191 3040860 5019760 6029582 6085163 5655444 5070843 4636813 4741769
6355D741769K75212r18830k782298l203864j436847Q18633J632755P68973r46637
$$ 4741769 5016981 4098151 1315853 -1888011 -3324858 -2506225 -873470 -104497 -1051134
6346a051134k517532k580996k67263K846740L516564Q09622k292656k575487l69913
$$ -1051134 -3568666 -6149662 -6416925 -3570185 -53621 756001 -1536655 -4112142 -4482055
6337d482055J717578K286880J641710K06253j447008j862442j39634K246337K879096
$$ -4482055 -2764477 -477597 1164113 1370366 -76642 -1939084 -2078718 167619 3046715
6328C046715J433396l13600j184026j563118j735824j101232M31038J600906J133453
$$ 3046715 4480111 4166511 2982485 1419367 -316457 -1417689 -986651 614255 1747708
6319A747708o48298j973299j320681Q12228J887043Q666l131021l531543L7238
$$ 1747708 1099410 -873889 -2194570 -1382342 504701 513367 -2617654 -6149197 -6111959
6310f111959M036019M741226K884071J396426M57459j662850l887136k911612
$$ -6111959 -2075940 2665286 5549357 6945783 7403242 5740392 1853256 -1058356
6302a058356R92487L070552P64992k338616j823792J223846K396690M61913j845296
$$ -1058356 -65869 3004683 3769675 1431059 -392733 831113 3227803 3689716 1844420
6293A844420k502788k173769j608955l28237J354408J686261K21735p70758O43708
$$ 1844420 -658368 -2832137 -4441092 -4769329 -3414921 -1728660 -1506925 -2277683 -1633975
6284a633975K887916K683854l74955k950968k153648Q08149K302953Q71403j364283
$$ -1633975 1253941 3937795 3562840 611872 -1541776 -733627 1569326 2440729 1076446
6275A076446j919389r62273k48485l70089n68823n18179n31498k61389J017657
$$ 1076446 -842943 -1805216 -2053701 -2423790 -2992613 -3510792 -4042290 -4303679 -3286022
6266c286022K712865L180937K013598N25297l10642p63156r10134k79273N05290
$$ -3286022 -573157 2607780 4621378 5146675 4836033 4072877 3162743 2883470 3388760
6257C388760j20385j884991k264202k00056J916618J729479L53420K10114J234895
$$ 3388760 3268375 1383384 -880818 -1080874 835744 2565223 2918643 3128757 4363652
6248D363652J690081J291522R12108L56057q63696j528029l64758J057388J14743
$$ 4363652 6053733 7345255 8257363 8613420 7749724 6221695 5856937 6914325 7029068
6239G029068k621543l961854k703083n83652J214178L085950M247541K665846
$$ 7029068 4407525 445671 -2257412 -2841064 -1626886 1459064 5706605 8372451
6231H372451j122074l421337k150908N66236K002172K221400K265000J730132
$$ 8372451 7250377 3829040 1678132 2244368 4246540 6467940 8732940 10463072
6223A0463072K41273r67596r96653q16730j148981j069597m88982j323207l838589
$$ 10463072 10704345 9736749 8740096 7923366 6774385 5704788 5215806 3892599 54010
6214E4010m594805j170567L354750M197521J385298j209612j834421j731460j058725
$$ 54010 -4540795 -5711362 -2356612 1840909 3226207 2016595 182174 -1549286 -2608011
6205b608011J395648M253268L759431p74823n219772n774492l120175k38734J260642
$$ -2608011 -1212363 3040905 6800336 6025513 805741 -4968751 -8088926 -8327660 -7067018
6196g067018J321303L90682l30555M20853J836501J561254o24924j909827n63608
$$ -7067018 -5745715 -5355033 -5685588 -5264735 -3428234 -1866980 -2491904 -4401731 -4965339
6187d965339J350695J174816m40363r62640J79072J400166J671131J361582Q32445
$$ -4965339 -3614644 -2439828 -2880191 -3842831 -3663759 -2263593 -592462 769120 1601565
6178A601565j01189j365478k352588k376894j034016J264829K924808K508953
$$ 1601565 1500376 134898 -2217690 -4594584 -5628600 -4363771 -1438963 1069990
6170A069990Q03096Q6509Q96447J349351L78007o03698n29101p56147k309112
$$ 1069990 1873086 1959595 2856042 4205393 4583400 3979702 3450601 2694454 385342
6161C85342l210725j236095K179346L617994K308853L57209r28821k121988l385967
$$ 385342 -2825383 -4061478 -1882132 1735862 4044715 4401924 3473103 1351115 -2034852
6152b034852l821375l230725k284151r31547J164852K775678K165088J45872l85148
$$ -2034852 -5856227 -9086952 -11371103 -12302650 -11137798 -8362120 -6197032 -6051160 -6436308
6143f436308J654221M324434N561449M890584K176292k279060n713774m403204
$$ -6436308 -4782087 -457653 5103796 9994380 12170672 9891612 4177838 -225366
6135b25366J059769M862322K683069k839234n704081l825303k11764J718831J288247
$$ -225366 834403 5696725 8379794 5540560 -163521 -3988824 -4200588 -2481757 -1193510
6126a193510l06670j559319j433152k59525L75683j52807k68305J312155K937835
$$ -1193510 -1500180 -3059499 -4492651 -4752176 -4376493 -4529300 -4797605 -3485450 -547615
6117e47615K042449q51805k538538j465520N16917J002007k70271j922820k501416
$$ -547615 1494834 643029 -1895509 -3361029 -2844112 -1842105 -2112376 -4035196 -6536612
6108f536612j178146J566249L644004L229737J190027J08171O95160J037600r6822
$$ -6536612 -7714758 -6148509 -2504505 725232 1915259 2023430 2718590 3756190 3659368
6099C659368j317160j092189k88384n73820j642714j916432j213130p91003r98787
$$ 3659368 2342208 1250019 961635 387815 -1254899 -3171331 -4384461 -5175464 -6174251
6090f174251p55808L00976P73809m47956k138761k104703l54662O38466m20285
$$ -6174251 -6930059 -6629083 -5855274 -6303230 -8441991 -10546694 -10901356 -10262890 -10683175
6081a0683175j124886J572553O216101P518162L283421j998539k923450m11192
$$ -10683175 -11808061 -10235508 -4019407 3498755 6782176 4783637 1860187 1448995
6073A448995M50681j403534j779055J202364L301646O76780l718168m235980o45431
$$ 1448995 1899676 496142 -1282913 -80549 3221097 3897877 179709 -4056271 -4701702
6064d701702K196950J686783J88536L11941J299816J233603L1483j108484j406198
$$ -4701702 -2504752 -817969 -629433 -317492 982324 2215927 2247410 1138926 -267272
6055b67272p27807L79969N12124j038323k456069j341920J295920J755018q13465
$$ -267272 -995079 -615110 -102986 -1141309 -3597378 -4939298 -3643378 -1888360 -2701825
6046b701825k628451q35842J999497J692892j346786l016787j601709M28927O77186
$$ -2701825 -5330276 -6166118 -4166621 -2473729 -3820515 -6837302 -8439011 -8010084 -7332898
6037g332898j94854n55650m69384q76658j586657j516781l14863J230549K131293
$$ -7332898 -7527752 -8083402 -8552786 -9429444 -11016101 -12532882 -12847745 -11617196 -9485903
6028i485903J997152J106724J03676l57647J42761J540980K863136K373364p31018
$$ -9485903 -7488751 -6382027 -6278351 -6635998 -6493237 -4952257 -2089121 284243 -446775
6019d46775m528768n642983l136127J22001J108099L18193J46531R19248J023261
$$ -446775 -4975543 -10618526 -13754653 -13632652 -12524553 -12206360 -12059829 -11140581 -10117320
6010a0117320L59806P57484K591278L684665K589738O93859k39886o04648j390377
$$ -10117320 -9757514 -9000030 -6408752 -2724087 -134349 559510 319624 -285024 -1675401
6001a675401j854374q38654P28134Q66989m01156j057463p0828J359443J731653
$$ -1675401 -3529775 -4368429 -3640295 -2773306 -3174462 -4231925 -4302753 -2943310 -1211657
5992a211657R30383l42887j532044k107469j513779J12444J755050K468406K132191
$$ -1211657 -281274 -624161 -2156205 -4263674 -5777453 -5665009 -3909959 -1441553 690638
5983F90638J204077L12792J11790P58885J388114Q93420n63628j695332j956835
$$ 690638 1894715 2207507 2319297 3078182 4466296 5359716 4796088 3100756 1143921
5974A143921k121427k429166j551707J246260L917020L555760L56995k289722
$$ 1143921 -977506 -3406672 -4958379 -3712119 204901 3760661 4117656 1827934
5966A827934k091707m34683K19719k34020l05688K20052L37138J66304Q99678
$$ 1827934 -263773 -698456 -478737 -712757 -1018445 -798393 -461255 -294951 604727
5957F04727K246259K225182L29892j118359j29694K002015K527852Q99236j139032
$$ 604727 2850986 5076168 5406060 4287701 4158007 6160022 8687874 9587110 8448078
5948H448078k313485k794649k747528j800234k05856Q90139P61827j94711j136017
$$ 8448078 6134593 3339944 592416 -1207818 -1413674 -523535 238292 43581 -1092436
5939a092436j354303m45883J093141J772637P99256n02073l33964R22155J407787
$$ -1092436 -2446739 -2892622 -1799481 -26844 772412 270339 -63625 858530 2266317
5930B266317P95616M53492O34362M9062j205991j039048J009896K109280J13364
$$ 2266317 3061933 3515425 4149787 4198849 2992858 1953810 2963706 5072986 5186350
5921E186350k887784l402851j333209P00877J599979K313849K712708J293733
$$ 5186350 2298566 -1104285 -2437494 -1736617 -136638 2177211 4889919 6183652
5913F183652j499244k723969j053217R73753O25992r63101p71689J121521J334772
$$ 6183652 4684408 1960439 907222 1880975 2506967 1543866 772177 1893698 3228470
5904C228470j672997m667449l438998J671902N935382N731658K205368r52852
$$ 3228470 1555473 -3111976 -6550974 -4879072 1056310 6787968 8993336 8040484
5896H040484j755969r03803J71584N82646r3513j493425k209492j289601J81086
$$ 8040484 6284515 5380712 5552296 6134942 6041429 4548004 2338512 1048911 1229997
5887A229997M85439m8064K95343J384997J096572j075673k745660k063777j17661
$$ 1229997 1715436 1667372 1962715 3347712 4444284 3368611 622951 -1440826 -1558487
5878a558487J439711K796964M164608L823163N81690l357091m701658l323732
$$ -1558487 -118776 2678188 6842796 10665959 11247649 7890558 3188900 -134832
5870a34832j792731j472156j493828j023517j81572R41844K132447K437290J678629
$$ -134832 -1927563 -3399719 -4893547 -5917064 -6098636 -5156792 -3024345 -587055 1091574
5861A091574J659966L449014M507138J717109l250289n252726k680727M56492
$$ 1091574 2751540 6200554 10707692 12424801 9174512 3921786 1241059 1697551
5853A697551M66825j374855j812958m16228Q19966P64080r2940j039315j689087
$$ 1697551 2164376 789521 -1023437 -1439665 -619699 144381 51441 -987874 -2676961
5844b676961j863956j838024j875407j224511J020757L800478M706573L234579
$$ -2676961 -4540917 -6378941 -8254348 -9478859 -8458102 -4657624 48949 3283528
5836C283528J375122L28844r64902k922566l492977j105831K494426M320219L604768
$$ 3283528 4658650 4987494 4022592 1100026 -2392951 -3498782 -1004356 3315863 6920631
5827F920631J592958n63924k024271j913773n90370N2491q48498j704529j149399
$$ 6920631 8513589 7949665 5925394 4011621 3421251 3473742 2625244 920715 -228684
5818b28684k85727l43564j72266J330436K205679J90613k812553k807714K55593
$$ -228684 -514411 -857975 -1030241 300195 2505874 2696487 -116066 -2923780 -2668187
5809b668187K422509J948364J535590L073824L971946J392273k529836l131633
$$ -2668187 -245678 1702686 3238276 6312100 10284046 11676319 9146483 6014850
5801F014850J76093L065824K320063j19705n82963Q06301N54073k638786n492938
$$ 6014850 6190943 9256767 11576830 11457125 10874162 11680463 12234536 9595750 4102812
5792D102812m632665j384241K76674n75362j215606k66957J43968j502128k909483
$$ 4102812 -529853 -1914094 -1637420 -2212782 -3428388 -3695345 -3551377 -5053505 -7962988
5783g962988j232245K475695M626577L682563J127326j097146j929165q75077
$$ -7962988 -9195233 -6719538 -2092961 1589602 2716928 1619782 -309383 -1184460
5775a184460J359756K501608J045046j500639k487889j529289j75811P90408J474497
$$ -1184460 175296 2676904 3721950 2221311 -266578 -1795867 -1971678 -1181270 293227
5766B93227J251911k57319j260718J75078K456113K014030j270566l424243j907872
$$ 293227 1545138 1287819 27101 202179 2658292 4672322 3401756 -22487 -1930359
5757a930359J234055K885364K713556J970862Q94719p16987k007387j986425r39082
$$ -1930359 -696304 2189060 4902616 6873478 7768197 7051210 5043823 3057398 2118316
5748B118316K89851J334780J745694P46868j391897k973640k854981j687164m45722
$$ 2118316 2408167 3742947 5488641 6235509 4843612 1869972 -985009 -2672173 -3117895
5739c117895Q63915K130425K292042Q41274r88743j756742j591844j435261j463304
$$ -3117895 -2253980 -123555 2168487 3009761 2021018 264276 -1327568 -2762829 -4226133
5730d226133j228797n14852P02123K199121K895565J628734p60962j658770r248
$$ -4226133 -5454930 -5969782 -5267659 -3068538 -172973 1455761 694799 -963971 -973219
5721i73219K055538K104862M83924q59760j218715j144650p72756N1376P00757
$$ -973219 1082319 3187181 3671105 2811345 1592630 447980 -324776 -273400 427357
5712D27357M95481n032J21704N08492J12851r61109j575541j157693r0640J035046
$$ 427357 922838 917806 1039510 1548002 1660853 699744 -875797 -2033490 -2124130 -1089084
5702a089084J543877P12823j114397k070538p51266J750465K991799J995064j03707
$$ -1089084 454793 1167616 53219 -2017319 -2768585 -1018120 1973679 3968743 3865036
5693C865036j688660j897000q29943L77925L38360p48026r56466N46336J884140
$$ 3865036 2176376 279376 -550567 -172642 165718 -582308 -1538774 -992438 891702
5684H91702J304103J47306N94942J653249N41342k342288l358668j090479J474203
$$ 891702 2195805 2343111 2938053 4591302 5132644 2790356 -568312 -1658791 -184588
5675a84588J522448J87746j34284L69101K23140j91110L64079J101243L13078
$$ -184588 1337860 1525606 1391322 1760423 1983563 1792453 2156532 3257775 3570853
5666C570853j203086q38425J535682K815823J099054j582613k400352j605722
$$ 3570853 2367767 1529342 3065024 5880847 6979901 5397288 2996936 1391214
5658A391214j322350j846868j553603o7707Q41499P2683r27934j88494J961119
$$ 1391214 68864 -1778004 -3331607 -3399314 -2557815 -2485132 -3413066 -3601560 -1640441
5649a640441L233763K109068o07611k713546k603856o57365J035335Q04307n17196
$$ -1640441 1593322 3702390 3094779 381233 -2222623 -2879988 -1844653 -1040346 -1557542
5640a557542n15609J363638K610255J047203j786384k551608p55585Q03489K77624
$$ -1557542 -2073151 -709513 1900742 2947945 1161561 -1390047 -2145632 -1342143 -1064519
5631a064519r28785q90340n1803L9616o84948j179510j179238j047498m12140
$$ -1064519 -1993304 -2883644 -2935447 -2895831 -3580779 -4760289 -5939527 -6987025 -7399165
5622g399165J337956L438241M138840K775021L40106j928785l416671l686811
$$ -7399165 -6061209 -2622968 1515872 4290893 4630999 2702214 -714457 -4401268
5614d401268k504509n79961Q36632J453238J992897K435810J546257r79897l125039
$$ -4401268 -6905777 -7485738 -6649106 -5195868 -3202971 -767161 779096 -200801 -3325840
5605c325840k799119q48413j05240j490413k831406k051578J95459K073910L070600
$$ -3325840 -6124959 -6973372 -7078612 -8569025 -11400431 -13452009 -13256550 -11182640 -8112040
5596h112040L375794K344090k4967j191877J134033M576777M174551l73140l504873
$$ -8112040 -4736246 -2392156 -2417123 -3609000 -2474967 2101810 6276361 5903221 2398348
5587B398348j701755J430146J132946j173830j141580P18042L26458k098968j869195
$$ 2398348 696593 2126739 3259685 2085855 944275 1662317 1988775 -110193 -1979388
5578a979388J903617L986747J098302k958037l240458m42588J691471K125496
$$ -1979388 -75771 3910976 5009278 2051241 -1189217 -1631805 59666 2185162
5570B185162J972873J092668p83096j614662L78813L113187L032013j3419l236382
$$ 2185162 4158035 5250703 4467607 2852945 3231758 6344945 9376958 9363539 6127157
5561F127157m903553m844733k546761J715025M951001M320230J289728m11325
$$ 6127157 1223604 -3621129 -6167890 -4452865 498136 4818366 6108094 5696769
5553E696769k25912n73313j907810k063244n46506N44404M28601P03675J746656
$$ 5696769 5470857 4897544 2989734 926490 379984 924388 1352989 2056664 3803320
5544C803320J751581M20834p254J154169J416937n66404k283995j254675J055718
$$ 3803320 5554901 5975735 5968481 7122650 8539587 7973183 5689188 4434513 5490231
5535E490231J671931L02053j294470k281254k720042k113536l08020J287703J385518
$$ 5490231 7162162 7464215 6169745 3888491 1168449 -945087 -1253107 34596 1420114
5526A420114O49329J73915m17921j446972j404209P47427K818703J983423n77315
$$ 1420114 2069443 2243358 1825437 378465 -1025744 -278317 2540386 4523809 3946494
5517C946494r54641J461964K672951m0149l923553m605977k024654K32191L79915
$$ 3946494 2991853 4453817 7126768 7086619 3163066 -1442911 -3467565 -3235374 -2855459
5508b855459J23787P86062Q83543q11325k139295k47794L518607M473063P82109
$$ -2855459 -2731672 -1945610 -1062067 -1873392 -4012687 -4260481 -741874 3731189 4513298
5499D513298l757370m361345p77049L267487M596626L034989N86834l07651J206067
$$ 4513298 755928 -3605417 -4382466 -1114979 3481647 6516636 7103470 6795819 8001886
5490H001886K849198J175584l487270o120929l262400J966401M139259K868912
$$ 8001886 10851084 12026668 8539398 2418469 -843931 1122470 5261729 8130641
5482H130641J858991K079922R90034j581958k254856j01817J251418j96794j219674
$$ 8130641 9989632 12069554 13059588 11477630 9222774 9120957 10372375 10175581 8955907
5473H955907R17312L233749J572776k685910m827394l675649j954565j128631
$$ 8955907 9873219 13106968 14679744 11993834 7166440 3490791 1536226 407595
5465D07595j96134R30808R18993K9929J27997J294111J598202P13978N94144J697116
$$ 407595 211461 1142269 2061262 2091191 2219188 3513299 5111501 5825479 6419623 8116739
5455H116739J639709r10133l624523l717810j807911n51232q36149j453270j696282
$$ 8116739 9756448 8846315 5221792 1503982 -303929 -855161 -1691310 -3144580 -4840862
5446d840862k078177k514088j729468P71167L289597L542560J442578n31058n8630
$$ -4840862 -6919039 -9433127 -11162595 -10391428 -7101831 -3559271 -2116693 -2647751 -2706381
5437b706381K290568L612570K009521j210725l102612k384294m23522Q89620J223262
$$ -2706381 -415813 3196757 5206278 3995553 892941 -1491353 -1914875 -1025255 198007
5428A98007J305827J196571J59335j768411l153679k784657j332295n29286r19659
$$ 198007 1503834 2700405 2859740 1091329 -2062350 -4847007 -6179302 -6708588 -7628247
5419g628247j378735r01787J55758R09480J003426L98324q35987j895754j499962
$$ -7628247 -9006982 -9908769 -9753011 -8843531 -7840105 -7441781 -8277768 -10173522 -11673484
5410a1673484M22228K334507L161077L476506L713287K885779O51829j068621
$$ -11673484 -11251256 -8916749 -5755672 -2279166 1434121 4319900 4971729 3903108
5402C903108o85680L09443l04198j657423j248090P83135K113160K265181K533614
$$ 3903108 3217428 3526871 3222673 1565250 317160 1100295 3213455 5478636 8012250
5393H012250K285428m46959m331867n183603k302176o5227j287060l135874k258997
$$ 8012250 10297678 9850719 5518852 335249 -1966927 -2032154 -3319214 -6455088 -8714085
5384h714085q8110L61425k45275N40124K103122J956010M07360J12504J554364
$$ -8714085 -8802195 -8440770 -8686045 -8145921 -6042799 -4086789 -3679429 -3566925 -2012561
5375b012561K473373J773202J020786J609405K607517K073444n67616l537972
$$ -2012561 460812 2234014 3254800 4864205 7471722 9545166 8977550 5439578
5367E439578l795525j86102M084159M128057m60770m553884m162019j346057p4473
$$ 5439578 1644053 1457951 5542110 9670167 9209397 4655513 493494 -852563 -927036
5358i27036j61167J040052L158303L417004J636370L43024K29386m65992j933645
$$ -927036 -1088203 -48151 3110152 6527156 8163526 8506550 8735936 8269944 6336299
5349F336299k060075m25678M91405p16142k153836j687492J90834J831217K641365
$$ 6336299 4276224 3850546 4341951 3625809 1471973 -215519 -24685 1806532 4447897
5340D447897K576187J307327p14301j865984j397797p39486j424942k502258j506762
$$ 4447897 7024084 8331411 7617110 5751126 4353329 3613843 2188901 -313357 -1820119
5331a820119J971149M913175M032354O3225k501332q91930K043988J491737k606584
$$ -1820119 151030 5064205 9096559 9159784 6658452 5766522 7810510 9302247 6695663
5322F695663n471941m207435j141210N19135P52624O41124k33957j794833k079931
$$ 6695663 1223722 -2983713 -4124923 -3605788 -2853164 -2212040 -2445997 -4240830 -6320761
5313f320761o26426m9791j286354r58731K642033M874876J377694l871900l616404
$$ -6320761 -6947187 -6996978 -8283332 -9242063 -6600030 -1725154 -347460 -4219360 -7835764
5304g835764J586312M405663K131481l61265K01037N79802k162848m963028l550352
$$ -7835764 -6249452 -1843789 287692 -73573 127464 707266 -1455582 -6418610 -9968962
5295i968962J118651M655245M807848K706784O23667K51139J491239K092911K61636
$$ -9968962 -8850311 -4195066 612782 3319566 3943233 4194372 5685611 7778522 8040158
5286H040158k422515l020514j574502l89992J54325J176401J481436r82148m102731
$$ 8040158 5617643 2597129 1022627 632635 786960 1963361 3444797 2462649 -1640082
5277a640082l441953M63898K259883J56587j789547j293756j347090l477677l822555
$$ -1640082 -5082035 -4618137 -2358254 -2201667 -3991214 -5284970 -6632060 -10109737 -13932292
5268a3932292J88384M637503M989272K625584J197102O52500n61978j168791K53068
$$ -13932292 -13743908 -9106405 -4117133 -1491549 -294447 358053 -203925 -1372716 -1119648
5259a119648J408322j57374k325429j748286N12629J115147J8755l75493K57405
$$ -1119648 288674 131300 -2194129 -3942415 -3429786 -2314639 -2295884 -2671377 -2413972
5250b413972O15726R54929J957478K240708P15092n67314K83178J039991j104521
$$ -2413972 -1798246 -843317 1114161 3354869 4069961 3502647 3785825 4825816 3721295
5241C721295m136439l977927j045910P07270K33633J75219J750964L220523L320480
$$ 3721295 -415144 -4393071 -5438981 -4731711 -4498078 -4322859 -2571895 648628 3969108
5232C969108K485311Q49555j607241l343822k826160j145335j31701R11580L280757
$$ 3969108 6454419 7303974 5696733 2352911 -473249 -1618584 -1750285 -838705 2442052
5223B442052N144988L669321j83577k872866l326155k906982j628080J117377
$$ 2442052 7587040 11256361 11072784 8199918 4873763 1966781 338701 1456078
5215A456078L080579J465959j650474j408687K084946L359777n7424l942164l868246
$$ 1456078 4536657 6002616 4352142 2943455 5028401 8388178 8330754 4388590 520344
5206E20344r89905J040722J350005J374903J647674J527988P29722m23605j260107
$$ 520344 -469561 571161 1921166 3296069 4943743 6471731 7201453 6777848 5517741
5197E517741q08212J051027K520579J765772l17060j210574l54925N68700N23393
$$ 5517741 4709529 5760556 8281135 10046907 9729847 8519273 8164348 8733048 9256441
5188I256441j02189j141947k523956k983972j630902k79715j293495l574170l820045
$$ 9256441 9154252 8012305 5488349 2504377 873475 593760 -699735 -4273905 -8093950
5179h093950j413356J147886K363921K953528L223807K640564J886483K017846
$$ -8093950 -9507306 -8359420 -5995499 -3041971 181836 2822400 4708883 6726729
5171F726729J869826k65448k936972l336963k125255k077477k545937m46871L266285
$$ 6726729 8596555 8331107 5394135 2057172 -68083 -2145560 -4691497 -5138368 -1872083
5162a872083L851602M18365k320840j467114L81039P92928J305809K935792L211110
$$ -1872083 1979519 2397884 77044 -1390070 -1009031 -216103 1089706 4025498 7236608
5153G236608R84688n79601N67840J380234r07891l502059k585206K20314N86443
$$ 7236608 8221296 7641695 8209535 9589769 8681878 5179819 2594613 2814927 3401370
5144C401370j774682l480443k796668p40520J591912L410192L403399J493259
$$ 3401370 1626688 -1853755 -4650423 -5390943 -3799031 -388839 3014560 4507819
5136D507819j20396j23193j66585j337195j437067R68126K775942P49484k770067
$$ 4507819 4387423 4264230 4097645 2760450 1323383 2291509 5067451 5816935 3046868
5127C046868l096696k23772K097513K700814L314310L579235J310758k287056
$$ 3046868 -49828 -273600 1823913 4524727 7839037 11418272 12729030 10441974
5119A0441974l104901o77278P84029p41399k081106q17839M72061r17254k685935
$$ 10441974 7337073 6659795 7443824 6702425 4621319 3803480 4275541 3358287 672352
5110F72352j329606J716565K292662L49070j59715J994833L301738J400562j054216
$$ 672352 -657254 1059311 3351973 3701043 3541328 5536161 8837899 10238461 9184245
5101I184245p91156R19377P03091j374293k408043j776537j624806k201240r60282
$$ 9184245 8393089 9312466 10015557 8641264 6233221 4456684 2831878 630638 -329644
5092c29644K402495M051338J587269j816087j976543K56239J055860l70226j685948
$$ -329644 2072851 6124189 7711458 5895371 3918828 4175067 5230927 4860701 3174753
5083C174753j862957j700054q54875J576444L956217L540543R41943n43451p952
$$ 3174753 1311796 -388258 -1243133 333311 4289528 7830071 8772014 8228563 8220611
5074H220611L70993l52271p84765n95729j104265k087251j795087m61157M486
$$ 8220611 8591604 8239333 7454568 6858839 5754574 3667323 1872236 1411079 1415565
5065A415565j47450Q76901K166249J309338l09729Q67513L404800J996820l036566
$$ 1415565 1268115 2145016 4311265 5620603 5310874 6178387 9583187 11580007 8543441
5056H543441m758420o72862K787266P99222k194045q03910K025125Q69416k443061
$$ 8543441 3785021 3112159 5899425 6698647 4504602 3700692 5725817 6595233 4152172
5047D152172k564107j64920O3452j690139j220753J356978J604687j191477k794416
$$ 4152172 1588065 1423145 1486597 -203542 -1424295 -67317 1537370 345893 -2448523
5038b448523j398438j47798j054728j712735J4045K160785J755050q70313k621622
$$ -2448523 -3846961 -3994759 -5049487 -6762222 -6748177 -4587392 -2832342 -3702655 -6324277
5029f324277j171819K715617N635229M771618J302583q72777m41265j15121j606625
$$ -6324277 -7496096 -4780479 854750 5626368 6928951 6056174 5614909 5499788 3893163
5020C893163k764514j968157j383132k476983k244044J702901N768763N218416
$$ 3893163 1128649 -839508 -2222640 -4699623 -6943667 -5240766 527997 5746413
5012E746413J579599j67343N33474L61994j293337k068694j688714j726752j340567
$$ 5746413 7326012 7158669 7692143 8054137 6760800 4692106 3003392 1276640 -63927
5003f3927J234250L843849K727069r42596k470728j151994n85717j693113j512100
$$ -63927 1170323 5014172 7741241 6798645 4327917 3175923 2590206 897093 -615007
4994f15007N51428J232684p20169k616060k978707l415801m009991k126454K254365
$$ -615007 -63579 1169105 448936 -2167124 -5145831 -8561632 -12571623 -14698077 -12443712
4985a2443712M898454L439491J021349J306059L274662L533378J223030j556092
$$ -12443712 -7545258 -4105767 -3084418 -1778359 1496303 5029681 6252711 4696619
4977D696619k494781r38730J657383K796783J767661P44308J376643J812780l05337
$$ 4696619 2201838 1263108 2920491 5717274 7484935 8229243 9605886 11418666 11113329
4968A1113329l600757m905965l774139j696765J093783M148847M563109R61772
$$ 11113329 7512572 2606607 -1167532 -2864297 -1770514 2378333 6941442 7903214
4960G903214k541501j638175J190812Q40099j656506j474451Q04542L13336k666942
$$ 7903214 5361713 3723538 4914350 5754449 4097943 2623492 3428034 3741370 1074428
4951A074428k851616K63096J319690r95542j424195K251551M996206K948517r39617
$$ 1074428 -1777188 -1514092 -194402 -1189944 -2614139 -362588 4633618 7582135 6642518
4942F642518k824429l166230l005590j112402K088949L296056J769346P74129
$$ 6642518 3818089 651859 -2353731 -3466133 -1377184 1918872 3688218 4462347
4934D462347J504274J163430r60609j523244N87864J968672Q93630j40640j9508
$$ 4462347 5966621 7130051 6169442 4646198 5234062 7202734 8096364 7955724 7936216
4925G936216r34037k776467k135644J053040K470618R82308L87520J829285J849104
$$ 7936216 7002179 4225712 2090068 3143108 5613726 6596034 6983554 8812839 10661943
4916A0661943j12597j77230J968546J883517o56510m95880K636656K448877k224127
$$ 10661943 10549346 10372116 12340662 14224179 13567669 13071789 15708445 18157322 15933195
4907A5933195m319855j003131J338166q81346k173238R76955L456982J662162
$$ 15933195 11613340 10610209 11948375 11067029 8893791 9870746 13327728 14989890
4899A4989890j88192N18650j43675k727130j305052M116400M900265n46800k523660
$$ 14989890 14801698 15320348 15176673 12449543 11144491 15260891 20161156 19614356 17090696
4890A7090696K069969L475313j759445l222254K574875L759183l230899l712398
$$ 17090696 19160665 22635978 20876533 17654279 20229154 23988337 20757438 17045040
4882A7045040P323054J2035808K446957j318352J1149520J5645857j811683r750251
$$ 17045040 24368094 36403902 38850859 37532507 48682027 64327884 62516201 52765950
4874E2765950J2368657J4874331n7121663j54096005j58417935m3689549P7633473
$$ 52765950 65134607 80008938 22887275 -131208730 -289626665 -333316214 -255682741
4867b55682741R8655217M4504154Q109990J6351595K4654002J0148973j552921
$$ -255682741 -157027524 -112523370 -104413380 -88061785 -63407783 -53258810 -54811731
4860e4811731N007471J0626977L097349k408118M025936R417045M441254r58492
$$ -54811731 -49804260 -39177283 -36079934 -38488052 -34462116 -25045071 -20603817 -21562309
4852b1562309Q34722K118383j874449l064798K108441M540138R2562k210490K336678
$$ -21562309 -20727587 -18609204 -20483653 -23548451 -21440010 -16899872 -16807310 -19017800 -16681122
4843a6681122N028585L32865l927593j489934J508111p04655l024267n72578J667304
$$ -16681122 -11652537 -11319672 -15247265 -16737199 -15229088 -15933743 -18958010 -19530588 -17863284
4834a7863284p49960k596283P99098M075217J599205k148471q77333K642847K698335
$$ -17863284 -18613244 -21209527 -20410429 -16335212 -14736007 -16884478 -17761811 -15118964 -12420629
4825a2420629O94601P60516J483766K4386j108966R95973L108618J503704q71539
$$ -12420629 -11726028 -10965512 -9481746 -9457360 -10566326 -9570353 -6461735 -4958031 -5829570
4816e829570o4618J031049j843200n407561l631404J782312L812092J013918j503872
$$ -5829570 -5894188 -4863139 -6706339 -12113900 -15745304 -13962992 -10150900 -9136982 -10640854
4807a0640854q17913R26898J821093K318231K169971M06880j640537j659532l50547
$$ -10640854 -11458767 -10531869 -8710776 -6392545 -4222574 -3815694 -5456231 -7115763 -7466310
4798g466310j41891o77383K53398J951482J354222j704821l763460k604197M22308
$$ -7466310 -7608201 -8285584 -8032186 -6080704 -4726482 -6431303 -10194763 -12798960 -12376652
4789a2376652L106807M405525L751497J342609p25195l78825J227893J048956
$$ -12376652 -9269845 -4864320 -1112823 229786 -495409 -874234 353659 1402615
4781A402615j261158k869824k188402r21612q88055j405094j121817k99780L21743
$$ 1402615 141457 -2728367 -4916769 -5838381 -6726436 -8131530 -9253347 -9553127 -9231384
4772i231384J269183L082243M352145L038405m45874l227767l406223j990969
$$ -9231384 -7962201 -4879958 -527813 2510592 2064718 -1163049 -4569272 -6560241
4764f560241p09011N15589K249117K953025M69369l837817n457650k590418J004900
$$ -6560241 -7269252 -6753663 -4504546 -1551521 -1082152 -4919969 -10377619 -12968037 -11963137
4755a1963137J132370j120628j590459P11117K902940K974770J823450O51482
$$ -11963137 -10830767 -11951395 -13541854 -12830737 -9927797 -6953027 -5129577 -4478095
4747d478095n24488j407188j215440m65698n66726j252307p74020R75726J940138
$$ -4478095 -5002583 -6409771 -7625211 -8090909 -8657635 -9909942 -10683962 -9708236 -7768098
4738g768098J043222l75999q69658n97361k01277K30468O96415J258255K305038
$$ -7768098 -6724876 -7100875 -7970533 -8567894 -8769171 -8538703 -7842288 -6584033 -4278995
4729d278995L383213K759657K24823j186404O77990K807948R74108l220153m272411
$$ -4278995 -895782 1863875 2088698 902294 1580284 4388232 5362340 2142187 -2130224
4720b130224j411092M03364j167600k446733o52248J502007J128809N4862P31760
$$ -2130224 -3541316 -3137952 -4305552 -6752285 -7404533 -5902526 -4773717 -4718855 -3987095
4711c987095J545172J83960j870085k194495j648213j821107j228373J705672
$$ -3987095 -2441923 -2257963 -4128048 -6322543 -7970756 -9791863 -11020236 -9314564
4703i314564M354658L066149j055103l671764l235997j761822p92960j82226J01639
$$ -9314564 -4959906 -1893757 -2948860 -6620624 -9856621 -11618443 -12411403 -12593629 -12491990
4694a2491990J78166J190418L109620L175500j85728l594134k733492J184681
$$ -12491990 -12313824 -11123406 -8013786 -4838286 -5024014 -8618148 -11351640 -10166959
4686a0166959L101694J373514q87234j304783q16387o24605n37456p84823j863019
$$ -10166959 -7065265 -5691751 -6578985 -7883768 -8700155 -9324760 -9862216 -10647039 -12510058
4677a2510058k152829N95718M708627N319185J002291l678041l967732m79357
$$ -12510058 -14662887 -14067169 -9358542 -4039357 -3037066 -6715107 -10682839 -11162196
4669a1162196K799008L570445K347869N02212o97377l12639J247880K168846J326631
$$ -11162196 -8363188 -4792743 -2444874 -1942662 -2640039 -2952678 -1704798 464048 1790679
4660A790679k93714j109539r78277q33609j033080j036534m59096K01518j6849
$$ 1790679 1496965 387426 -590851 -1424460 -2457540 -3494074 -3953170 -3751652 -3768501
4651c768501j410583k926520l046304j511660N23168K208050L644164M412310
$$ -3768501 -5179084 -8105604 -11151908 -12663568 -12140400 -9932350 -6288186 -1875876
4643a875876L285515N95400j013992q1224J076781l89559l383278m385670k570377
$$ -1875876 1409639 2005039 991047 909823 1986604 1597045 -1786233 -6171903 -8742280
4634h742280m55698J54361k7249k9941M7766K64600R75331J459400O58302n58871
$$ -8742280 -9197978 -9043617 -9070866 -9100807 -9053041 -8788441 -7813110 -6353710 -5695408 -6254279
4624f254279j91659J633218K572791J534462q8205r23397j019196n06292O61443
$$ -6254279 -6445938 -4812720 -2239929 -705467 -793672 -1717069 -2736265 -3242557 -2581114
4615b581114J388553M63875r21322o03036M67241q14995m011206m648754j130821
$$ -2581114 -1192561 -728686 -1650008 -2253044 -1785803 -2600798 -6612004 -11260758 -12391579
4606a2391579K154611J429043p22636k3306K340556K086453o15639j307732J410518
$$ -12391579 -10236968 -8807925 -9530561 -9553867 -7213311 -5126858 -5742497 -7050229 -5639711
4597e639711L734985K780746N31972j39470J49860n29332j431012m33643J933797
$$ -5639711 -1904726 876020 1407992 1268522 1418382 889050 -541962 -975605 958192
4588I58192K817644J256270n25707o29188j07266q40515k455483l177788k762715
$$ 958192 3775836 5032106 4506399 3877211 3769945 2929430 473947 -2703841 -5466556
4579e466556k402214k045145k89877K560813L885046K550317J050343J763899
$$ -5466556 -7868770 -9913915 -10203792 -7642979 -3757933 -1207616 -157273 1606626
4571A606626L017081J657226j743157l500127k177051j01001N91099K81096k72964
$$ 1606626 4623707 6280933 4537776 1037649 -1139402 -1240403 -649304 -368208 -641172
4562f41172j267459k018680p88254K057117L362375J410577j508765k561832k074672
$$ -641172 -1908631 -3927311 -4715565 -2658448 703927 2114504 605739 -1956093 -4030765
4553d030765j666649r61912J069468L117626K926904R21367k96658J97398O55984
$$ -4030765 -5697414 -6659326 -5589858 -2472232 454672 1376039 1079381 1276779 1932763
4544A932763m23747k334643l416627k948848j567686n38462m15258j10166J728523
$$ 1932763 1509016 -825627 -4242254 -7191102 -8758788 -9297250 -9712508 -9822674 -8094151
4535h094151M040830L916896R68406j072155P38052L954975L961182N23099k176581
$$ -8094151 -4053321 -136425 831981 -240174 497878 4452853 8414035 8937134 6760553
4526F760553j630775K03518N87374n05355j568904j940456j808578j429663j242479
$$ 6760553 5129778 5333296 5920670 5415315 3846411 1905955 97377 -1332286 -2574765
4517b574765j580246j828240j083837J93895O19066L7521l84302l39916p52519
$$ -2574765 -4155011 -5983251 -7067088 -6873193 -6254127 -6216606 -6600908 -6940824 -7693343
4508g693343j575203j250227P50972K594987K474807J071641M64023J384384K518412
$$ -7693343 -9268546 -10518773 -9767801 -7172814 -4698007 -3626366 -3162343 -1777959 740453
4499G40453K177145K60760j268094k99941K433235L341233M23374l422320l921609
$$ 740453 2917598 3178358 1910264 1610323 4043558 7384791 7808165 4385845 464236
4490D64236j386069Q8253q45616j100847R64028K243073P4036k744519j811538
$$ 464236 -921833 -833580 -1679196 -2780043 -1816015 427058 501094 -2243425 -4054963
4481d054963K146771M303692K505013o06012k070754k009701j976940k365921
$$ -4054963 -1908192 2395500 4900513 4294501 2223747 214046 -1762894 -4128815
4473d128815k361418j110129J372835L477320K712704j289073n071788m714353
$$ -4128815 -6490233 -7600362 -6227527 -2750207 -37503 -1326576 -6398364 -11112717
4465a1112717p19491K531850K229914j38794j782720j938642j286340j30002J333844
$$ -11112717 -11832208 -9300358 -7070444 -7209238 -8991958 -10930600 -12216940 -12346942 -11013098
4456a1013098K280933K264029K134135K736882L293135K247525m87869l043876
$$ -11013098 -8732165 -6468136 -4334001 -1597119 1696016 3943541 3455672 411796
4448D11796l455392j620808O61098J540679R83921N09802R63064J338749N41916
$$ 411796 -3043596 -4664404 -4003306 -2462627 -1478706 -968904 -5840 1332909 1874825
4439A874825n32007p3817J835442L072220K252715K83325j155191j427918r13528
$$ 1874825 1342818 1269001 3104443 6176663 8429378 8712703 7557512 6129594 5216066
4430E216066k89591j76126n00097j79646J337442K385646P60538k720352m548987
$$ 5216066 4926475 4750349 4250252 4070606 5408048 7793694 8554232 5833880 1284893
4421A284893l222750j319980j439332k254074q76019K384508M352979L489742
$$ 1284893 -1937857 -3257837 -4697169 -6951243 -7827262 -5442754 -1089775 2399967
4413B399967J480454K98796j5475j58994j72335j90631j053873k980162m622108
$$ 2399967 3880421 4179217 4163742 4004748 3832413 3641782 2587909 -392253 -5014361
4404e014361m633455l550782k895523k690527j281387J930063M806471M792328
$$ -5014361 -9647816 -13198598 -16094121 -18784648 -20066035 -18135972 -13329501 -8537173
4396h537173K432921R35064J847638K925223J607061q83696j249004P11886J546297
$$ -8537173 -6104252 -5169188 -3321550 -396327 1210734 327038 -921966 -210080 1336217
4387A336217o36628l148006k572956M18364K333765J696292K40596k65008j10335
$$ 1336217 699589 -2448417 -5021373 -4603009 -2269244 -572952 -332356 -597364 -707699
4378g07699k26098m55813j74186K28064n38248k904253n161599m702937j197097
$$ -707699 -933797 -1389610 -1563796 -1335732 -1873980 -4778233 -9939832 -14642769 -15839866
4369a5839866K195576K305732L28244M56173L732302O045212L878083n04737k275324
$$ -15839866 -13644290 -11338558 -11010314 -10554141 -6821839 -776627 3101456 2596719 321395
4360C21395o68807Q02455p1285j691669j854443n90099R53318K260702L079879
$$ 321395 -347412 455043 383758 -1307911 -3162354 -3752453 -2799135 -538433 2541446
4351B541446K806040J158606j316685l712830n085140m632688k535713k11925
$$ 2541446 5347486 6506092 5189407 1476577 -3608563 -8241251 -10776964 -10988889
4343a0988889J240163K181991L006669K784992R32022j063860j619344j481411
$$ -10988889 -9748726 -7566735 -4560066 -1775074 -843052 -1906912 -3526256 -5007667
4335e007667j802601j330416J219642L268234J121006l654023n222261j677020
$$ -5007667 -6810268 -8140684 -6921042 -3652808 -2531802 -6185825 -11408086 -13085106
4327a3085106K224846K185073P2037K7615K331407M137556L825433J781408j199377
$$ -13085106 -10860260 -8675187 -8603150 -8575535 -6244128 -2106572 1718861 3500269 2300892
4318B300892l734798l793301j186034J347760J537731M13943j14079l97847j355377
$$ 2300892 -1433906 -5227207 -6413241 -5065481 -3527750 -3113807 -3227886 -3625733 -4981110
4309d981110j654871L53068L145377L497670Q59735k231097l564064k835261m71689
$$ -4981110 -6635981 -6282913 -3137536 360134 1219869 -1011228 -4575292 -7410553 -7882242
4300g882242K678215M693633L851440Q00229j983085k863941k077487n69550R04268
$$ -7882242 -5204027 -510394 3341046 4141275 2158190 -705751 -2783238 -3352788 -2448520
4291b448520J824699K058959J754389P98290p53434j671398o56074J227330J346296
$$ -2448520 -623821 1435138 3189527 3987817 3234383 1562985 906911 2134241 3480537
4282C480537o72309k381716k503744k393197k375005m38182L232151M448412J131477
$$ 3480537 2808228 426512 -2077232 -4470429 -6845434 -7283616 -4051465 396947 1528424
4273A528424k353025j181518K540190L118750k25812l246744l586910k745129
$$ 1528424 -824601 -2006119 534071 3652821 3427009 180265 -3406645 -6151774
4265f151774j918232o88524M50101N51990P99459K565822L750845J562309j937905
$$ -6151774 -8070006 -8758530 -8308429 -7756439 -6956980 -4391158 -640313 921996 -1015909
4256a015909k226406K47059O84409j866262k967488n01402K036403J877968J055622
$$ -1015909 -3242315 -2995256 -2310847 -4177109 -7144597 -7645999 -5609596 -3731628 -2676006
4247b676006J574159J595357m19277k095728j064261J006285J445104O73070M42851
$$ -2676006 -1101847 493510 74233 -2021495 -3085756 -2079471 -634367 38703 481554
4238D81554O79092N68007L17048j59445j661961l233603k427047L76646J536173
$$ 481554 1160646 1728653 2045701 1886256 224295 -3009308 -5436355 -5059709 -3523536
4229c523536k08141j741558j303011j491254l531145l473881J487375P059478
$$ -3523536 -3731677 -5473235 -6776246 -8267500 -11798645 -15272526 -13785151 -6725673
4221f725673P341958L190392m7739n98072p24586j111511m47919K94022j389247
$$ -6725673 616285 3806677 3758938 3160866 2436280 1324769 876850 1170872 -218375
4212b18375m452554m744563j164943K587695L253145J683835L81916J32758K01171
$$ -218375 -4670929 -9415492 -10580435 -7992740 -4739595 -3055760 -2673844 -2541086 -2339915
4203b339915L4074j27202M59123K008265L041730J531807j939645m056045l085539
$$ -2339915 -2305841 -2433043 -1973920 34345 3076075 4607882 2668237 -1387808 -4473347
4194d473347j070640q7891Q78550K908006L887553J639532j931584l328004k294620
$$ -4473347 -5543987 -5631878 -4753328 -1845322 2042231 3681763 1750179 -1577825 -3872445
4185c872445q86463L09594J487871J214374j277913l122394j392650J803082K181598
$$ -3872445 -4758908 -4449314 -2961443 -1747069 -3024982 -6147376 -7540026 -5736944 -3555346
4176c555346j7677q70931N48400J261885K9119q82132j55668N04722k99459j617534
$$ -3555346 -3573023 -4443954 -3895554 -2633669 -2604550 -3486682 -3642350 -3137628 -3437087 -5054621
4166e054621k237192k153965j583859o96254j27461M8737P89128J792790R27133
$$ -5054621 -7291813 -9445778 -11029637 -11725891 -11853352 -11804615 -11015487 -9222697 -8295564
4157h295564j838452k980636q62345J062151J44664q15933N53392J058042j303729
$$ -8295564 -10134016 -13114652 -13976997 -12914846 -12770182 -13586115 -13032723 -11974681 -13278410
4148a3278410j815936J519984M55397r464113j4196397K097052K8303703L4795749
$$ -13278410 -15094346 -13574362 -13118965 -22583078 -36779475 -34682423 -6378720 28417029
4140B8417029J3906471q451508r755560K37856Q21057o978550p910042q66544
$$ 28417029 42323500 33871992 24116432 24354288 25175345 18196795 10286753 9420209
4132I420209J625659k976374m405386L56799K353921j846381l988764L01442L764761
$$ 9420209 11045868 8069494 3664108 4020907 6374828 4528447 539683 841125 4605886
4123D605886J007626k261834k64677K683674O51484l254955k681714J291309K811984
$$ 4605886 5613512 3351678 3087001 5770675 6422159 3167204 485490 1776799 4588783
4114D588783O93267j393002j464883m97532Q26966K186145K170916K83573j425298
$$ 4588783 5282050 3889048 2424165 1926633 2753599 4939744 7110660 7394233 5968935
4105E968935j425381j036225j209700o4243L308500N686946M044626M33839j261775
$$ 5968935 4543554 3507329 2297629 2233386 5541886 11228832 15273458 15707297 14445522
4096A4445522j184737k096837l972795m309233k804363j622629j368366n14538
$$ 14445522 13260785 11163948 7191153 2881920 77557 -1545072 -2913438 -3427976
4088c427976J077846J409688l09915k177200k142745j94539K299989L821002L267435
$$ -3427976 -2350130 -940442 -1250357 -3427557 -5570302 -5764841 -3464852 356150 3623585
4079C623585R26758j143637j172860N1114L69133p05306j801993k185768k430387
$$ 3623585 4550343 3406706 2233846 2284960 2654093 1948787 146794 -2038974 -4469361
4070d469361k517337j274132J579998M277019M779183K957289M89960q33510m78876
$$ -4469361 -6986698 -8260830 -6680832 -2403813 2375370 5332659 5822619 4989109 4510233
4061D510233N70876P10223p25849k763078l923495l774731k949402k050618j131771
$$ 4510233 5081109 5791332 5065483 2302405 -1621090 -5395821 -8345223 -10395841 -11527612
4052a1527612K1797J514188K852032K720490L19013k600055k628683R80959M342926
$$ -11527612 -11505815 -9991627 -7139595 -4419105 -4100092 -6700147 -9328830 -8347871 -4004945
4043d004945L401307n85021k646675q65994J488391J162808q38563j822426j518240
$$ -4004945 -603638 -1188659 -3835334 -4701328 -3212937 -2050129 -2888692 -4711118 -6229358
4034f229358j130688k74835J998577M145652L508897P13373o32529O51998J446216
$$ -6229358 -7360046 -7634881 -5636304 -1490652 2018245 2731618 2099089 2751087 4197303
4025D197303n70112k934402k090696J132558K891040J950535O77963Q10296J343225
$$ 4197303 3627191 692789 -1397907 -265349 2625691 4576226 5254189 6064485 7407710
4016G407710Q69484o70545k906070n138780n310100j861588K778238L918180J042482
$$ 7407710 8277194 7606649 4700579 -438201 -5748301 -7609889 -4831651 -913471 129011
4007A29011r82802R50393L531640K511181n41754j166681O35445Q43819j763440
$$ 129011 -853791 96602 3628242 6139423 5597669 4430988 5066433 5910252 4146812
3998D146812l982449l439440j268953R45552L000940M052416K557576m80720j675566
$$ 4146812 164363 -3275077 -4544030 -3598478 -597538 3454878 6012454 5531734 3856168
3989C856168k03608O42854j344956l661948k997551j49289J644058J341529M35757
$$ 3856168 3652560 4295414 2950458 -711490 -3709041 -3858330 -2214272 -872743 -436986
3980d36986M0788P6224M11861P88507L57242j096917k311056k189400j174859
$$ -436986 -396198 -319974 91887 880394 1237636 140719 -2170337 -4359737 -5534596
3971e534596P1363J668086K879761J683260j910676m149231j933567K544491M490062
$$ -5534596 -5463233 -3795147 -915386 767874 -1142802 -5292033 -7225600 -4681109 -191047
3962a91047K727087K21308p25927m92928K52145J493279K148010O27474k158734
$$ -191047 2536040 2757348 2031421 1538493 1790638 3283917 5431927 6059401 3900667
3953C900667l164881j391515Q93143J880957K392104L212167L123984J338369
$$ 3900667 735786 -655729 237414 2118371 4510475 7722642 10846626 12184995
3945A2184995n52826j069753j233510k353371l326763k592326j248790j494655
$$ 12184995 11632169 10562416 9328906 6975535 3648772 1056446 -192344 -1686999
3937a686999k911243l026316j086586J317291L090169M401139M585798K224868
$$ -1686999 -4598242 -7624558 -8711144 -7393853 -4303684 97455 4683253 6908121
3929F908121j846873m270595l365658j500685j555200k772752k260779N31638
$$ 6908121 5061248 790653 -2575005 -4075690 -5630890 -8403642 -10664421 -10132783
3921a0132783L181799L787420K991375K300935K071800J735829R13296k64508
$$ -10132783 -6950984 -3163564 -172189 2128746 4200546 5936375 6849671 6585163
3913F585163j310770j671397j374332j180713j402448j136124J28544P96140r64893
$$ 6585163 5274393 3602996 2228664 1047951 -354497 -1490621 -1362077 -565937 -1530830
3904a530830l788116m015394p25571K611820K874899J330110Q95174J468548Q57570
$$ -1530830 -5318946 -9334340 -10059911 -7448091 -4573192 -3243082 -2347908 -879360 -21790
3895b1790r60054j768022q89063Q6239M31102J093952J882078R43273j776288
$$ -21790 -981844 -2749866 -3638929 -3552690 -3121588 -2027636 -145558 797715 -978573
3886i78573l386309k020692M29030J345277R36459P23286O00281q0419k50839
$$ -978573 -4364882 -6385574 -5956544 -4611267 -3674808 -2951522 -2351241 -2431660 -2682499
3877b682499J178387K644561J984424K47892K09730J577603J269219j341424l167295
$$ -2682499 -1504112 1140449 3124873 3372765 3582495 5160098 6429317 5087893 1920598
3868A920598k398204j183603j536007j784992K56634L091228L645403J997035
$$ 1920598 -477606 -1661209 -3197216 -4982208 -4725574 -1634346 2011057 4008092
3860D008092Q04495R31155Q25054n9237l80316K14844K26155q87315j612340j173440
$$ 4008092 4812587 5743742 6568796 6509559 6129243 6344087 6570242 5682927 4070587 2897147
3850B897147r49941j618529j246609J588790M607155M409411J244424j467874
$$ 2897147 1947206 328677 -917932 670858 5278013 9687424 10931848 9463974
3842I463974j911122j508834j736018j982344j427163q26045j129794j851912
$$ 9463974 7552852 6044018 4308000 2325656 898493 72448 -1057346 -2909258
3834b909258k020530j551360o37758R85484K979029L741354K251470j84576j383020
$$ -2909258 -4929788 -6481148 -7118906 -6133422 -3154393 586961 2838431 2653855 1270835
3825A270835r40903k51897l86995j147327j794988j606991j36516J988402L031323
$$ 1270835 329932 78035 -308960 -1456287 -3251275 -4858266 -4994782 -3006380 24943
3816B4943K080316M96284J81091R71302J212966L97644n11384j071198j765915
$$ 24943 2105259 2601543 2782634 3753936 4966902 5364546 4853162 3781964 2016049
3807B016049k430064k205921j340859j146122j719614j566869j07188J294134
$$ 2016049 -414015 -2619936 -3960795 -5106917 -6826531 -8393400 -8500588 -7206454
3799g206454J597112J517143J618879Q73487j314763l181680k597556o1552K002985
$$ -7206454 -5609342 -4092199 -2473320 -1599833 -2914596 -6096276 -8693832 -8755384 -6752399
3790f752399K254638J197519l44587j799287k340228j569747n68474o34380j029055
$$ -6752399 -4497761 -3300242 -3644829 -5444116 -7784344 -9354091 -9922565 -10556945 -11586000
3781a1586000K38877L075922M620923K909058k02814j239979N07045K390277K078927
$$ -11586000 -11347123 -8271201 -3650278 -741220 -944034 -2184013 -1676968 713309 2792236
3772B792236K32401j113764j485690j886748k388019j657656O63250K715424K690008
$$ 2792236 3024637 1910873 425183 -1461565 -3849584 -5507240 -4843990 -2128566 561442
3763E61442J262420L74298L54854o1857j185337j718159r67984q2242l50575j429814
$$ 561442 1823862 2198160 2553014 2491157 1305820 -412339 -1380323 -1462565 -1813140 -3242954
3753c242954k005169j401936N4033J596712K425841K074261P87617o45091j359819
$$ -3242954 -5248123 -6650059 -6596026 -4999314 -2573473 -499212 288405 -356686 -1716505
3744a716505o07501J678650L848388L349388P4042k341107q02541K570380K924912
$$ -1716505 -2324006 -645356 3203032 6552420 6626462 4285355 3482814 6053194 8978106
3735H978106n51088l609501k996744j46430K021986K542127J264683k167736o041156
$$ 8978106 8427018 4817517 1820773 1674343 3696329 6238456 7503139 5335403 -705753
3726g05753o486174k467224J729536J908967l96734p80193J567757L643834L459265
$$ -705753 -7191927 -9659151 -7929615 -6020648 -6417382 -7197575 -5629818 -1985984 1473281
3717A473281J717878l72798j906628j726724R6034J139274k55498j894027p97479
$$ 1473281 3191159 2818361 911733 -814991 -718957 420317 164819 -1729208 -2526687
3708b526687J885069K604695J090901K77199R79344R60442l86426p52538N68785
$$ -2526687 -641618 1963077 3053978 3331177 4310521 5270963 4884537 4131999 4700784
3699D700784Q59375j479584l834448l119399k93770J118366l45228k699207l075203
$$ 4700784 5560159 4080575 246127 -2873272 -3167042 -2048676 -2393904 -5093111 -8168314
3690h168314p23656K224285L051234J845764J320978K237045J458607k767956
$$ -8168314 -8891970 -6667685 -3616451 -1770687 -449709 1787336 3245943 477987
3682D77987o254975m100640J241893K790948n24975k577266j27484K419064J021383
$$ 477987 -5776988 -9877628 -8635735 -5844787 -6369762 -8947028 -9074512 -6655448 -5634065
3673e634065j333047j42944L203647M311100K608520O61563o82921j999567k201741
$$ -5634065 -6967112 -7110056 -3906409 404691 3013211 3674774 2991853 992286 -1209455
3664a209455l2689K806316L709766K992190K422124J633704n95520l125616l949502
$$ -1209455 -1242144 1564172 5273938 8266128 10688252 12321956 11726436 8600820 4651318
3655D651318l357511k411713l09653L111842M612554J813942j773182j129734
$$ 4651318 1293807 -1117906 -1427559 1684283 6296837 8110779 6337597 5207863
3647E207863K354034K995327l3619j890008n14262N41880r07273k004091n94767
$$ 5207863 7561897 10557224 10523605 8633597 8119335 8661215 7753942 5749851 5155084
3638E155084O93424p87800l275557m065815l581245k935670j134320K030773L760163
$$ 5155084 5848508 5060708 1785151 -2280664 -5861909 -8797579 -9931899 -7901126 -4140963
3629d140963K445229R00086J713970K556339M23850k309893j251773K525119L889684
$$ -4140963 -1695734 -795648 918322 3474661 3898511 1588618 336845 2861964 6751648
3620F751648J678619k54306p0816m34850k732565m016322k154404K00525j30745
$$ 6751648 8430267 8175961 8105145 7670295 4937730 921408 -1232996 -1032471 -1163216
3611a163216j821646j567020O64736K219028K018925J080572j06300j556995j872255
$$ -1163216 -2984862 -4551882 -3887146 -1668118 350807 1431379 1325079 -231916 -2104171
3602b104171L32020L144507K866579n22922k633891q43654J760160R84112k260038
$$ -2104171 -1772151 1372356 4238935 3716013 1082122 238468 1998628 2982740 722702
3593G22702l567400j621672M71236M62505q617J026077K277934J510952n49909
$$ 722702 -2844698 -4466370 -3995134 -3532629 -3541246 -2515169 -237235 1273717 723808
3584G23808j405476q67498j057880k473813k914535j082869J235140K013569J998188
$$ 723808 -681668 -1549166 -2607046 -5080859 -7995394 -9078263 -7843123 -5829554 -3831366
3575c831366K885688L890169K650723p86030l336096k760316k40255J786746K616765
$$ -3831366 -945678 2944491 5595214 4809184 1473088 -1287228 -1527483 259263 2876028
3566B876028K762546J970849j54449k227244k094224J9517J418022O05208q82790
$$ 2876028 5638574 7609423 7454974 5227730 3133506 3153023 4571045 5176253 4293463
3557D293463j300852j331170k166501k697089j123802J576630K590284J431914
$$ 4293463 2992611 1661441 -505060 -3202149 -4325951 -2749321 -159037 1272877
3549A272877L88366N74508M65193p90117j520377n92041K90280n30897j677135
$$ 1272877 1661243 2235751 2700944 1910827 390450 -201591 88689 -442208 -2119343
3540b119343j127317K38256L64857j18803R47266L006734L190069R99889p64274
$$ -2119343 -3246660 -3008404 -2643547 -2762350 -1815084 1191650 4381719 5381608 4617334
3531D617334m46945J59130q43468k434614k593260j263462J29814O17452l2162
$$ 4617334 4170389 4329519 3486051 1051437 -1541823 -2805285 -2675471 -2058019 -2090181
3522b090181j439649k060955l17126K663913L550509J449263l48987O97105K201078
$$ -2090181 -3529830 -5590785 -5907911 -3243998 306511 1755774 1406787 2103892 4304970
3513D304970O75228k443793k627211O58983L001982J677252p66506j090896j56095
$$ 4304970 4980198 2536405 -90806 568177 3570159 5247411 4480905 3390009 3233914
3504C233914p76502l118536m729147l786094l97200M022855O935234N800050J157349
$$ 3233914 2457412 -661124 -5390271 -9176365 -9573565 -5550710 1384524 7184574 8341923
3495H341923k749271k725446p31170o69645k448446k681495n32338J253315J364819
$$ 8341923 5592652 2867206 2136036 1466391 -982055 -3663550 -4195888 -2942573 -1577754
3486a577754J677778K851147K500595j15320j717238l43233P61021j424460l740422
$$ -1577754 100024 2951171 5451766 5336446 3619208 3275975 4036996 2612536 -1127886
3477a127886j458636L486597M801097J377311j638576j524623j399330l405278
$$ -1127886 -2586522 900075 5701172 7078483 5439907 3915284 2515954 -889324
3469h89324m585951k547112M675J68242j22378J732548L591289K270096k69900
$$ -889324 -5475275 -8022387 -8017712 -7849470 -7971848 -6239300 -2648011 -377915 -647815
3460f47815J68098K807968L143729M86862j238973l30924L26014j208287k694684
$$ -647815 -479717 2328251 5471980 5958842 4719869 4388945 4714959 3506672 811988
3451H11988j875417j32452K12099n34804o92915k3295N09179L74180l18081j043323
$$ 811988 -1063429 -1195881 -983782 -1518586 -2211501 -2234796 -1725617 -1351437 -1669518 -2712841
3441b712841p40185J111036L049649K953408Q66594j315472k672084l392187k603877
$$ -2712841 -3453026 -2341990 707659 3661067 4527661 3212189 540105 -2852082 -5455959
3432e455959N67149L704214K847464j452323l830761j576689J567715J519563
$$ -5455959 -4888810 -1184596 1662868 210545 -3620216 -5196905 -3629190 -2109627
3424b109627j21429L22526K144074J765004j058391k822961j468394J483590L660441
$$ -2109627 -2231056 -1908530 235544 2000548 942157 -1880804 -3349198 -1865608 1794833
3415A794833L820715J557547k127385m268720k751451M31705J370563m29931j715224
$$ 1794833 5615548 7173095 5045710 776990 -1974461 -1542756 -172193 -602124 -2317348
3406b317348o71306N63237l93326k458403k733279l72321K668147L979079K812747
$$ -2317348 -2988654 -2425417 -2818743 -5277146 -8010425 -8382746 -5714599 -1735520 1077227
3397A077227L46715j501000j715818q30606J15477P51485J072979P81662j15476
$$ 1077227 1423942 -77058 -1792876 -2623482 -2508005 -1756520 -683541 98121 -17355
3388a7355o94050k05204P49873J203342J277007J345647N05240k295543n795233
$$ -17355 -711405 -916609 -166736 1036606 2313613 3659260 4164500 1868957 -3926276
3379c926276o910647m122898P14188M197958M352253K033791Q6006O31557K602499
$$ -3926276 -10836923 -14959821 -14245633 -10047675 -5695422 -3661631 -3575625 -2944068 -341569
3370c41569K895795O60548j280802p51459J44024j572702m339980l825475L30276
$$ -341569 2554226 3214774 1933972 1182513 1326537 -246165 -4586145 -8411620 -8081344
3361h081344L560817K880688O20894P3462O45072k11718k456058l567333k200369
$$ -8081344 -4520527 -1639839 -1018945 -945483 -300411 -512129 -2968187 -6535520 -8735889
3352h735889M00463K261964K571879J945325J536447J597126R89321r20332k392562
$$ -8735889 -8335426 -6073462 -3501583 -1556258 -19811 1577315 2566636 1646304 -746258
3343g46258j394050O30696N8595l094684m138218m90835L826889L702085L05990
$$ -746258 -2140308 -1509612 -1451017 -4545701 -8683919 -9174754 -5347865 -1645780 -1339790
3334a339790j157710N28006J552104j94448k090379j608084o3591M19350L18706
$$ -1339790 -2497500 -1969494 -417390 -611838 -2702217 -4310301 -4373892 -3954542 -3635836
3325c635836O60169M10924j113390j491414J587204N602809N494093N38851m484615
$$ -3635836 -2975667 -2564743 -3678133 -5169547 -3582343 2020466 7514559 8053410 3568795
3316C568795n522300l461016j144862O11554K041669K080821j80909l088020m053275
$$ 3568795 -1953505 -5414521 -6559383 -5947829 -3906160 -1825339 -2006248 -5094268 -9147543
3307i147543k805655q65468J173284L277644L851969J317343k256966k618785
$$ -9147543 -11953198 -12818666 -11645382 -8367738 -4515769 -3198426 -5455392 -8074177
3299h074177P58443L530188K604413J95405k77266O98910O44693k38607J27166
$$ -8074177 -7315734 -3785546 -1181133 -985728 -1262994 -564084 80609 -157998 -30832
3290c0832J508045J526788l60765k129669k401809j724578o09555J130389K873115
$$ -30832 1477213 3004001 2643236 513567 -1888242 -3612820 -4222375 -3091986 -218871
3281b18871L381685K736555J902959M73530k541125n616249n526207k047451J095886
$$ -218871 3162814 5899369 7802328 8275858 5734733 118484 -5407723 -7455174 -6359288
3272f359288J192677k68628p90182n23300p79045j187754o59732M19679J034369
$$ -6359288 -5166611 -5435239 -6225421 -6748721 -7527766 -8715520 -9375252 -8955573 -7921204
3263g921204J289890J589253J426749O69392N77312J807310K869158K318479R04565
$$ -7921204 -6631314 -5042061 -3615312 -2945920 -2368608 -561298 2307860 4626339 5530904
3254E530904k38689j588034l235061l138155l56517K027112R30989j460297q81028
$$ 5530904 5292215 3704181 469120 -2669035 -3025552 -998440 -67451 -1527748 -2408776
3245b408776J727663J464818k020431l265433O2951K820218M27214l691970l515509
$$ -2408776 -681113 783705 -1236726 -4502159 -4439208 -1618990 -1191776 -4883746 -8399255
3236h399255L21203K298560R96328L23929K139026L369312J684930p64854j287424
$$ -8399255 -8078052 -5779492 -4783164 -4459235 -2320209 1049103 2734033 1969179 681755
3227F81755m30412M47547J930023M088152M223430M43634m528133o505657n316551
$$ 681755 251343 698890 2628913 6717065 10940495 11384129 6855996 350339 -4966212
3218d966212l780167k589614j99381K804987L636847K131400J488674K937729
$$ -4966212 -8746379 -11335993 -11535374 -8730387 -5093540 -2962140 -1473466 1464263
3210A464263L588038J544604n89300j40718R51023m95405l270715l671740j618579
$$ 1464263 5052301 6596905 6007605 5866887 6817910 6322505 3051790 -619950 -2238529
3201b238529n34344j510087j810611K20938K503050K754739J737756J415826K089435
$$ -2238529 -2772873 -4282960 -6093571 -5872633 -3369583 -614844 1122912 2538738 4628173
3192D628173K759444K604473J098430j595475l557447k449794J062099L224874
$$ 4628173 7387617 9992090 11090520 9495045 5937598 3487804 4549903 7774777
3184G774777J767963j257873k484293j316005L52643Q83026q3421j930297l109823
$$ 7774777 9542740 8284867 5800574 4484569 4837212 5720238 5636817 3706520 596697
3175E96697k235295j19544R11213N20211Q23027K206302J789776j650443m334487
$$ 596697 -1638598 -1758142 -846929 -326718 496309 2702611 4492387 2841944 -1492543
3166a492543k561015J247139J827046j066446k736084r65349J463452K222025
$$ -1492543 -4053558 -2806419 -979373 -2045819 -4781903 -5747252 -4283800 -2061775
3158b061775K670377L931952L928472J105807j953358j851897N84482J662751
$$ -2061775 608602 4540554 8469026 9574833 7621475 5769578 6354060 8016811
3150H016811J24053j769323k040381j300885r36171r95743o96902J70635J160316
$$ 8016811 8140864 6371541 4331160 3030275 2094104 1098361 401459 572094 1732410
3141A732410J888237K201844J875127O74062j095626k363323k104163n90366N81645
$$ 1732410 3620647 5822491 7697618 8371680 7276054 4912731 2808568 2218202 2799847
3132B799847J66340j293942k158204j527226P5673J481658J744200O22533j134380
$$ 2799847 2966187 1672245 -485959 -2013185 -1937512 -455854 1288346 1910879 776499
3123G76499k311563k515343k326740j775085J5824K616269L401806R56167j927500
$$ 776499 -1535064 -4050407 -6377147 -8152232 -8136408 -5520139 -2118333 -1162166 -3089666
3114c089666j450911J619325K792334L26965k583998k957998j838571j193195
$$ -3089666 -4540577 -2921252 -128918 198047 -2385951 -5343949 -7182520 -8375715
3106h375715k79266K078231M025886K940166j12705j476806l864J890809K189496
$$ -8375715 -8654981 -6576750 -2550864 389302 276597 -1200209 -1204073 686736 2876232
3097B876232J464868O98869m25382j969940k588744j411196L01886Q50000N12333
$$ 2876232 4341100 5039969 4614587 2644647 55903 -1355293 -1053407 -203407 308926
3088C08926P89477J729178J632736k82788k250564k012919L3938J097300k80223
$$ 308926 1098403 2827581 4460317 4177529 1926965 -85954 -52016 1045284 765061
3079G65061k009853j157041J895188L694272K122869j198081l392839l451871
$$ 765061 -1244792 -2401833 -506645 3187627 5310496 4112415 719576 -2732295
3071b732295j943203N71024L150662L852175J599415j897712l922197l961353
$$ -2732295 -4675498 -4104474 -953812 2898363 4497778 2600066 -1322131 -5283484
3063e283484l330711k238589K62892L356889M292766K232361j1299L04129K122767
$$ -5283484 -8614195 -10852784 -10589892 -7233003 -2940237 -707876 -719175 -415046 1707721
3054A707721K500683R90505j60312K72369Q88573K14674j010744j170200k38331
$$ 1707721 4208404 5198909 5038597 5310966 6199539 6414213 5403469 4233269 3994938
3045C994938L90529R1277k97112j74237m23078k030186m032593m186367j935201
$$ 3994938 4385467 4476744 4179632 4005395 3582317 1552131 -2480462 -6666829 -8602030
3036h602030N53242J170525O04810Q62446J829066J487469l01307p41112J774890
$$ -8602030 -8048788 -6878263 -6273453 -5411007 -3581941 -2094472 -2395779 -3136891 -1362001
3027a362001M494202L632833j17599k169545k58941K555739K288786o45888k461358
$$ -1362001 3132201 6765034 6647435 4477890 4218949 6774688 9063474 8417586 5956228
3018E956228j231387J148755K117891J451944K97487j190185l582235n995397
$$ 5956228 4724841 5873596 7991487 9443431 9740918 8550733 4968498 -1026899
3010a026899n921853k088224L260572O036997M412246N80856j841741j552563
$$ -1026899 -6948752 -9036976 -5776404 260593 4672839 5253695 3411954 1859391
3002A859391j46116M42948j311n08164m69914j30464j01668p84041j772220j680631
$$ 1859391 1713275 2156223 2154912 1646748 1176834 1046370 944702 160661 -1611559 -3292190
2992c292190N28850L595003M471103J813024j939800l264040j652849M50899J199619
$$ -3292190 -2763340 831663 5302766 7115790 5175990 1911950 259101 710000 1909619
2983A909619Q73457M9065j452163l134470l412513j823527p7165L86789M68747
$$ 1909619 2783076 2832141 1379978 -1754492 -5167005 -6990532 -7067697 -6680908 -6212161
2974f212161J531012K702599K005318m17113k087112j252928J168015K809655
$$ -6212161 -4681149 -1978550 26768 -390345 -2477457 -3730385 -2562370 247285
2966B47285K127800m13273k661832k613242n87695J050500J012405P53577J823595
$$ 247285 2375085 1961812 -700020 -3313262 -3900957 -2850457 -1838052 -1084475 739120
2957G39120K967199J978413m96516j651534q09769k83975j463993k608393j669385
$$ 739120 3706319 5684732 5188216 3536682 2726913 2442938 978945 -1629448 -3298833
2948c298833O92637K274657K069284O43163j038149k092559j987661j168093o10351
$$ -3298833 -2606196 -331539 1737745 2380908 1342759 -749800 -2737461 -3905554 -4515905
2939d515905l88339J52747O17717k56644k066395k428010l12442K192516K780844
$$ -4515905 -4904244 -4751497 -4133780 -4390424 -6456819 -8884829 -9197271 -7004755 -4223911
2930d223911J770755O13792l92223r71396M22791L976229O156398L401335k366493
$$ -4223911 -2453156 -1839364 -2231587 -3202983 -2780192 1196037 7352435 10753770 8387277
2921H387277n245229k629114J944875L857364K577118N67310o93345j745065l260824
$$ 8387277 3142048 512934 2457809 6315173 8892291 9459601 8766256 7021191 3760367
2912C760367m587555m069157p07455L922086N981125L212629j710894l756351
$$ 3760367 -827188 -4896345 -5603800 -1681714 4299411 7512040 5801146 2044795
2904B044795j729903M22808o53612l240011l604765j468746K32096L7785l75018
$$ 2044795 314892 737700 84088 -3155923 -6760688 -8229434 -7997338 -7959553 -8334571
2895h334571O43086K155890K165085M11808j312586j203404P04144K533720K325533
$$ -8334571 -7691485 -5535595 -3370510 -2958702 -4271288 -5474692 -4770548 -2236828 88705
2886H8705p650k549088l323616k065024P8501J910449K731252K205382O11970
$$ 88705 81055 -2468033 -5791649 -7856673 -7778172 -5867723 -3136471 -931089 -319119
2877c19119j008648j690740j370577m27302J044004K741699L594073K888629J588787
$$ -319119 -1327767 -3018507 -4389084 -4816386 -3772382 -1030683 2563390 5452019 7040806
2868G040806J122469R74236q70304m659730p603680o808065k510708K389956N126861
$$ 7040806 8163275 9137511 8267207 3607477 -3996203 -10804268 -13314976 -10925020 -5798159
2859e798159M690811J852140j222803k191126o94674J156617J481939J034864
$$ -5798159 -1107348 744792 -478011 -2669137 -3363811 -2207194 -725255 309609
2851C09609J587943K814336K765259J047942o98052j533314k106320k465111j570730
$$ 309609 1897552 4711888 7477147 8525089 7827037 6293723 4187403 1722292 151562
2842A51562R9983K12921j516124j744085J678016N542434N157922R06417k592032
$$ 151562 251545 464466 -1051658 -2795743 -1117727 4424707 9582629 10489046 7897014
2833G897014k987028k047346j268331J13277J860100J619354j007628k751973
$$ 7897014 4909986 2862640 1594309 1707586 3567686 5187040 4179412 1427439
2825A427439j482781K30544p76835l139333l342493j341895J4931J05761J009381
$$ 1427439 -55342 175202 -601633 -3740966 -7083459 -8425354 -8410423 -8304662 -7295281
2816g295281K958851L326838J143026q39019l78448O72989n81063l204578l348922
$$ -7295281 -4336430 -1009592 133434 -705585 -1084033 -411044 -992107 -4196685 -7545607
2807g545607L43857M549937N113226J781022j859345k678869j161059Q7341j6949
$$ -7545607 -7201750 -2651813 2461413 4242435 2383090 -295779 -1456838 -1369497 -1386446
2798a386446k76059J00559O0215j026717j475914L51208K895289L024806M84229
$$ -1386446 -1662505 -1561946 -1501731 -2528448 -4004362 -3653154 -757865 2266941 2751170
2789B751170j720093j601342m50073k3939K44873J702492L709782M247109K600886
$$ 2751170 1031077 -570265 -1020338 -1044277 -799404 903088 4612870 8859979 11460865
2780A1460865L2056j895414k603670k380014j849825j515055j327620q63722j20047
$$ 11460865 11492921 9597507 6993837 4613823 2763998 1248943 -78677 -942399 -1062446
2771a062446L19814J75509n5859Q3482K58478j06071q95450j373001r95963M0269
$$ -1062446 -742632 -567123 -622982 -539500 -281022 -387093 -1282543 -2655544 -3651507 -3611238
2761c611238R19730R23986K64964j15873L2132k88064j618240k618016j864977
$$ -3611238 -2691508 -1767522 -1502558 -1618431 -1586299 -1874363 -3492603 -6110619 -7975596
2752g975596m83928q39594k639056k876903m32419J892581J603046M92490J821807
$$ -7975596 -8459524 -9299118 -11938174 -14815077 -15247496 -13354915 -11751869 -11259379 -9437572
2743i437572M921784N700027K438699j656326k589344l82817J514489O43891j864653
$$ -9437572 -4515788 1184239 3622938 1966612 -622732 -1005549 508940 1152831 -711822
2734g11822k966742j275132J356453J902324l33179k849743k847011l12302K360570
$$ -711822 -3678564 -4953696 -3597243 -1694919 -2028098 -4877841 -7724852 -8037154 -5676584
2725e676584L162886J985195j22063j948292k417150j095882J113288K503792
$$ -5676584 -2513698 -528503 -650566 -2598858 -5016008 -6111890 -4998602 -2494810
2717b494810K248021J151266M69391M13800K18936n52478j272337j030265N6244
$$ -2494810 -246789 904477 1373868 1787668 2006604 1454126 181789 -848476 -792232
2708g92232Q29033O61180M65074J273569K150042R57517k381680m900944m010734
$$ -792232 36801 697981 1163055 2436624 4586666 5544183 3162503 -1738441 -5749175
2699e749175p96325J618371K214583K611335L613880L540595J004521k365601
$$ -5749175 -6545500 -4927129 -2712546 -101211 3512669 7053264 8057785 5692184
2691E692184l698210k593827j304988j295277j387402j11908J482007R96991j625808
$$ 5692184 1993974 -599853 -1904841 -3200118 -4587520 -4699428 -3217421 -2220430 -3846238
2682c846238l318452j580144K139533M035760K537281n3326o91443Q67124K336938
$$ -3846238 -7164690 -8744834 -6605301 -2569541 -32260 -85586 -777029 90095 2427033
2673B427033J842324l74748k747643l840485k999472n29003K233669L516600K512145
$$ 2427033 4269357 3894609 1146966 -2693519 -5692991 -6221994 -3988325 -471725 2040420
2664B040420K42985j413673j700597j516233j713796j597951r1130K001603K449166
$$ 2040420 2283405 869732 -830865 -2347098 -4060894 -5658845 -5749975 -3748372 -1299206
2655a299206P23058q64815j92245J774680K550499J592953M09581j23342m38475
$$ -1299206 -576148 -1440963 -1633208 141472 2691971 4284924 4694505 4571163 4132688
2646D132688m58004O18867K239579K298135K264k633135l214118j683019K65819
$$ 4132688 3674684 4293551 6533130 8831265 8833529 6200394 2986276 1303257 1569076
2637A569076J294654J078147N8406m71190Q14022L243891L983406J215706l172970
$$ 1569076 2863730 3941877 4000283 3529093 4343115 7587006 11570412 12786118 9613148
2628I613148n346752l636256j7926K157310J198315j726036l719070k795212J35744
$$ 9613148 4266396 630140 612214 2769524 3967839 2241803 -1477267 -4272479 -4136735
2619d136735K192296J551207r12458k853268k506828J82146L266606L959086J672589
$$ -4136735 -1944439 -393232 -1305690 -4158958 -6665786 -6483640 -3217034 742052 2414641
2610B414641n00440M93217K841350J879750k693183n419139k599615K390352M046779
$$ 2414641 1914201 2407418 5248768 7128518 4435335 -983804 -3583419 -1193067 2853712
2601B853712K000300n0751l92996m64763j241295k025073k268845j773712J52418
$$ 2853712 4854012 4803261 4410265 3945502 2704207 679134 -1589711 -3363423 -3211005
2592c211005L129328M473548K420424o87856j581398r87176j662171k944330j904506
$$ -3211005 -81677 4391871 6812295 6124439 4543041 3555865 1893694 -1050636 -2955142
2583b955142Q02293J419892l87909p81381J509740K955900J510945q836N96372
$$ -2955142 -2152849 -732957 -1120866 -1902247 -392507 2563393 4074338 4065502 4661874
2574D661874Q90538j323722l359037j977688R97756J767265O12898M25516J222122
$$ 4661874 5552412 4228690 869653 -1108035 -110279 1656986 2269884 2695400 3917522
2565C917522P24832r17599j455073p86163o67754q08046M00431J593123l37863
$$ 3917522 4642354 3724755 2269682 1483519 815765 7719 408150 2001273 1663410
2556A663410m270944n053789j176542K449130J845207k04517P75968L597628L752286
$$ 1663410 -2607534 -7661323 -8837865 -6388735 -4543528 -4748045 -3972077 -374449 3377837
2547C377837R74751p12673J5308r8933k750507m643963k676583R39631K027545
$$ 3377837 4352588 3639915 3655223 3556290 805783 -3838180 -6514763 -5575132 -3547587
2538c547587O24141J49833J599918K383495R34663r91205j434374p91350j95952
$$ -3547587 -2923446 -2773613 -1173695 1209800 2144463 1153258 -281116 -1072466 -1268418
2529a268418J50277j23067j820986l880304l264133R03191N189238N886544L322738
$$ -1268418 -1118141 -1241208 -3062194 -6942498 -10206631 -9303440 -4114202 1772342 5095080
2520E095080K46691j856872k539408r49224K286547L854684J892619n58063J6739
$$ 5095080 5341771 3484899 945491 -3733 2282814 6137498 8030117 7472054 7488793
2511G488793J689104J59487l851099n625281m068104k556601k260217p55021J905433
$$ 7488793 9177897 9337384 5486285 -138996 -4207100 -6763701 -9023918 -9778939 -7873506
2502g873506K150751k31931n21234K846136M759271J798384j642153m09679L201045
$$ -7873506 -5722755 -5954686 -6475920 -3629784 1129487 2927871 1285718 876039 4077084
2493D077084L842819J674576N21770N58330q65359l007078k527056L29801J857686
$$ 4077084 7919903 9594479 10116249 10674579 9809220 6802142 4275086 4604887 6462573
2484F462573Q98468j44034j37728n04487j551778j665811n13708M09624N05171
$$ 6462573 7361041 7217007 7079279 6574792 5023014 3357203 2843495 3253119 3758290
2475C758290L34877l02539j515875j590088M98748K218665J038061p28443P02152
$$ 3758290 4093167 3790628 2274753 684665 1183413 3402078 4440139 3711696 4413848
2466D413848L768909L613984J46597j918611j008618m12579j405978j127692J125716
$$ 4413848 8182757 11796741 11943338 10024727 9016109 8603530 7197552 6069860 7195576
2457G195576J851410r9628j038221N89223Q08926k536446m858353k093136K071788
$$ 7195576 9046986 8947358 7909137 8498360 9307286 6770840 1912487 -180649 1891139
2448A891139J892571j371205k142900M29104K290735J838628J473207K106076
$$ 1891139 3783710 2412505 269605 698709 2989444 4828072 6301279 8407355
2440H407355J503420j160192l397108l175623j377079L91081J682856K124864
$$ 8407355 9910775 8750583 5353475 2177852 800773 1191854 2874710 4999574
2432D999574R59738j240176k283437r32029J314302J816721k75955k971053l275381
$$ 4999574 5959312 4719136 2435699 1503670 2817972 4634693 4358738 1387685 -1887696
2423a887696n18090K322641J842062j218901k598790l04795K634787K590160J26678
$$ -1887696 -2405786 -83145 1758917 540016 -2058774 -2363569 271218 2861378 2988056
2414B988056j681282j719650j106311m42443N38588J315928R09144l82505j155286
$$ 2988056 1306774 -412876 -1519187 -1961630 -1423042 -107114 802030 419525 -735761
2405g35761m92047J497079L755399M227151J442455k828444m552070k381466N66595
$$ -735761 -1227808 269271 4024670 8251821 9694276 6865832 2313762 -67704 498891
2396D98891J241691K52401p98813k268289m112142l927358q77252J470492L48926
$$ 498891 1740582 1992983 1194170 -1074119 -5186261 -9113619 -9990871 -8520379 -8171453
2387h171453j016925J659935N976031N807015P67823l323239l237867j763180
$$ -8171453 -9188378 -7528443 -1552412 4254603 5022426 1699187 -1538680 -3301860
2379c301860j750796k256735j901850j213276j82137K078013M010888K559800
$$ -3301860 -5052656 -7309391 -9211241 -10424517 -10606654 -8528641 -4517753 -1957953
2371a957953j213541k334260M74044K499179Q31392q34403J182199L909042K453514
$$ -1957953 -3171494 -5505754 -5031710 -2532531 -1701139 -2535542 -1353343 2555699 5009213
2362E009213k142621m822397l956066k096040r32318n6013K58440o89381j493933
$$ 5009213 2866592 -1955805 -5911871 -8007911 -8940229 -8996242 -8737802 -9427183 -10921116
2353a0921116k17557J823607J533138p97316j495111Q75664L387736L254780J444388
$$ -10921116 -11138673 -9315066 -7781928 -8579244 -10074355 -9198691 -5810955 -2556175 -1111787
2344a111787L50373L04064J95933r5439K43021J270862K089332K009654J002712
$$ -1111787 -761414 -457350 -261417 -356856 -113835 1157027 3246359 5256013 6258725
2335F258725p56990k944745m626023m481661k126295R23981K382254J685694O24345
$$ 6258725 5501735 2556990 -2069033 -6550694 -8676989 -7753008 -5370754 -3685060 -3060715
2326c060715Q20692J579465J531238J314446K355489L538783K101110j682577
$$ -3060715 -2240023 -660558 870680 2185126 4540615 8079398 10180508 8497931
2318H497931l783051j793405J585966K294051L2425k317714k631335r59167J445962
$$ 8497931 4714880 2921475 4507441 6801492 6833917 4516203 1884868 925701 2371663
2309B371663K747979J666626n13064r27916M63363J24885l313046n712987l213301
$$ 2371663 5119642 6786268 6273204 5345288 5808651 5933536 2620490 -3092497 -6305798
2300f305798J414734K552697r3549k011185j357761n17349l93480J133883L891651
$$ -6305798 -4891064 -2338367 -2431916 -4443101 -5800862 -6318211 -6711691 -5577808 -1686157
2291a686157L941730j45842l922749k994104R64976L145386J969959m05950j873484
$$ -1686157 2255573 2109731 -1813018 -4807122 -3842146 -696760 1273199 867249 -1006235
2282a006235j763956O681K532110L694556K466728M40786n60429q97143j346203
$$ -1006235 -2770191 -2763510 -231400 3463156 5929884 6370670 5810241 4913098 3566895
2273C566895q20856J546327L513502K070221j869245m102538k630226M9752P23581
$$ 3566895 2746039 4292366 7805868 9876089 8006844 3904306 1274080 1323832 2047413
2264B047413n93166j514047o86122Q46845J270287K82943n35014J72556J533526
$$ 2047413 1454247 -59800 -745922 100923 1371210 1654153 1119139 1291695 2825221
2255B825221J692949Q66292J116010K519317K186762j139477m058651k970044
$$ 2825221 4518170 5384462 6500472 9019789 11206551 10067074 6008423 3038379
2247C038379L62682J357360m00370r61128J228883K865507J417466q27567p87529
$$ 3038379 3401061 4758421 4358051 3396923 4625806 7491313 8908779 8081212 7293683
$$ [...]
##END NTUPLES=NMR SPECTRUM
##END=
