##TITLE=31P_DE-80H_X3
 64 sc D2O
 26.2.2025
##JCAMPDX= 6.0         $$ Bruker NMR JCAMP-DX V2.0
##DATA TYPE= NMR SPECTRUM
##DATA CLASS= NTUPLES
##ORIGIN= UXNMR, Bruker Analytische Messtechnik GmbH
##OWNER= root
$$ XWIN-NMR		Version 3.5
$$ Mon May 12 17:13:55 2025 Russian Standard Time (UT+4h)  Yarkov@DPX200
##.OBSERVE FREQUENCY= 81.013821
##.OBSERVE NUCLEUS= ^31P
##.ACQUISITION MODE= SIMULTANEOUS
##.ACQUISITION SCHEME= undefined
##.AVERAGES= 64
##.DIGITISER RES= 17
##SPECTROMETER/DATA SYSTEM= spect
##.PULSE SEQUENCE= zgpg30
##.SOLVENT NAME= DMSO
##.SHIFT REFERENCE= (INTERNAL, DMSO, 0, 198.062)
##AUDIT TRAIL= $$ (NUMBER, WHEN, WHO, WHERE, WHAT)
$$ ##TITLE= Audit trail, XWIN-NMR		Version 3.5
$$ ##JCAMPDX= 5.01
$$ ##ORIGIN= Bruker BioSpin GmbH
$$ ##OWNER= Yarkov
$$ C:/Bruker/XWIN-NMR/data/yarkov2/nmr/P31/2/pdata/1/auditp.txt
$$ ##AUDIT TRAIL=  $$ (NUMBER, WHEN, WHO, WHERE, WHAT)
(   1,<2025-05-12 17:13:05.60 +0400>,<Yarkov>,<DPX200>,
      <created by zg, POWCHK disabled, PULCHK disabled
       configuration hash MD5:
       00 E9 B6 7A A2 85 ED C7 34 08 36 98 17 FE 4E 26
       data hash MD5: 32K
       CE 1F 7E D9 7B DB 8A C1 81 B0 E7 30 FE 6A 3C 05>)
(   2,<2025-05-12 17:13:11.31 +0400>,<Yarkov>,<DPX200>,
      <Start of raw data processing
       efp BC_mod = 2 LB = 1.5 FT_mod = 6 PKNL = 1 PHC0 = 1794.796 PHC1 = 8.695429 SI = 64K 
       data hash MD5: 64K
       A5 07 B9 88 F4 1F 9F 61 B8 55 5C EF 2C 36 E2 F9>)
(   3,<2025-05-12 17:13:34.00 +0400>,<Yarkov>,<DPX200>,
      <pk PHC0 = -4.8 PHC1 = 0 
       data hash MD5: 64K
       00 E9 B3 5A 2E 74 3A 9F 7F 56 7E 7D CC 7E 32 68>)
$$ ##END=
$$ 
$$ hash MD5
$$ CE 84 EE 22 4F 98 06 48 BB 09 30 2E CD 9C 61 6D
##$RELAX= 
##$RELAX= 
##$RELAX= 
##$RELAX= 
##$RELAX= 
##$RELAX= 
##$RELAX= 
##$RELAX= 
$$ Bruker specific parameters
$$ --------------------------
##$DU= <C:/Bruker/XWIN-NMR>
##$EXPNO= 2
##$NAME= <P31>
##$PROCNO= 1
##$TYPE= <nmr>
##$USER= <yarkov2>
##$AMP= (0..31)
100 100 100 100 100 100 100 100 100 100 100 100 100 100 100 100 100 100 
100 100 100 100 100 100 100 100 100 100 100 100 100 100 
##$AQSEQ= 0
##$AQ_mod= 1
##$AUNM= <au_zg>
##$AUTOPOS= <>
##$BF1= 81.014009
##$BF2= 200.13
##$BF3= 200.13
##$BF4= 200.13
##$BF5= 200.13
##$BF6= 200.13
##$BF7= 200.13
##$BF8= 200.13
##$BYTORDA= 1
##$CFDGTYP= 0
##$CFRGTYP= 5
##$CHEMSTR= <none>
##$CNST= (0..31)
1 1 145 1 1 1 1 1 1 1 1 1 1 1 1 1 1 1 1 1 1 1 1 1 1 1 1 1 1 1 1 1 
##$CPDPRG= <waltz16>
##$CPDPRG1= <>
##$CPDPRG2= <waltz16>
##$CPDPRG3= <>
##$CPDPRG4= <mlev>
##$CPDPRG5= <mlev>
##$CPDPRG6= <mlev>
##$CPDPRG7= <mlev>
##$CPDPRG8= <mlev>
##$CPDPRGB= <>
##$CPDPRGT= <>
##$D= (0..31)
0 1 0 0 0 0 0 0 0 0.06 0 0.03 2e-05 3e-06 0 0 0.0002 0 0 0 0 0 0 0 0 0 
0 0 0 0 0 0 
##$DATE= 1747055585
##$DBL= (0..7)
120 120 120 11 120 120 24 19 
##$DBP= (0..7)
150 150 150 150 150 150 150 150 
##$DBP07= 0
##$DBPNAM0= <>
##$DBPNAM1= <>
##$DBPNAM2= <>
##$DBPNAM3= <>
##$DBPNAM4= <>
##$DBPNAM5= <>
##$DBPNAM6= <>
##$DBPNAM7= <>
##$DBPOAL= (0..7)
0.5 0.5 0.5 0.5 0.5 0.5 0.5 0.5 
$$ [...]
##$SUBNAM2= <"">
##$SUBNAM3= <"">
##$SUBNAM4= <"">
##$SUBNAM5= <"">
##$SUBNAM6= <"">
##$SUBNAM7= <"">
##$SUBNAM8= <"">
##$SUBNAM9= <"">
##$SW= 400.765351723535
##$SWIBOX= (0..15)
0 1 3 0 0 0 0 0 0 0 0 0 0 0 0 0 
##$SW_h= 32467.5324675325
##$TD= 32768
##$TD0= 1
##$TE= 0
##$TE2= 300
##$TE3= 300
##$TEG= 300
##$TL= (0..7)
0 120 53 12 22 120 120 120 
##$TP= (0..7)
150 150 150 150 150 150 150 150 
##$TP07= 0
##$TPNAME0= <>
##$TPNAME1= <>
##$TPNAME2= <>
##$TPNAME3= <>
##$TPNAME4= <>
##$TPNAME5= <>
##$TPNAME6= <>
##$TPNAME7= <>
##$TPOAL= (0..7)
0.5 0.5 0.5 0.5 0.5 0.5 0.5 0.5 
##$TPOFFS= (0..7)
0 0 0 0 0 0 0 0 
##$TUNHIN= 0
##$TUNHOUT= 0
##$TUNXOUT= 0
##$USERA1= <user>
##$USERA2= <user>
##$USERA3= <user>
##$USERA4= <user>
##$USERA5= <user>
##$V9= 5
##$VALIST= <valist>
##$VCLIST= <CCCCCCCCCCCCCCC>
##$VD= 0
##$VDLIST= <DDDDDDDDDDDDDDD>
##$VPLIST= <PPPPPPPPPPPPPPP>
##$VTLIST= <TTTTTTTTTTTTTTT>
##$WBST= 1024
##$WBSW= 4
##$XGAIN= (0..3)
0 0 0 0 
##$XL= 0
##$YL= 0
##$YMAX_a= 8837
##$YMIN_a= -7960
##$ZGOPTNS= <>
##$ZL1= 120
##$ZL2= 120
##$ZL3= 120
##$ZL4= 120
##$ABSF1= 0
##$ABSF2= 0
##$ABSG= 0
##$ABSL= 0
##$ALPHA= 0
##$AQORDER= 0
##$ASSFAC= 0
##$ASSFACI= 0
##$ASSFACX= 0
##$ASSWID= 0
##$AUNMP= <proc_1d>
##$AZFE= 0.1
##$AZFW= 0.5
##$BCFW= 0
##$BC_mod= 2
##$BYTORDP= 0
##$COROFFS= 0
##$CY= -3
##$DATMOD= 1
##$DC= 0
##$DFILT= <>
##$DTYPP= 0
##$F1P= 0
##$F2P= 0
##$FCOR= 1
##$FTSIZE= 65536
##$FT_mod= 6
##$GAMMA= 0
##$GB= 0
##$INTBC= 1
##$INTSCL= 9.790993e-09
##$ISEN= 30
##$LB= 1.5
##$LEV0= 0
##$LPBIN= 0
##$MAXI= 10000
##$MC2= 0
##$MEAN= 0
##$ME_mod= 0
##$MI= 50
##$NCOEF= 0
##$NC_proc= -8
##$NLEV= 6
##$NOISF1= 182.463
##$NOISF2= 159.3651
##$NSP= 0
##$NTH_PI= 0
##$NZP= 0
##$OFFSET= 198.0616
##$PC= 4
##$PHC0= 1789.996
##$PHC1= 8.695429
##$PH_mod= 1
##$PKNL= yes
##$PPARMOD= 0
##$PSCAL= 0
##$PSIGN= 0
##$REVERSE= no
##$SF= 81.0140089999434
##$SI= 65536
##$SIGF1= 159.3651
##$SIGF2= -187.1042
##$SINO= 113.3802
##$SIOLD= 16384
##$SREGLST= <1H.CDCl3>
##$SSB= 0
##$STSI= 65536
##$STSR= 0
##$SW_p= 32467.5324675325
##$SYMM= 0
##$S_DEV= 0
##$TDeff= 32768
##$TDoff= 0
##$TI= <>
##$TILT= no
##$TM1= 0
##$TM2= 0
##$TOPLEV= 0
##$USERP1= <user>
##$USERP2= <user>
##$USERP3= <user>
##$USERP4= <user>
##$USERP5= <user>
##$WDW= 1
##$XDIM= 65536
##$YMAX_p= 161793920
##$YMIN_p= -346313013
$$ End of Bruker specific parameters
$$ ---------------------------------
##NTUPLES= NMR SPECTRUM
##VAR_NAME=  FREQUENCY,     SPECTRUM/REAL,   SPECTRUM/IMAG
##SYMBOL=    X,             R,               I
##VAR_TYPE=  INDEPENDENT,   DEPENDENT,       DEPENDENT
##VAR_FORM=  AFFN,          ASDF,            ASDF
##VAR_DIM=   65536,         65536,           65536
##UNITS=     HZ,            ARBITRARY UNITS, ARBITRARY UNITS
##FACTOR=    0.49542278885378, 1,            1
##FIRST=     16045.7642231865, 0,            0
##LAST=      -16421.768244346, 0,            0
##MIN=       -16421.768244346, -346313013,   0
##MAX=       16045.7642231865, 161793920,    0
$$ Real data points
##PAGE= N=1
##DATA TABLE= (X++(R..R)), XYDATA
$$ [...]
7490a599156R54391J17543k127501l179003k079367o40758R5403J163420K675101
7481d619927K921862J611509P51544J043438P33801n06474k83897J827802K178998
7472E658656j220479m295527k319850K754582M888722K365811r57108k086589
7464D788218j947176j755182p59339J070196J657881l5178k058520k335331j362804
7455b737235n52018Q7682Q85761R22624m49813j710474q84687J439470K662027
7446c36663J555249m42794j385657r97991l88617m83413j165297j535348q03501
7437e984032Q47699K265201K377585J184116l65902j191222p06491P81874J945781
7428A154609J353273p84645k299262j445022P12988J473779P6030j277143m98449
$$ y = [-1599156, -644765, -527222, -2654723, -5833726, -7913093, -8553851, -8458448, -7295028, -4619927, -1698065, -86556, 664988, 1708426, 2442227, 1935753, 1651856, 3479658, 5658656, 4438177, 142650, -2177200, 577382, 5466104, 7831915, 6874807, 4788218, 2841042, 1085860, 326521, 1396717, 3054598, 3019420, 960900, -1374431, -2737235, -3289253, -3201571, -2315810, -1393186, -1842999, -3553473, -4438160, -2998690, -336663, 1218586, 775792, -609865, -1607856, -1996473, -2479886, -3645183, -5180531, -5984032, -5136333, -2871132, -493547, 690569, 324667, -866555, -1573046, -791172, 1154609, 2507882, 1723237, -576025, -2021047, -1308059, 165720, 241750, -1035393, -1533842]
7419a533842J629369K882619K699013K207359J694221Q5284k663192m485863l629075
7410a114107j019871R18707J060711J79721n32122m47164M67561J528157J638997
7401B680590O35825k16128o361L17222n16091j872334k146038j285380n43585
7392b952280k03994M00395R92589Q05511O55818J845094L043822J550391j840566
7383D296780k983173p33575Q41965j015868l037006j377457J660200J274032j732445
7374b806547k155921J033927L060119R83348k227253k959405j762853n93042P70264
7365f657363K653238L103302Q81203j552439j294127N93013J021202l87643j674396
7356c314010k205763k521554j687346J280850L898883K468642j696063k681736
$$ y = [-1533842, 95527, 2978146, 5677159, 7884518, 9578739, 9664023, 7000831, 2514968, -1114107, -2133978, -1215271, -154560, 25161, -506961, -954125, -486564, 1041593, 2680590, 3316415, 3100287, 3093926, 3411148, 2895057, 1022723, -1123315, -2408695, -2952280, -3156274, -2755879, -1763290, -957779, -301961, 1543133, 4586955, 6137346, 4296780, 1313607, 580032, 1421997, 406129, -2630877, -4008334, -2348134, -1074102, -2806547, -4962468, -3928541, -868422, 114926, -2112327, -5071732, -6834585, -7427627, -6657363, -4004125, -900823, -19620, -1572059, -2866186, -2273173, -1251971, -1639614, -3314010, -5519773, -8041327, -9728673, -8447823, -4548940, -2080298, -3776361, -6458097]
7348f458097J812360O649744O172747J629758j609163j747426j422097k131821
7340B896005k193756o26913P06335K97288m62139J89844J314772Q74020q31433
7331B164023j531698l98451Q22479L01248j614025l067154k733056p08997K030976
7322d734655M386991N301985L769742l45426n011004o609234l462529J472301
7314e231829L409984J544224k18502Q17620K270492Q44046k198163l073710j430420
7305c266258l53930r81597j148064K50844J450984J392043J421613J947967R62126
7296A675728k029260l895901k297496O35575J804766J638180J957693J932271
7288A421556N055k060953j306359J330516K197506O74865l11906N74621J413116
$$ y = [-6458097, -4645737, 2004007, 8176754, 9806512, 8197349, 6449923, 5027826, 2896005, 702249, 75336, 781671, 1078959, 616820, 806664, 2121436, 2995456, 2164023, 632325, 233874, 1056353, 1357601, -256424, -3323578, -6056634, -6765631, -4734655, -347664, 4954321, 8724063, 8378637, 3367633, -3241601, -6704130, -5231829, -1821845, -277621, -496123, 321497, 2591989, 3436035, 1237872, -1835838, -3266258, -3620188, -4601785, -5749849, -5499005, -4048021, -2655978, -1234365, 713602, 1675728, -353532, -4249433, -6546929, -5911354, -4106588, -2468408, -510715, 1421556, 1426611, -634342, -1940701, -610185, 1587321, 2262186, 1950280, 2524901, 3938017]
7279C938017Q68056k3512n91209j546555k391244j254916J468331K565417O16584
7270C648969j710275j595911K92929J710953J928007J271543r0473j223718n32536
7261C699488J473876J754374r99343l788291l171088Q3889K450872K297729Q71474
7252D672980k89845q73587j282348j963049k722573k269210K56341L119011L533228
7243B180948J728915O19040P98258l50082l128129l609305r5079K912402J257562
7234B314530k231918k581629p26994q30112k190672p14485K881937L660697J268334
7225H49688P75173L455368M055874j6464l592142j918601J787223J964272o14541
7216F745850j331279K78911P28833r62828k247790j757870o35502M55039J796669
$$ y = [3938017, 4806073, 4782561, 4191352, 2644797, 253553, -1001363, 466968, 3032385, 3648969, 1938694, 342783, 635712, 2346665, 4274672, 5546215, 5455742, 4232024, 3699488, 5173364, 6927738, 5928395, 2140104, -1030984, -947095, 1503777, 3801506, 4672980, 4383135, 3509548, 2227200, 264151, -2458422, -4727632, -4471291, -1352280, 2180948, 3909863, 4528903, 5327161, 4977079, 1848950, -1760355, -1855434, 1056968, 2314530, 82612, -2499017, -3226011, -4056123, -6246795, -6961280, -4079343, -418646, 849688, 1624861, 5080229, 9136103, 9119639, 5527497, 3608896, 5396119, 7360391, 6745850, 5414571, 5693482, 6422315, 5459487, 3211697, 1453827, 818325, 1273364, 3070033]
7207C070033K384639Q14614j661671k207772m82631J313166K140356K639014K266141
7198A0275889k87196l456493l480698J19519L205341K625906n6442k077124l342138
7189C526564m474251m171726j701420M19253j49347j216973R05476N060803O251651
7180D450030L005009n43758r31623K60160K00746o24826m97723l08736j744094
7171C265185l341595k200368J003688K421715O44956j517087j645310q23580o99105
7162b891501m69194R13979J904142N98952j642418j852815q9399N96543j026128
7153c957839k415773j155190J422096K196805N88284r61294n53595P56099P50188
7144c330219p37334j660012q07734L78652N9549r89082m74836J617309K632645
$$ y = [3070033, 5454672, 6269286, 4607615, 2399843, 1917212, 3230378, 5370734, 8009748, 10275889, 9988693, 6532200, 3051502, 3171021, 6376362, 9002268, 8945826, 6868702, 3526564, -947687, -5119413, -6820833, -6401580, -6550927, -7767900, -6862424, -1801621, 4450030, 7455039, 6911281, 5979658, 6239818, 6440564, 5815738, 5318015, 5009279, 3265185, -76410, -2276778, -1273090, 1148625, 1793581, 276494, -1368816, -2192396, -2891501, -3360695, -2446716, -542574, 56378, -1586040, -3438855, -3528254, -2931711, -3957839, -6373612, -7528802, -6106706, -3909901, -3321617, -4282911, -4836506, -4080407, -3330219, -4067553, -5727565, -6535299, -6156647, -6097098, -7086180, -7561016, -5943707, -3311062]
7135c311062J192727p52151r98298o9664N41696J071800K174322K637844J163644
7126C650858p38020n48049J260813J930128O82008o97663j323906k102173k969249
7117h55253k430028m78577R44081J109181J253755J548607N32114j438981j615025
7108a430126O97802K434974J491894p6438N0909N26735o84523k110816j088061
7099a87650J644642L127988K573118J410964K62884j001501j413607l56187K10734
7090F271385j678610m099855l420321K09648L034301K955193J145609j154899
7082C262451l581456m453973j881000K262382L521324J179116m87225J237376
7074A058995L573537L041665O84804k94896O03350J610398J940988J830885Q85103
$$ y = [-3311062, -2118335, -2870486, -3868784, -3938448, -3396752, -2324952, -150630, 2487214, 3650858, 2912838, 2364789, 3625602, 5555730, 6237738, 5540075, 4216169, 2113996, -855253, -3285281, -3763858, -2819777, -1710596, -456841, 1091766, 1623880, 184899, -1430126, -732324, 1702650, 3194544, 3118106, 3169015, 3695750, 3011227, 900411, -187650, 1456992, 4584980, 7158098, 8569062, 8831946, 7830445, 6416838, 6060651, 6271385, 4592775, 492920, -2927401, -2717753, 316548, 3271741, 4417350, 3262451, -319005, -4772978, -6653978, -4391596, -870272, 308844, -178381, 1058995, 4632532, 7674197, 8359001, 8064105, 8667455, 10277853, 12218841, 14049726, 14934829]
7065A4934829j041072k521402k373221j711766k192289l303754l342825k048634
7057c600134m67415P77678J449643J136519L34923O59752K227436K524751N3893
7048E097046k619028k158697N85935J908043N20218j568784k693283k807063j591285
7039e326898J262433L836328L422383N83332j357907j264445j248049k203484
7031b296307k129338l25723N67356r36397j977127L42385M028517M891725K410463
7022D575554l30826j362937j392069j356464j254454j067922n52525J317452M431171
7013C006980N923061L248940j593964l858931k016204Q91495J919806J225227
7005H746410l0578j571467k670060j828721N75062J688178q1160k745146l721993
$$ y = [14934829, 13893757, 11372355, 8999134, 7287368, 5095079, 1791325, -1551500, -3600134, -4067549, -3289871, -1840228, -703709, -368786, 290966, 2518402, 5043153, 5097046, 2478018, 319321, 905256, 2813299, 3333517, 1764733, -928550, -3735613, -5326898, -4064465, -228137, 3194246, 3777578, 2419671, 1155226, -92823, -2296307, -4425645, -4751368, -4184012, -5120409, -7097536, -6755151, -2726634, 2165091, 4575554, 4244728, 2881791, 1489722, 133258, -1121196, -2189118, -2741643, -1424191, 3006980, 8930041, 12178981, 10585017, 6726086, 4709882, 5601377, 7521183, 8746410, 8715832, 7144365, 4474305, 2645584, 3220646, 4908824, 4827664, 2082518, -1639475]
6996a639475l070953k029582n43487J403292J889039n46088l598086l287366P51105
6987a0671601M513294M468994J299894j572309j744998K82576K024405J561651
6979A61906m19201j542304r38551k61222p73273j245087l78701N09792k73875
6970e160516j290696J39165L150099L878861J112566j806770j742770K28160R82128
6961e09773m44848k246417k207633K11675L178045L714746R97604j785181q73892
6952C4326K853870M645027K161252j779255l540459k897952j655450p32509l14607
6943a225757o48482j071702l05659J007414N14812j742287k402540R9504K625739
6934c148958K150738M25500N25825J507030N39008j669967j985489j92726J039357
$$ y = [-1639475, -4710428, -6740010, -7283497, -5880205, -3991166, -4537254, -8135340, -11422706, -10671601, -6158307, -1689313, -389419, -1961728, -3706726, -3424150, -1399745, 161906, -257295, -1799599, -2738150, -2999372, -3772645, -5017732, -5396433, -4886641, -5160516, -6451212, -6312047, -3161948, 716913, 1829479, 22709, -1720061, -1491901, -509773, -954621, -3201038, -5408671, -5196996, -2018951, 1695795, 2693399, 908218, 34326, 2888196, 7533223, 9694475, 7915220, 4374761, 1476809, -178641, -911150, -1225757, -1874239, -2945941, -3251600, -2244186, -1729374, -3471661, -5874201, -5774697, -3148958, -998220, -572720, -46895, 1460135, 1999143, 329176, -1656313, -1849039, -809682]
6925h09682Q81603R43904J465741R22257m39500m46538J136464J940646P58021
6916F352916r58879j721619j411306q4664J791986K282028L46893j337798K60127
6907E519684L032580K303169j374361k614781l2015J596921j49161j242937J013057
6898H052156K529949k91654l441753j764594J829038R28821l392346m069480L77971
6889G58108L524703J194860k987027m336483l472056k922827k233979j56479J771182
6880h859998J577378M57111O92476J727232J398648k12914j123710q44031p01982
6871e889790j122594j050752j16603P59752J165270J683571K155967J278732j167195
6862b303642l109727k449827K30714K345261K295426Q52183k03892Q2253J276244
$$ y = [-809682, 71921, 1015825, 2481566, 3403823, 2964323, 2517785, 3654249, 5594895, 6352916, 5394037, 3672418, 2261112, 2176448, 3968434, 6250462, 6597355, 5259557, 5519684, 8552264, 10855433, 9481072, 6866291, 6834276, 8431197, 8282036, 7039099, 8052156, 10582105, 10290451, 6848698, 5084104, 6913142, 7841963, 4449617, 380137, 758108, 4282811, 5477671, 2490644, -1845839, -5317895, -8240722, -10474701, -10631180, -8859998, -7282620, -6825509, -6133033, -4405801, -3007153, -3220067, -4343777, -5187808, -5889790, -7012384, -8063136, -8179739, -7419987, -6254717, -4571146, -2415179, -1136447, -2303642, -5413369, -7863196, -7632482, -5287221, -2991795, -2139612, -2343504, -2261251, -985007]
6853i85007J963456P35489k276183m702172l877903j5285L548731L976754J869903
6844B37783k24088j102044j363904j512018j372736j049235q25903l68906M96069
6835g084982P38232l19220j035420N24748L003488L172243R98703j72041Q27952
6826F53703J195163m54547j088890J363260L416055J089109l136613l491948K88439
6817a66269K619789N21665k610699k935808j496836j325783k418732k407304n00986
6808a0720963J659270K353693J445796J30918j85537P07472J306684J81499j742112
6799d863280k095358l90089J310993J504259J122798J348360J335603k98380k784780
6790c809874l677769j791481J408563L363595K833767P91740q18017j087071o08125
$$ y = [-985007, 978449, 1713938, -562245, -5264417, -9142320, -9157605, -5608874, -1632120, 237783, 13695, -1088349, -2452253, -3964271, -5337007, -6386242, -7212145, -7581051, -7084982, -6346750, -6665970, -7701390, -7176642, -4173154, -1000911, -2208, -174249, 653703, 1848866, 1394319, 305429, 1668689, 5084744, 6173853, 3037240, -454708, -166269, 2453520, 2975185, 364486, -2571322, -4068158, -5393941, -7812673, -10219977, -10720963, -9061693, -6708000, -5262204, -5131286, -5316823, -4609351, -3302667, -3121168, -4863280, -6958638, -7348727, -6037734, -4533475, -3410677, -2062317, -726714, -1025094, -3809874, -7487643, -9279124, -7870561, -4506966, -1673199, -881459, -1699476, -2786547, -3394672]
6781c394672M0721J190169K686439K884874P06219k123164k881357j416944K07738
6772b099977J162390K278543L109924J774815j384391l069001j549479P60894
6764I83718J186176O77139J292104K025177M79048k528191l564934j637722N05439
6755e82046N87977m55429q92107q58406j039893n87217J516899L919652L893867
6746E503297R19573k419070l604973k893757k031635j499157n39551O65494P98087
6737e101692k78351p98735L18920J669303J571686Q46111J438883K989221L030951
6728E686297O61964k081832l050299k388322j332346j76528J364341K739611K756923
6719D179809J002703j468570k769868j651103J084053K852833J849677q29031
$$ y = [-3394672, -3353951, -2163782, 522657, 3407531, 4113750, 1990586, -890771, -2307715, -2099977, -937587, 1340956, 4450880, 6225695, 4841304, 1772303, 222824, 983718, 2169894, 2847033, 4139137, 6164314, 6643362, 4115171, 550237, -1087485, -582046, 5931, -449498, -1341605, -2200011, -3239904, -3827121, -2310222, 1609430, 5503297, 6422870, 4003800, 398827, -2494930, -4526565, -6025722, -6565273, -5899779, -5101692, -5380043, -6178778, -5859858, -4190555, -2618869, -1772758, -333875, 2655346, 5686297, 6348261, 4266429, 1216130, -1172192, -2504538, -2681066, -1316725, 1422886, 4179809, 5182512, 3713942, 944074, -707029, 377024, 3229857, 5079534, 4250503]
6711D250503k525346k169265r36250j41886j1198l99131j070457j181496p8972
6702d263498J320097J558200R49525R89517J616665J374886L20193L8576M30592
6693D334753l93885k169302j894749J154348L295128J787916q36185r81640J96559
6684D492943q25739l533945l822574m31850L141243L700780K013883N11025M7479
6675E293245J70257N88646J074370J084406L35198r56459k499314l669469l128981
6666a708101j76693L510937N039638L572679J211693K23220N04277L81188q52955
6657A1705883j961051j352562O04228J472669l24150l029242l618130k177022
6649A320623j827659l675956m743897k670291L37847R50019k18710l05533Q39202
$$ y = [4250503, 1725157, -444108, -1380358, -1522244, -1533442, -1932573, -3003030, -4184526, -4263498, -2943401, -1385201, -435676, 553841, 2170506, 3545392, 3865585, 3904161, 4334753, 3940868, 1771566, -123183, 1031165, 4326293, 6114209, 5278024, 4296384, 4492943, 3667204, 133259, -3689315, -4121165, -979922, 2720858, 4734741, 5245766, 5293245, 5463502, 6052148, 7126518, 8210924, 8546122, 7589663, 5090349, 1420880, -1708101, -1884794, 1626143, 6665781, 10238460, 11450153, 11673373, 12177650, 12558838, 11705883, 9744832, 8392270, 8996498, 10469167, 10145017, 7115775, 3497645, 1320623, -507036, -4182992, -8926889, -11597180, -11259333, -10309314, -10528024, -10833557, -9994355]
6640i994355J227936J084405K331432M071376L048449o98653k827154q29569K377786
6631b08347K911535R56797q15973j356764j343530j005217j98911M78865N42865
6622c8680O26112J114707Q64592j075731l325844l456776j050864J806055K883203
6613a653226J781702j49190j166499o28908M81896Q08975L51384K80887J131164
6604A238185K138220K400101J689169J89391j422081j813338l43865J548049J872533
6595G496364Q28245J87974K00201n03334j834459j933183o23971k36496j671691
6586A909650k501338q38051J505896K007427J269659J159532J006624j106627
6578D412772m229018m916430j756771K843256N570318N135774K368429q72542
$$ y = [-9994355, -8766419, -7682014, -5350582, -1279206, 1769243, 1070590, -1756564, -2586133, -208347, 2703188, 3659985, 2844012, 1487248, 143718, -861499, -1060410, -581545, -38680, 587432, 1702139, 2566731, 1491000, -1834844, -5291620, -6342484, -4536429, -1653226, 128476, -20714, -1187213, -1816121, -1334225, -525250, -173866, 107021, 1238185, 3376405, 5776506, 7465675, 7655066, 6232985, 4419647, 4075782, 5623831, 7496364, 8324609, 8512583, 8712784, 8209450, 6374991, 4441808, 3817837, 3581341, 1909650, -591688, -1429739, 76157, 2083584, 3353243, 4512775, 5519399, 4412772, 183754, -4732676, -6489447, -3646191, 1924127, 7059901, 9428330, 8555788]
6570H555788k703899k462320j153578n5393N67722P21824m1840j285282j031632
6561A111390J503864L572039J794245k927761n887621m221135J8420K893393K822835
6552F79669J086640l66394o53203l25501n69164j562043j793472M6781K747007
6543g09680L508292J357811j662708l084745k635992j756212j452537j358073
6535g793844n09988J337508L034955K850658M32658k316452l026131j346899J003181
6526f334354K343996K295987J246722k30481j292971j247362m83854k74672j224196
6517e201185k385629k254116l96289K066557L487188L223137K155044J499346
6509B194053J292376O52062n90916j523377j545341r91253j10256J162029J987357
$$ y = [8555788, 5851889, 3389569, 2235991, 2180598, 2748320, 3470144, 3428304, 2143022, 1111390, 2615254, 6187293, 7981538, 5053777, -833844, -5054979, -5036559, -2143166, 679669, 1766309, 1399915, 746712, 421211, -147953, -1709996, -3503468, -3456687, -709680, 2798612, 4156423, 2493715, -591030, -3227022, -4983234, -6435771, -7793844, -8303832, -6966324, -3931369, -1080711, -648053, -2964505, -5990636, -7337535, -6334354, -3990358, -1694371, -447649, -678130, -1971101, -3218463, -3702317, -3976989, -5201185, -7586814, -9840930, -10237219, -8170662, -4683474, -1460337, 694707, 2194053, 3486429, 4138491, 3547575, 2024198, 478857, -512396, -622652, 539377, 2526734]
6500B526734R90450j239402k001342l28550J029734l97510k683413k270931M06192
6491c968038J504454l52372k210067j342479J287676L115527L108996J756225
6483B899922m4604j101307p42973k60261j581339l825251l544035L76349M391279
6474c432220M647142J748298p97509j287009p27027j58038N20163J385342K066983
6465C966125K442486K464982J649130l0329j282378j024578l44365j272602l644344
6456B924127m784861k729332J355020M355415M102024R98572k466459l796510
6448d2004k774191j612727k172623l404042k679670M80306L452695L704888J707916
6439c339452j11269l70279L44037R53575J053438O18149l35785j306736j282361
$$ y = [2526734, 3517184, 2277782, 276440, -52110, 977624, 580114, -2103299, -4374230, -3968038, -2463584, -2815956, -5026023, -6368502, -5080826, -1965299, 1143697, 2899922, 2855318, 1754011, 1011038, 750777, -830562, -4655813, -8199848, -7823499, -3432220, 1214922, 2963220, 2165711, 878702, 151675, -6363, 513800, 1899142, 3966125, 6408611, 8873593, 10522723, 10492394, 9210016, 8185438, 7841073, 6568471, 2924127, -1860734, -4590066, -3235046, 1120369, 5222393, 6220965, 3754506, -42004, -2816195, -4428922, -6601545, -10005587, -12685257, -12204951, -8752256, -5047368, -3339452, -3450721, -3821000, -3476963, -2523388, -1469950, -851801, -1187586, -2494322, -3776683]
6430c776683Q2913J602464J691410L48676q16419p52844k49528m55832j027166
6421c353009q68842j42089J8072k42760P12442L219670M848207L219380m87892
6412F923179k531572j084387J724172K660213J070871j102584k098360j865229
6404C696303j120869l23435j2368q89041k512602k859842p17739J992181K234495
6395e12917K48778m61579J556343L006142O65626l201192l657945m25943J572197
6386a210490m17584k944140j735249J960712L539869J752591k82973k98202L47485
6377G12019r3519o08739N71278K488164K326111m97028l054612k408760P82047
6368B16961L207069K988136J637277J666636L193004L806395J582875k589692
$$ y = [-3776683, -3693770, -2091306, -399896, -51220, -867639, -1620483, -1870011, -2325843, -3353009, -4221851, -4363940, -4345868, -4588628, -3876186, -656516, 4191691, 7411071, 6923179, 4391607, 3307220, 5031392, 7691605, 8762476, 7659892, 5561532, 3696303, 2575434, 2251999, 2239631, 1350590, -1162012, -4021854, -4739593, -2747412, -512917, -264139, -725718, 830625, 3836767, 4502393, 1301201, -2356744, -2782687, -1210490, -1628074, -4572214, -6307463, -4346751, -806882, 945709, 662736, 364534, 712019, 618500, 9761, 581039, 3069203, 5395314, 4898286, 1843674, -565086, 216961, 3424030, 6412166, 8049443, 9716079, 12909083, 16715478, 18298353, 15708661]
6360A5708661n910485o407347m451093j782762M25283K127099L226967K861429
6352E797752P16382j602655k016668p43600M4404l86196l34195J043046J760257
6343D278527J79793j860567j653394J24006O95432k94951p97581l65124o63648
6334c57507j923360k354061j574426j195546j301637Q837K498675L114087J145475
6325a939463Q7156J875628L160918P12611k832642k781264N19839K771836K252606
6316C827225R46711K37594l18792m86956M38105J202114L0700j788146j391119
6307B697436Q79157J972577J223674Q77396J443154Q84706r93878j835962j386666
6298E761594k215934m292363l732138N97001L937587K471467q44285j236784O60452
$$ y = [15708661, 9798176, 3390829, -1060264, -2843026, -2417743, -290644, 2936323, 5797752, 6514134, 4911479, 2894811, 2151211, 2195615, 1809419, 1475224, 2518270, 4278527, 4458320, 2597753, 944359, 1068365, 1763797, 1468846, 671265, 306141, -357507, -2280867, -4634928, -6209354, -7404900, -8706537, -8697700, -6199025, -3084938, -1939463, -1852307, 23321, 3184239, 3896850, 1064208, -1717056, -1197217, 1574619, 3827225, 4773936, 5011530, 4692738, 4205782, 4643887, 5846001, 5876701, 4088555, 2697436, 3576593, 5549170, 6772844, 7650240, 9093394, 9978100, 8984222, 7148260, 5761594, 3545660, -746703, -4478841, -3881840, 55747, 2527214, 1682929, 446145, 1106597]
6289A106597J106218q1162k39400O08613J61692j140545o37612J130003N29964
6280B544368k892786m966900l295577r04841j154186k537988j684442Q99841J656899
6271a2335612l92344k060373l83597L582451O256737N672468L156546J188208
6263D684484M70818k26756j564075k213345q06850J630590K682612J642070M9548
6254F349096q42663j439075k202473k345398j120399O84824J598851J180121J11591
6245A974475q32387j195707o97765N76566J969624K609692J953455J21660j903756
6236D575857k711512j854302n87743k86092m41300L95794J869981J929692J13755
6227C004130j285890m18945J520800K284183J584194M15501j207697l583943n278550
$$ y = [1106597, 2212815, 2131653, 1892253, 2500866, 2662558, 1522013, 884401, 2014404, 2544368, -348418, -5315318, -8610895, -9515736, -10669922, -13207910, -14892352, -13992511, -12335612, -12727956, -14788329, -15171926, -11589475, -5332738, 339730, 3496276, 4684484, 5155302, 4928546, 3364471, 1151126, 344276, 1974866, 4657478, 6299548, 6349096, 5506433, 4067358, 1864885, -480513, -1600912, -916088, 682763, 1862884, 1974475, 1142088, -53619, -751384, -174818, 1794806, 4404498, 6357953, 6479613, 4575857, 1864345, 10043, -577700, -863792, -1305092, -909298, 960683, 2890375, 3004130, 1718240, 1299295, 2820095, 5104278, 6688472, 7103973, 5896276, 2312333, -2966217]
6218b966217m292947j200783J160299J457014J292775K275344L511286L042399
6210D279170M80375k728719m701287m175389j361266J525491J827764m54565k244071
6201g552497j204984J108450J423325p51405k649336k064493J71040J869211K106713
6192g543976J427153N60543o0900p1620O13774J407387J405472K90074j195588
6183c167681j692902m06106J822964K884965J504696j081823k304532j205836
6175c646255O44420J433167J225747J035411P50125n72433k555578l165429j148210
6166e999035K085442L823995K939512P88121n19625q9054J443252K796596K880878
6157A0150082J277564j393534l532479l527394j132141K070148L746814K579854
$$ y = [-2966217, -7259164, -8459947, -7299648, -5842634, -4549859, -2274515, 1236771, 4279170, 4759545, 2030826, -2670461, -6845850, -8207116, -6681625, -4853861, -5308426, -7552497, -8757481, -7649031, -6225706, -6977111, -9626447, -11690940, -11519900, -9650689, -7543976, -6116823, -5556280, -5617180, -5688800, -5075026, -3667639, -2262167, -1972093, -3167681, -4860583, -5266689, -3443725, -558760, 945936, -135887, -2440419, -3646255, -3001835, -1568668, -342921, 692490, 1442615, 870182, -1685396, -4850825, -5999035, -3913593, -89598, 2849914, 3638035, 3118410, 3029356, 4472608, 7269204, 10150082, 11427646, 10034112, 6501633, 2974239, 1842098, 3912246, 7659060, 10238914]
6149A0238914p11193l809887m437074k179381R40956K094261L88862k098909k522082
6140b095533m43840J789176J985339O21537k43676K9798l513j367265k785845
6131b513822k377253n05389N96159R8092j78435J351480L311651L121765P20138
6122C624386j367566j537575p11052q7493O01723J548061J488762l89542k471493
6113F98211k571425r52252M03762Q49107J255477J552277N70025j371058k091734
6104a657610o15457J380159K160314K132994K238089J915515L80992j366997j718650
6095D849349r18944o25106j380631k090334j866093j009099j05747O71094J147332
6086a328179R55471Q4859q93028j333282j009235j70891P03163J360919J938208
$$ y = [10238914, 9527721, 5717834, 1280760, -898621, 42335, 2136596, 2525458, 426549, -2095533, -2539373, -750197, 1235142, 1856679, 1613003, 1642801, 1639288, 272023, -2513822, -4891075, -5396464, -4800305, -4702213, -4880648, -3529168, -217517, 2904248, 3624386, 2256820, 719245, 8193, -79300, 522423, 2070484, 3559246, 3169704, 698211, -1873214, -2825466, -2421704, -1572597, -317120, 1235157, 1805182, 434124, -1657610, -2273067, -892908, 1267406, 3400400, 5638489, 7554004, 7934996, 6567999, 4849349, 3930405, 3305299, 1924668, -165666, -2031759, -3040858, -3146605, -2475511, -1328179, -372708, -287849, -1180877, -2514159, -3523394, -3694285, -2991122, -1630203, 308005]
6077C08005K317890J735802J7837j166769j6701K307431K465035l93839l063193
6068D511498k832179j227136r92256j547494o00005J248858J309558k77019l36604
6059g42779K128999M143261L376346J380134M79158J83816j048041k559837k561202
6050D779855j220185l19444m52780o37839m75502q17520j997068k777058j771355
6041e688896N92939K109712J054506j590647k794215r72718J885919K780072J644584
6032i78744Q34866J086571O76410r22068j517192J20362J643902M74499k187372
6023g68766l280913k385598j479102j110784R4335K204340L195942K076762M32054
6014a021730j26123j60484r01161k013540k208533j216155O167N89120M62344
$$ y = [308005, 2625895, 4361697, 4379534, 3212765, 3196064, 5503495, 7968530, 7574691, 4511498, 1679319, 452183, -540073, -2087567, -2687572, -1438714, -129156, -406175, -742779, 1386220, 5529481, 8905827, 10285961, 10765119, 10948935, 9900894, 7341057, 4779855, 3559670, 3240226, 2787446, 2149607, 1674105, 856585, -1140483, -3917541, -5688896, -5095957, -2986245, -1931739, -3522386, -6316601, -7289319, -5403400, -2623328, -978744, -143878, 942693, 1619103, 697035, -820157, -699795, 944107, 1418606, -768766, -4049679, -6435277, -7914379, -9025163, -8930828, -6726488, -3530546, -1453784, -1021730, -1147853, -1308337, -2209498, -4223038, -6431571, -7647726, -7641559, -7052439, -6590095]
6005f590095P1477k4687M73531J235780J564374J297404J076323J356328J509051
5996A969486M91955j588100l119069k619235n65711J007012R49284L63600Q78702
5987b232076K178080K439204J023445p19025j557941j773070j792515r58615J146878
5978b245635L210434L379272J422345j240065l049942l106880j435908M98871
5970b567508N87873j297105k457025p25373K232191K918752P04056j683274k188954
5961d476367j599384j281269j077551n43289l75469j004544j016275J109912M099089
5952f165147M620745J520346k026103j934280J588264L897649J648589k820658
5944C29405m506701k146347Q93432J912424J900984K288935J982226p261j644344
$$ y = [-6590095, -6518618, -6543305, -6069774, -4833994, -3269620, -1972216, -895893, 460435, 1969486, 2461441, 873341, -2245728, -4864963, -5430674, -4423662, -3474378, -3110778, -2232076, -53996, 2385208, 3408653, 2689628, 1131687, -641383, -2433898, -3392513, -2245635, 964799, 4344071, 5766416, 4526351, 1476409, -1630471, -3066379, -2567508, -1979635, -3276740, -5733765, -6459138, -4226947, -1308195, -604139, -2287413, -4476367, -6075751, -7357020, -8434571, -8977860, -9353329, -10357873, -11374148, -10264236, -6165147, -1544402, -24056, -2050159, -3984439, -2396175, 1501474, 3150063, 329405, -4177296, -6323643, -5430211, -3517787, -1616803, 672132, 2654358, 2647097, 1002753]
5935A002753p47308J073675Q36471p70977o38336J161871J282146j113688k728312
5926f41705j510356K44384J28331m37602Q93726L165280L726839K390583J188413
5917I147893R82149P67959j56587j288672j860790j305335N93842K731079K779221
5908A2390759r2985l276216l314552k75538K098407Q84151k544278m128995j825911
5899h5158J841732K462455q58759l910436k518324J790273L748681J590085r78273
5890C082276p26900Q23225J045311P03649J615152K377473M26036k927116l562132
5881B856974n25694K584914K728936R89737J22557P80375J295565n8877l134463
5872G640024n442015m080699O22448M308229L320067o44856k998891k514336j977138
$$ y = [1002753, 255445, 1329120, 2165591, 1394614, 756278, 1918149, 3200295, 2086607, -641705, -2152061, -1907677, -1779346, -2216948, -1323222, 1842058, 5568897, 7959480, 9147893, 10130042, 10898001, 10741414, 9452742, 7591952, 6286617, 6880459, 9611538, 12390759, 12297774, 9021558, 5707006, 5431468, 7529875, 8414026, 5869748, 1740753, -85158, 1756574, 4219029, 3360270, -550166, -3068490, -1278217, 2470464, 4060549, 3082276, 2355376, 3178601, 4223912, 4927561, 6542713, 8920186, 9346222, 6419106, 2856974, 2331280, 4916194, 7645130, 8634867, 8757424, 9537799, 10833364, 10774487, 7640024, 2198009, -1882690, -1260242, 3047987, 6368054, 5723198, 2724307, 209971, -1767167]
5863a767167k908442l356830j760472M46598J590447K157797K692452K056123
5855h49494m0677j200221L83930K681164K581973M77427p57788l48437j39903
5846B787974q99514j150109j30630P36394L36131k78582J64588Q96995L37259
5837B800506j296688k098469r52714J223937K733337K691570J205291j159490
5829E147280l410435m123775k486879L39469J740488L20542k350922l522003k499788
5820a0846023j000017l13651L60309K050364L856728M108565L012749K473729
5812C702753L188599L469626J712542j102679k636183k403085k216921l118980
5804E95672l416700j112098K582824M084384J955207j190049k067122m60044J575258
$$ y = [-1767167, -4675609, -8032439, -9792911, -9346313, -7755866, -5598069, -2905617, -849494, -890171, -2090392, -1706462, 974702, 3556675, 4034102, 3276314, 2927877, 2787974, 1888460, 738351, 607721, 1344115, 1680246, 1401664, 1566252, 2463247, 2800506, 1503818, -594651, -1547365, -323428, 2409909, 5101479, 6306770, 5147280, 1736845, -2386930, -4873809, -4534340, -2793852, -2473310, -4824232, -8346235, -10846023, -11846040, -12159691, -11799382, -9749018, -5892290, -1783725, 1229024, 3702753, 6891352, 10360978, 12073520, 10970841, 8334658, 5931573, 3714652, 595672, -2821028, -3933126, -1350302, 2734082, 4689289, 3499240, 1432118, 972074, 2547332]
5795B547332K750024L000253K012138l43290k380139j805507R61304K652333J096496
5786A0490944k293113m697164m978666l732487j838961k10831K58729j56837J72745
5777f985641K035112L761153L054343j05411l428642m689261l316527l63439K144004
5768g894309K552095J288681N17531J178475J489225k02441k254626j609006J630773
5759c303602L892861K757489j85106j895890j585303o66961k41129j06160J06722
5750a227079K1125r63716k623541l633448k605220L09290L133202L974354L055062
5741e59971K137840K110999K152744J389018K23911n13727p94298j010376j094888
5732D041252q47546o14952p90531j053740r96162j059628j670712j781355Q336
$$ y = [2547332, 5297356, 8297609, 10309747, 9966457, 7586318, 5780811, 6742115, 9394448, 10490944, 8197831, 3500667, -1477999, -5210486, -7049447, -7260278, -7001549, -7158386, -6985641, -4950529, -1189376, 1864967, 1759556, -1669086, -6358347, -9674874, -10038313, -7894309, -5342214, -4053533, -3536002, -2357527, -868302, -1070743, -3325369, -4934375, -3303602, 589259, 3346748, 3161642, 1265752, -319551, -986512, -1227641, -1333801, -1227079, -1205954, -2169670, -4793211, -8426659, -11031879, -10722589, -7589387, -3615033, -559971, 1577869, 3688868, 5841612, 7230630, 7454541, 6940814, 6146516, 5136140, 4041252, 3193706, 2578754, 1788223, 734483, -261679, -1321307, -2992019, -4773374, -4765038]
5723d765038K638837L021229M95154j250146Q72229M031151K764946k675546n695512
5714e62696k637221J693383J239554k158079k009304K367069M825889K068207
5706D826802j726690j965479m7965N24966P4833O49571J268267j56033k261060
5697A187212k137248m75617m90071k480861l610402k677371j127580M23971K561200
5688h826767L949067K240038j228430j951695J268203M384322M189252K360144
5680F384134J391432M13343k034163m255573l749264j115924J264671K544337
5672H42993K850618J584506q62075j717711O19282L261715K392707j133779l137730
5663D700526k048630O657J311160J975627J449881j403852n040896n659558k316006
$$ y = [-4765038, -2126201, 895028, 1390182, 140036, 1012265, 5043416, 7808362, 5132816, -562696, -3199917, -1506534, -266980, -2425059, -4434363, -2067294, 2758595, 4826802, 3100112, 1134633, 1086668, 1611634, 1686467, 2336038, 3604305, 3448272, 1187212, -950036, -1425653, -1915724, -4396585, -8006987, -10684358, -11811938, -11387967, -8826767, -4877700, -2637662, -3866092, -5817787, -4549584, -165262, 4023990, 6384134, 7775566, 8188909, 6154746, 1899173, -1850091, -2966015, -1701344, 842993, 3693611, 5278117, 4416042, 2698331, 3317613, 6579328, 8972035, 7838256, 4700526, 2651896, 2658553, 3969713, 5945340, 7395221, 5991369, 950473, -4709085, -7025091]
5654g025091J292364J752997J62638l90300N53756R96927M376j275632j804424
5645e732389j974726k332932k202192n05127K284626L947945K962380O53606l33760
5636c232569L10826J87283j875609l566789k435232K89277J619451J363118J902744
5627e437500L856129M884723L223507p949k637200l617528k908093j105922K61406
5618c488427j38990j507582j726903l75090Q74872J000320O18201R691j252211
5609e986119k080042k17157L791574N750940L032987j553067l408097j840160
5601b509141L65367J521897K234522K754894K154329M39021p91304m99512M63648
5592F133721P51916J41911o88027j162976j202429j119498j331723j868437k192648
$$ y = [-7025091, -5732727, -3979730, -3817092, -4207392, -3653636, -2656709, -2652333, -3927965, -5732389, -7707115, -10040047, -12242239, -12747366, -10462740, -6514795, -3552415, -2898809, -3232569, -2921743, -2734460, -4610069, -8176858, -10612090, -10322813, -8703362, -7340244, -5437500, -1581371, 3303352, 6526859, 6518910, 3881710, 264182, -2643911, -3749833, -3488427, -3627417, -5134999, -6861902, -7236992, -6362120, -5361800, -4743599, -4733908, -5986119, -8066161, -8283318, -4491744, 1259196, 4292183, 2739116, -668981, -2509141, -2143774, -621877, 1612645, 4367539, 6521868, 6960889, 6169585, 5670073, 6133721, 6885637, 7027548, 6339521, 5176545, 3974116, 2854618, 1522895, -345542, -2538190]
5583b538190j743274n10393J006171K067899J993318Q68480n0510L84742J405163
5574B883406J023811j043449k554305j711272K73454Q24514n60133j790056q29885
5565c483915K028983M491333M494152K331918M86818P42211J795191R61130j966865
5556A1880956m371900m570494l776337l408121k599621j02588K914819M084586
5548E1300L120928J985448J920145J868032L03568k181837k992736p15760K247970
5539E607058J917231j697194l591811n41315L525740K770304j654469l203913
5531C131631k8298K621285J158727j485161k218502k702705m193306l554904N31884
5522f739349K919440k65597m018576j772835L598871M250535R1553j892435J78902
$$ y = [-2538190, -4281464, -4791857, -3785686, -1717787, 275531, 1144011, 1093501, 1478243, 2883406, 3907217, 2863768, 309463, -1401809, -1128355, -303841, -863974, -2654030, -3483915, -1454932, 3036401, 7530553, 9862471, 10349289, 11091500, 12886691, 13847821, 11880956, 7509056, 2938562, -837775, -4245896, -6845517, -6948105, -4033286, 51300, 3172228, 5157676, 7077821, 8945853, 9249421, 7067584, 4074848, 3359088, 5607058, 7524289, 5827095, 2235284, 1693969, 5219709, 7990013, 6335544, 3131631, 3103333, 5724618, 6883345, 5398184, 3179682, 476977, -3716329, -7271233, -6739349, -3819909, -4085506, -8104082, -9876917, -6278046, -2027511, -1935958, -3828393, -3649491]
5513c649491R45088j572887k364798J175262M332917L008079k29610j733148k382825
5504b471413l623967l364176k49221K505868J989424M99532J355569L169743K542671
5495B354030k14413k028931j700031l11274J118424J786686R04722o57606r36272
5486C15335n18977k190203n336924n209813l77100L872241L161017M34114M33768
5477e416542K199483K219040J187088J824767K937389J563395j157747j884148
5469C472725r10702p53100r48153J88606P47645j741999m329334k337219K248274
5460d363257L097305l75316k469139q00966R60428Q08959J346501L156818K476376
5451C837709j639076m314271k422668N90181R68192L05070J090444J684594J27372
$$ y = [-3649491, -2704403, -4277290, -6642088, -5466826, -1133909, 1874170, 1644560, -88588, -2471413, -6095380, -9459556, -9708777, -7202909, -5213485, -4713953, -3358384, -188641, 2354030, 2139617, 110686, -1589345, -1900619, -782195, 1004491, 1909213, 1251607, 315335, -203642, -2393845, -7730769, -12940582, -13317682, -9445441, -6284424, -5850310, -5416542, -3217059, -998019, 189069, 2013836, 4951225, 6514620, 5356873, 3472725, 2562023, 1808923, 860770, 1049376, 1797021, 55022, -4274312, -6611531, -4363257, -1265952, -1641268, -4110407, -4911373, -3950945, -3141986, -1795485, 1361333, 3837709, 2198633, -2115638, -4538306, -3948125, -2979933, -2674863, -1584419, 100175, 227547]
5442B27547j402459m93375Q60246M3744j087506M71892L322385M071514K894971
5433H908959K103119J302518j212857l868735l537988r67348J95151o46140n94455
5424A682224J172026J871605O0503j807503j315153M35456J003296N8886j021567
5415B139773j474224j551249j501403j255587o75430M36683K146768L910887M673986
5406F850204L681282J162870j589473k905300k187903q00827o06752j482825j563011
5397E58265k91791M73685o17500k016583j300736J537478M313565N297303M294920
5388A2248606J959658n53663j919749j924763j819869k376233k568430j473189
5380A572368l10696p08408j691915o55079K674025N344654M951392K694132J488310
$$ y = [227547, -1174912, -1668287, -808041, -764297, -1851803, -1379911, 1942474, 6013988, 8908959, 11012078, 12314596, 11101739, 7233004, 3695016, 2727668, 2922819, 2276679, 1682224, 2854250, 4725855, 4786358, 2978855, 1663702, 2099158, 3102454, 3161340, 2139773, 665549, -885700, -2387103, -3642690, -4318120, -3881437, -1734669, 2176218, 6850204, 10531486, 11694356, 10104883, 7199583, 5011680, 4210853, 3604101, 2121276, 558265, 266474, 740159, 122659, -1893924, -3194660, -1657182, 2656383, 7953686, 12248606, 14208264, 13654601, 11734852, 9810089, 7990220, 5613987, 3045557, 1572368, 1261672, 553264, -1138651, -1793730, 880295, 6224949, 11176341, 13870473, 15358783]
5371A5358783J876946J335850k041395o296267p380227m132915Q3367J593013
5363C97155P43056L92548J397797K125275J836997J604769J684301R01763o90079
5354A0393582j386953j002963j557155l470419m067791j807522P55444O68795
5346a474982j069576j553225m52891M26946O63131J308187K231236K047925M67819
5337B594570j277918k059668j467169L92199K251769J956437q64114l395585k741758
5328d611237L96161K794066K599773O28097j258077j538621K19029K612707L360510
5319E202408J961522L6464j514879l236066m119210j493869L851514O204811K204369
5310I097064l516132m277554m98317J939531O75859j107299r15468J22108Q74735
$$ y = [15358783, 17235729, 18571579, 16530184, 10233917, 2853690, -1279225, -1195858, 397155, 1140211, 1532759, 2930556, 5055831, 6892828, 8497597, 10181898, 11083661, 10393582, 9006629, 8003666, 6446511, 2976092, -1091699, -2899221, -2143777, -1474982, -2544558, -4097783, -4550674, -4123728, -3460597, -2152410, 78826, 2126751, 2594570, 1316652, -743016, -2210185, -1817986, 433783, 2390220, 1526106, -1869479, -4611237, -4215076, -1421010, 1178763, 1806860, 548783, -989838, -770809, 1841898, 5202408, 7163930, 7200394, 5685515, 2449449, -1669761, -3163630, 687884, 6892695, 9097064, 5580932, 1303378, 805061, 2744592, 3420451, 2313152, 1397684, 1519792, 2394527]
5301B394527K066929L567477L649603J926447m4145j502525k877056l481010k089145
5292C611102K27590J167526R10113J296796J790136L37003k047835k201876m73937
5283D616618n24132k813620l445585p74523J956636K331806K020463K142593N72084
5274F082340l136879m972358k310066J503578K148731L24700q80629j074302j172249
5265c487134l21948J681077K055603n97921k644411p33002K221187J574737j218839
5256a470651j259341J350277K260470R58386J045839K439513P51944l957219n183932
5247c064714j28544M664898K726784k489452l272185M54853J991041q43236k713295
5238b673850k17769K371392L19548l561451l145893J455027M121615J957404j047828
$$ y = [2394527, 4461456, 8028933, 11678536, 13604983, 13560838, 12058313, 9181257, 5700247, 3611102, 3838692, 5006218, 5916331, 7213127, 9003263, 9340266, 7292431, 5090555, 4616618, 4092486, 1278866, -2166719, -2941242, -984606, 1347200, 3367663, 5510256, 6082340, 2945461, -2026897, -4336963, -2833385, -684654, -359954, -1240583, -2314885, -3487134, -3809082, -2128005, -72402, -670323, -3314734, -4047736, -1826549, -251812, -1470651, -2729992, -1379715, 880755, 1839141, 2884980, 5324493, 6076437, 2119218, -3064714, -3193258, 1471640, 4198424, 1708972, -1563213, -1108360, 882681, 39445, -2673850, -2891619, -520227, -200679, -3762130, -6908023, -5452996, -1331381, 626023, -421805]
5229d21805q72642P04832K6161k151591k232617J62656J788468R28368o40863
5220b709033j058384o53432k42002K10711N97522O11937J000090K509064L573520
5211C839993J981242j001265j690306K26016R92063q23853j725570M88054K381260
5202D667634N49956k169218j055651K517323K942748r01063m172828l472077q91182
5193a984358M38849P42818J642414K797456K676550R53956j472716l656527m667060
5184b528618l541822k71269L593504N851870N114886J763193k004130l655247
5176D322367k620594n58456J049369K183368K459285L30513l833964o051403l352218
5167f071733J188381J829427j804084m109675j576153K536299L457370J528117
$$ y = [-421805, -1294447, -589615, -563454, -2715045, -4947662, -4785006, -2996538, -2068170, -2709033, -3767417, -4420849, -4662851, -4452140, -3854618, -3242681, -2242591, 266473, 3839993, 5821235, 4819970, 3129664, 3355680, 4347743, 3523890, 1798320, 2286374, 4667634, 5217590, 3048372, 1992721, 4510044, 7452792, 6551729, 2378901, -1093176, -1984358, -1545509, -802691, 839723, 3637179, 6313729, 7267685, 5794969, 2138442, -2528618, -6070440, -6341709, -2748205, 3103665, 8218551, 9981744, 7977614, 4322367, 1701773, 1143317, 2192686, 4376054, 6835339, 7165852, 3331888, -2719515, -6071733, -4883352, -3053925, -4858009, -8967684, -10543837, -8007538, -4550168, -3022051]
5159c022051O66193K182721L311004J508440k205049m704288m246192j922533
5151h431755r8260K47423M08256J903746L971780M207138J864329p71999j173979
5142B126679K03922P60508n46405j833130j138134O40783J085347P5709K92738
5133A668017L132836N936928N168867J293103j918820k607929k635924l726514
5125F310564m631941l612366j462920j05584J93014J60999n74131k571947m285390
5116a0579702l145882P77071M009020L429511J8579k017490o4593L467809L745205
5107c60472q7981l120670j179133K988516L617320O17870p29270J172791J562805
5098D481776k152380n174724k777355J849381K538013n34367k250842j025795
$$ y = [-3022051, -2355858, -173137, 3137867, 4646307, 2441258, -2263030, -6509222, -8431755, -8530015, -8282592, -7874336, -5970590, -1998810, 2208328, 4072657, 3300658, 2126679, 2330601, 3091109, 2544704, 711574, -426560, 214223, 1299570, 1375279, 1668017, 4800853, 10737781, 15906648, 17199751, 15280931, 12673002, 10037078, 6310564, 1678623, -1933743, -3396663, -3502247, -3309233, -3148234, -3722365, -6294312, -10579702, -13725584, -12948513, -8939493, -5509982, -5491403, -7508893, -7573486, -4105677, -360472, -448453, -3569123, -4748256, -1759740, 1857580, 2475450, 1746180, 2918971, 4481776, 2329396, -2845328, -5622683, -3773302, -1235289, -1769656, -4020498, -5046293]
5090e046293O6649m17013n23669N88818J242071P61639M16703O01934N71066O97383
5080a040712J473685J065592k000277m593793k402572K763114M642550J951051
5072A858638K29565K745557N433293L760259m63923k823541k797064k538691k261221
5063C142872r42864M35643J97400p61245l07550J209291J552574M11463j20162
5054D817422J016996K149552J288109j112406k736499k385659j510152k101340
5046e73977l510125l069134l66382J480819N82551j84400K474324O317090O159636
5037I310402J568017k565565l175107k175515j741445j117338J41131L6628k170653
5028a889445l505794j357456K454372M272069L329281J646438Q53229J110361
$$ y = [-5046293, -4979644, -5396657, -5920326, -5331508, -4089437, -3327798, -2911095, -2309161, -1738095, -1040712, 432973, 1498565, -501712, -5095505, -7498077, -4734963, -92413, 1858638, 2088203, 4833760, 10267053, 14027312, 13563389, 10739848, 7942784, 5404093, 3142872, 2200008, 2635651, 2833051, 2071806, 1764256, 2973547, 4526121, 4937584, 4817422, 5834418, 7983970, 9272079, 8159673, 5423174, 3037515, 1527363, -573977, -4084102, -7153236, -7519618, -6038799, -5456248, -5640648, -3166324, 3150766, 9310402, 10878419, 8312854, 5137747, 2962232, 1220787, 103449, 244580, 281208, -1889445, -5395239, -6752695, -4298323, -26254, 3303027, 4949465, 5802694, 6913055]
5020F913055J834609J846411N41l038069m804779l807693j226339O87412P43868
5011h50984p23490k084126j308642J671398M023039L375769J156688J31129P3414
5002E464195p22450j169289Q14866L211862J934653k204953m153881k608472j419608
4993h53077k130323j569429J215359K177544n80285k916658j510308Q77581Q38953
4984d450643j72085J73139N83086n9962O64143L610001M471447N88519l207491
4975B200154j534368K665656K692382j466911l972483k465465p2289Q93477J274263
4966B14416J465402O63742l20097J20554R46501j90859k483836k629048J34936
4957b078289K932637L189421J101700j523868k878017k273998j123859j495215
$$ y = [6913055, 8747664, 10594075, 10594616, 7556547, 2751768, -1055925, -2282264, -1594852, -850984, -1574474, -3658600, -4967242, -3295844, 727195, 4102964, 5259652, 5390781, 5464195, 4741745, 3572456, 4387322, 7599184, 9533837, 7328884, 3175003, 566531, -853077, -2983400, -4552829, -3337470, -1159926, -1740211, -4656869, -6167177, -5289596, -4450643, -4622728, -4449589, -3866503, -3926465, -3262322, 347679, 4819126, 5407645, 2200154, 665786, 3331442, 6023824, 4556913, 584430, -1881035, -1953324, -1059847, 214416, 1679818, 2343560, 2023463, 2144017, 3090518, 2899659, 415823, -2213225, -2078289, 854348, 4043769, 5145469, 3621601, 743584, -1530414, -2654273, -4149488]
4949d149488k733532j880420J461020L915474L496556K211755J672672M87933
4941D481970j537060j421910J565858L329053J473984l61692J234275L645422
4933A2409900L075795N79811j153292k322394l062928j257603K254046K250705
4925A2774040k154329m072088J35040L754410O83031m107775l513165l40577o59675
4916B498912j909963J377434N725367M186259r56063k479658j048066k215551
4908E178671m632387l026293P73874J517158J182583L982600N496038r5050o835692
4899C541502n323898O73022J184819j596711J110627N883108K938983l524761
4891D886691j631275N019569K992251m948969m075460L814941L218428m301178
$$ y = [-4149488, -6883020, -8763440, -7302420, -3386946, 109610, 2321365, 3994037, 4481970, 2944910, 1523000, 3088858, 6417911, 7891895, 7530203, 8764478, 12409900, 15485695, 16065506, 14912214, 12589820, 9526892, 8269289, 10523335, 12774040, 10619711, 6547623, 6682663, 10437073, 11120104, 7012329, 3499164, 3158587, 2498912, 588949, 1966383, 7691750, 11878009, 10921946, 8442288, 7394222, 5178671, 546284, -2480009, -1706135, -188977, 993606, 4976206, 10472244, 10377194, 3541502, -1782396, -1109374, 75445, -1521266, -410639, 5472469, 8411452, 4886691, 3255416, 8274985, 11267236, 6318267, 2242807, 6057748, 9276176, 4974998]
4883D974998k173458P184964M058716r166781q132450O622874N933612j2184208
4875b881733j3340369L154048j7554962r3088662j41845218q0756117M7107036
4868b99205977J17584107Q5678283K5935896J0346441K2477403J7392921l11177
4861b0102103j850939P992489N593411n674892n358631M927421O968291n96865
4853h101818l750281O485J449725k3072K137635N174317J528642m991852m961573
4844a1531792m06070k3159k462958j73116M791814M384369P2644k03087K799822
4835b751533J951104j689808r11314L157446K518123k800873m450711j38106L694101
4826a421571L631083K728233K139567l58243l355659k870575k52516j30190j438342
$$ y = [4974998, 2801540, 9986504, 14045220, 4878439, -3254011, 3368863, 9302475, -2881733, -16222102, -13068054, -30623016, -123711678, -265556896, -346313013, -299205977, -181621870, -95943587, -70007691, -59661250, -37183847, -19790926, -20102103, -21953042, -13960553, -8367142, -14042034, -19400665, -14473244, -7504953, -8101818, -11852099, -11845614, -10395889, -10418961, -8281326, -3107009, -1578367, -6570219, -11531792, -11937862, -11961021, -14423979, -14597095, -9805281, -5420912, -5348268, -5551355, -2751533, -800429, -2490237, -3401551, -244105, 2274018, -526855, -4977566, -5115672, -1421571, 2209512, 4937745, 7077312, 6719069, 3363410, 492835, 240319, 110129, -1328213]
4817a328213L48056L405269J907815k766422l454916M58913K393809M45686l65647
4808A044350J502490J708375n01267l77580K671203L075061o69135k958364j247917
4799D247216k96033k665125l602323J29433M026732L442785Q37368M23640J203271
4790G746964K76328j539523j934977j241256p29995j81192J65260j114243l203906
4781a756540k925583m6397J637844M89516l96544J061725K561130K234048J818518
4772D677717K276658J342431j438230k316742L94842K541108O19411k508088k736094
4763B853013j271991j349708k252419j705611r49235k093955l075094p22678L056575
4754g511103L588801P23249j332358p80901J33283J77964J017672L201795M319200
$$ y = [-1328213, -980157, 2425112, 4332927, 1566505, -1888411, -1429498, 964311, 1409997, 1044350, 2546840, 4255215, 3753948, 3376368, 6047571, 9122632, 8453497, 5495133, 4247216, 3951183, 1286058, -2316265, -2186832, 1839900, 5282685, 6120053, 6543693, 7746964, 8023292, 6483769, 4548792, 3307536, 2577541, 2396349, 2561609, 1447366, -1756540, -4682123, -4728520, -3090676, -2601160, -2997704, -1935979, 625151, 2859199, 4677717, 6954375, 8296806, 6858576, 4541834, 4936676, 7477784, 8097195, 5589107, 2853013, 1581022, 231314, -2021105, -3726716, -4675951, -6769906, -9845000, -10567678, -7511103, -3922302, -3199053, -4531411, -5312312, -5179029, -5001065, -3983393, -781598, 3537602]
4745C537602K675931n3216j306550p78605M5081J4772r43443k249121l155714
4736b213263l192877k263740l43146K256510M249619M243245K678293J536925
4728F951566J569025J409204J51116j082228j219067j016726j392727j697682
4720C672481j153862m69438n11760p82845n97472l45550l21761Q8620P92023M17492
4710G87928j162119j731529M7864K197696K155435K07613j727892k876344l066138
4701e167486j442894J703952L610212K342048q0256o93816j23016p94167k044543
4692b689966j058963J803798K826773O46360j590655j053939Q89970J377448L14395
4683A465221n6786J440296L614739M488644L250135R29182n95232o53941o60823
$$ y = [3537602, 6213533, 6160317, 4853767, 4075162, 4120243, 4135015, 3191572, 942451, -2213263, -5406140, -7669880, -8013026, -5756516, -1506897, 2736348, 5414641, 6951566, 8520591, 9929795, 10080911, 8998683, 7779616, 6762890, 5370163, 3672481, 2518619, 2049181, 1537421, 754576, 157104, -188446, -510207, -421587, 370436, 787928, -374191, -2105720, -2057856, 139840, 2295275, 2502888, 774996, -2101348, -5167486, -6610380, -4906428, -1296216, 1045832, 965576, 271760, 148744, -645423, -2689966, -3748929, -1945131, 881642, 1528002, -62653, -1116592, -226622, 1150826, 1465221, 1408435, 2848731, 6463470, 10952114, 14202249, 15131431, 14536199, 13882258, 13221435]
4674A3221435k245989m915980o554887n887407l400890l17226K089078K657468
4666e354398J366109m7800O6233J057769J055761j27527r75763j002879j438858
4657e401353k753160l400757k026488L93175J770315J631423J590753L022932
4649e173160M828346M300904P49009k607529k124934J072584K013741j193274
4641A865687m473890l889233j426400j159067k251821p49457K889129L769238
4633e425814O53430j455580R96805M536081M086416N19379j165868P64628L048265
4624F557742K479262l51250k588397k495982r50112k93334j514508k662546j399588
4615c218713J005820Q11477k371090m137361j618903J993569K370574O81531J069596
$$ y = [13221435, 10975446, 6059466, -495421, -6382828, -9783718, -10100944, -8011866, -5354398, -3988289, -4036089, -3969856, -2912087, -1856326, -1983853, -2959616, -3962495, -5401353, -8154513, -11555270, -13581758, -13188583, -11418268, -9786845, -8196092, -5173160, -344814, 3956090, 4705099, 2097570, -27364, 1045220, 3058961, 1865687, -2608203, -6497436, -7923836, -9082903, -11334724, -12084181, -9195052, -5425814, -4772384, -6227964, -5231159, -695078, 3391338, 3910717, 2744849, 3509477, 6557742, 9037004, 8685754, 6097357, 3601375, 2651263, 2357929, 843421, -1819125, -3218713, -2212893, -1401416, -3772506, -7909867, -9528770, -7535201, -5164627, -4483096, -3413500]
4606c413500L322438L189528j91295k329339k60351K910231K808082j86j532116
4597D503492k08102J742636J879265K31194j452664j600673n5806J614790J373515
4588H027647r55390l140292l096082j332208K7818M446n52743o14620j61200K49976
4578a542648K83606J00808K08821Q47342J327990O24918r40775j490628M6902
4569e33664K111010K253618K72736j681116j930087r04525J6047l4250j239211
4560a669442k990385l604601j688329J513411K748772R69304o59042J056089M266037
4551e8186M027086o88953m989523m376608m57625J960993J557336J054423J892853
4542g8204K108968L45400j393201j022128Q4704n28040k189006k286284p10814
$$ y = [-3413500, -91062, 3098466, 2907171, 577832, 317481, 3227712, 6035794, 6035608, 4503492, 4295390, 6038026, 7917291, 8148485, 6695821, 5095148, 5039342, 6654132, 8027647, 7072257, 3931965, 835883, -496325, -468507, -464061, -1016804, -1631424, -1792624, -1542648, -1259042, -1158234, -949413, -102071, 1225919, 1850837, 910062, -580566, -533664, 1577346, 3830964, 4103700, 2422584, 492497, -412028, -395981, -430231, -1669442, -4659827, -8264428, -9952757, -8439346, -5690574, -4721270, -5380312, -4324223, -58186, 3968900, 3279947, -1709576, -6086184, -6543809, -4582816, -3025480, -1971057, -78204, 2030764, 2376164, 982963, -39165, 45539, -482501, -2671507, -4957791, -5668605]
4533e668605J70210j69247M21865K456796K967069r0097m076066m789385j756087
4524a0533547J991496M198532M848059M096574J673045j424534l098369k752374
4516a001118j877795j434110n49338J238956K299616J026467j519023k720668
4508d537013j617445L60051J539505J612617J093523K96951o88308j501027j402687
4499d843833J54982K556072L706712J631878k925259o211384m952235q3007L996969
4490f969105M077616J181552j326244j640612o21022L61413J208456K279853K847734
4481A399641J522027j801064n193648o228375m021924J73131L919554N171436
4473e059222L682315J257530J26120P21395J509576J168127J17828n59598p61818
$$ y = [-5668605, -5498395, -5667642, -5245777, -2788981, 178088, 87991, -3988075, -8777460, -10533547, -8542051, -4343519, 504540, 4601114, 6274159, 4849625, 1751256, -1001118, -2878913, -4313023, -4862361, -3623405, -1323789, -297322, -1816345, -4537013, -6154458, -5794407, -4254902, -2642285, -1548762, -1251811, -1940119, -3441146, -4843833, -4688851, -2132779, 1573933, 3205811, 280552, -5930832, -10883067, -10966074, -6969105, -2891489, -1709937, -3036181, -4676793, -5297815, -4936402, -3727946, -1448093, 1399641, 2921668, 1120604, -4073044, -10301419, -14323343, -14150212, -10230658, -5059222, -1376907, -119377, 6743, 728138, 2237714, 3405841, 3523669, 2964071, 2202253]
4464B202253r95801j093547n00685M64838P95427K23629m29533l79615L03970
4455E90936R37981Q11235j47376q98463k16479J385018J818332M41606o25753
4446D097037J74079Q88019r94584l954453m225839j638675J86810k19695k09793
4437e897094J706777K778667O91039k179868k384852n75404L76573K57797P66698
4428d459667J457156M44803j564300j843587j94030O38270n08678j488827m36086
4419g954946J655086K842461K481745Q50177j391050k793286k200670o49446j55490
4410g315419m85295L75759K347534K918196J431660L90482J031479R39390j658409
4401b4623m192583l335015q5412J914467J586922P42159L44631k28864p71538
$$ y = [2202253, 1206452, 112905, -387780, 77058, 872485, 1096114, 666581, 286966, 590936, 1528917, 2340152, 2192776, 1294313, 1077834, 2462852, 4281184, 4722790, 4097037, 4271116, 5159135, 4164551, 210098, -4015741, -5654416, -5467606, -5687301, -5897094, -4190317, -1411650, -720611, -2900479, -5285331, -5860735, -5484162, -5226365, -4459667, -3002511, -2557708, -4122008, -5965595, -6159625, -5521355, -6030033, -7518860, -7954946, -6299860, -3457399, -975654, -125477, -1516527, -4309813, -6510483, -7159929, -7315419, -7800714, -7424955, -5077421, -2159225, -727565, -337083, 694396, 1633786, -24623, -4217206, -7552221, -7637633, -5723166, -4136244, -3394085, -3049454, -3278318, -4049856]
4392d049856k84613O85092O59531J50907J005774K695610K534327L17016o35065
4383C078723J425054L630063K759908p1003j706711j857169k486538l581565l068100
4374a877338p24928J072804J021732N60688J067978J781849J545860N62813o65393
4365D346065k221546l491443k971606p02570R85715O36999l09844k47759R873
4356c966116n49559o03717R82239K095896L06724k664684l274872j801587j296505
4347a0772181j649791J47163L586866M138510P33147j708379Q3506K611520J743208
4338a086431o07496m95439J103836O90573j034453n64444J662730J567528j661788
4329d25384m012954k675885N21418K559088K618753J255575o92275j618358l26545
$$ y = [-4049856, -4334469, -3649377, -2989846, -2838939, -1833165, 862445, 3396772, 3713788, 3078723, 4503777, 8133840, 10893748, 10822745, 9116034, 7258865, 4772327, 1190762, -1877338, -2602266, -1529462, -507730, 52958, 1120936, 2902785, 4448645, 5011458, 4346065, 2124519, -1366924, -4338530, -5041100, -4055385, -3418386, -3728230, -3975989, -3966116, -4515675, -5119392, -4137153, -2041257, -1734533, -4399217, -7674089, -9475676, -10772181, -12421972, -12274809, -8687943, -4549433, -3816286, -5524665, -5441159, -2829639, -1086431, -1693927, -2189366, -1085530, -394957, -1429410, -1993854, -331124, 1236404, -425384, -4438338, -7114223, -6592805, -4033717, -1414964, -159389, -851664, -2470022, -2796567]
4320b796567J762836K082533O93140j07175K01645p3223j175071j305833k37818
4311i55533p946j069318j137868Q32266K655860K423678J220134P56581P79214
4302E497068M28888M4782J76057N66645J029315J531730J106530r92799k983508
4293F404708k414478m83267p60863l066895l107298L24631K666403P85674j791263
4284a442648o84196K235430K237444o10931k254818j432637o34501r24016m58904
4275c969777J499874K957262K372761N89620j070278k225028k504174j478005
4267c827745k3905K50707n54568o10305P24291J738490R10054q39650j456091
4258c688722m45638P54215Q40203K96999O36120K208447L460597K841103Q36384
$$ y = [-2796567, -1033731, 1048802, 1741942, 1634767, 1836412, 1763189, 588118, -717715, -955533, -963479, -2032797, -3170665, -2338399, 317461, 2741139, 3961273, 4717854, 5497068, 5925956, 5970738, 6146795, 6713440, 7742755, 9274485, 10381015, 9388216, 6404708, 3990230, 3506963, 2746100, -320795, -3428093, -3103462, -437059, 348615, -1442648, -2126844, 108586, 2346030, 1735099, -519719, -1952356, -2586857, -3510873, -3969777, -2469903, 487359, 2860120, 3449740, 2379462, 154434, -2349740, -3827745, -3851650, -3600943, -4155511, -4765816, -4041525, -2303035, -1392981, -2232631, -3688722, -4134360, -3380145, -2539942, -2242943, -1606823, 601624, 4062221, 6903324, 7739708]
4249G739708q04813j381246j520972j520878j002266j88645J24793N3412N13449
4240B012542J464209J800617J083335j72682j772695l590444m333338k781072
4232f289528j65598J000053M16370l2395M29565Q26962P86411O83954r8898j867625
4222d310729k280866P58470M517119M371193R74548p74826J66379Q9946j673661
4213A837573j135058K237144L027095j177123n096462m186454j532107j589581
4205g614973k782900j644712O71182J478059J791590L229762L780966J760362
4197F69336q983J048208K338164Q54497j255534q51525O06752N45179J36077R36600
4187E018771J187193k2258m6587J470292L12983l927194m652310O75909M525914
$$ y = [7739708, 6934895, 5553649, 4032677, 2511799, 1509533, 1320888, 1445681, 1499093, 2012542, 3476751, 5277368, 6360703, 6188021, 4415326, 824882, -3508456, -6289528, -6455126, -5455073, -5038703, -5071098, -4641533, -3814571, -3028160, -2344206, -2443104, -4310729, -6591595, -5833125, -1316006, 3055187, 4029735, 3254909, 3421288, 3511234, 1837573, 702515, 2939659, 5966754, 4789631, -306831, -4493285, -6025392, -7614973, -10397873, -12042585, -11371403, -9893344, -8101754, -4871992, -1091026, 669336, 660353, 1708561, 4046725, 4901222, 3645688, 2794163, 3400915, 3946094, 4082171, 5018771, 6205964, 6183706, 6137119, 7607411, 7920394, 3993200, -659110, 16799, 4542713]
4178D542713J489353k327132n98264J779774j307856m970964k746946P21948p24508
4169d141882j643719M130255Q776906L165876m672020k254115M701243L003401
4161A1065945k911569j85234N830953J360620n817554K127777J5953563J1483003
4153C8907504j017689J4850193N3213542N5840370k792261o5314368o5778678
4146B7908613j9342080Q697894j744470j3741766m623809N608066O16294n232415
4138a853673L13227M955077j267006o312039q7924O372762K060443m342336j884934
4129b046403L225267J172059l506779k428543R05310j12603j800801J246888M077714
4120G32109M44460m745913l936235k7853L12317q60897J820074N579486M503520
$$ y = [4542713, 6032066, 3704934, 3106670, 4886444, 3578588, -1392376, -4139322, -3417374, -4141882, -5785601, -1655346, 7121560, 10287436, 5615416, 3361301, 8062544, 11065945, 8154376, 7969142, 13800095, 15160715, 9343161, 11470938, 27424501, 38907504, 37889815, 52740008, 105953550, 161793920, 159001659, 93687291, 27908613, 8566533, 17264427, 15519957, 1778191, -2845618, 2762448, 3378742, -1853673, -1540446, 3414631, 2147625, -4164414, -4252338, 2120424, 4180867, -161469, -2046403, 1178864, 2350923, -1155856, -3584399, -2679089, -2791692, -4592493, -3345605, 732109, 1176569, -3569344, -7505579, -7533432, -7221115, -8082012, -6261938, -682452, 3821068]
4111C821068P09681J16477J604075K03120k892887k871368n07619j11304j196055
4102a124812l06763J519653P80349j435524j578594m86986j262536k595154r97128
4093g487495K203996K650512K71463j193318o85692k65831k68339O85772J783760
4084b305172R51605j032071j473819l7027J316980J498665N68165j372513k964345
4075d849532j696230K108655M294693K591518n5645p23189q94047k003317j306242
4066b533336K815386N635681K268908l881977n180393n74886L510886K373955
4058D434224j918138m532933l064473J142406M194246K933207j209209l451953
4050a472623k091098n12443j137922j720037k84959J050997O48080P47673K328094
$$ y = [3821068, 4530749, 4647226, 6251301, 6454421, 3561534, 690166, 182547, 71243, -1124812, -1431575, 88078, 868427, -567097, -2145691, -2632677, -3895213, -6490367, -7487495, -5283499, -2632987, -2361524, -3554842, -4240534, -4506365, -4774704, -4088932, -2305172, -1353567, -2385638, -3859457, -3896484, -2579504, -1080839, -512674, -1885187, -4849532, -6545762, -4437107, -142414, 2449104, 2393459, 1670270, 776223, -1227094, -2533336, 282050, 5917731, 8186639, 4304662, -875731, -1450617, 2060269, 4434224, 2516086, -2016847, -5081320, -3938914, 255332, 3188539, 1979330, -1472623, -3563721, -4076164, -5214086, -6934123, -7219082, -6168085, -5520005, -4772332, -2444238]
4041b444238J919730j629002k876386J679469O216575L937153j941363l573382
4033A288556r00357P0626j560088j408034Q38028J078989o70049j41590K557353
4024A153434K432654j440272m089474k926724q21675J64232J265374K162532N26539
4015a573380k248834j636348K113864L346814J67583k396817p44157K147879K680533
4006A857137J850738J474017N63252j351120k022530n78958M43085l65060r38163
3997I32398p1446L20856o40646r46353l3704k04313j639184j145538J715645K706335
3987I94050J21844j589939Q10419L566556J965159k285542m374467l292797r38393
3978e023110K037486M820737M298599n55068m860635l498570J496674M045183
$$ y = [-2444238, -524508, -2153510, -5029896, -3350427, 2866148, 6803301, 4861938, 1288556, 388199, 458825, -1101263, -2509297, -1671269, -592280, -1262329, -1403919, 1153434, 3586088, 2145816, -1943658, -4870382, -5692057, -5527825, -4262451, -2099919, -1573380, -3822214, -5458562, -3344698, 2116, 169699, -2227118, -2971275, -823396, 1857137, 3707875, 5181892, 5745144, 4394024, 2371494, 1792536, 2235621, 1870561, 932398, 860952, 1181808, 541162, -405191, -438895, -643208, -2282392, -3427930, -1712285, 994050, 1115894, -474045, 336374, 3902930, 5868089, 3582547, -791920, -4084717, -5023110, -2985624, 1835113, 6133712, 5578644, 718009, -2780561, -1283887, 2761296]
3970B761296K620599P43537L12638k94077j811376k576067j934211j360801j497488
3961c035950j124030K65597J371871J223059N07669L18772R12250J793678K045128
3952D278044R39248q86439j615339n52947O79511K38222j580263k914794k343356
3943c758113J75765L146740M115465K042058q96011j957048j922653l392701n229668
3934g676166l280666K270125N415551K867034p14479J18836L372519L407733j18049
3925E662438k540334j723013r9243J90813l42589r64837j673408j665651j12458
3916c268282J555328J032817j338492l040664k940923j880106m70418J001332
3908i349408J380847K71663j41946J900730L981487K512343j300494k823773j157572
$$ y = [2761296, 5381895, 6125432, 6438070, 6143993, 4332617, 1756550, -177661, -1538462, -3035950, -4159980, -3894383, -2522512, -1299453, -791784, -473012, 439238, 2232916, 4278044, 5217292, 4330853, 2715514, 2162567, 2842078, 3080300, 1500037, -1414757, -3758113, -3582348, -435608, 3679857, 5721915, 4825904, 2868856, 946203, -2446498, -7676166, -10956832, -8686707, -3271156, -404122, -1118601, -999765, 2372754, 5780487, 5662438, 3122104, 1399091, 1299848, 1490661, 1148072, 183235, -1490173, -3155824, -3268282, -1712954, -680137, -2018629, -5059293, -8000216, -9880322, -10350740, -9349408, -7968561, -7696898, -7838844, -5938114, -1956627, 555716, -744778, -3568551, -4726123]
3899d726123k29352j955764l011861l67418L911095N970432N225428L393042R69410
3890I178889k256569m745870m403224j832880J8835l70983j420660r30100R33623
3881e828939J834090J17060l022224m541719k801918O22454K802817K664335J603697
3872f550347J252712J633715J663232P47714m89669r31124l49569J96504j13008
3863b939840l16127J081809L367314L963497K082908J5189l34378p2714q16286
3854F031372j685763j216942n48847j710989l756921l780190j423762O89931J113389
3845f288722J198098K052524K677890K164800J390741J233220R66229k02493j473788
3836C718499j705128j231520j139212j411929r50046Q13757L044689M192290L331189
$$ y = [-4726123, -4955475, -6911239, -9923100, -10290518, -6379423, -408991, 4816437, 8209479, 9178889, 6922320, 2176450, -2226774, -4059654, -4040819, -4411802, -5832462, -6762562, -5828939, -3994849, -3877789, -6900013, -11441732, -14243650, -13621196, -10818379, -8154044, -6550347, -5297635, -3663920, -2000688, -1252974, -1742643, -2673767, -3023336, -2826832, -2939840, -3255967, -2174158, 1193156, 5156653, 7239561, 7254750, 6920372, 6847658, 6031372, 4345609, 3128667, 2579820, 868831, -2888090, -6668280, -8092042, -7402111, -6288722, -5090624, -3038100, -360210, 1804590, 3195331, 4428551, 5394780, 5192287, 3718499, 2013371, 781851, -357361, -1769290, -2719336, -1905579, 1139110, 5331400, 8662589]
3827H662589J056149r03527j262559l48530N12196M92090j44729n62592k07973
3818G293114L84600l05924k820262m909419l615323K36483K077147k87839l137599
3809e085022k076089J374575K192887l40316j765099L62175K868509K307508J68735
3800G863j39913R94639K60020k858888m649087k226658K341170M584314L110274
3791A423734O12415l81896n26675j315441j799374k37025K006046J624702j304431
3782A02055k732979o36407J893975J639800n1847m72151k61126j103045j432734
3773c054459Q61154L334337J879845k158949l297703m12584J687285L06227j028565
3764a883412J104368M283935M132889N89380k931143m201923l222820p13975J799132
$$ y = [8662589, 9718738, 8815211, 7552652, 7204122, 7716318, 8208408, 8063679, 7501087, 7293114, 7677714, 7371790, 4551528, -357891, -3973214, -3736731, -1659584, -1947423, -5085022, -7161111, -5786536, -3593649, -3933965, -5699064, -5336889, -2468380, -160872, 7863, -132050, 862589, 1122609, -1736279, -6385366, -8612024, -6270854, -1686540, 1423734, 2036149, 1654253, 1127578, -187863, -1987237, -2224262, -218216, 1406486, 102055, -2630924, -3267331, -1373356, 266444, 214597, -257554, -518680, -1621725, -3054459, -2193305, 1141032, 3020877, 861928, -2435775, -2848359, -1161074, -854847, -1883412, -779044, 3504891, 7637780, 8227160, 5296017, 1094094, -2128726, -2842701, -1043569]
3755a043569K159509K16242j232697j39349J820316J963585N13424m75947n40057
3746C241457o47131p15577J91329J644300J919016K81485k131417l642805l519502
3737c378845k474811j952697k235062j605390J086298L612228K820450j74756
3729d302585q39581J913158L788292J951747m44656K13664J830275L93949k893705
3720A610558l444813p05657J426373J111391N52003J102110R40975j142414l294484
3711a843958l407148j672100O72920K653199K998885J008346j364151j134455
3703b088462J224283J943791l75911k520125j658092O00837J347587P35597N22625
3694b67870N73236j65904q61426l2687J471186J607715N11094j5685J82065l84018
$$ y = [-1043569, 1115940, 1332182, 99485, -39864, 1780452, 3744037, 4257461, 3781514, 3241457, 2594326, 1878749, 2070078, 3714378, 5633394, 5914879, 3783462, 140657, -3378845, -5853656, -7806353, -10041415, -11646805, -10560507, -6948279, -4127829, -4302585, -5142166, -3229008, 559284, 2511031, 2066375, 2280039, 4110314, 4504263, 1610558, -1834255, -2539912, -1113539, -2148, 549855, 1651965, 2592940, 1450526, -1843958, -5251106, -6923206, -6250286, -3597087, -598202, 410144, -954007, -2088462, -864179, 1079612, 703701, -1816424, -3474516, -2873679, -1526092, -790495, -267870, 305366, 139462, -721964, -754651, 716535, 2324250, 2835344, 2819659, 3001724, 2617706]
3684B617706j738549k188970j423249j140254j922440k006912k74521J704082
3676f373107K010829J063883M95715P14778J065780J316804J484636J036726k25625
3667B590419j102100k88085J610842K671145K047177O36051m37312q98913j035733
3658E793491j321481k186394l306484l446740j923347K09160J390909J363477
3650c427409O68319o88135k442524k962214j197490R71160J058029J71186J512197
3641f336881M578677M942419J128554k405203j683779J031055J316925n83220
3633A988547j231313k48540l78279k089751k728249j326191j61743n48370n94091
3624g317980J315617L533223L437236R94656j371628j469591P52758L112439L028740
$$ y = [2617706, 879157, -1309813, -2733062, -3873316, -5795756, -7802668, -8077189, -6373107, -4362278, -3298395, -2802680, -2087902, -1022122, 294682, 1779318, 2816044, 2590419, 1488319, 1200234, 2811076, 5482221, 7529398, 8165449, 7728137, 6829224, 5793491, 4472010, 2285616, -1020868, -4467608, -6390955, -6181795, -4790886, -3427409, -2759090, -3447225, -5889749, -8851963, -10049453, -9078293, -8020264, -7849078, -6336881, -1758204, 3184215, 4312769, 1907566, 223787, 1254842, 2571767, 1988547, 757234, 508694, 130415, -1959336, -4687585, -6013776, -6175519, -6723889, -7317980, -6002363, -2469140, 968096, 1962752, 591124, -878467, -125709, 2986730, 6015470]
3615F015470M91774j383120k16128K177883K274305j80608k309221k459398j416144
3606B994813J56399K084532K798276Q00578j929340j923030J49226J80340k452320
3597B859474l612857j498366K42470r37821j865189O98588M042783L590584j49920
3588C369746l070570l394373k053636M34828L235589L548202K11904k827195j268107
3579a813612K790269L631766L40538k638057k800162k131762k049814j033414
3571e704248J365850K684686J589984J06291J8346L12438l5053J41378J530378
3562B010050K222363N89466j854907k774762k469628k688005l235229k206040
3554a0406692P68753L513786L879986K162297M55342J26167N42651M63264K6266
$$ y = [6015470, 6507244, 5124124, 4907996, 7085879, 9360184, 9179576, 6870355, 4410957, 2994813, 3151212, 5235744, 8034020, 8834598, 6905258, 4982228, 5131454, 5311794, 2859474, -753383, -2251749, -2009279, -2947100, -4812289, -4113701, -70918, 3519666, 3369746, 299176, -3095197, -5148833, -4714005, -1478416, 2069786, 2281690, -545505, -1813612, 976657, 4608423, 4948961, 2310904, -489258, -2621020, -4670834, -5704248, -4338398, -1653712, -63728, 42563, 60909, 373347, 338294, 479672, 2010050, 4232413, 4821879, 2966972, 192210, -2277418, -4965423, -8200652, -10406692, -9637939, -6124153, -2244167, -81870, 373472, 499639, 1042290, 1505554, 1531820]
3545A531820K79813R31205L39161j643968k781990j658575J51304P52574P45101
3536a353555J274582J448336M63118J71944J997053L173235M56474l672598l596428
3527C62161Q94903L975176K474979o0966K23544J933077J927836K80219j341906
3518A0669023k842960m090896l144516M71445L148574J470552k586308m168209
3510a073295k065351N37371J057534J22077o82127r71178j046440j008680q52671
3501e982760n76958k87755n46852j703819k489579r25546K448729M208991K447051
3492c408498l08853n53182J446151K707290K064189R44449K53756p91780k519429
3483a65907l602699k649950J11610K919911L630108J385520j936691k812424P6964
$$ y = [1531820, 1811633, 2742838, 3081999, 1438031, -1343959, -3002534, -2851230, -2098656, -1353555, -78973, 1369363, 1832481, 2004425, 4001478, 7174713, 7631187, 3958589, 362161, 1257064, 5232240, 7707219, 7646253, 7869797, 9802874, 11730710, 12010929, 10669023, 7826063, 3735167, 590651, 1062096, 4210670, 5681222, 3094914, -1073295, -3138646, -2601275, -1543741, -1421664, -2103791, -3074969, -4121409, -5130089, -5982760, -6559718, -6847473, -7394325, -9098144, -11587723, -12513269, -10064540, -5855549, -3408498, -3717351, -4270533, -2824382, -117092, 1947097, 2891546, 3145302, 2353522, -165907, -3768606, -6418556, -6306946, -3387035, 243073, 1628593, -308098, -3120522, -3043558]
3474c043558L786677M306609J201847k362619l597933k466081n20516Q18530P50283
3465a126761o11870j994072j958611m71592J090427J544485J021480M82906M43998
3456a579610K85257q86291k456333k313315J55668K084421M46761l111163l866252
3447a1240857q14083J767511R92069k45248J635171M762217M778138J729967m88817
3438B876068n16082p72466k339996k973034j349765L33400j10939j336888n51029
3429f740731K435515N051868N076720K643978m16445k368781k756802k138126
3421G87196r55836O49094J869798J468645k73367j380628j119817j307821k949239
3412c211975l662367j275335J730281J163615k239841l362941k58355L059388
$$ y = [-3043558, 743119, 5049728, 6251575, 3888956, 291023, -2175058, -2695574, -1877044, -1126761, -1738631, -3732703, -5691314, -6162906, -5072479, -3527994, -2506514, -2023608, -1579610, -1294353, -2180644, -4636977, -6950292, -6794624, -4710203, -4263442, -7374605, -11240857, -12054940, -10287429, -9295360, -9540608, -7905437, -3143220, 1634918, 3364885, 2876068, 2359986, 1587520, -752476, -3725510, -5075275, -4741875, -4852814, -6189702, -6740731, -4305216, 746652, 5823372, 8467350, 8050905, 5682124, 2925322, 787196, -168640, 480454, 2350252, 3818897, 3545530, 2164902, 1045085, -262736, -3211975, -6874342, -8149677, -6419396, -5255781, -7495622, -10858563, -11116918, -8057530]
3404h057530K842936Q31645P43020K440445K799634Q43726j151803j365023o73900
3395g46850o68459j126107n22808J536723L395053L210148J260955m60265q55648
3386E022742o16465k04457J145358L180066L461519P19312k273751k116534O5609
3377H383399K92154k065969l642863k781737j717717j958235j540893J002372
3369d029489L377082K909332O15455q04177r60638j129919j376763j004202n50408
3360b953727q61106j248083p36206L1484K06346O22565J954933K553848R68885
3351E38939p22355M90742L426317L918446J095191j365387r85291J83901m56639
3342F123864j964473k042821q96780l05836n07563o36873j093211k631324l666477
$$ y = [-8057530, -5214594, -4382949, -3639929, -1199484, 1600150, 2443876, 1292073, -72950, -746850, -1415309, -2541416, -3064224, -1527501, 1867552, 5077700, 6338655, 5878390, 5022742, 4406277, 4201820, 5347178, 8527244, 11988763, 12708075, 10434324, 8317790, 8383399, 8675553, 6609584, 2966721, 184984, -1532733, -3490968, -5031861, -4029489, -652407, 2256925, 2872380, 2068203, 1107565, -22354, -1399117, -2403319, -2953727, -3814833, -5062916, -5799122, -5767638, -5561292, -4938727, -2983794, -429946, 538939, -183416, 307326, 3733643, 7652089, 8747280, 7381893, 6396602, 6580503, 6123864, 4159391, 2116570, 1219790, 913954, 406391, -230482, -1323693, -3955017, -7621494]
3333g621494j618052K584577M295050J027804l676346m533036j249380J809086
3325h981791K129772J839382L043680L745153J191375k776286l453296K7195L313061
3316G8245K916572M67579o99634l44361j78266n0885J378811K984510J725135
3307H277706k493433n427137l707444L90643J719152p86750k469993O86605N971302
3298B160651O791386J411905m196336l930030N71006K809255O68913j596243p16621
3289C973886J059301P30934m92426l75386l72677k747663n214531l507069J476604
3280e469027M074799J831688j433257j713200J06906J183221J255988J683963
3272A521081K372789K255571J315083J29915j240848k321078j753274N05970K073709
$$ y = [-7621494, -9239546, -6654969, -2359919, -1332115, -5008461, -9541497, -10790877, -8981791, -6852019, -5012637, -1968957, 1776196, 2967571, 191285, -3262011, -3234816, 78245, 2994817, 3462396, 2762762, 2418401, 2240135, 2189250, 3568061, 6552571, 8277706, 5784273, 357136, -3350308, -2959665, -1240513, -2027263, -4497256, -3810651, 2160651, 8952037, 10363942, 6167606, 2237576, 2808582, 5617837, 6286750, 4690507, 3973886, 5033187, 5764121, 5271695, 4896309, 4523632, 1775969, -3438562, -6945631, -5469027, -1394228, 437460, -995797, -2708997, -2602091, -1418870, -162882, 1521081, 3893870, 6149441, 7464524, 7594439, 6353591, 4032513, 2279239, 2785209, 4858918]
3263D858918J081399j131902k036202j191046L01655J949417L224186K456199
3255I512624p35981l191926j730588J799380K629945Q9876j489237L16573K287074
3246I487740Q18782k468061l415809j410631N02550M50112m36582p43153o38633
3237B146315o43568n32123o5771M68643P83229O80415k67490j960063k914740
3228b305153j668502R23684K341627J623790M18367L79360J083015J294867Q71490
3219D962545L69560p2616l75439n8112P56057Q97777n675k96590J383963L316739
3209A0878209K462137j080551l663957k811976l05023P19951O2553p9200R81830
3200G163973J371754k51158k489621l123353k037874r66937r28609j274560j176563
$$ y = [4858918, 5940317, 4808415, 2772213, 1581167, 1882822, 3832239, 7056425, 9512624, 8776643, 5584717, 3854129, 5653509, 8283454, 8373330, 6884093, 7200666, 9487740, 10306522, 7838461, 4422652, 3012021, 3514571, 3964683, 3528101, 2784948, 2146315, 1502747, 970624, 904853, 1373496, 2156725, 2837140, 2569650, 609587, -2305153, -3973655, -3049971, -708344, 915446, 1333813, 1713173, 2796188, 4091055, 4962545, 5332105, 5259489, 4884050, 4825938, 5581995, 6479772, 6474097, 6177507, 7561470, 10878209, 13340346, 12259795, 8595838, 5783862, 5478839, 6198790, 6261343, 6182143, 7163973, 8535727, 8284569, 5794948, 2671595, 633721, -333216, -1261825, -2536385, -3712948]
3191c712948p21759j90575N46509J214663P84181r95380k487872j896727L62486
3182g097422K319440K995943K680178J152193j928484m605523l536996J144824
3174f875847M489008K745896j202204j630330J913242M094401J631481k158528
3166C007119k403796N95786K389495O95761k117558k831375j419840l16467p84166
3157c185041j427521n01326J349898J855162M55657p33367n1451J260432J296056
3148C18499O49491R29068J197566q06042m023227m410862r97471J998581J176826
3139c967571j130521q85842J342472J890628K44872m71881R75177J942136L67388
3130C06858k023806k527595j129901K87010P34669N64286L12916M37491J291818
$$ y = [-3712948, -4434707, -4625282, -4078773, -2864110, -2079929, -3075309, -5563181, -7459908, -7097422, -4777982, -1782039, 898139, 2050332, 121848, -4483675, -8020671, -6875847, -2386839, 359057, -843147, -2473477, -560235, 3534166, 5165647, 3007119, 603323, 1199109, 3588604, 4284365, 2166807, -664568, -2084408, -2400875, -3185041, -4612562, -5113888, -3763990, -1908828, -1453171, -2186538, -2237989, -977557, 318499, 967990, 1897058, 3094624, 2288582, -1734645, -6145507, -7142978, -5144397, -3967571, -5098092, -5983934, -4641462, -2750834, -2505962, -2977843, -2002666, -60530, 306858, -1716948, -4244543, -5374444, -5087434, -4352765, -3788479, -3475563, -3038072, -1746254]
3121a746254K279181J901742k69668k439586k525086p47076P26009M25167r53723
3112c349294j561258l19032J947572L002746J359113j678115k894366p86439K440807
3103a838266L472954J873003J77260K74087J246737J237575R3982q39008p74944
3094D923380j98209K03162L02889K12850N5105K22824J072954K071007K056143
3085A0922105Q61036j27762J82768Q38933R832k428959m637716n045812l673667
3076c099242j214446J762414M178740M418056K067757j030930k512137j891453
3068B678759n03504M78186J052638J659876K310209K551449J874110J91149j817471
3059A0475401l059886l039198k324330j844833j952330k197751j684284J83157
$$ y = [-1746254, 532927, 2434669, 2165001, -274585, -2799671, -3546747, -2820738, -2395571, -3349294, -4910552, -5229584, -3282012, -279266, 1079847, -598268, -3492634, -4279073, -1838266, 1634688, 3507691, 3684951, 3959038, 5205775, 6443350, 6537332, 5698324, 4923380, 4725171, 4928333, 5231222, 5444072, 5499177, 5722001, 6794955, 8865962, 10922105, 11783141, 11655379, 11838147, 12677080, 12686912, 10257953, 5620237, 574425, -3099242, -4313688, -2551274, 1627466, 6045522, 8113279, 7082349, 4570212, 2678759, 2175255, 2653441, 3706079, 5365955, 7676164, 10227613, 12101723, 12292872, 10475401, 7415515, 4376317, 2051987, 207154, -1745176, -3942927, -5627211, -5444054]
3051e444054K690281L880714K644716M20584o22222p89271k109949m276043m240542
3042g845786j080303J748756J326837j95885Q01244L294295L160981p0846k410348
3033a271055j650446k59182p10270j597486n96272J481183K184589J196393J71627
3024a050919o4486j7700N8076L79881O44473K80577n47538j225172j562852j508240
3014d613900o30605J041447K227843J658989p6890r84094J5136J925863K933193
3005C496982K337909J051410K35912k82002j549070l203881k993096P3550L278210
2996B445924L213302O16252p39494L6380k48378l054875m970738k966539M12158
2987e256008P04949j768304k886208j226245N45349N59758Q3607L94554P92296
$$ y = [-5444054, -2753773, 1126941, 3771657, 4192241, 3570019, 2780748, 670799, -3605244, -7845786, -8926089, -7177333, -5850496, -6046381, -5245137, -1950842, 1210139, 1139293, -1271055, -2921501, -3180683, -3890953, -5488439, -6084711, -4603528, -2418939, -1222546, -1050919, -1115405, -1133105, -1075029, -695148, -50675, 229902, -317636, -1542808, -3105660, -4613900, -5244505, -4203058, -1975215, -316226, -393116, -1377210, -1362074, 563789, 3496982, 5834891, 6886301, 7122213, 6840211, 5291141, 2087260, -905836, -832286, 2445924, 5659226, 6275478, 5535984, 5572364, 5323986, 2269111, -2701627, -5668166, -5256008, -4551059, -6319363, -9205571, -10431816, -9886467, -9326709, -9243102, -8848548, -8056252]
2978h056252P82171J257593K257398K218035Q07222p0093L86724J98265j675427
2969a894364k563860j1578L455106L166896q43377l611106k181193P88587J683025
2960b011864R92456J275819K331001J715221o90693k009523q39249M44800o28201
2951E79767k783519l000288j030453N96802O31632N68547J653772K777683K449577
2942B443520J047302k75041j449392k674742k926457j207534J290701K144717
2934a606926P64008r53320j061121N12018K390400K978134J441197j351560l057598
2925E5232k233298j92650Q01443O46206Q25768J166027j68098k965715m095780
2916f160865j826462J339685K197265J302760J354579K452766K119061j80914
$$ y = [-8056252, -7274081, -6016488, -3759090, -1541055, -733833, -803926, -417202, -218937, -1894364, -4458224, -4469802, -1014696, 2152200, 1308823, -2302283, -4483476, -3694889, -2011864, -1019408, 256411, 2587412, 4302633, 3611940, 1602417, 763168, 1207968, 579767, -2203752, -5204040, -6234493, -5637691, -5006059, -4437512, -2783740, -6057, 2443520, 3490822, 3215781, 1766389, -908353, -3834810, -5042344, -3751643, -1606926, -842918, -1796238, -2857359, -2345341, 45059, 3023193, 4464390, 3112830, 55232, -2178066, -2370716, -1569273, -923067, -97299, 1068728, 900630, -2065085, -6160865, -7987327, -6647642, -4450377, -3147617, -1793038, 659728, 2778789, 2597875]
2908B597875j690935n13442J352899Q46656j760117l250220j778421Q64776J579765
2899a751164m85197l225589l968731k110389N63288J906322J535066P98775Q37604
2890e900015J233028R01005j57596p48580q8900J261604K340795K858233K742450
2881D442024J483283q42050k389321j207243J606790K343677n23269l621820k734857
2872a442786J417084L923451K130137j205991k039534j12768J666924J429144
2864E765661j7262j103053j254691o84253K63217J175353J648646J509780P39531
2855H042929n17034j547865j325369J52402J367254J022935k14070p56142m63237
2846E761803o80521j979863l164739k845993j061301R63281J916674J195416n50782
$$ y = [2597875, 906940, 393498, 1746397, 2593053, 832936, -2417284, -4195705, -3330929, -1751164, -2236361, -5461950, -9430681, -11541070, -10977782, -9071460, -7536394, -6737619, -5900015, -4666987, -3765982, -3923578, -4672158, -4761058, -3499454, -1158659, 1699574, 4442024, 5925307, 5083257, 2693936, 1486693, 3093483, 5437160, 4913891, 1292071, -1442786, -25702, 3897749, 6027886, 4821895, 2782361, 2669593, 4336517, 5765661, 5748399, 4645346, 3390655, 2706402, 2969619, 4144972, 5793618, 7303398, 8042929, 7525895, 5978030, 4652661, 4805063, 6172317, 7195252, 6981182, 6225040, 5761803, 5081282, 3101419, -63320, -2909313, -3970614, -3007333, -1090659, 104757, -446025]
2837d46025j628369r77709M09034Q44747N22243J061844K346734J999547r60907
2828C171139l969871m091262j769546M70494J666543K506256K932733K372459
2820C288945J681393J929245J613627j486372n483544n464326q04387K689066
2812b036353O51304l452570l636866k01792J648705L02281p28706L91935J164467
2803e897595K05069N6392K017909K868134L09297k247296p58548K585703K664549
2794A803614l26992j498090N51235J920092M47669j011524l20097o434k313942
2785g54469m482307l099179j57082m5062k180410j624884L079910P239503O340690
2776D316710J596569k498262l562354k421495p05652O11556J195756J393194J807690
$$ y = [-446025, -2074394, -3052103, -2643069, -1798322, -1276079, -214235, 2132499, 4132046, 3171139, -798732, -4889994, -6659540, -6189046, -4522503, -2016247, 916486, 3288945, 4970338, 6899583, 8513210, 7026838, 1543294, -3921032, -4725419, -2036353, -1385049, -4837619, -8474485, -8676277, -7027572, -6725291, -7453997, -7062062, -5897595, -5692526, -5636134, -3618225, -750091, -440794, -2688090, -3446638, -860935, 1803614, 1476622, -21468, 529767, 2449859, 2897528, 1886004, 1565907, 1559473, -754469, -5236776, -8335955, -8493037, -8538099, -10718509, -12343393, -9263483, -2023980, 4316710, 5913279, 3415017, -147337, -2568832, -3274484, -2662928, -1467172, -73978, 1733712]
2767A733712K088226J072099j100851k326403j298083K00110m53758k817417l796294
2758f698659j992616M38122J096549P31291J692603L934098M620057K008165j905605
2749C924005l657588k328740o0832R99472Q30686M60107K25004m3558j31871J33943
2739C50628J94480m04155r78816p06145j41366k24437j61022J625228M225662
2730C780057M365260R51159k677774k955483q59205n8897j436360k382694j331258
2721b605195O0890L1346o08734l14933P02045J472412K131339K967845K928826
2712F765841J160913q40825q96349M31764M08492j712560l348153k143114J020473
2703H46482L610132M441092L802498J960255p32970k949317l364570k431440j801624
$$ y = [1733712, 3821938, 4894037, 3793186, 1466783, 168700, 368810, -84948, -2902365, -6698659, -8691275, -8253153, -7156604, -6425313, -4732710, -798612, 3821445, 5829610, 3924005, 266417, -2062323, -2123155, -1123683, -292997, 167110, 392114, 348556, 216685, 350628, 545108, 140953, -837863, -1544008, -1685374, -1909811, -2070833, -445605, 3780057, 8145317, 9096476, 6418702, 3463219, 2604014, 2545117, 1108757, -1273937, -2605195, -2544305, -2512959, -3121693, -3436626, -2734581, -1262169, 869170, 3837015, 6765841, 7926754, 7085929, 6189580, 6621344, 7029836, 5317276, 1969123, -173991, 846482, 4456614, 8897706, 12700204, 14660459, 13927489, 10978172, 7613602, 5182162, 3380538]
2694C380538j962099j769483n79690N05224K84055n88926l88576J218222K483062
2685B582327J641407q69869k764242k422762o45715L75924m01810j857381k242339
2676f604460j145404M28367J467662J888437K259842L027626L822724L296099
2668H440893K61860m307992p106459n604380j184806K177532K423718J068190
2660c831444R2214p20976k053459k571882n50812K881639M659360L912785K850776
2651D668201L084336L349259J904714p59952l002131m226449m480429l257622
2643b720073n41965J960360K534447J713903J094595P65779J7091k59220J311257
2634E876174L272182K331743j585771m265504k653695J078710K698722J072641
$$ y = [3380538, 1418439, -351044, -930734, -425510, -141455, -730381, -1118957, 99265, 2582327, 4223734, 3353865, 589623, -1833139, -2478854, -2102930, -2504740, -4362121, -6604460, -7749864, -7321497, -5853835, -3965398, -1705556, 1322070, 5144794, 8440893, 8702753, 4394761, -2711698, -8316078, -9500884, -7323352, -4899634, -3831444, -3739230, -4460206, -6513665, -9085547, -9636359, -6754720, -2095360, 1817425, 4668201, 7752537, 11101796, 13006510, 12246558, 9244427, 5017978, 537549, -2720073, -3262038, -1301678, 1232769, 2946672, 4041267, 4807046, 4824137, 4564917, 5876174, 9148356, 11480099, 9894328, 5628824, 2975129, 4053839, 6752561, 7825202]
2626G825202j741438l692891l859163j929815J032746K393184P52121j910031
2618a130085k845319k080438j197637k25674J217296J171297k187382n903583
2610a3181525m744715J039855N108178L756159P02388N25341J676567J50108l096377
2601h064021l511297l14028K503532K454343J380309J251052J152810P8398n68346
2592c637248N21788J907922J612401L64320K65465J279448J473431L43252m59750
2583C671029N380M40600m82718j957610k331121j513594o67884j22182P58566
2574b199534J730510J470442k43576j688499j460054l13410L18569L86972M74312
2565a524268K69502m15623k57905J665860L412642K319412p73160k426686j778517
$$ y = [7825202, 6083764, 2390873, -1468290, -3398105, -2365359, 27825, 779946, -1130085, -3975404, -6055842, -7253479, -7479153, -6261857, -5090560, -7277942, -13181525, -17926240, -16886385, -11778207, -8022048, -7319660, -6794319, -5117752, -4967644, -8064021, -11575318, -11889346, -9385814, -6931471, -5551162, -4300110, -3147300, -3068902, -3637248, -3115460, -1207538, 404863, 769183, 1034648, 2314096, 3787527, 4130779, 3671029, 3676409, 4117009, 3634291, 1676681, -654440, -2168034, -2835918, -2958100, -2199534, -469024, 1001418, 757842, -930657, -2390711, -2704121, -2385552, -1998580, -1524268, -1254766, -1670389, -1928294, -262434, 3150208, 5469620, 4696460, 2269774, 491257]
2556D91257j506350k948416l749084j933429P98692J925084J601234J139146M70604
2547c711262n33273n85558O57096J071252m52919j501027j59196J147043k90328
2538d358172k114060m62282L028101L424535P41621k15819J597073J675174j622328
2529A693843l369377j52213L710759K685089j376920k477039K87787K254804R53717
2520D210450q70134m88100Q33952O92867n38602p31178N47693J513739Q11137
2511E981824o94840j353526j285219k205346m343925n162370k746137P66048J610675
2502i432816l52945j746877r27243K72427O39474J613915L599404L982583J498288
2493h53790o06202Q84805L908885M134205J440663n47856l50805J2448o51516
$$ y = [491257, -1015093, -3963509, -7712593, -9646022, -8847330, -6922246, -5321012, -4181866, -3711262, -4244535, -4830093, -4172997, -3101745, -3554664, -5055691, -5214887, -4067844, -4358172, -6472232, -6934514, -3906413, -481878, 259743, 43924, 1640997, 3316171, 1693843, -1675534, -1827747, 1883012, 4568101, 3191181, 714142, 1001929, 3256733, 4210450, 3340316, 2852216, 3686168, 4379035, 3840433, 3109255, 3656948, 5170687, 5981824, 5286984, 3933458, 2648239, 442893, -3901032, -9063402, -11809539, -11043491, -9432816, -9785761, -11532638, -12459881, -12187454, -11547980, -9934065, -6334661, -2352078, -853790, -1459992, -575187, 3333698, 7467903, 8908566, 8360710, 8009905, 8022353, 7370837]
2484G370837r04593J38905J043122N70043m89658j054254j254896j210066k04932
2475D004508J667006K522195P69396k548031m553340l443010j62720K530735K545149
2466C331888L46001j609657j564728k44130M43998r3896p17250k96801R15264
2457E10689J636172R02362p98347j759665r43883N61704R75139M70827P80162
2448B335160K056294K242434L11061j914918k274736p64038J463301L454786L727263
2439A0636607Q34688l567861m967327j717177K008727J782430j039910k189332
2431A780845j063154l40180p16637n50037J30417k41712r92098K9890J962851
2422A85J687291o21405j307846N80920J632318M4101j408943o09809J35216j326708
$$ y = [7370837, 6466244, 6605149, 7648271, 8218314, 7728656, 6674402, 5419506, 4209440, 4004508, 5671514, 8193709, 8963105, 6415074, 1861734, -1581276, -1743996, 786739, 3331888, 3677889, 2068232, 503504, 259374, 703372, 609476, -107774, -404575, 510689, 2146861, 3049223, 2250876, 491211, -452672, 109032, 1084171, 1554998, 2335160, 4391454, 6633888, 6944949, 5030031, 2755295, 1991257, 3454558, 6909344, 10636607, 11471295, 7903434, 2936107, 1218930, 3227657, 5010087, 3970177, 1780845, 717691, 377511, -339126, -889163, -758746, -1000458, -1992556, -1962666, 185, 1687476, 1066071, -241775, 339145, 1971463, 2015564, 606621, -3188, 132028, -1194680]
2412a194680k477799j12774L872013M877073K249548m47237j126167j367845k648433
2403A623699l655973k674366m88613Q30572J078354K102312M649229O418170M569379
2394A4452763k47434m124900m606890l300710k704803k542258j327633K67133
2386d134732N31201L4154O41133J892396J687891K22034k87586K22177m93347
2377C15321k497368k881578n63603J697926J566977K54398j52237L93193J090078
2368g76893J683475J439679m69173k549578k104901K48189Q35252j048640j540365
2359d282955J428500M496110M267563K219293J047348Q8771j883987k932539j257392
2350C190712P62993J13859j881731k273751j528666j521918j183960R85613K511788
$$ y = [-1194680, -3672479, -3785253, 86760, 4963833, 7213381, 6766144, 5639977, 4272132, 1623699, -2032274, -4706640, -5195253, -4364681, -3286327, -1184015, 3465214, 9883384, 14452763, 14205329, 10080429, 5473539, 2172829, -531974, -3074232, -4401865, -4134732, -3603531, -3569377, -2928244, -1035848, 652043, 874077, 586491, 808668, 315321, -2182047, -5063625, -5627228, -3929302, -2362325, -2107927, -2260164, -1866971, -776893, 906582, 2346261, 1877088, -672490, -2777391, -2529202, -1693950, -2742590, -4282955, -2854455, 1641655, 5909218, 8128511, 9175859, 9264630, 7380643, 4448104, 3190712, 3953705, 4067564, 2185833, -87918, -1616584, -3138502, -4322462, -3336849, -825061]
2341h25061M71774k530198j764737J594394K089790q89989k131005N67617K851004
2332e66411J027768k500915l642706k271333p63100k0537N58912J328204K306575
2323d543543L109695K358455o02643l276766k335569J254049K858398P34435j632385
2314b075874j045135J105549J961383J479663J241787J312711O00612j099540
2306C481156k959002l804133k377572J284973M467556M201785J459822O7009R50412
2297F772006R65618j460648l398614k221014J48259N27771p94131j514492j176234
2288b151479o49792L16706K063347K980381J351453j667671l255868k405104m69850
2279c887877P70300J83832k152965m054453k705274J323127L671133J854125r81231
$$ y = [-825061, -353287, -2883485, -4648222, -3053828, -964038, -1854027, -3985032, -3417415, -566411, 461357, -2039558, -5682264, -7953597, -8716697, -8737234, -8178322, -6850118, -4543543, -1433848, 924607, 321964, -2954802, -5290371, -4036322, -1177924, -443489, -2075874, -3121009, -2015460, -54077, 1425586, 2667373, 3980084, 4580696, 3481156, 522154, -3281979, -5659551, -4374578, 92978, 4294763, 5754585, 5821594, 6772006, 7737624, 6276976, 2878362, 657348, 805607, 1333378, 539247, -975245, -2151479, -2801271, -2484565, -421218, 2559163, 3910616, 2242945, -1012923, -3418027, -3887877, -3117577, -2933745, -5086710, -9141163, -11846437, -10523310, -6852177, -4998052, -5979283]
2270e979283o13794K143881L238630J615011j26525m45638m21773p02240m13763
2261a705494L84530J52937j426994k560929j863926J15178K200088L507116K985351
2252A787857K59450k763139l347109j438154M22874R99823J563832K469473J583611
2243A538518j973887n051957m146699l62797K101622J637595N57137R16816J985627
2234b798025K632733L428889M585827M034735K75185m043084m560745j203231
$$ y = [-5979283, -6593077, -4449196, -1210566, 404445, 277920, -167718, -589491, -1291731, -1705494, -1320964, -1168027, -2595021, -5155950, -7019876, -6904698, -4704610, -1197494, 1787857, 2047307, -715832, -4062941, -5501095, -5078221, -4078398, -2514566, -45093, 1538518, -435369, -5487326, -9634025, -9996822, -7895200, -6257605, -5700468, -4783652, -2798025, -165292, 3263597, 7849424, 11884159, 12159344, 8116260, 3555515, 2352284]
$$ [...]
##END NTUPLES=NMR SPECTRUM
##END=
