##TITLE=31P_DE-80H_X3
 64 sc D2O
 26.2.2025
##JCAMPDX= 6.0         $$ Bruker NMR JCAMP-DX V2.0
##DATA TYPE= NMR SPECTRUM
##DATA CLASS= NTUPLES
##ORIGIN= UXNMR, Bruker Analytische Messtechnik GmbH
##OWNER= root
$$ XWIN-NMR		Version 3.5
$$ Mon May 12 15:53:56 2025 Russian Standard Time (UT+4h)  Yarkov@DPX200
##.OBSERVE FREQUENCY= 81.013821
##.OBSERVE NUCLEUS= ^31P
##.ACQUISITION MODE= SIMULTANEOUS
##.ACQUISITION SCHEME= undefined
##.AVERAGES= 64
##.DIGITISER RES= 17
##SPECTROMETER/DATA SYSTEM= spect
##.PULSE SEQUENCE= zgpg30
##.SOLVENT NAME= DMSO
##.SHIFT REFERENCE= (INTERNAL, DMSO, 0, 198.062)
##AUDIT TRAIL= $$ (NUMBER, WHEN, WHO, WHERE, WHAT)
$$ ##TITLE= Audit trail, XWIN-NMR		Version 3.5
$$ ##JCAMPDX= 5.01
$$ ##ORIGIN= Bruker BioSpin GmbH
$$ ##OWNER= Yarkov
$$ C:/Bruker/XWIN-NMR/data/yarkov2/nmr/P31/2/pdata/1/auditp.txt
$$ ##AUDIT TRAIL=  $$ (NUMBER, WHEN, WHO, WHERE, WHAT)
(   1,<2025-05-12 15:53:10.07 +0400>,<Yarkov>,<DPX200>,
      <created by zg, POWCHK disabled, PULCHK disabled
       configuration hash MD5:
       00 E9 B6 7A A2 85 ED C7 34 08 36 98 17 FE 4E 26
       data hash MD5: 32K
       13 AA 7B B2 09 A2 A1 9A A4 B7 48 CA 96 C8 D1 A2>)
(   2,<2025-05-12 15:53:14.03 +0400>,<Yarkov>,<DPX200>,
      <Start of raw data processing
       efp BC_mod = 2 LB = 1.5 FT_mod = 6 PKNL = 1 PHC0 = 1788.236 PHC1 = -6.504568 SI = 64K 
       data hash MD5: 64K
       C9 E0 04 C1 77 42 68 97 F8 A6 80 9F E2 B9 76 34>)
(   3,<2025-05-12 15:53:25.87 +0400>,<Yarkov>,<DPX200>,
      <abs ABSG = 5 
       data hash MD5: 64K
       3D 18 A4 43 B8 C8 F8 F4 9B 7E A9 13 8C 67 46 0A>)
$$ ##END=
$$ 
$$ hash MD5
$$ 9D 0E 02 4A E9 2A 23 44 10 BD BA 07 08 CA 56 89
##$RELAX= 
##$RELAX= 
##$RELAX= 
##$RELAX= 
##$RELAX= 
##$RELAX= 
##$RELAX= 
##$RELAX= 
$$ Bruker specific parameters
$$ --------------------------
##$DU= <C:/Bruker/XWIN-NMR>
##$EXPNO= 2
##$NAME= <P31>
##$PROCNO= 1
##$TYPE= <nmr>
##$USER= <yarkov2>
##$AMP= (0..31)
100 100 100 100 100 100 100 100 100 100 100 100 100 100 100 100 100 100 
100 100 100 100 100 100 100 100 100 100 100 100 100 100 
##$AQSEQ= 0
##$AQ_mod= 1
##$AUNM= <au_zg>
##$AUTOPOS= <>
##$BF1= 81.014009
##$BF2= 200.13
##$BF3= 200.13
##$BF4= 200.13
##$BF5= 200.13
##$BF6= 200.13
##$BF7= 200.13
##$BF8= 200.13
##$BYTORDA= 1
##$CFDGTYP= 0
##$CFRGTYP= 5
##$CHEMSTR= <none>
##$CNST= (0..31)
1 1 145 1 1 1 1 1 1 1 1 1 1 1 1 1 1 1 1 1 1 1 1 1 1 1 1 1 1 1 1 1 
##$CPDPRG= <waltz16>
##$CPDPRG1= <>
##$CPDPRG2= <waltz16>
##$CPDPRG3= <>
##$CPDPRG4= <mlev>
##$CPDPRG5= <mlev>
##$CPDPRG6= <mlev>
##$CPDPRG7= <mlev>
##$CPDPRG8= <mlev>
##$CPDPRGB= <>
##$CPDPRGT= <>
##$D= (0..31)
0 1 0 0 0 0 0 0 0 0.06 0 0.03 2e-05 3e-06 0 0 0.0002 0 0 0 0 0 0 0 0 0 
0 0 0 0 0 0 
##$DATE= 1747050789
##$DBL= (0..7)
120 120 120 11 120 120 24 19 
##$DBP= (0..7)
150 150 150 150 150 150 150 150 
##$DBP07= 0
##$DBPNAM0= <>
##$DBPNAM1= <>
##$DBPNAM2= <>
##$DBPNAM3= <>
##$DBPNAM4= <>
##$DBPNAM5= <>
##$DBPNAM6= <>
##$DBPNAM7= <>
##$DBPOAL= (0..7)
0.5 0.5 0.5 0.5 0.5 0.5 0.5 0.5 
$$ [...]
##$SUBNAM3= <"">
##$SUBNAM4= <"">
##$SUBNAM5= <"">
##$SUBNAM6= <"">
##$SUBNAM7= <"">
##$SUBNAM8= <"">
##$SUBNAM9= <"">
##$SW= 400.765351723535
##$SWIBOX= (0..15)
0 1 3 0 0 0 0 0 0 0 0 0 0 0 0 0 
##$SW_h= 32467.5324675325
##$TD= 32768
##$TD0= 1
##$TE= 0
##$TE2= 300
##$TE3= 300
##$TEG= 300
##$TL= (0..7)
0 120 53 12 22 120 120 120 
##$TP= (0..7)
150 150 150 150 150 150 150 150 
##$TP07= 0
##$TPNAME0= <>
##$TPNAME1= <>
##$TPNAME2= <>
##$TPNAME3= <>
##$TPNAME4= <>
##$TPNAME5= <>
##$TPNAME6= <>
##$TPNAME7= <>
##$TPOAL= (0..7)
0.5 0.5 0.5 0.5 0.5 0.5 0.5 0.5 
##$TPOFFS= (0..7)
0 0 0 0 0 0 0 0 
##$TUNHIN= 0
##$TUNHOUT= 0
##$TUNXOUT= 0
##$USERA1= <user>
##$USERA2= <user>
##$USERA3= <user>
##$USERA4= <user>
##$USERA5= <user>
##$V9= 5
##$VALIST= <valist>
##$VCLIST= <CCCCCCCCCCCCCCC>
##$VD= 0
##$VDLIST= <DDDDDDDDDDDDDDD>
##$VPLIST= <PPPPPPPPPPPPPPP>
##$VTLIST= <TTTTTTTTTTTTTTT>
##$WBST= 1024
##$WBSW= 4
##$XGAIN= (0..3)
0 0 0 0 
##$XL= 0
##$YL= 0
##$YMAX_a= 3542
##$YMIN_a= -27190
##$ZGOPTNS= <>
##$ZL1= 120
##$ZL2= 120
##$ZL3= 120
##$ZL4= 120
##$ABSF1= 198.0616
##$ABSF2= -202.7028
##$ABSG= 5
##$ABSL= 3
##$ALPHA= 0
##$AQORDER= 0
##$ASSFAC= 0
##$ASSFACI= 0
##$ASSFACX= 0
##$ASSWID= 0
##$AUNMP= <proc_1d>
##$AZFE= 0.1
##$AZFW= 0.5
##$BCFW= 0
##$BC_mod= 2
##$BYTORDP= 0
##$COROFFS= 0
##$CY= -3
##$DATMOD= 1
##$DC= 0
##$DFILT= <>
##$DTYPP= 0
##$F1P= 0
##$F2P= 0
##$FCOR= 1
##$FTSIZE= 65536
##$FT_mod= 6
##$GAMMA= 0
##$GB= 0
##$INTBC= 1
##$INTSCL= 9.790993e-09
##$ISEN= 30
##$LB= 1.5
##$LEV0= 0
##$LPBIN= 0
##$MAXI= 10000
##$MC2= 0
##$MEAN= 0
##$ME_mod= 0
##$MI= 50
##$NCOEF= 0
##$NC_proc= -8
##$NLEV= 6
##$NOISF1= 182.463
##$NOISF2= 159.3651
##$NSP= 0
##$NTH_PI= 0
##$NZP= 0
##$OFFSET= 198.0616
##$PC= 4
##$PHC0= 1788.236
##$PHC1= -6.504568
##$PH_mod= 1
##$PKNL= yes
##$PPARMOD= 0
##$PSCAL= 0
##$PSIGN= 0
##$REVERSE= no
##$SF= 81.0140089999434
##$SI= 65536
##$SIGF1= 159.3651
##$SIGF2= -187.1042
##$SINO= 113.3802
##$SIOLD= 16384
##$SREGLST= <1H.CDCl3>
##$SSB= 0
##$STSI= 65536
##$STSR= 0
##$SW_p= 32467.5324675325
##$SYMM= 0
##$S_DEV= 0
##$TDeff= 32768
##$TDoff= 0
##$TI= <>
##$TILT= no
##$TM1= 0
##$TM2= 0
##$TOPLEV= 0
##$USERP1= <user>
##$USERP2= <user>
##$USERP3= <user>
##$USERP4= <user>
##$USERP5= <user>
##$WDW= 1
##$XDIM= 65536
##$YMAX_p= 367761964
##$YMIN_p= -105290075
$$ End of Bruker specific parameters
$$ ---------------------------------
##NTUPLES= NMR SPECTRUM
##VAR_NAME=  FREQUENCY,     SPECTRUM/REAL,   SPECTRUM/IMAG
##SYMBOL=    X,             R,               I
##VAR_TYPE=  INDEPENDENT,   DEPENDENT,       DEPENDENT
##VAR_FORM=  AFFN,          ASDF,            ASDF
##VAR_DIM=   65536,         65536,           65536
##UNITS=     HZ,            ARBITRARY UNITS, ARBITRARY UNITS
##FACTOR=    0.49542278885378, 1,            1
##FIRST=     16045.7642231865, 0,            0
##LAST=      -16421.768244346, 0,            0
##MIN=       -16421.768244346, -105290075,   0
##MAX=       16045.7642231865, 367761964,    0
$$ Real data points
##PAGE= N=1
##DATA TABLE= (X++(R..R)), XYDATA
$$ [...]
##PAGE= N=2
##DATA TABLE= (X++(I..I)), XYDATA
6761C367345o782033k680061L509431N182254K207277r58401k437200l338393
$$ 3367345 -3414688 -6094749 -2585318 2596936 4804213 3845812 1408612 -1929781
6753a929781l252008p15182K587975K974749L14603j556381m06317J852982K727557
$$ -1929781 -5181789 -5896971 -3308996 -334247 -19644 -1576025 -1982342 -129360 2598197
6744B598197K108965R57749k10912o72750K96175J712058J462201o39675k271709
$$ 2598197 4707162 5664911 5453999 4781249 5077424 6789482 8251683 7612008 5340299
6735E340299j789815j93276Q22675J016911Q87702L69153o04107j278501q90103
$$ 5340299 3550484 3357208 4179883 5196794 6084496 6453649 5849542 4571041 3680938
6726C680938K31564R46931L44624j501399l210663k880538k81019K038769J351402
$$ 3680938 3912502 4859433 5204057 3702658 491995 -2388543 -2669562 -630793 720609
6717G20609j504298k695536k62788L169506L591728M48318k906644l136932l77399
$$ 720609 -783689 -3479225 -3742013 -572507 3019221 3467539 560895 -2576037 -2953436
6708b953436K227825K012411l81583j962840j241589p2660o30455j706321l06850
$$ -2953436 -725611 1286800 905217 -1057623 -2299212 -2371872 -3002327 -4708648 -5015498
6699e015498L298988N049033K718720o03339r15741Q40476N07789k603867m483241
$$ -5015498 -1716510 3332523 6051243 5447904 4532163 5372639 5880428 3276561 -1206680
6690a206680k512920O47148J237043j77213l13129J388901K300334J174059j52176
$$ -1206680 -3719600 -3072452 -1835409 -2012622 -2325751 -936850 1363484 2537543 2385367
6681B385367j61941K75703L78891J077895K417602K133652o57624k829983j554640
$$ 2385367 2223426 2499129 2878020 3955915 6373517 8507169 7849545 5019562 3464922
6672C464922Q67199N70122j033859P54779N273268N899263O9665n769913n075247
$$ 3464922 4332121 4902243 3868384 4623163 9896431 15795694 15865359 10095446 5020199
6663E020199n41049O33014k265401l392333k37553K777393J784357q37871r96308
$$ 5020199 4479150 5112164 2846763 -545570 -783123 1994270 3778627 2940756 1944448
6654A944448P91461J112829o59541k077818k058969k211578l449617m026258k185284
$$ 1944448 2735909 3848738 3189197 1111379 -947590 -3159168 -6608785 -10635043 -12820327
6645a2820327R08712K488726J791433Q68467J649362L314729L318696N51600l259669
$$ -12820327 -11911615 -9422889 -7631456 -6762989 -5113627 -1798898 1519798 2071398 -1188271
6636a188271n238719l966628n42714K435920L069033J850666J022489J783867
$$ -1188271 -6426990 -10393618 -10936332 -8500412 -5431379 -3580713 -2558224 -774357
6628g74357K699029J784472m82986j801850j395546p89696j040564j299842r01794
$$ -774357 1924672 3709144 3226158 1424308 28762 -760934 -1801498 -3101340 -4003134
6619d003134q16283j712489k269039r73619J617738L771355M556925L763663J298525
$$ -4003134 -4819417 -6531906 -8800945 -9774564 -8156826 -4385471 171454 3935117 5233642
6610E233642j853797l491829k725641j415998j453860k014637j410959j65280
$$ 5233642 3379845 -111984 -2837625 -4253623 -5707483 -7722120 -9133079 -9298359
6602i298359J53328o6839O95517K097475K450582J686814J197112J168653P02568
$$ -9298359 -9145031 -9211870 -8516353 -6418878 -3968296 -2281482 -1084370 84283 786851
6593G86851J43372N25879J089038L35521p33375J65039K161362J918324n74170
$$ 786851 930223 1456102 2545140 2880661 2147286 2312325 4473687 6392011 5817841
6584E817841j134515J859126L862595M10521n897974q334284m554293J150417
$$ 5817841 4683326 6542452 10405047 10815568 4917594 -3416690 -7970983 -6820566
6576f820566L674762K416649M78599M79364J933734K207684j36053l113755l279123
$$ -6820566 -3145804 -729155 -250556 228808 2162542 4370226 4234173 1120418 -2158705
6567b158705o158L487345L926414J484401j225947k388991k222199j879239k010417
$$ -2158705 -2164863 1322482 5248896 6733297 5507350 3118359 896160 -983079 -2993496
6558b993496k001086n69744K133888L603427J841289j302680k095870k06820R40795
$$ -2993496 -4994582 -5564326 -3430438 172989 2014278 711598 -1384272 -1591092 -650297
6549f50297l44963j568710n06551J274109J645411J621203K842923L825579K174912
$$ -650297 -995260 -2563970 -3070521 -1796412 -151001 1470202 4313125 8138704 10313616
6540A0313616j078422k774468k202570j265413r63704p88939q79151j658634j869254
$$ 10313616 9235194 6460726 4258156 2992743 2029039 1240100 360949 -1297685 -3166939
6531c166939j28741J907212J241124j671857l208086j914126q1782O59256J633078
$$ -3166939 -3295680 -1388468 -147344 -1819201 -5027287 -6941413 -7023195 -6363939 -4730861
6522d730861L552297M137359J632198j921614l453438k910064k044897r63225
$$ -4730861 -1178564 2958795 4590993 2669379 -784059 -3694123 -5739020 -6702245
6514f702245J181597L204065K875780P49877n9957J439380K388841M14836k555913
$$ -6702245 -5520648 -2316583 559197 1309074 1249117 2688497 5077338 5492174 2936261
6505B936261l026100j127317l53424k215604l905224k452152Q70966K271151M22766
$$ 2936261 -89839 -1217156 -1570580 -3786184 -7691408 -10143560 -9272594 -7001443 -6578677
6496f578677k379179l521012k394717M03639L849877O014730N056360J713766
$$ -6578677 -8957856 -12478868 -14873585 -14469946 -10620069 -4605339 451021 2164787
6488B164787r05052r54267L21235J075202J164869R97368L36130l30526M64786
$$ 2164787 1259735 305468 626703 1701905 2866774 3864142 4200272 3869746 4334532
6479D334532K297535K150861j136137m115950l306112l72819O37232n55964r41695
$$ 4334532 6632067 8782928 7646791 3530841 224729 -148090 489142 -66822 -1008517
6470a008517M41369J765918K273808K706702K321896j92350k967615k703041l49056
$$ -1008517 -567148 1198770 3472578 6179280 8501176 8308826 5341211 2638170 2289114
6461B289114j12762k174985j937896J878234M267005J993197r99344m32398J070390
$$ 2289114 2176352 1367 -1936529 -58295 4208710 6201907 5202563 4770165 5840555
6452E840555r51791m383970l643445R39750L409663J330525j340752j089107P33668
$$ 5840555 4888764 504794 -3138651 -2198901 1210762 2541287 1200535 111428 845096
6443H45096J644993J682866J473848L13224j759245k805873j840268n46569n32237
$$ 845096 2490089 4172955 5646803 5960027 4200782 1394909 -445359 -991928 -1524165
6434a524165r82173n73360L10728Q69864J499463K411123K324266L92153j873297
$$ -1524165 -2506338 -3079698 -2768970 -1899106 -399643 2011480 4335746 4727899 2854602
6425B854602k424027j442591o45591o97664r44479j000093r28988k88221J397875
$$ 2854602 430575 -1012016 -1657607 -2355271 -3299750 -4299843 -5228831 -5517052 -4119177
6416d119177L319138L892491K657800O55481j005275j954787k036896j122602
$$ -4119177 -800039 3092452 5750252 6405733 5400458 3445671 1408775 286173
6408B86173K91141J194228J172978Q10034O74897M94518k05897j024301r22884
$$ 286173 577314 1771542 2944520 3754554 4429451 4923969 4718072 3693771 2770887
6399B770887K96227J220764J48133k685314m772223l861707o02715K078520K252685
$$ 2770887 3067114 4287878 4436011 1750697 -3021526 -6883233 -7485948 -5407428 -3154743
6390c154743Q28463j01410J47719N62858J40733r02529j439929m74512J854656
$$ -3154743 -2326280 -2427690 -2279971 -1717113 -1576380 -2478909 -3918838 -4393350 -2538694
6381b538694L913642L707660J025350j931330k800684j599935j44583O55230J498899
$$ -2538694 1374948 5082608 6107958 4176628 1375944 -223991 -368574 286656 1785555
6372A785555K574029K431976Q6585k887622l902633k617080j175527j157184j715942
$$ 1785555 4359584 6791560 6878145 3990523 87890 -2529190 -3704717 -4861901 -6577843
6363f577843j231955M37532K193020L238633L399666K589243J062978k51195p74441
$$ -6577843 -7809798 -7372266 -5179246 -1940613 1459053 4048296 5111274 4860079 4085638
6354D085638j202575k173374k502682n80621K472609L289852P89379j863565j445593
$$ 4085638 2883063 709689 -1792993 -2373614 98995 3388847 4178226 2314661 869068
6345H69068Q98996J667045K50089o68198K41497R08080o09756k989486l624370
$$ 869068 1768064 3435109 3685198 3017000 3258497 4166577 3556821 567335 -3057035
6336c057035k069402J18126J675992K083931Q60490j552957k888586j216948K131619
$$ -3057035 -5126437 -5008311 -3332319 -1248388 -387898 -1940855 -4829441 -6046389 -3914770
6327c914770L850966K940650J610136J560233J682172M90662j266650k014457
$$ -3914770 -63804 2876846 4486982 6047215 7729387 8220049 6953399 4938942
6319D938942j734922j243835n01596M93874M86452j142534k446100j522317r0966
$$ 4938942 3204020 1960185 1458589 1952463 2438915 1296381 -1149719 -2672036 -2763002
6310b763002j215314l896132l829635r7232L060126K795759J845095L244596M552289
$$ -2763002 -3978316 -7874448 -11704083 -11801315 -8741189 -5945430 -4100335 -855739 3696550
6301C696550J681575l781995o013927l004512J315209L112706K650677J553793
$$ 3696550 5378125 1596130 -4417797 -7422309 -6107100 -2994394 -343717 1210076
6293A210076Q7381j325141j230059L28724J076501L047r76131n57801m53944j976083
$$ 1210076 1297457 -27684 -1257743 -929019 147482 150529 -825602 -1383403 -1837347 -3813430
6283c813430k892816p60547K577380L253695R81876j027257j181486j035486j512298
$$ -3813430 -6706246 -7466793 -4889413 -1635718 -653842 -1681099 -2862585 -3898071 -5410369
6274e410369j039269J277498L303450K633352J01095j435501j049368n90319j514667
$$ -5410369 -6449638 -5172140 -1868690 764662 865757 -569744 -1619112 -2209431 -3724098
6265c724098k529046j470586J276343K892795J913837J67182k97417n26996k507514
$$ -3724098 -6253144 -7723730 -6447387 -3554592 -1640755 -1473573 -1770990 -2297986 -4805500
6256d805500m777278l696427O46456L520841K024721r27929j342065K47435R42558
$$ -4805500 -9582778 -13279205 -12632749 -9111908 -7087187 -8015116 -9357181 -9109746 -8167188
6247h167188O54953J334841K695816K656380J235022L46621J85916o52351j704599
$$ -8167188 -7512235 -6177394 -3481578 -825198 409824 756445 942361 290010 -1414589
6238a414589r11641J447268K552467J323035k39414n93327n36066q38433q67391
$$ -1414589 -2326230 -878962 1673505 2996540 2757126 2163799 1627733 789300 -78091
6229g8091l45800J00852O08176J614463J739219n05000k816452j177223L386430
$$ -78091 -423891 -323039 285137 1899600 3638819 3133819 317367 -859856 2526574
6220B526574M892045J077625k829080j890606J490950K145865n3437j518394j253162
$$ 2526574 7418619 8496244 5667164 3776558 5267508 7413373 7359936 5841542 4588380
6211D588380j018889j052412k67185M75646l78317j490758m98560J334650P27943
$$ 4588380 3569491 2517079 2249894 2725540 2347223 856465 357905 1692555 2420498
6202B420498j784163k276458M3188J414441k42377k041678j059774J134093J481714
$$ 2420498 636335 -1640123 -1596935 -182494 -424871 -2466549 -3526323 -2392230 -910516
6193i10516K61328M3241J428633K483185J799368R3395j261656k019609k949402
$$ -910516 -649188 -605947 822686 3305871 5105239 5198634 3936978 1917369 -1032033
6184a032033m227658m397037j812222K542889N101169L837116R82903j93425J01119
$$ -1032033 -5259691 -9656728 -11468950 -8926061 -3824892 12224 995127 801702 902821
6175I02821m97182j828125j338002J246685K951759J979091m4430j196877j655050
$$ 902821 405639 -1422486 -2760488 -1513803 1437956 3417047 3372617 2175740 520690
6166E20690j794975q63290Q91003J448097J26396r79458l85468M74873K45294
$$ 520690 -1274285 -2137575 -1246572 201525 327921 -651537 -1037005 -562132 -316838
6157c16838K78898J805422K954438J652305n04683o71265M02735l78637l090807
$$ -316838 -37940 1767482 4721920 6374225 5869542 5198277 5601012 5222375 2131568
6148B131568m383215k559978J96529J262391M97695r25932k124908k119749j40180
$$ 2131568 -2251647 -4811625 -4615096 -3352705 -2855010 -3780942 -5905850 -8025599 -8165779
6139h165779K680255L857971K755632J415766J350002J504511N92529n87480q29172
$$ -8165779 -5485524 -1627553 1128079 2543845 3893847 5398358 5990887 5403407 4574235
6130D574235p53321j333082j584755j22644J851607J755497l47304j528718k87422
$$ 4574235 3820914 2487832 903077 780433 2632040 4387537 4040233 2511515 2224093
6121B224093J318534Q62601j138302k525743k516525j770397o95122M75112P96387
$$ 2224093 3542627 4405228 3266926 741183 -1775342 -3545739 -4240861 -3765749 -2969362
6112b969362k61679j382723r58935M82912J430127K239853M102684N517101L401949
$$ -2969362 -3231041 -4613764 -5572699 -5089787 -3659660 -1419807 2682877 8199978 11601927
6103A1601927j517161m230234k258489N35160k76678l188031l668502j156588
$$ 11601927 10084766 5854532 3596043 4131203 3854525 666494 -3002008 -4158596
6095d158596J128140J781319J968847J385749j489392m798561m041184J035523
$$ -4158596 -3030456 -1249137 719710 2105459 616067 -4182494 -8223678 -7188155
6087g188155M706137K744632j957860l819138j607425J674738L461383L281383
$$ -7188155 -2482018 262614 -1695246 -5514384 -7121809 -5447071 -1985688 1295695
6079A295695J527067p38026j869881j484000j009105j132410o79707N46072N21979
$$ 1295695 2822762 2084736 214855 -1269145 -2278250 -3410660 -4090367 -3544295 -3022316
6070c022316j223557j530434J558462M511145K901230j523634k918853K69859
$$ -3022316 -4245873 -5776307 -4217845 293300 3194530 1670896 -1247957 -978098
6062i78098L532758L085227K31137j962117k642646k326379j048033Q01377J795945
$$ -978098 2554660 5639887 5871024 3908907 1266261 -1060118 -2108151 -1306774 489171
6053D89171J196181J5324n47707m69608j95503J9347k73223j255397j834514q03206
$$ 489171 1685352 1700676 1152969 683361 487858 507205 233982 -1021415 -2855929 -3659135
6043c659135Q56416P99034j240524k890658k473236p37940J251406L446760M980940
$$ -3659135 -2802719 -2003685 -3244209 -6134867 -8608103 -9346043 -8094637 -4647877 333063
6034C33063L672801o14283m098493l061692J287768M220562L310278P07077n28990
$$ 333063 4005864 3391581 -706912 -3768604 -2480836 1739726 5050004 5757081 5228091
6025E228091l38282q12729k577869l666378k247034P08798K523399K029539L49276
$$ 5228091 4889809 4077080 1499211 -2167167 -4414201 -3705403 -1182004 847535 1196811
6016A196811j318641k798133l395011j550122K468609N403205M535755J063554
$$ 1196811 -121830 -2919963 -6314974 -7865096 -5396487 6718 4542473 5606027
6008E606027j832252k708005j682505J314909N125944O127236K326824k525631
$$ 5606027 3773775 1065770 -616735 698174 5824118 11951354 14278178 11752547
6000A1752547l178775l89389N74909j504677k460748p27780l76997l530385n515784
$$ 11752547 8573772 8184383 8759292 7254615 4793867 4066087 3689090 158705 -5357079
5991e357079j892572L995013N471759J798955j838441j985111j19974J058590
$$ -5357079 -7249651 -3254638 2217121 4016076 2177635 192524 72550 1131140
5983A131140P70038l46023j137674m94579J175819J831872O80881l79348R2579
$$ 1131140 1901178 1555155 417481 -77098 1098721 2930593 3611474 3232126 3324705
5974C324705O58551n0097m90550P02290J326422q84039l529635k759008L85772
$$ 3324705 3983256 3933159 3442609 4144899 5471321 4587282 1057647 -1701361 -1315589
5965a315589J703035Q45489J189937K907815K076441k011756m254357j184005
$$ -1315589 387446 1232935 2422872 5330687 7407128 5395372 1141015 -42990
5957d2990L414921L761902j35257l404198l019594m41233J344052Q54982j273683
$$ -42990 3371931 7133833 6998576 3594378 574784 133551 1477603 2332585 1058902
5948A058902k928616k164153O90217L136789L332552J861837K78666p45269j199182
$$ 1058902 -1869714 -4033867 -3343650 -206861 3125691 4987528 5266194 4520925 3321743
5939C321743j062396n70974k3164Q90050K131402J979817r31174m179151l404225
$$ 3321743 2259347 1688373 1665209 2555259 4686661 6666478 5735304 1556153 -1848072
5930a848072J392164M797432L076788r99253k943225k820713l059494k837215
$$ -1848072 -455908 4341524 7418312 6419059 3475834 655121 -2404373 -5241588
5922e241588L24892M631206N065602Q00474l221083l375529j632904p60489L84781
$$ -5241588 -4916696 -285490 4780112 5580586 2359503 -1016026 -2648930 -3409419 -3024638
5913c024638L360036N455931L250740j006833j769029J290744K388713j347780
$$ -3024638 335398 5791329 9042069 8035236 6266207 7556951 9945664 8597884
5905H597884m981735l170048J432665K007966k175922m798256j866223L008042
$$ 8597884 3616149 446101 1878766 3886732 1710810 -3087446 -4953669 -1945627
5897a945627M419910K106939o18230k164467k997359k719401m42327K675483M240542
$$ -1945627 2474283 4581222 3962992 1798525 -1198834 -3918235 -4360562 -1685079 2555463
5888B555463L685929K232614M12902j885513l441425k577815n9142J444650J017375
$$ 2555463 6241392 8474006 8886908 7001395 3559970 982155 923013 2367663 3385038
5879C385038K48912J30986k48820j359752k061721j728170j411059j849122k128796
$$ 3385038 3633950 3764936 3516116 2156364 94643 -1633527 -3044586 -4893708 -7022504
5870g022504j334930J2736R99904J416688J322428R59124J253849K620174L306142
$$ -7022504 -8357434 -8344698 -7344794 -5928106 -4605678 -3646554 -2392705 227469 3533611
5861C533611J322396j877543k644018o58099K72779j634008k904418l52075L347963
$$ 3533611 4856007 2978464 334446 -323653 -50874 -1684882 -4589300 -4941375 -1593412
5852a593412L262319o23056l610133k730827M20979K961893L811431L330308K231100
$$ -1593412 1668907 1045851 -2564282 -5295109 -4874130 -1912237 1899194 5229502 7460602
5843G460602J224601K61228j600463m196268n127024k728835O87874J204165j398302
$$ 7460602 8685203 8946431 7345968 3149700 -1977324 -4706159 -4018285 -2814120 -4212422
5834d212422l380178k228384N52814K380491K772876K534137J911706R34845J9936
$$ -4212422 -7592600 -9820984 -9268170 -6887679 -4114803 -1580666 331040 1265885 1285821
5825A285821r46313k658726m401616l726080J17100L819006L491069l4465j951055
$$ 1285821 339508 -2319218 -6720834 -10446914 -10329814 -6510808 -3019739 -3054204 -5005259
5816e005259J30527L037140K611230o04382k508906j181614J202382K139982J827366
$$ -5005259 -4874732 -1837592 773638 169256 -2339650 -3521264 -2318882 -178900 1648466
5807A648466J611114J724311J838631J876003R51874k176629n818043n330744
$$ 1648466 3259580 4983891 6822522 8698525 9650399 7473770 1655727 -3675017
5799c675017N10140N672374L759832k864597n993381k963867P40231R40373M08727
$$ -3675017 -3164877 2507497 6267329 3402732 -2590649 -5554516 -4814285 -3873912 -3465185
5790c465185K420445M521210L133869P4842n79271P10988K78032k385975m229929
$$ -3465185 -1044740 3476470 6610339 6685181 6105910 6816898 7094930 4708955 479026
5781D79026l627903j747281K99395K047058K201332J19244j881291j128943J090360
$$ 479026 -3148877 -4896158 -4596763 -2549705 -348373 -229129 -2110420 -3239363 -2149003
5772b149003J270184q13392j926643m95028J593441K364050J751880K04570j661337
$$ -2149003 -878819 -1692211 -3618854 -4113882 -2520441 -156391 1595489 1800059 138722
5763A38722k105122l3609K449157K387693N05970m5364R77546Q94054o22429p76975
$$ 138722 -1966400 -2000009 449148 2836841 3342811 3297447 4274993 5169047 4546618 3769643
5753C769643J085331J939626K19093j661083j662313j074297j098111l30668J824448
$$ 3769643 4854974 6794600 7013693 5352610 3690297 2616000 1517889 1187221 3011669
5744C011669K775152P96293j456461p59145J590812J804167p79831l172294l040421
$$ 3011669 5786821 6583114 5126653 4367508 5958320 7762487 6982656 3810362 769941
5735G69941j067130O01101N63107q39555j825331j119637K27324L98324J6914
$$ 769941 -297189 303912 867019 27464 -1797867 -2917504 -2690180 -2291856 -2274942
5726b274942J258568L510676L302982k21390l269164k803576o51255K71396N29195
$$ -2274942 -1016374 2494302 5797284 5575894 2306730 -496846 -1148101 -876705 -347510
5717c47510J718792K385484M73598k090377j628674J320402K354007m43986l984882
$$ -347510 1371282 3756766 4230364 2139987 511313 1831715 4185722 3741736 -243146
5708b43146m595125k212819O67616K216077K461320K385591K548250K480409J688145
$$ -243146 -4838271 -7051090 -6383474 -4167397 -1706077 679514 3227764 5708173 7396318
5699G396318J026680J701860K792109J909119r41438k692767j768863n89232j478939
$$ 7396318 8422998 10124858 12916967 14826086 13884648 11191881 9423018 8833786 7354847
5690G354847k717483j410953J830255M036450L963400K192501j030230m898715
$$ 7354847 4637364 3226411 5056666 9093116 13056516 15249017 14218787 9320072
5682I320072o658709m615412j325674m26409j492175j556534m37407m03808j340350
$$ 9320072 2661363 -1954049 -3279723 -3706132 -5198307 -6754841 -7192248 -7596056 -8936406
5673h936406p55411J382202K161631O53186o75605l02472L28692J49045K35099
$$ -8936406 -9691817 -8309615 -6147984 -5494798 -6170403 -6472875 -6144183 -5995138 -5760039
5664e760039R66443Q11265n29167r25617M78746J262288n54135l176494l511917
$$ -5760039 -4793596 -3982331 -4511498 -5437115 -4958369 -3696081 -4250216 -7426710 -10938627
5655a0938627j135745J994596M146845M532027K954163L68934j319794j270968
$$ -10938627 -12074372 -10079776 -5932931 -1400904 1553259 1922193 602399 -668569
5647f68569n76189l80461l48386K94192J416361K321510K412805J360346k12274
$$ -668569 -1244758 -1625219 -1973605 -1679413 -263052 2058458 4471263 5831609 5619335
5638E619335n31857J094873K328289M74532l123181m280300j786801J080426J491823
$$ 5619335 5087478 6182351 8510640 8985172 5861991 1581691 -205110 875316 2367139
5629B367139K91318p29829j477414j937547j045919R13438J586368K17889o61822
$$ 2367139 2658457 1928628 451214 -1486333 -2532252 -1618814 -32446 185443 -476379
5620d76379O75620K125586J249553p91583j569462j300274j389358j156124N90401
$$ -476379 199241 2324827 3574380 2782797 1213335 -86939 -1476297 -2632421 -2042020
5611b042020K265938J372222j207160k094318k45999J993136K509731J563762
$$ -2042020 223918 1596140 388980 -1705338 -1951337 41799 2551530 4115292
5603D115292L61435l37692k09981L04554l9102j541432k546204j748995l71132
$$ 4115292 4476727 4139035 3929054 4233608 4194506 2653074 106870 -1642125 -2013257
5594b013257j34415m21108J64072P24763m50117k179671j460903J813587M193041
$$ -2013257 -2147672 -2568780 -2404708 -1679945 -2130062 -4309733 -5770636 -3957049 235992
5585B35992L116185l34947l326027l809337j323996K458392M180035K151849j018933
$$ 235992 3352177 3017230 -308797 -4118134 -5442130 -2983738 1196297 3348146 2329213
5576B329213j617019k7202L51038j131122j701167n80746o08509k887916m002270
$$ 2329213 712194 684992 1036030 -95092 -1796259 -2377005 -2985514 -5873430 -9875700
5567i875700j233040K767933L710194J680320J43154N45360J184168P00650j91815
$$ -9875700 -11108740 -8340807 -4630613 -2950293 -2807139 -2261779 -1077611 -376961 -568776
5558e68776m32391K134N38425N35884l81165j585839j702694m63020O87773P59049
$$ -568776 -1001167 -999033 -460608 75276 -305889 -1891728 -3594422 -4057442 -3369669 -2610620
5548b610620O90492J521112K578440K937967L125601L603424L124708P49730j878894
$$ -2610620 -1920128 -399016 2179424 5117391 8242992 11846416 14971124 15720854 13841960
5539A3841960k682002k353311k784303l399741k201755J79152R46730l02773q94050
$$ 13841960 11159958 8806647 6022344 2622603 420848 600000 1546730 1243957 349907
5530C49907M80251J865344J566215M88513l57576j743717l838385m568548k546093
$$ 349907 830158 2695502 4261717 4750230 4392654 2648937 -1189448 -5757996 -8304089
5521h304089M23999J917463K211866K889987L708441L159720J062645j362067
$$ -8304089 -7880090 -5962627 -3750761 -860774 2847667 6007387 7070032 5707965
5513E707965k987989k869677m56295K549773K644227p51085l183109r53557L034930
$$ 5707965 2719976 -149701 -605996 1943777 4588004 3836919 653810 -299747 2735183
5504B735183L291503O7527j342640Q01587K368457O90710j250409n17706O26681
$$ 2735183 6026686 6094213 4751573 5553160 7921617 8612327 7361918 6844212 7470893
5495G470893j044217l794042l464971N3786K845673K482520K62472j538942k009708
$$ 7470893 6426676 2632634 -832337 -778551 2067122 4549642 4812114 3273172 1263464
5486A263464j509529j158348j838867k404812m26764L638688N344730K070121
$$ 1263464 -246065 -1404413 -3243280 -5648092 -6074856 -2436168 2908562 4978683
5478D978683k242197j909456K383371M615190K060822j577999k189269k61442
$$ 4978683 2736486 827030 3210401 7825591 9886413 8308414 6119145 5857703
5470E857703J448288J811719J178633m1551j058874j003509n94409j443896l037517
$$ 5857703 7305991 9117710 10296343 10254792 9195918 8192409 7598000 6154104 3116587
5461C116587k938576q17187N91184k34194j341310r86898n67640j594738k474905
$$ 3116587 178011 -639176 -47992 -282186 -1623496 -2610394 -3178034 -4772772 -7247677
5452g247677j175165J033309J622979J058589J723151L450866L378086K72819
$$ -7247677 -8422842 -7389533 -5766554 -4707965 -2984814 466052 3844138 4116957
5444D116957l599039n323838m171398j347062J450052K916570K837115K174425
$$ 4116957 517918 -4805920 -8977318 -10324380 -8874328 -5957758 -3120643 -946218
5436i46218J813888J524483Q35645K00885K48183N52388L02717l63034p48249
$$ -946218 867670 2392153 3227798 3428683 3676866 4229254 4531971 4168937 3420688
5427C420688p59875p28464o77585n62959m42504K06956K051436L966723L296809
$$ 3420688 2660813 1932349 1254764 691805 249301 456257 2507693 6474416 9771225
5418I771225n12416m191209m358909j532054J367000K845498L003003J635639
$$ 9771225 9258809 5067600 708691 -823363 543637 3389135 6392138 8027777
5410H027777r34782k464271j397637R4455r47348l116621k358732J343984L339146
$$ 8027777 7092995 4628724 3231087 3325542 2378194 -738427 -3097159 -1753175 1585971
5401A585971J194755j912182k349524q84241j30106k61851K4882O39338R29729
$$ 1585971 2780726 868544 -1480980 -2365221 -2495327 -2757178 -2732296 -2092958 -1163229
5392a163229J621316L320566M479319L302117N71862j602449k657454l009681
$$ -1163229 458087 3778653 8257972 11560089 12131951 10529502 7872048 4862367
5384D862367k053964M95029K328730Q43700k604163l922953j945455K53356L14670
$$ 4862367 2808403 3303432 5632162 6475862 3871699 -51254 -1996709 -1743353 -1428683
5375a428683l34671K53011J172245P37075l29763l57592J61889l80412j526131
$$ -1428683 -1763354 -1510343 -338098 398977 69214 -288378 -126489 -506901 -2033032
5366b033032j370144O1936P93057K87133J53458R71451J106490k57093j427332
$$ -2033032 -3403176 -3341240 -2548183 -2261050 -2107592 -1136141 -29651 -286744 -1714076
5357a714076j103345o75441j558821k170913k27743L132982M349682K157490j173479
$$ -1714076 -2817421 -3492862 -5051683 -7222596 -7450339 -4317357 32325 2189815 1016336
5348A016336l210998l676150l286549k460108j595652r68510j46213J077074J593350
$$ 1016336 -2194662 -5870812 -9157361 -11617469 -13213121 -14181631 -14327844 -13250770 -11657420
5339a1657420P05388K24211K167777M807368M374864R19381j296259k31294J002822
$$ -11657420 -10952032 -10727821 -8560044 -3752676 622188 1541569 245310 14016 1016838
5330A016838m85009k785239k732339r18989J09301K67656J014957J717036N11523
$$ 1016838 531829 -2253410 -4985749 -5904738 -5795437 -5527781 -4512824 -2795788 -2284265
5321b284265k038418l258994j964212N77560K671971L261637J987176J15523P9649
$$ -2284265 -4322683 -7581677 -9545889 -8968329 -6296358 -3034721 -1047545 -932022 -852373
5312h52373K084898K885996L25131k857456k721130J55839K046810J645928O00075
$$ -852373 1232525 4118521 4443652 1586196 -1134934 -979095 1067715 2713643 3313718
5303C313718k54177j257649j478482N5572J365000j21779k799161k826620m03681
$$ 3313718 3059541 1801892 323410 378982 1743982 1622203 -1176958 -4003578 -4407259
5294d407259O52173m62945n24242J430813K107010j83727k515074k203188l52898
$$ -4407259 -3755086 -4218031 -4742273 -3311460 -1204450 -1388177 -3903251 -6106439 -6459337
5285f459337J326966K881388L351369M53409m363117n397034p56754L499072J529320
$$ -6459337 -5132371 -2250983 1100386 1553795 -2809322 -8206356 -8963110 -5464038 -3934718
5276c934718l750575n047697o97954M584666O790344N611356J959673k647865
$$ -3934718 -7685293 -12732990 -13430944 -8846278 -2055934 3555422 5515095 2867230
5268B867230n027532l118435M51296J386900k07893o79874Q02735J248572m16188
$$ 2867230 -2160302 -5278737 -4827441 -3440541 -3648434 -4328308 -3525573 -2277001 -2693189
5259b693189j194561P85415K773158J596277j296827j859784P68182L126468K074979
$$ -2693189 -3887750 -3102335 -329177 1267100 -29727 -1889511 -1121329 2005139 4080118
5250D080118j228416k844816r33832J997092K333316N3073j418676p3878K061533
$$ 4080118 2851702 6886 -926946 1070146 3403462 3456535 2037859 1963981 4025514
5241D025514K199034O92380j94933l7002m47609k013982l102078j996315R45015
$$ 4025514 6224548 6916928 6721995 6684993 6237384 4223402 1121324 -874991 70024
5232G0024L486265L445786Q20060j820665j977435l86766j609j523535k210716
$$ 70024 3556289 7002075 7822135 6001470 4024035 3637269 3635660 2112125 -98591
5223i8591j56167K694662L522549K390135R44656m75726j926455k003838J17118
$$ -98591 -254758 2439904 5962453 8352588 9297244 8821518 6895063 4891225 5008343
5214E008343K244537J815986j64526q77699k69782m99586j605660j482341m7872
$$ 5008343 7252880 9068866 8904340 8026641 7756859 7257273 5651613 4169272 4121400
5205D121400L44511q24393j138739M91033J676362K78675k276164l232824k156042
$$ 4121400 4465911 3641518 2502779 2993812 4670174 4948849 2672685 -560139 -2716181
5196b716181o19934L22545P50661Q89539P96834M91895k49207j495680k237506
$$ -2716181 -3336115 -3013570 -2262909 -1373370 -576536 -84641 -333848 -1829528 -4067034
5187d067034j067135J575613L104137J815842o61924j259658N69734K163598J273548
$$ -4067034 -5134169 -3558556 -454419 1361423 699499 -560159 9575 2173173 3446721
5178C446721q41400j217955L89047R23862j239303l107154j075129L176864M357097
$$ 3446721 2605321 1387366 1776413 2700275 1460972 -1646182 -2721311 455553 4812650
5169D812650J143134j857616j033449J230318J014639j030086j611683m59148
$$ 4812650 5955784 4098168 3064719 4295037 5309676 4279590 2667907 2208759
5161B208759N211n92095j90703J584631K454159J103033r12299j514535n33646
$$ 2208759 2213970 1621875 1431172 3015803 5469962 6572995 5660696 4146161 3612515
5152C612515N47145J11508j958556l321093j230367L189870M892123J295161l581230
$$ 3612515 4159660 4271168 2312612 -1008481 -2238848 951022 5843145 7138306 3557076
5143C557076m346661j396699Q65115R55520Q38164P90798r59173l515465l445240
$$ 3557076 -789585 -2186284 -1321169 -365649 472515 1263313 304140 -3211325 -6656565
5134f656565n94539R24013r12545k889680j720849J251427K752448K092253Q21442
$$ -6656565 -7251104 -6327091 -7239636 -10129316 -11850165 -10598738 -7846290 -5754037 -4932595
5125d932595P4859J9422K22614m34219k374764l536472j497695K326159L807412
$$ -4932595 -4857736 -4838314 -4615700 -5049919 -7424683 -10961155 -12458850 -10132691 -6325279
5116f325279K063720O45545J562787K118647m9696k461252j578663J522895K835949
$$ -6325279 -4261559 -3616014 -2053227 65420 15724 -2445528 -4024191 -2501296 334653
5107C34653J290454l48275Q6072J513586J625018r1022j815167j467021P24210
$$ 334653 1625107 1276832 1362904 2876490 4501508 4410486 2595319 1128298 1852508
5098A852508K155104J115241p26937p22801P68092J222525J82901m08878k2528
$$ 1852508 4007612 5122853 4395916 3673115 4441207 5663732 5846633 5437755 5415227
5089E415227l25947j686464k230761j236838k66397l3999N47855J255365J18614
$$ 5415227 5089280 3402816 1172055 -64783 -331180 -365179 182676 1438041 1556655
5080A556655k566744l533046j585355L51513K37289J31671J876800L357346K301131
$$ 1556655 -1010089 -4543135 -6128490 -5776977 -5539688 -5408017 -3531217 -173871 2127260
5071B127260N34186Q58672K381540K586927J758255J642552J622870l7343k515415
$$ 2127260 2661446 3520118 5901658 8488585 10246840 11889392 13512262 13474919 10959504
5062A0959504l487961k856767k334710k228686j421642K95751K256454M165158
$$ 10959504 7471543 4614776 2280066 51380 -1370262 -1074511 1181943 5347101
5054E347101N195117L541901o12957l566743k505562K38450N44982j488624k491685
$$ 5347101 10542218 14084119 13471162 9904419 7398857 7637307 8182289 6693665 4201980
5045D201980j445889l54378L0995J036601K570633K653218J071355J33906Q56268
$$ 4201980 2756091 2401713 2432708 3469309 6039942 8693160 9764515 9898421 10754689
5036A0754689J332584K0075j923688k873063l136656l663893m016930l236130
$$ 10754689 12087273 12107348 10183660 7310597 4173941 510048 -3506882 -6743012
5028f743012j753081r54389j104497p97496J193460L991846N226538L833988J507287
$$ -6743012 -8496093 -9450482 -10554979 -11352475 -10159015 -6167169 -940631 2893357 4400644
5019D400644M25381K57674q77987k828717l146128q83761J734371K506990J963626
$$ 4400644 4826025 5083699 4205712 1376995 -1769133 -2652894 -918523 1588467 3552093
5010C552093J553053J167547J55008q84548j125760j108547j696696k398639k012188
$$ 3552093 5105146 6272693 6427701 5543153 4417393 3308846 1612150 -786489 -2798677
5001b798677k01032K266206L944551L313948N12744j656062o78151J794137J877225
$$ -2798677 -2999709 -733503 3211048 6524996 7037740 5381678 4703527 6497664 8374889
4992H374889o32209j878111j51381J648175J300053P78750K010844K987315J296025
$$ 8374889 7742680 5864569 5713188 7361363 8661416 9440166 11451010 14438325 15734350
4983A5734350j558107k659597k068782j684189j853518j862177j882834k078616
$$ 15734350 14176243 11516646 9447864 7763675 5910157 4047980 2165146 86530
4975H6530j616004l93777L61129N43871J479694K690423J898645m66574r95696
$$ 86530 -1529474 -1923251 -1562122 -1018251 461443 3151866 5050511 4583937 3588241
4966C588241Q49375J411086n97858j623980p6941L15332k397449l978738j221895
$$ 3588241 4437616 5848702 5250844 3626864 3549923 3865255 1467806 -2510932 -3732827
4957c732827K318357K928492L113750N479505O227033J837568l080848k473778
$$ -3732827 -1414470 1514022 4627772 10107277 16334310 18171878 15091030 12617252
4949A2617252J114279J271112j497653k204478j160218k351006m573966l258364
$$ 12617252 13731531 15002643 13504990 11300512 10140294 7789288 3215322 -43042
4941d3042M50014J114572j509265k589971r49550J90857M01752K286315N126708
$$ -43042 406972 1521544 12279 -2577692 -3527242 -3336385 -2934633 -648318 4478390
4932D478390N539898L759012K510788J111284k318892m802824k363626K068729
$$ 4478390 10018288 13777300 16288088 17399372 15080480 10277656 7914030 9982759
4924I982759K574731l8056o57479M80304m92348k194272m71068K497815J583060
$$ 9982759 12557490 12519434 11861955 12342259 11849911 9655639 9184571 11682386 13265446
4915A3265446j084791J87636L233323J755722j906914k98094M747539M625719
$$ 13265446 12180655 12368291 15601614 17357336 15450422 15152328 19899867 24525586
4907B4525586l49571j843285O85498o8313l659148k007567M055313M590425j393469
$$ 24525586 24176015 22332730 23018228 22949915 19290767 17283200 21338513 25928938 24535469
4898B4535469m055616r03834O1465k387960k39866O096003O441010N39766n61195
$$ 24535469 20479853 19576019 19637484 17249524 17009658 23105661 29546671 30086437 29525242
4889B9525242L806560K416899l890827r53765J0670774J3066192L533305N55234
$$ 29525242 33331802 35748701 31857874 30904109 41574883 54641075 58174380 58729614
4881E8729614Q248079Q046526k106692J344562K0253300K3040383O518774J7232000
$$ 58729614 66977693 75024219 72917527 74262089 94515389 117555772 124074546 141306546
4873A41306546O6440723P6373192j8042752j48136147j78056449q4165078J7619758
$$ 141306546 207747269 284120461 266077709 117941562 -60114887 -144279965 -126660207
4866a26660207L4352590J569584m826264J6094970J8981641J093905l677004Q619797
$$ -126660207 -92307617 -90738033 -95564297 -79469327 -60487686 -59393781 -63070785 -54450988
4858e4450988J1071384p88245m408066N703800J0845473M432622L73311L766722
$$ -54450988 -43379604 -44167849 -48575915 -42872115 -32026642 -27594020 -27220709 -23453987
4850b3453987L559767k838057m141259K042071M217952j358112m546852o29548
$$ -23453987 -19894220 -22732277 -26873536 -24831465 -20613513 -21971625 -26518477 -27148025
4842b7148025K690117J279086P76802L244532L056018m52706n41952L553333M344375
$$ -27148025 -24457908 -23178822 -22402020 -19157488 -16101470 -16554176 -17096128 -13542795 -9198420
4833i198420J95886j401851K114101L737576N6560k864387j020396R81031o37564
$$ -9198420 -9002534 -10404385 -8290284 -4552708 -4496148 -7360535 -8380931 -7399900 -8037464
4824h037464k584809k034249j581954k654054k048339J270177L373675K487099
$$ -8037464 -10622273 -12656522 -14238476 -16892530 -18940869 -17670692 -14297017 -11809918
4816a1809918J775718K532383J892190l61755l42023K049226J476397l561827
$$ -11809918 -10034200 -7501817 -5609627 -5971382 -6313405 -4264179 -2787782 -6349609
4808f349609p235768n520351j872699l17088M45787K258432L090320J494143J08386
$$ -6349609 -13585377 -19105728 -20978427 -21295515 -20849728 -18591296 -15500976 -14006833 -13898447
4799a3898447Q94502J662889O37994k34968M10475N32443p84863p14250K104374
$$ -13898447 -13003945 -11341056 -10703062 -10938030 -10527555 -9995112 -10779975 -11494225 -9389851
4790i389851M176826K442340r08284k133990r91609P63463K497675L563623K268374
$$ -9389851 -5213025 -2770685 -3678969 -5812959 -6804568 -6041105 -3543430 20193 2288567
4781B288567j333112m314984m570492k967660o53833K309779M442335L136538
$$ 2288567 955455 -3359529 -7930021 -10897681 -11551514 -9241735 -4799400 -1662862
4773a662862p63453k796463j306744Q9216j355183l184939k291470J55029J362116
$$ -1662862 -2426315 -5222778 -6529522 -6440306 -7795489 -10980428 -13271898 -13116869 -11754753
4764a1754753J088550K93795j132831k560700j824321J000119K373581P04601
$$ -11754753 -10666203 -10372408 -11505239 -14065939 -15890260 -14890141 -12516560 -11811959
4756a1811959n82166J295669L373688J680117j926311k502379K70562K010698
$$ -11811959 -12394125 -11098456 -7724768 -6044651 -7970962 -10473341 -10202779 -8192081
4748h192081N37489j575092j533224K07079J763617K483485K807299L028579K838413
$$ -8192081 -7654592 -9229684 -10762908 -10555829 -8792212 -6308727 -3501428 -472849 2365564
4739B365564J462002j493447m712637n525070k623128K145915N498015N656563
$$ 2365564 3827566 2334119 -2378518 -7903588 -10526716 -8380801 -2882786 2773777
4731B773777L203833J0848k143712k816830l092490l677786l236254l55186L242508
$$ 2773777 5977610 5988458 3844746 1027916 -2064574 -5742360 -8978614 -9333800 -6091292
4722f091292M071446J737619m16036k84340L77423l30747j138303k30717J225836
$$ -6091292 -2019846 -282227 -698263 -982603 -605180 -935927 -2074230 -2304947 -1079111
4713a079111R13405p77538j370141q4807J225056P97379r13593j944345r14885
$$ -1079111 -165706 -943244 -2313385 -2398192 -1173136 -375757 -1289350 -3233695 -4148580
4704d148580J475557K865638J675207r26894k343627j594944R9245J339579J570812
$$ -4148580 -2673023 192615 1867822 940928 -1402699 -2997643 -2898398 -1558819 11993
4695A1993N13011j482468k770119k147770r07087r05488j228181K98317K772878
$$ 11993 525004 -957464 -3727583 -5875353 -6782440 -7687928 -8916109 -8617792 -5844914
4686e844914L056251R89435k43547M59912O63180n00472m39929J625227K210554
$$ -5844914 -2788663 -1799228 -2042775 -1582863 -919683 -1420155 -1860084 -234857 1975697
4677A975697n51861k883074j131255K097829K188333j1712j74441J892572K182427
$$ 1975697 1423836 -1459238 -2590493 -492664 1695669 1683957 1509516 3402088 5584515
4668E584515m33707k417224j647885n86718j521900k491908p30866K304231K606495
$$ 5584515 5150808 2733584 1085699 498981 -1022919 -3514827 -4245693 -1941462 665033
4659F65033m96004l076710j855903J417870K472339L01264j887657j620936l41439
$$ 665033 169029 -2907681 -4763584 -3345714 -873375 -572111 -2459768 -4080704 -4422143
4650d422143j42981P1865K228376M671199L997406O13623j652730j532366j548757
$$ -4422143 -4565124 -4493259 -2264883 2406316 6403722 7017345 5364615 3832249 2283492
4641B283492k597829k064298Q51464K576624P63855j666499j517460o12989j933652
$$ 2283492 -314337 -2378635 -1527171 1049453 1813308 146809 -1370651 -1983640 -3917292
4632c917292l627504j931011J890191K887207J29845j977252o08442J704764J738518
$$ -3917292 -7544796 -9475807 -7585616 -4698409 -4568564 -6545816 -7154258 -5449494 -3710976
4623c710976N12357J176683L876592N158512K376857k636191n139576k893947
$$ -3710976 -3198619 -2021936 1854656 7013168 9390025 6753834 1614258 -1279689
4615a279689Q63951J256039j874446l820167j653525J872239K594876M60524j486038
$$ -1279689 -415738 840301 -1034145 -4854312 -6507837 -4635598 -2040722 -1580198 -3066236
4606c066236j503859n1969J998292L490948K735669l57159l041718k890899r63746
$$ -3066236 -4570095 -4622064 -2623772 867176 3602845 3245686 203968 -2686931 -3650677
4597c650677K76455O19332J240298J812279J354200O61887R58198J251084K8444
$$ -3650677 -3374222 -2754890 -1514592 297687 1651887 2313774 3271972 4523056 4551500
4588D551500j462708q27554J329380K065666M70518j587475k612971k470202q18346
$$ 4551500 3088792 2261238 3590618 5656284 6126802 4539327 1926356 -543846 -1362192
4579a362192K222952M209126K568267j257475l083754j666730P65m57233j722272
$$ -1362192 860760 5069886 7638153 6380678 3296924 1630194 1630959 1173726 -548546
4570e48546j496516K56976J907236K223370J173305o2443L9115J219951J137924
$$ -548546 -2045062 -1788086 119150 2342520 3515825 3453382 3492497 4712448 5850372
4561E850372j083765k619950r39741J705940J493060p11835r30044Q27393M63836
$$ 5850372 4766607 2146657 1206916 2912856 4405916 3694081 2764037 3591430 4055266
4552D055266k744952m276942j765677R73419J82179k071926j942204k2224N00987
$$ 4055266 1310314 -2966628 -4732305 -3758886 -3576707 -5648633 -7590837 -7613061 -7112074
4543g112074o07630r64058N6793Q89295R00719Q82901Q89239J99787p30850m43084
$$ -7112074 -7719704 -8683762 -8626969 -7737674 -6836955 -5954054 -5064815 -4865028 -5595878 -6038962
4533f038962J351378L255684L772418K425056j76706k433021k637974q21750R18864
$$ -6038962 -4687584 -1431900 2340518 4765574 4588868 2155847 -482127 -1303877 -385013
4524c85013Q19527n18497j282663q26672k3950J08208n93935j361837j118875
$$ -385013 434514 -83983 -1366646 -2193318 -2217268 -2109060 -2702995 -4064832 -5183707
4515e183707K46323J376000J161599N20560R25273J650556P25181j472943k250204
$$ -5183707 -4937384 -3561384 -2399785 -1879225 -953952 696604 1421785 -51158 -2301362
4506b301362o92065J026862J285111J136075J499486J103556q47348k452570j864494
$$ -2301362 -2993427 -1966565 -681454 454621 1954107 3057663 2210315 -242255 -2106749
4497b106749k84247J21579l38074J02651J436220J963163Q95463q69469j972564
$$ -2106749 -2390996 -2269417 -2607491 -2504840 -1068620 894543 1790006 920537 -1052027
4488a052027j482759M21597J857177R32220j110716p00763K774610N127011K942549
$$ -1052027 -2534786 -2113189 -256012 676208 -434508 -1135271 1639339 6766350 9708899
4479I708899j477490l476494k282846q54134j083015k294565l391652l564149
$$ 9708899 8231409 4754915 2472069 1617935 534920 -1759645 -5151297 -8715446
4471h715446j842521J328273L205007K217379R63365K566217N425109N378362
$$ -8715446 -10557967 -9229694 -6024687 -3807308 -2843943 -277726 5147383 10525745
4463A0525745K115910p63958j657232k440334l830127l859822k104935j178249
$$ 10525745 12641655 11877697 10220465 7780131 3950004 90182 -2014753 -3193002
4455c193002k253815k822633j014189J089943Q25572j040341k017002j390380
$$ -3193002 -5446817 -8269450 -9283639 -8193696 -7368124 -8408465 -10425467 -11815847
4447a1815847J40211K230830M128934M064731J618851r40019j652076j431663
$$ -11815847 -11675636 -9444806 -5315872 -1251141 367710 -572309 -2224385 -3656048
4439c656048j666320j381797N65214K377486J678222k38363m3393K218442K916596
$$ -3656048 -5322368 -6704165 -6138951 -3761465 -2083243 -2321606 -2364999 -146557 2770039
4430B770039L64134k732920l430502k400593j994398k439493j917415N22594L710770
$$ 2770039 3134173 401253 -3029249 -5429842 -7424240 -9863733 -11781148 -11258554 -7547784
4421g547784N686528N358913L175876P93900k46677J9059K01236m97100j206520
$$ -7547784 -1861256 3497657 6673533 7467433 7220756 7239815 7441051 6943951 5737431
4412E737431p96961K99085O07923k45651r40899l37603Q39373R39787l65992j735515
$$ 5737431 4940470 5239555 5847478 5601827 4660928 4323325 5162698 6102485 5736493 4000978
4402D000978k075835j725407j246622k52432J409963K299274J026380j093656
$$ 4000978 1925143 199736 -1046886 -1299318 110645 2409919 3436299 2342643
4394B342643j125280J418711L592630K912693M17323j299508j447291r65235m88660
$$ 2342643 1217363 2636074 6228704 9141397 9558720 8259212 6811921 5846686 5358026
4385E358026j00627j56006p83239j334520j559970k185923l007794k052357J366847
$$ 5358026 5257399 5101393 4318154 2983634 1423664 -762259 -3770053 -5822410 -4455563
4376d455563M397879M065373J550008K6103m49674k032154l902336k763826J053531
$$ -4455563 -57684 4007689 5557697 5583800 5134126 3101972 -800364 -3564190 -2510659
4367b510659K921887R21230j173529l25003Q89325o74731k808564j642622J620984
$$ -2510659 411228 1332458 158929 -166074 723251 48520 -2760044 -4402666 -2781682
4358b781682K675295J020177j20002K29919J3508q63173J26185K965764L946761
$$ -2781682 -106387 913790 793788 1023707 1037215 174042 300227 3265991 7212752
4349G212752J297721j947269k599233j435177o20416j19898Q46302J266383j5365
$$ 7212752 8510473 6563204 3963971 2528794 1908378 1788480 2634782 3901165 3885800
4340C885800j724514j639326L28574K261388K549232R47193j461937k486033o50680
$$ 3885800 2161286 521960 850534 3111922 5661154 6608347 5146410 2660377 2009697
4331B009697K293325K732586J31938j916444j176122l31726k347505m930993l558344
$$ 2009697 4303022 7035608 7167546 5251102 4074980 3743254 1395749 -3535244 -7093588
4322g093588J380158M698405L581324P83041j52383M69816L41411p31092q58599
$$ -7093588 -5713430 -1015025 2566299 3349340 3196957 3666773 4008184 3277092 2418493
4313B418493O25732J821207O38590k258886l753199j946012J068450J438296j428408
$$ 2418493 3044225 4865432 5504022 3245136 -508063 -2454075 -1385625 52671 -1375737
4304a375737l939992l194772p19471L35406q7872M06206K252380K998644J029356
$$ -1375737 -5315729 -8510501 -9229972 -8894566 -8982438 -8576232 -6323852 -3325208 -2295852
4295b295852j938645k820610m85326L220782N072195L298895m90531k767423k102705
$$ -2295852 -4234497 -7055107 -7540433 -4319651 752544 4051439 3560908 793485 -1309220
4286a309220o40949o43345j234720m34404J123910J219719K7944R2519K198836
$$ -1309220 -1950169 -2593514 -3828234 -4262638 -3138728 -1919009 -1891065 -1798546 400290
4277D00290L949624L161477N73637j669302k545400k308148j475460n77113o5589
$$ 400290 4349914 7511391 8085028 6415726 3870326 1562178 86718 -490395 -555984
4268e55984J29871M02811O53158L24488o68203j665782j971353j427115m04656
$$ -555984 -426113 -23302 629856 954344 286141 -1379641 -3350994 -4778109 -5182765
4259e182765N60197J379824K488905L630905L204743M78341k077017j321673J602720
$$ -5182765 -4622568 -3242744 -753839 2877066 6081809 6560150 4483133 3161460 4764180
4250D764180K164337r28047l757164l397282j876923j451154m27037K476683L868605
$$ 4764180 6928517 6000470 2243306 -1153976 -3030899 -4482053 -4909090 -2432407 1436198
4241A436198Q61406k956930k541046L58913L87896j994338j473161K519445M612568
$$ 1436198 2297604 -659326 -3200372 -2841459 -2453563 -4447901 -5921062 -3401617 1210951
4232A210951K519592K16125N26574J035627k75919j157735K34421J694127R99784
$$ 1210951 3730543 3946668 4473242 5508869 5232950 4075215 4309636 6003763 7003547
4223G003547m63052p97991p32341j322724j774425j425960q63720Q1131K042165
$$ 7003547 6540495 5742504 5010163 3687439 1913014 487054 -376666 -295535 1746630
4214A746630L246547J162660k381175k699922J80670J052011j852197l835077
$$ 1746630 4993177 6155837 3774662 1074740 1255410 2307421 455224 -3379853
4206c379853j777450R25365Q20176J4274J257379K545112J161231j142896j394769
$$ -3379853 -5157303 -4231938 -3411762 -3397488 -2140109 405003 1566234 423338 -971431
4197i71431k30620L74369P69085J616556J716968Q41249J002160K277699J671667
$$ -971431 -1202051 -827682 -58597 1557959 3274927 4116176 5118336 7396035 9067702
4188I067702j311042k873509j412308l45245j569792k188713j009703j430952
$$ 9067702 7756660 4883151 3470843 3125598 1555806 -632907 -1642610 -3073562
4180c073562l829667k611551L920449Q360897N167738m48094j520808Q652o78816
$$ -3073562 -6903229 -9514780 -5594331 2766566 7934304 7486210 5965402 5974054 5295238
4171E295238j715742K80909J929899q08149l993909k308264J327675J750176J162281
$$ 5295238 3579496 3860405 5790304 4982155 988246 -1320018 7657 1757833 2920114
4162B920114L465237N461401L361005R71789J637435Q45253k509458O93710J1815054
$$ 2920114 6385351 11846752 15207757 16179546 17816981 18662234 16152776 16846486 28661540
4153B8661540J4868770M704656P523843M2462344P5084369N0762361k4499979
$$ 28661540 43530310 48234966 55758809 98221153 173305522 224067883 199567904
4146A99567904p9769550o8947923k5311820m791746j1511769j2591891N76806
$$ 199567904 119798354 50850431 25538611 20746865 9235096 -3356795 -2779989
4139b779989O926972q80186o468814j937685J538777j626655k257260L120076
$$ -2779989 4146983 3266797 -3202017 -5139702 -3600925 -5227580 -7484840 -4364764
4131d364764M768885j166128m917264r86927K605542k54719l560432j530130J283041
$$ -4364764 404121 -762007 -5679271 -6666198 -4060656 -4315375 -7875807 -9405937 -8122896
4122h122896m68072l573327l209188p28103J089028K954459M685117L205290j075481
$$ -8122896 -8590968 -12164295 -15373483 -16101586 -15012558 -12058099 -7372982 -4167692 -5243173
4113e243173k868066l42883K031814J669753J469838K607393J683398j721483
$$ -5243173 -8111239 -8454122 -6422308 -4752555 -3282717 -675324 1008074 -713409
4105g13409k631466M57652K095300o11088k705665l84866K101892J66054l050131
$$ -713409 -3344875 -2887223 -791923 -1403011 -4108676 -4493542 -2391650 -2225596 -5275727
4096e275727k496036K42659M50475j789292k926212k038747o95448N87443J746918
$$ -5275727 -7771763 -7529104 -7078629 -8867921 -11794133 -13832880 -14528328 -13940885 -12193967
4087a2193967J664949M64410M14967J980624K492538J104179P39475K417211K557278
$$ -12193967 -10529018 -10064608 -9649641 -7669017 -5176479 -4072300 -3332825 -915614 1641664
4078A641664n89050k833893o63919K669672K507358J05563o23062j12789j236836
$$ 1641664 1052614 -1781279 -2445198 224474 2731832 2837395 2214333 2101544 864708
4069H64708l103150k521608l8506P94473o75354j574075l00201J783692K995598
$$ 864708 -2238442 -4760050 -4798556 -4004083 -4679437 -6253512 -6553713 -4770021 -1774423
4060a774423K645160M87790k446220l546895j662523Q05012J124688m8459m72254
$$ -1774423 870737 1358527 -1087693 -4634588 -6297111 -5492099 -4367411 -4415870 -4888124
4051d888124Q7966N96718J148967J994644K044180R22639M99063J756034K378245
$$ -4888124 -4800158 -4203440 -3054473 -1059829 984351 1906990 2406053 4162087 6540332
4042F540332L44925k376430k907336j972304j840856j867823O311K893662M029005
$$ 6540332 6885257 4508827 1601491 -370813 -2211669 -4079492 -4073181 -1179519 2849486
4033B849486L087742J850767P03658r31155j794081k70520K030257J922124n04661
$$ 2849486 5937228 7787995 8491653 7560498 5766417 5495897 7526154 9448278 8943617
4024H943617k132712j611215n87944l99892p53478j531833k782570l041189q15848
$$ 8943617 6810905 5199690 4611746 4211854 3458376 1926543 -856027 -3897216 -4713064
4015d713064K254119K862834Q71581l97104Q12001K315891J601323o47645j906065
$$ -4713064 -2458945 403889 1275470 878366 1690367 4006258 5607581 4959936 3053871
4006C053871j138010K80058K90252j438960k619531p60850L048168M627354K194756
$$ 3053871 1915861 2195919 2486171 1047211 -1572320 -2333170 714998 5342352 7537108
3997G537108r67011j374676k94344p72050k107162j412357Q43427J466432J37497
$$ 7537108 6570097 5195421 4901077 4129027 2021865 609508 1452935 2919367 3056864
3988C056864k25820J141996J589771o09j220625n60511r0356j711566l712512
$$ 3056864 2831044 3973040 5562811 5562202 4341577 3781066 3690710 1979144 -1733368
3979a733368l305549n44748K203966L249324K646367J484864J024634J508311
$$ -1733368 -5038917 -5583665 -3379699 -130375 2515992 4000856 5025490 6533801
3971F533801J549045n1642k088994k357279r95617j64975m79491l72662P16332
$$ 6533801 8082846 8031204 5942210 3584931 2589314 2424339 1944848 1572186 2288518
3962B288518J254966L81717p58939j225929j498485j780531j392756m85403k7949
$$ 2288518 3543484 3925201 3166262 1940333 441848 -1338683 -2731439 -3216842 -3244791
3953c244791L26428J693730K930260J476912j947243l266230j231609K60925j490739
$$ -3244791 -2918363 -1224633 1705627 3182539 1235296 -2030934 -3262543 -3001618 -4492357
3944d492357l226884r46174L267311M236586J601695k12516O87495J341237k90648
$$ -4492357 -7719241 -8665415 -5398104 -1161518 440177 227661 915156 2256393 1965745
3935A965745j707691k43549K137960J449117k422973n300560m037167p1592K890518
$$ 1965745 258054 14505 2152465 3601582 1178609 -4121951 -8159118 -8230710 -5340192
3926e340192L148543J826285L83115r74690k235920k535442j269064O04073J609377
$$ -5340192 -2191649 -365364 17751 -956939 -3192859 -5728301 -6997365 -6393292 -4783915
3917d783915J641139J636020J790317J443405N18850k91683p05400r02600n65423
$$ -4783915 -3142776 -1506756 283561 1726966 2245816 1954133 1248733 346133 -219290
3908b19290O65500J876160J634861Q1481j348468k165389k865369k868574r64526
$$ -219290 446210 2322370 3957231 4038712 2690244 524855 -2340514 -5209088 -6173614
3899f173614J751234K195437k49935k187018q26354K056302K850093R83917j225911
$$ -6173614 -4422380 -2226943 -2476878 -4663896 -5490250 -3433948 -583855 400062 -825849
3890h25849k254580k465339k292101j632584q71561o90003q25214l51425Q34297
$$ -825849 -3080429 -5545768 -7837869 -9470453 -10342014 -11032017 -11857231 -12208656 -11374359
3881a1374359J824125J889112J153161L68203M40253J557317K503680J870837
$$ -11374359 -9550234 -7661122 -6507961 -6139758 -5699505 -4142188 -1638508 232329
3873B32329K54096k25815Q99847J611075O37080n88133o22822m82363j427090
$$ 232329 486425 260610 1160457 2771532 3408612 2820479 2197657 1715294 288204
3864B88204k320272j668458n74882q24761j392719Q740K779267M025164K826861
$$ 288204 -2032068 -3700526 -4275408 -5100169 -6492888 -6484148 -3704881 320283 3147144
3855C147144Q37018r74372k859224l729566j762623J796752K951398L02017k896500
$$ 3147144 3984162 3009790 150566 -3579000 -5341623 -3544871 -593473 -291456 -3187956
3846c187956l286040j194459J368468L459327M241399K314429j623961l965564
$$ -3187956 -6473996 -7668455 -6299987 -2840660 1400739 3715168 2091207 -1874357
3838a874357k635938k33080r5542j337940r62156P99409J026793p15156j501808
$$ -1874357 -4510295 -4743375 -4838917 -6176857 -7139013 -6339604 -5312811 -6027967 -7529775
3829g529775L59376K953877L667089K049718p74107l317883l824027j427450J956331
$$ -7529775 -7170399 -4216522 -549433 1500285 726178 -2591705 -6415732 -7843182 -5886851
3820e886851K951474Q55601j379961j187769N08696J374600R97858N46071M67231
$$ -5886851 -2935377 -2079776 -3459737 -4647506 -4138810 -2764210 -1766352 -1220281 -753050
3811g53050K86589o1772j53072J31991P12276J608312K338293J862848P4903j518741
$$ -753050 -466461 -528233 -681305 -549314 162962 1771274 4109567 5972415 6047318 4528577
3801D528577j633575q87561n75520o57731k64257N11185P17844N7796q12872j082351
$$ 4528577 2895002 2007441 1431921 774190 509933 1021118 1738962 1796758 983886 -98465
3791i8465j26107K031894L707376K463741j400096l826348j827893J871343K052713
$$ -98465 -224572 1807322 5514698 7978439 6578343 2751995 924102 2795445 4848158
3782D848158j694237m332587k393114J798497M088628L577309J891550M341j814871
$$ 4848158 3153921 -1178666 -3571780 -1773283 2315345 5892654 7784204 7788545 5973674
3773E973674k647698j935286p91925m36644l76385J71586M15564l81112p07295
$$ 5973674 3325976 1390690 598765 162121 -214264 -42678 372886 -8226 -715521
3764g15521J154412L675178L567266O70905j512446q74777K50838j461489n568848
$$ -715521 438891 4114069 7681335 8352240 6839794 5965017 6215855 4754366 -814482
3755h14482q258066o707546j716590L569322O366974N773711K730484p86475k777189
$$ -814482 -9072548 -15780094 -17496684 -13927362 -7560388 -1786677 943807 157332 -2619857
3746b619857k244286J07485K291437K791450J989240J296932J043412L60261o98854
$$ -2619857 -4864143 -4756658 -2465221 326229 2315469 3612401 4655813 5016074 4317220
3737D317220n87650J195799K487197J052029k040939l492460j983852L64706R38074
$$ 4317220 3729570 4925369 7412566 8464595 6423656 2931196 947344 1312050 2250124
3728B250124l21840j292006l02692K013752L255838J714873j587334l882587l837794
$$ 2250124 1928284 636278 333586 2347338 5603176 7318049 5730715 1848128 -1989666
3719a989666k715984j977074j307273j17996O90949L04140l1904J110420K446987
$$ -1989666 -4705650 -6682724 -7989997 -8107993 -7417044 -7112904 -7144808 -6034388 -3587401
3710c587401J610321p72902j485926N41007K587504K064117j89970j639098j254340
$$ -3587401 -1977080 -2749982 -4235908 -3694901 -1107397 956720 766750 -872348 -2126688
3701b126688J86413J493777J570457k21528k902832l925528j641538K519380N084654
$$ -2126688 -1940275 -446498 1123959 902431 -2000401 -5925929 -7567467 -5048087 36567
3692C6567L754232m85275m166089m407867j640579R89358J291693L31521L27239
$$ 36567 3790799 3305524 -860565 -5268432 -6909011 -5919653 -4627960 -4296439 -3969200
3683c969200J381439J759684O15633j210517k537892k484398o03833J908697K287534
$$ -3969200 -2587761 -828077 -212444 -1422961 -3960853 -6445251 -7049084 -5140387 -2852853
3674b852853k89672k450489p55282K939792L765882R04589j706195j749267j028416
$$ -2852853 -3142525 -5593014 -6348296 -3408504 357378 1261967 -444228 -2193495 -3221911
3665c221911o83104J160778M659627N666354J432934m289187n655108k181262
$$ -3221911 -3905015 -2744237 1915390 7581744 9014678 4725491 -929617 -3110879
3657c110879J584295K221944J16276k672172m073935k425975J871982N495588
$$ -3110879 -1526584 695360 811636 -1860536 -5934471 -8360446 -6488464 -992876
3649i92876N268461J748912j885826l588771l335600j581666Q64253K295320J704859
$$ -992876 4275585 6024497 4138671 549900 -2785700 -4367366 -3503113 -1207793 497066
3640D97066M06669K04316O60923O3934j613032k641989j971085j85887J364678
$$ 497066 903735 1108051 1768974 1832908 219876 -2422113 -4393198 -4579085 -3214407
3631c214407J221117j285575m454598m973698j869575J833006L159003L074441
$$ -3214407 -1993290 -3278865 -7733463 -12707161 -14576736 -12743730 -9584727 -6510286
3623f510286M071203N650043N138504J986008j512117l209879k692263o98165
$$ -6510286 -2439083 3210960 8349464 10335472 8823355 5613476 2921213 2223048
3615B223048J137311J132175j19887k9314J626079J394496k079706m316648j272683
$$ 2223048 3360359 4492534 4372647 4343333 5969412 7363908 5284202 967554 -305129
3606c05129L555161L734426l82304k717481j298544l42907k121366l375946j641255
$$ -305129 3250032 6984458 6602154 3884673 2586129 2243222 121856 -3254090 -4895345
3597d895345O66263R03676M6400m86639j291186j970163l00837L037308L615370
$$ -4895345 -4229082 -3325406 -3279006 -3765645 -5056831 -7026994 -7327831 -4290523 -675153
3588f75153K01663k077158P68145N219330N657006K371307n11336j834458k999529
$$ -675153 -473490 -2550648 -1782503 3436827 9093833 11465140 10953804 9119346 6119817
3579F119817l307643j189800J483850J596410K97154J209580L707386L273849
$$ 6119817 2812174 1622374 3106224 4702634 4999788 6209368 9916754 13190603
3571A3190603j076795m743884m174750j383634j88577j293794k823306l085022
$$ 13190603 12113808 7369924 3195174 1811540 1622963 329169 -2494137 -5579159
3563e579159j351456J821210L930696K456091j528054l938635k863658p37277
$$ -5579159 -6930615 -5109405 -1178709 1277382 -250672 -4189307 -7052965 -7790242
3555g790242k09957n14433K72761J759142K388598K313723K600432K755154J605953
$$ -7790242 -8000199 -8514632 -8241871 -6482729 -4094131 -1780408 820024 3575178 5181131
3546E181131l8157j98200R31464R70674q29673k095167q51903J316590J472357
$$ 5181131 5142974 4944774 5876238 6846912 6017239 3922072 3070169 4386759 5859116
3537E859116l78282j358783J2239J752829J442203l76599j362049r33709o87207
$$ 5859116 5480834 4122051 4134290 5887119 7329322 6952723 5590674 4656965 3969758
3528C969758j423941j857873j039249l17072j365497l244624l266468o81248K161988
$$ 3969758 2545817 687944 -351305 -668377 -2033874 -5278498 -8544966 -9226214 -7064226
3519g064226K872377J922182J451097K017329K086353P28441q55951j380878j595547
$$ -7064226 -4191849 -2269667 -818570 1198759 3285112 4013553 3157602 1776724 181177
3510A81177k658116l357964j490784J999355L200506P28621j768323p73962J866212
$$ 181177 -2476939 -5834903 -7325687 -5326332 -2125826 -1397205 -3165528 -3939490 -2073278
3501b073278J996831k76972r68410J327940L337479K204249o41079k047318j086732
$$ -2073278 -76447 -353419 -1321829 6111 3343590 5547839 4906760 2859442 1772710
3492A772710Q64479K068751J505572l22555j256393O498J398622M1689k893939
$$ 1772710 2637189 4705940 6211512 5888957 4632564 4639062 6037684 6079373 3185434
3483C185434l349822o83238J296756O28058N54J279404J888341k24493k295184
$$ 3185434 -164388 -847626 449130 1077188 1077742 2357146 4245487 4020994 1725810
3474A725810j413369J97841p97417k551798r48768L200418N118758L114779j12969
$$ 1725810 312441 510282 -287135 -2838933 -3787701 -587283 4531475 7646254 7533285
3465G533285k355008l448855k709425M32269L537007L448405J227711L53028N60374
$$ 7533285 5178277 1729422 -980003 -547734 2989273 6437678 7665389 8018417 8578791
3456H578791j344031m717599n024691j395734J628430J499798R97857J914742
$$ 8578791 7234760 2517161 -2507530 -3903264 -2274834 -775036 222821 2137563
3448B137563J364786k125876m301917j591635K423842K050322k078966m639034
$$ 2137563 3502349 1376473 -2925444 -4517079 -2093237 -42915 -2121881 -6760915
3440f760915l490060j041576P87218K269284L164794K461086Q39691K75290J255248
$$ -6760915 -10250975 -11292551 -10505333 -8236049 -5071255 -2610169 -1770478 -1495188 -239940
3431b39940K723560L990795M416031K607033j293626m066806l323670j368240
$$ -239940 2483620 6474415 10890446 13497479 12203853 8137047 4813377 3445137
3423C445137j576150k670871j183062J691318J368156j980431k661938J505160
$$ 3445137 1868987 -801884 -1984946 -293628 1074528 -905903 -3567841 -2062681
3415b062681N119438L251191j184911k203988N63463K520240J362125p96265j742713
$$ -2062681 3056757 6307948 5123037 2919049 3482512 6002752 7364877 6568612 4825899
3406D825899j710229j529812j235942q81419o43689q2724R90769J374782J11754
$$ 4825899 3115670 1585858 349916 -531503 -1175192 -1257916 -267147 1107635 1219389
3397A219389j390398j126164K08551K88474q57084r35924M90173J299955Q41866
$$ 1219389 -171009 -1297173 -1088622 -800148 -1657232 -2593156 -2102983 -803028 38838
3388C8838J114589K556957K322535q88019l656147k780690n34278r11999k838502
$$ 38838 1153427 3710384 6032919 5144900 1488753 -1291937 -1826215 -2738214 -5576716
3379e576716k114969R54896J585449j334857k822372K95848M085746L574436J77844
$$ -5576716 -7691685 -6736789 -5151340 -6486197 -9308569 -9012721 -4926975 -1352539 -1174695
3370a174695j174767L84636J535362O92221l93965m28183J502P69457K444724
$$ -1174695 -2349462 -1964826 -429464 262757 -131208 -559391 -557889 211568 2656292
3361B656292L933506L130965L52934j807375k333737k501563k547186j100982
$$ 2656292 6589798 9720763 10073697 8266322 5932585 3431022 883836 -217146
3353b17146J372118K206096Q32202j17113M74064J76898k096919l097719m34432
$$ -217146 1154972 3361068 4193270 4076157 4550221 4727119 2630200 -467519 -901951
3344i01951K585589J486234k417370m151573k639872j311656j768373j795820
$$ -901951 1683638 3169872 752502 -3399071 -6038943 -7350599 -9118972 -10914792
3336a0914792k65285O04993m55161j015966J167574M270940M881522K547394l13415
$$ -10914792 -11180077 -10575084 -11030245 -12046211 -10878637 -6607697 -1726175 821219 507804
3327E07804j671749j153569P28631K653219K665685K13622k427284k461816j01887
$$ 507804 -1163945 -2317514 -1588883 1064336 3730021 3943643 1516359 -945457 -1047344
3318a047344J758310J364611O3088R803J155447J409055o26354l763952n180038
$$ -1047344 710966 2075577 2138665 2148468 3303915 4712970 4086616 322664 -4857374
3309d857374l205553P43973L193520J950783j540848l554731j918242J823386
$$ -4857374 -8062927 -7318954 -4125434 -2174651 -3715499 -7270230 -9188472 -7365086
3301g365086M266471L782952J808407O81409R52243J227517K20341j678691k879964
$$ -7365086 -3098615 684337 2492744 3174153 4126396 5353913 5574254 3895563 1015599
3292A015599k335611q09423l81302k183804m504557m130716l17871L661151M303657
$$ 1015599 -1320012 -2129435 -2510737 -4694541 -9199098 -13329814 -13647685 -9986534 -5682877
3283e682877K276850J006764J466962J216395r56702k582064j415942P76869Q69532
$$ -5682877 -3406027 -2399263 -932301 284094 -672608 -3254672 -4670614 -3893745 -3024213
3274c024213r26345j778493o22714R54030J718655J935398J543494j26175k301298
$$ -3024213 -3950558 -5729051 -6351765 -5397735 -3679080 -1743682 -200188 -326363 -2627661
3265b627661k786766r25562J286936J907080J270289O80182L85486p0365n91908
$$ -2627661 -5414427 -6339989 -5053053 -3145973 -1875684 -1195502 -810016 -880381 -1472289
3256a472289o81237k63813J98422o587j338405k966495k730532K99050L542097
$$ -1472289 -2153526 -2417339 -2218917 -2225504 -3563909 -6530404 -9260936 -8961886 -5419789
3247e419789L338106j57135k877058k267860k21712N82304M89153R19578J066239
$$ -5419789 -2081683 -2238818 -5115876 -7383736 -7605448 -7023144 -6533991 -5614413 -4548174
3238d548174m61909k241830j633840Q18284J863652N80721j70686J723914M313875
$$ -4548174 -5010083 -7251913 -8885753 -8067469 -6203817 -5623096 -5793782 -4069868 244007
3229B44007M414979J912013o21420j507507j324410j084581p21826K29763J409223
$$ 244007 4658986 6570999 5949579 4442072 3117662 2033081 1311255 1541018 2950241
3220B950241J743728O87083r35629j586268p11570M90489N53493j60321J96972
$$ 2950241 4693969 5381052 4445423 2859155 2147585 2638074 3191567 3031246 3228218
3211C228218K147374L451458J634233k446198n008956l789936q60506Q1383j549629
$$ 3228218 5375592 8827050 10461283 8015085 3006129 -783807 -1644313 -1562930 -3112559
3202c112559k823508j518663J212856L178906M164564M820255M097087O15131
$$ -3112559 -5936067 -7454730 -6241874 -3062968 1101596 5921851 10018938 10634069
3194A0634069l841130n313030k850276P9235N95747R0048R58930K275102J682519
$$ 10634069 6792939 1479909 -1370367 -1291132 -695385 -605337 353593 2628695 4311214
3185D311214k35383j040947r02636k066550l977129l131924J022177L969267K263891
$$ 4311214 4075831 3034884 2132248 65698 -3911431 -7043355 -6021178 -2051911 211980
3176B11980j301557j789808P57089J944505j34136k439836j854107O12144J943687
$$ 211980 -1089577 -2879385 -2122296 -177791 -311927 -2751763 -4605870 -3993726 -2050039
3167b050039J371627N74763N70066L13896j298729l181110k846085L94667L814588
$$ -2050039 -678412 -103649 466417 780313 -518416 -3699526 -6545611 -6150944 -2336356
3158b336356L911757O00843k567511k862387j462264q71203r23896K49635K180022
$$ -2336356 1575401 2176244 -391267 -3253654 -4715918 -5587121 -6511017 -6261382 -4081360
3149d081360K128234l62379j979392k36712K767848L286534R64345j447317k344602
$$ -4081360 -1953126 -2315505 -4294897 -4531609 -1763761 1522773 2487118 1039801 -1304801
3140a304801k516474k420482j080315J475555K999718J830137m85934j069311
$$ -1304801 -3821275 -6241757 -7322072 -5846517 -2846799 -1016662 -1502596 -2571907
3132b571907M79750J765756R73470q93476j621828o48982N30183N12062k48884
$$ -2571907 -2092157 -326401 647069 -246407 -1868235 -2517217 -1987034 -1474972 -1723856
3123a723856j24995J541090L426166L527686J301188j742650l587858l659963
$$ -1723856 -1848851 -307761 3118405 6646091 7947279 6204629 2616771 -1043192
3115a043192l062127k933541k923045j753007O75246K461868J733235q08523k346315
$$ -1043192 -4105319 -7038860 -9961905 -11714912 -11039666 -8577798 -6844563 -7653086 -9999401
3106i999401j149682J503489K903010J629945j550727m477869m763499j442619
$$ -9999401 -11149083 -9645594 -6742584 -5112639 -6663366 -11141235 -15904734 -17347353
3098a7347353L469783O089433M642442J540035J77397P00280Q20523r7232m18736
$$ -17347353 -13877570 -7788137 -3145695 -1605660 -1428263 -727983 92540 -4692 -423428
3089d23428M43998R61407L79603K8804O09089O65661o27606j454320k28087J408087
$$ -423428 20570 981977 1361580 1390384 1999473 2665134 2037528 583208 355121 1763208
3079A763208R28098j087165j920412q09480N22181Q81732N56882m60702k451284
$$ 1763208 2691306 1604141 -316271 -1125751 -603570 278162 835044 374342 -2076942
3070b076942l984019k726018R63177L645984L124036J072356R2834Q4423p00112
$$ -2076942 -6060961 -8786979 -7823802 -4177818 -1053782 18574 111408 195831 -504281
3061e04281k389528l318222k557977r33071M61850J569939K945764M553768N192119
$$ -504281 -2893809 -6212031 -8770008 -9703079 -9241229 -7671290 -4725526 -171758 5020361
3052E020361L335303q82247m735370n150828k171599J033939K067728J758391
$$ 5020361 8355664 7473417 2738047 -2412781 -4584380 -3550441 -1482713 275678
3044B75678J906765K254542J422701j90892o22505O55895J811221J164746p61862
$$ 275678 2182443 4436985 5859686 5668794 5046289 5702184 7513405 8678151 7916289
3035G916289k334583k824241k488570j438903L93971K254612K620562R04632j391314
$$ 7916289 5581706 2757465 268895 -1170008 -776037 1478575 4099137 5003769 3612455
3026C612455k065180p61210O87120P30146l419K5026R56084J592479J189093n6046
$$ 3612455 1547275 786065 1473185 2203331 2199912 2224938 3181022 4773501 5962594 5906548
3016E906548j836227l633849m156698k582461k22123R01602J028535J957518L289903
$$ 5906548 4070321 436472 -3720226 -6302687 -6524810 -5623208 -4594673 -2637155 652748
3007F52748K370172j006432l042830j292633J176208O1317l602210m721514j229060
$$ 652748 3022920 2016488 -1026342 -2318975 -1142767 -1081450 -4683660 -9405174 -10634234
2998a0634234L505439N362378L665062L52012k450077l381233k487820j556118
$$ -10634234 -7128795 -1766417 1898645 2250657 -199420 -3580653 -6068473 -7624591
2990g624591k143357l077317j783983J796880M808018N286812M048348K274568
$$ -7624591 -9767948 -12845265 -14629248 -12832368 -8024350 -2737538 1310810 3585378
2982C585378j20363k595826l036419n77254K416980L072151J449381k49895o70861
$$ 3585378 3465015 869189 -2167230 -2744484 -327504 2744647 4194028 3944133 3273272
2973C273272l336J103641J755482R49018j003659k077081r38022J130844J985947
$$ 3273272 3269936 4373577 6129059 7078077 6074418 3997337 3059315 4190159 6176106
2964F176106J285214N7450j246081k658667l619901l619627l073347k151876l0303
$$ 6176106 7461320 7518770 6272689 3614022 -5879 -3625506 -6698853 -8850729 -8881032
2955h881032K930609L887853J097934k395232k012170J784738L751843J224803
$$ -8881032 -5950423 -2062570 -964636 -3359868 -5372038 -3587300 164543 1389346
2947A389346k286664k323161O71912K862204K261237J05434j712206k296922j392735
$$ 1389346 -897318 -3220479 -2548567 313637 2574874 2680308 968102 -1328820 -2721555
2938b721555P12478K842553L627234K685581P24277j201716k286744k488955k663308
$$ -2721555 -2009077 833476 4460710 7146291 7870568 6668852 4382108 1893153 -770155
2929g70155l373675l595422j963624N67005J283117k98639j169222R07926L806030
$$ -770155 -4143830 -7739252 -9702876 -9135871 -7852754 -8151393 -9320615 -8412689 -4606659
2920d606659L885846J047951j526672j822244o20348Q41141K114799K350126N94253
$$ -4606659 -720813 327138 -1199534 -3021778 -3642126 -2800985 -686186 1663940 2258193
2911B258193j905861k079947R63460M100123L833677N10247k470933k609370j30531
$$ 2258193 352332 -1727615 -764155 3335968 7169645 7679892 5208959 2599589 2469058
2902B469058L139906N074405L992399j4184m272033n471454l045446K05416J299162
$$ 2469058 5608964 10683369 14675768 14661584 10389551 4918097 1872651 2078067 3377229
2893C377229J25705j174577j024152M22233K434841M497948N509161L703308j100580
$$ 3377229 3502934 2328357 1304205 1726438 4161279 8659227 14168388 17871696 16771116
2884A6771116n824667o626073l379028K768M27559q71515r33448N12561J388694
$$ 16771116 10946449 4320376 941348 944116 1371675 500160 -433288 79273 1467967
2875A467967J036205R26450J562323J317232o97956k770238l021584k102020j784023
$$ 1467967 2504172 3430622 4992945 6310177 5612221 2841983 -179601 -2281621 -4065644
2866d065644k030566j372163L36230J464018J064555K13116K54832P95089L87268
$$ -4065644 -6096210 -7468373 -7132143 -5668125 -4603570 -4390454 -4135622 -3340533 -2953265
2857b953265j188725k305373j452849P37455K165138J908995J277965J725926
$$ -2953265 -4141990 -6447363 -7900212 -7162757 -4997619 -3088624 -1810659 -84733
2849h4733K684098K578704J299375Q4901p24286j884204k982519k125688J073448
$$ -84733 2599365 5178069 6477444 6562345 5838059 3953855 971336 -1154352 -80904
2840h0904L956890L751210Q93177j873235k678753j571634M35112J815705J069577
$$ -80904 3875986 7627196 8520373 6647138 3968385 2396751 2831863 4647568 5717145
2831E717145j415526k804956r49294K510091L987385K337561n45495k866312m197118
$$ 5717145 4301619 1496663 547369 3057460 7044845 9382406 8836911 5970599 1773481
2822A773481l898409j239786K271896L437141J472990o99908o07510N90699P24647
$$ 1773481 -2124928 -3364714 -1092818 2344323 3817313 3117405 2509895 3100594 3825241
2813C825241J39782K19524K55360j153599k657302j561007J399964K158193q41113
$$ 3825241 3965023 4184547 4439907 3286308 629006 -932001 467963 2626156 1785043
2804A785043l993409l605965j114951n47103k343762l016719p50857J926818K227117
$$ 1785043 -2208366 -5814331 -6929282 -7476385 -9820147 -12836866 -13587723 -11660905 -9433788
2795i433788J228064J724766L454869L241721j10512l492870l206573M01849L467457
$$ -9433788 -8205724 -6480958 -3026089 215632 105120 -3387750 -6594323 -6192474 -2725017
2786b725017L235282Q08932q76448p55854m38471j494092k927264k279524Q99057
$$ -2725017 510265 1319197 442749 -313105 -751576 -2245668 -5172932 -7452456 -6553399
2777f553399L902466L921305J329961j223406k326497k797516l385498l366641
$$ -6553399 -2650933 1270372 2600333 1376927 -949570 -3747086 -7132584 -10499225
2769a0499225j987114J82299K075655L184021L270188K301063J177103J082899
$$ -10499225 -12486339 -12304040 -10228385 -7044364 -3774176 -1473113 -296010 786889
2761G86889J504218N55467j922042l517073k685929r97489l48562n5155J112883
$$ 786889 2291107 2846574 924532 -2592541 -5278470 -6275959 -6624521 -6679676 -5566793
2752e566793K009813J059565m01985M9638J702207J667553l19469j401926n0259
$$ -5566793 -3556980 -2497415 -2899400 -2849762 -1147555 519998 200529 -1201397 -1251656
2743a251656K020882K765534J935969L6021k147340k760066n24852K492267K772054
$$ -1251656 769226 3534760 5470729 5506750 3359410 599344 74492 2566759 5338813
2734E338813M38590p65858P59751K290934J500349k45476j024688j413922k302625
$$ 5338813 5777403 5011545 5771296 8062230 9562579 9317103 8292415 6878493 4575868
2725D575868k665390j725352o39493l1183J283938L127737K867304R493j647470
$$ 4575868 1910478 185126 -454367 -485550 798388 3926125 6793429 6802922 5155452
2716E155452L04729K456940P87698k741378l409476j168380J84038l57265l88049
$$ 5155452 5460181 7917121 8704819 5963441 2553965 1385585 1569623 1212358 824309
2707H24309P00366R34506l798l55437r7690q29331j921183j294929m5100j350071
$$ 824309 1524675 2459181 2455383 2099946 2002256 1172925 -748258 -2043187 -2088287 -3438358
2697c438358m341774m408834q27847J446265j58013j396931J666938N747060N101500
$$ -3438358 -7780132 -12188966 -13016813 -11570548 -11728561 -13125492 -11458554 -5711494 -609994
2688f09994Q4609l767787l370868n39434K091017L569836L348833J090400j638416
$$ -609994 -525385 -4293172 -7664040 -8203474 -6112457 -2542621 806212 1896612 258196
2679B58196k075478M22811L333799L868591J935899j60404l70537J018666J890198
$$ 258196 -1817282 -1394471 1939328 5807919 7743818 7583414 7212877 8231543 10121741
2670A0121741R39399p30036j421983j422456k032978k655044j458316R04947J264902
$$ 10121741 11061140 10331104 8909121 7486665 5453687 2798643 1340327 2245274 3510176
2661C510176j343194l732547k949394j55255J726419K030819J906959J689515
$$ 3510176 2166982 -1565565 -4514959 -4670214 -2943795 -912976 993983 2683498
2653B683498R05641m00832k001124l677864l913579p50720M306768O096547K231058
$$ 2683498 3589139 3188307 1187183 -2490681 -6404260 -7154980 -2848212 3248335 5479393
2644E479393k842240l578765q75003J93342j527094k282167j44764K101139J771776
$$ 5479393 2637153 -941612 -1816615 -1623273 -3150367 -5432534 -5577298 -3476159 -1704383
2635a704383K8556p44188l38201P2120p3625p39731j564277j480597R7056J488047
$$ -1704383 -1675827 -2420015 -2758216 -2686096 -2759721 -3499452 -5063729 -6544326 -6447270 -4959223
2625d959223M49509k042427k422266L73537L270810L560871K163206R50754k28864
$$ -4959223 -4509714 -6552141 -8974407 -8600870 -5330060 -1769189 394017 1344771 1115907
2616A115907j757993k165260n71921Q55454o9577j608400m94274K589831L477611
$$ 1115907 -642086 -2807346 -3379267 -2523813 -2593390 -4201790 -4696064 -2106233 1371378
2607A371378N98637k671787k731635k01374J816879J949498J183602M69588l66542
$$ 1371378 1970015 -701772 -3433407 -3634781 -1817902 131596 1315198 1784786 1418244
2598A418244j529044k483904k556792j624838j33510J141661J502297J042466
$$ 1418244 -110800 -2594704 -5151496 -6776334 -6909844 -5768183 -4265886 -3223420
2590c223420Q26947J688077K829891K417858r4925k909054l744556k312704k64816
$$ -3223420 -2396473 -708396 2121495 4539353 4444428 1535374 -2209182 -4521886 -4786702
2581d786702R07015R97770L52053p61140j726532j665071o29750J02088l18232
$$ -4786702 -3879687 -2881917 -2529864 -3291004 -5017536 -6682607 -7312357 -7210269 -7528501
2572g528501j067410q78042J51699R65926J225792J398273J486985R89493J55843
$$ -7528501 -8595911 -9473953 -9322254 -8356328 -7130536 -5732263 -4245278 -3255785 -3099942
2563c099942L0204Q92107J688981J470520N07611n04306j487764k524155l054312
$$ -3099942 -3069738 -2177631 -488650 981870 1489481 985175 -502589 -3026744 -6081056
2554f081056k477921j256884n34759o60489q48092m66897P0836J78035K44387
$$ -6081056 -8558977 -9815861 -10350620 -11011109 -11859201 -12326098 -12255262 -12077227 -11832840
2545a1832840J083600K447267L102439K592934J877793J680934J374043N54421
$$ -11832840 -10749240 -8301973 -5199534 -2606600 -728807 952127 2326170 2880591
2537B880591N09204K207373L601581J603922k999648n457209l152589P43094J743455
$$ 2880591 3389795 5597168 9198749 10802671 7803023 2345814 -806775 -63681 1679774
2528A679774r398j055473l02074J57954m61816q5001K262583M058292K823557
$$ 1679774 1670376 614903 312829 470783 8967 -76034 2186549 6244841 9068398
2519I068398o8872j424226p74912m51638j525647k119525m72772K042205K393415
$$ 9068398 8999526 7575300 6800388 6348750 4823103 2703578 2230806 4273011 6666426
2510F666426k12651l215186l644005j245757J826096L652654L879496K810925
$$ 6666426 6453775 3238589 -405416 -1651173 174923 3827577 7707073 10517998
2502A0517998O69897j733087k807429j720066M22311J777597J716914Q65523j52469
$$ 10517998 11187895 9454808 6647379 4927313 5349624 7127221 8844135 9709658 9557189
2493I557189r78874j023015J0024J158566R72918n14553j557746q41626Q44303
$$ 9557189 8578315 7555300 7565324 8723890 9696808 9182255 7624509 6782883 7627186
2484G627186J580537O25091o97651n08329J304856K624345J479059j318633k894465
$$ 7627186 9207723 9832814 9135163 8626834 9931690 12556035 14035094 12716461 9821996
2475I821996j874295m4592J96021j121124k121685j828913j006786p06073j107018
$$ 9821996 7947701 7903109 8099130 6978006 4856321 3027408 2020622 1314549 207531
2466B07531j630965j505788n80434O4887p48494k086930j343341K045055M976857
$$ 207531 -1423434 -2929222 -3509656 -3444769 -4193263 -6280193 -7623534 -5578479 -601622
2457f01622M456741J491039q25459j655217k193903k232547l30746K655658L555130
$$ -601622 3855119 5346158 4520699 2865482 671579 -1560968 -1891714 763944 4319074
2448D319074J268357j418397j494175Q09963L106990L559871J706339j571696
$$ 4319074 5587431 4169034 2674859 3484822 6591812 10151683 11858022 10286326
2440A0286326l989953l467003p50531J024721J89193j558598j861619o94853L65190
$$ 10286326 6296373 2829370 2078839 3103560 3292753 1734155 -127464 -822317 -457127
2431d57127M48650j44710p41293o58734L46208J416146J299572M7274j066053
$$ -457127 -8477 -153187 -894480 -1553214 -1207006 209140 1508712 1555986 489933
2422D89933j450638j674551j873698j283974K56201J813818K700134K946413K481449
$$ 489933 -960705 -2635256 -4508954 -5792928 -5536727 -3722909 -1022775 1923638 4405087
2413D405087J430061Q95639J393960J055411j812290m815862l857959L41691K444755
$$ 4405087 5835148 6730787 8124747 9180158 7367868 2552006 -1305953 -964262 1480493
2404A480493L57427j754957m64874J674051J264615K5766J007445K401538O63426
$$ 1480493 1837920 82963 -381911 1292140 2556755 2582521 3589966 5991504 6654930
2395F654930k505953k248118J399903L397269J677772l70219l40913l95575k395070
$$ 6654930 4148977 1900859 3300762 6698031 8375803 8005584 7664671 7269096 4874026
2386D874026m026622k648094L55354J938512J606578O59816n43176j890244j955618
$$ 4874026 847404 -1800690 -1445336 493176 2099754 2759570 2216394 326150 -1629468
2377a629468k704J745564O79040k136715l183478j379208R11365J740520J749834
$$ -1629468 -1632172 113392 792432 -1344283 -4527761 -5906969 -4995604 -3255084 -1505250
2368a505250J885413J532137K97057m12374N16328J624902Q07898j335141k306038
$$ -1505250 380163 1912300 2209357 1796983 2313311 3938213 4746111 3410970 1104932
2359A104932j487574p41332j133897j578702j332103j164399q96196J269532M871697
$$ 1104932 -382642 -1123974 -2257871 -3836573 -5168676 -6333075 -7229271 -5959739 -1088042
2350a088042N638246J151470m254696m508950k96271K272849Q91298n66296L70244
$$ -1088042 4550204 5701674 1446978 -3061972 -3358243 -1085394 -194096 -760392 -390148
2341c90148O90129j974488m299965k389378J735754L163786J129814j199513k115418
$$ -390148 299981 -1674507 -5974472 -8363850 -6628096 -3464310 -2334496 -3534009 -5649427
2332e649427k330334j808779J81755K366725K550938J222723P60013J306840Q73588
$$ -5649427 -7979761 -9788540 -9606785 -7240060 -4689122 -3466399 -2706386 -1399546 -525958
2323e25958m83979k52703K089541L620004K292456j10239j021289q18629j440824
$$ -525958 -1009937 -1262640 826901 4446905 6739361 6629122 5607833 4789204 3348380
2314C348380k702886k303353N80268L407243K963286n05989l111881k024534P45312
$$ 3348380 645494 -1657859 -1077591 2329652 5292938 4786949 1675068 -349466 395846
2305C95846J085128j308081k532704l94919K457569K820128J405982P86094J306499
$$ 395846 1480974 172893 -2359811 -2754730 -297161 2522967 3928949 4715043 6021542
2296F021542J614119J272731M30719j196380k773427k101714O37331J685172p57542
$$ 6021542 7635661 8908392 9339111 8142731 5369304 3267590 3904921 5590093 4832551
2287D832551k939960j362152J082888j70129l220794k453550K097373M703198
$$ 4832551 1892591 530439 1613327 1443198 -1777596 -4231146 -2133773 2569425
2279B569425K964900M69677j71953p68403k514598l065417q39635K149140L673795
$$ 2569425 5534325 6004002 5832049 5063646 2549048 -516369 -1356004 793136 4466931
2270D466931L754906K562095j68772k658998k284071k10959l84316l000012l959237
$$ 4466931 8221837 10783932 10615160 7956162 5672091 5461132 5076816 2076804 -1882433
2261a882433j980465p35454k028842k546443j29000K106404J237730p19683j032063
$$ -1882433 -3862898 -4598352 -6627194 -9173637 -9302637 -7196233 -5958503 -6678186 -7710249
2252g710249p19827j282809j271213K65069J105390K74857Q17452M228379O489887
$$ -7710249 -8430076 -9712885 -10984098 -10719029 -9613639 -9338782 -8521330 -4292951 2196936
2243B196936M138225K29858n55437R10374Q84885p58775j787053k281669l057045
$$ 2196936 6335161 6565019 6009582 6919956 7804841 7046066 5259013 2977344 -79701
2234g9701k394735O02962K460650M17827k044056m72656K838787K764310K05145
$$ -79701 -2474436 -1871474 589176 1007003 -1037053 -1509709 1329078 4093388 4298533
2225D298533o2485J619362N71288l336562n111096l043401p15560j05941O97636
$$ 4298533 4236048 5855410 6426698 3090136 -2020960 -5064361 -5779921 -5885862 -5188226
2216e188226K137244J962782M63200P92776K815004K575601o88921k901450k013810
$$ -5188226 -3050982 -1088200 -625000 167776 2982780 5558381 4869460 1968010 -45800
2207d5800o04489J7032J984096M880332M118817j270207n224818l238060Q22189
$$ -45800 -650289 -633257 1350839 6231171 10349988 9079781 3854963 616903 1439092
2198A439092J116230j416243j848306N68319K312649J655659J80905o39934p62293
$$ 1439092 2555322 1139079 -709227 -140908 2171741 3827400 4008305 3368371 2606078
2189B606078l02410L03376j76466k007114l496225l357826k368948j357350J19976
$$ 2606078 2303668 2607044 2430578 423464 -3072761 -6430587 -8799535 -10156885 -10036909
2180a0036909J626384J221677j064262k045879L6533K593176K811752J796941
$$ -10036909 -8410525 -7188848 -8253110 -10298989 -10262456 -7669280 -4857528 -3060587
2172c060587J788379K145486J400540P50097J862041L214344K232443m97701k455652
$$ -3060587 -1272208 873278 2273818 3023915 4885956 8100300 10332743 9835042 7379390
2163G379390l049219l037743j835841J021032L176059K017120j023866k332256
$$ 7379390 4330171 1292428 -543413 477619 3653678 5670798 4646932 2314676
2155B314676j394113n94278n35497M63385K386443K952731J478290o4398m12703
$$ 2314676 920563 326285 -209212 254173 2640616 5593347 7071637 7007239 6594536
2146F594536m18270n99640l08450K5494j131141l190097l140161k9468K748804
$$ 6594536 6176266 5576626 5268176 5293670 4162529 972432 -2167729 -2197197 551607
2137E51607J693042j977150l898215k174610N78744R66048q30463j513667O60289
$$ 551607 2244649 267499 -3630716 -5805326 -5226582 -4260534 -5090997 -6604664 -5944375
2128e944375L077726K077853j614763l315576q41443K295820K001241o82129j817042
$$ -5944375 -2866649 -788796 -2403559 -5719135 -6560578 -4264758 -2263517 -2945646 -4762688
2119d762688n78393N54177N64892J016716K429624L079014K017396L23363j287632
$$ -4762688 -5341081 -4786904 -4222012 -3205296 -775672 2303342 4320738 4644101 3356469
2110C356469l201786m538977l201319L11883K092051n2872k950779k053379K413490
$$ 3356469 154683 -4384294 -7585613 -7273730 -5181679 -5234551 -8185330 -10238709 -7825219
2101g825219N868228N259863K136593k45685q72823j153808k241583l405263l219550
$$ -7825219 -1956991 3302872 5439465 5193780 4320957 3167149 925566 -2479697 -5699247
2092e699247j642025o3982O62518J145547J878827K010324Q96095k11578K16283
$$ -5699247 -7341272 -7405254 -6742736 -5597189 -3718362 -1708038 -811943 -1023521 -807238
2083h07238J437665J610064J020702J553632K825338J872296k056628n080183
$$ -807238 630427 2240491 3261193 4814825 7640163 9512459 7455831 2375648
2075B375648l322048J644770M474714K564340j276995k696701n91467K461212
$$ 2375648 -946400 698370 5173084 7737424 6460429 3763728 3172261 5633473
2067E633473L378539J427358j617278l508401l511127k457683j321036l88887
$$ 5633473 9012012 10439370 8822092 5313691 1802564 -655119 -1976155 -2365042
2059b365042K66395M49176L33060M84510Q78403O35512o03255j767516j728464
$$ -2365042 -2098647 -1649471 -1316411 -831901 46502 682014 78759 -1688757 -3417221
2050c417221j008120r51032j464194j017019Q00940K168124J511027O5642L26910
$$ -3417221 -4425341 -5376373 -6840567 -7857586 -7056646 -4888522 -3377495 -3311853 -2984943
2041b984943K215911K738259K21226k791898k535702J003604M120221M205562
$$ -2984943 -769032 1969227 2190453 -601445 -3137147 -2133543 1986678 6192240
2033F192240K402909R56285O7823j178332k350584k164964q39982p3166o30113
$$ 6192240 8595149 9551434 9619257 8440925 6090341 3925377 3085395 3012229 2382116
2024B382116j431664j319349n17802J44061N14823Q94816J037966K31675j448423
$$ 2382116 950452 -368897 -886699 -742638 -227815 667001 1704967 1936642 488219
2015D88219k486006j266223J668536L420739J736430k054189m237898k940591
$$ 488219 -1997787 -3264010 -1595474 1825265 3561695 1507506 -2730392 -5670983
2007e670983M2277J874162J742904P06815p5582P2995J330941K696243K275942
$$ -5670983 -5628706 -3754544 -2011640 -1304825 -1380407 -1307412 23529 2719772 4995714
1998D995714m13275l143928l256780o81959K432441M374125M798852L694416J184311
$$ 4995714 4582439 1438511 -1818269 -2500228 -67787 4306338 9105190 12799606 13983917
1989A3983917j643050l212092l170471k676867k643303k408110o86917K295277
$$ 13983917 12340867 9128775 5958304 3281437 638134 -1769976 -2456893 -161616
1981a61616M141303K589481j179397k893753m14773K646679J369734l022964m175149
$$ -161616 3979687 6569168 5389771 2496018 2081245 4727924 6097658 3074694 -1100455
1972a100455J34429M272542K838540j683774l324681j445009k00377j159882j838732
$$ -1100455 -966026 3306516 6145056 4461282 1136601 -308408 -508785 -1668667 -3507399
1963c507399j004300l30873m00735L57821J895456J885941M581r98534J11717
$$ -3507399 -4511699 -4842572 -5243307 -4885486 -2990030 -1104089 -1099508 -2098042 -1986325
1954a986325J068953L86836Q0934J873152L687056K566404r84530l869257m046595
$$ -1986325 -917372 -530536 -449602 1423550 5110606 7677010 6692480 2823223 -1223372
1945a223372j646186J831052L872379K359090j658191m174808k830938J50005
$$ -1223372 -2869558 -1038506 2833873 5192963 3534772 -640036 -3470974 -3320969
1937c320969J053382p44005k689478k296386O57161L972574M432420R44902l294618
$$ -3320969 -2267587 -3011592 -5701070 -7997456 -7340295 -3367721 1064699 2009601 -1285017
1928a285017l893810r17241J304770O96849K05911K322906M511521L088809j088497
$$ -1285017 -5178827 -6096068 -4791298 -4094449 -3888538 -1565632 2945889 6034698 4946201
1919D946201m114458m255728k644311m98268J304213J364882m94693j808805m92473
$$ 4946201 831743 -3423985 -6068296 -6566564 -5262351 -3897469 -4392162 -6200967 -6693440
1910f693440J983594L004834K713385K522399J585494j460503m519570m027528
$$ -6693440 -4709846 -1705012 1008373 3530772 5116266 3655763 -863807 -4891335
1902d891335m89227J970525J567069N39005O52708Q98255M22555J44011K84585
$$ -4891335 -5380562 -3410037 -1842968 -1303963 -651255 247000 669555 813566 1098151
1893A098151n19502k364142l202933k107245p23169k32126M32005J912630K700405
$$ 1098151 578649 -1785493 -4988426 -7095671 -7818840 -8050966 -7618961 -5706331 -3005926
1884c005926J871960J094579J815569K575871J424929p07066j502651r01781p85198
$$ -3005926 -1133966 -39387 1776182 4352053 5776982 5069916 3567265 2665484 1880286
1875A880286j674241k059256r66864O22578J203374M26907q18972j241338q4378
$$ 1880286 206045 -1853211 -2820075 -2197497 -994123 -567216 -1386188 -2627526 -2711904
1866b711904K122404L822923L863124K508972Q67096k62916p44567q78701j120542
$$ -2711904 -589500 3233423 7096547 9605519 10472615 10209699 9465132 8586431 7465889
1857G465889j569512j664967r85078k49686n72173j669374j991760r49214K02327
$$ 7465889 5896377 4231410 3246332 2996646 2424473 755099 -1236661 -2185875 -1983548
1848a983548K74071j58283J94694J341084J928202Q91527j242458k587980j624145
$$ -1983548 -1709477 -1867760 -1673066 -331982 1596220 2487747 1245289 -1342691 -2966836
1839b966836Q59738K081703M94398j928349k129955j67630J119396N03167j65540
$$ -2966836 -2107098 -25395 469003 -1459346 -3589301 -3756931 -2637535 -2134368 -2299908
1830b299908N11785J199533N12576l91697J06490J267159J440623Q64000O60354
$$ -2299908 -1788123 -588590 -76014 -467711 -361221 905938 2346561 3210561 3870915
1821C870915K41730j607273l684098l264650k46921K118372J453153o90566j065381
$$ 3870915 4112645 2505372 -1178726 -4443376 -4690297 -2571925 -1118772 -1809338 -2874719
1812b874719J227908L962502M404539K033094j039437k142112p83320R06135Q32662
$$ -2874719 -1646811 2315691 6720230 8753324 7713887 5571775 4788455 5694590 6527252
1803F527252o31574j721587j938324k098273k192553j186475P61468J737460N84278
$$ 6527252 5895678 4174091 2235767 137494 -2055059 -3241534 -2480066 -742606 -158328
1794a58328j357994j941429o75548J226518K317850J724806n06265k963275l610128
$$ -158328 -1516322 -3457751 -4133299 -2906781 -588931 1135875 629610 -2333665 -5943793
1785e943793j946550K05618Q96165L01324r1314L12083J038545J860789K745881
$$ -5943793 -7890343 -7684725 -6788560 -6487236 -6578550 -6266467 -5227922 -3367133 -621252
1776f21252K831926J131416j574238l025697k157935l20685O69813N78726J64610
$$ -621252 2210674 3342090 1767852 -1257845 -3415780 -3736465 -3066652 -2487926 -2323316
1767b323316m15003j506209k734591k964271j635094M06095J695550J716473J496717
$$ -2323316 -2738319 -4244528 -6979119 -9943390 -11578484 -11172389 -9476839 -7760366 -6263649
1758f263649K315700L791177M013095K119961j85255q17362j41236M8555l67565
$$ -6263649 -3947949 -156772 3856323 5976284 5791029 4973667 4832431 4880986 4513421
1749D513421j50537J67923j376532m027347l968894l7696L437343K396709r83002
$$ 4513421 4362884 4530807 3154275 -873072 -4841966 -4879662 -1442319 954390 -28612
1740b8612j703587O31607K050471Q44273n82598n57509m72623j305048j585109
$$ -28612 -1732199 -1100592 949879 1794152 1211554 654045 181422 -1123626 -2708735
1731b708735k81847J347282K086896K162948J376768j006786l418200k572444
$$ -2708735 -2990582 -1643300 443596 2606544 3983312 2976526 -441674 -3014118
1723c014118J439607M159885K927458N49470L47762J064986j30252k675125m180512
$$ -3014118 -1574511 2585374 5512832 6062302 6410064 7475050 7344798 4669673 489161
1714D89161m314675l616810j123407K959384M873182K053891k002048k362684
$$ 489161 -3825514 -7442324 -8565731 -5606347 -733165 1320726 -681322 -3044006
1706c044006r896P58822K56907K176012N320433M026928k081151n899540l125401
$$ -3044006 -3053902 -2295080 -2038173 137839 5458272 9485200 7404049 1504509 -1620892
1697a620892J377593J204704k582513m421409k535573K73188J782543K164202
$$ -1620892 -243299 961405 -1621108 -6042517 -8578090 -8304902 -6522359 -4358157
1689d358157J903577J194218P04641P00984K76716r32278j599641p78051M64464
$$ -4358157 -2454580 -1260362 -555721 145263 421979 -510299 -2109940 -2887991 -2423527
1680b423527R77913J355724K221163K457994R35150j441295k895323k669570q15422
$$ -2423527 -1445614 -89890 2131273 4589267 5524417 4083122 1187799 -1481771 -2297193
1671b297193K079428M128699L405647Q83238m90342m57161j759277m560575m896117
$$ -2297193 -217765 3910934 7316581 8199819 7709477 7252316 5493039 932464 -3963653
1662c963653j173778K203790J402079o87192M78722L254602K686682r40489k466534
$$ -3963653 -5137431 -2933641 -1531562 -2218754 -1740032 1514570 4201252 3260763 794229
1653G94229k6831K728261K778689J211326r5522j043883j741287j860208k087298
$$ 794229 767398 3495659 6274348 7485674 7390152 6346269 4604982 2744774 657476
1644F57476l056221k957579J64960L954761L850256n3297k758696j787253j42261
$$ 657476 -2398745 -5356324 -5191364 -1236603 2613653 2560356 -198340 -1985593 -2127854
1635b127854l79977n67283J215713K608571Q13665k290528k640444J95885K954174
$$ -2127854 -2507831 -3075114 -1859401 749170 1562835 -727693 -3368137 -3172252 -218078
1626b18078L294005J761404q5226j208945j181691m31743q8874o15223j285160
$$ -218078 3075927 4837331 4752105 3543160 2361469 1929726 1840852 1225629 -59531
1617e9531j611686k009170k343396j478040O74770K286609K059812J048002P56479
$$ -59531 -1671217 -3680387 -6023783 -7501823 -6827053 -4540444 -2480632 -1432630 -676151
1608f76151R48092P94061P68595J670733K776627K634670J123421n30184j309106
$$ -676151 271941 1066002 1834597 3505330 6281957 8916627 10040048 9509864 8200758
1599H200758j145704o55485o08454r88166o35158R32006J740461l45352l601540
$$ 8200758 7055054 6399569 5791115 4802949 4167791 5099797 6840258 6494906 2893366
1590B893366l804220m18801K057214P40685j232677K6089K614125J832879k085072
$$ 2893366 -910854 -1329655 727559 1468244 235567 261656 2875781 4708660 2623588
1581B623588m051557j723042J410013J583064k20983p57538M63908J086955j78671
$$ 2623588 -1427969 -3151011 -1740998 -157934 -378917 -1136455 -672547 414408 235737
1572B35737j670252j078664J414521L112018K016522n88055j704639n16786P96188
$$ 235737 -1434515 -2513179 -1098658 2013360 4029882 3441827 1737188 1220402 2016590
1563B016590M62508m83781k59867Q71559J389833Q12898l66679j869777l126270
$$ 2016590 2479098 1995317 1735450 2607009 3996842 4809740 4443061 2573284 -552986
1554e52986k773406n04934J628887J685071N47453J39750R7511j212424l226511
$$ -552986 -3326392 -3831326 -2202439 -517368 30085 169835 267346 -945078 -4171589
1545d171589l681108k236963o57777N77833K674516N056439M829505J151312k572124
$$ -4171589 -7852697 -10089660 -10747437 -10169604 -7495088 -2438649 2390856 3542168 970044
1536I70044k808147l30009J363463O41460j130511k119354j849470q02374L89247
$$ 970044 -1838103 -2168112 -804649 -163189 -1293700 -3413054 -5262524 -6064898 -5675651
1527e675651J183336J275802P11226j70047p24587k99240Q09531J108769l16505
$$ -5675651 -4492315 -3216513 -2505287 -2675334 -3399921 -3699161 -2889630 -1780861 -2097366
1518b097366k115827k133599l88436J016791J000018O77169J042569J380679Q26361
$$ -2097366 -4213193 -6346792 -6735228 -5718437 -4718419 -4041250 -2998681 -1618002 -791641
1509g91641j49982p87252j075809q17593P07377K856430L035290j56414m249040
$$ -791641 -941623 -1728875 -2804684 -3622277 -2914900 -58470 2976820 2820406 -1428634
$$ [...]
##END NTUPLES=NMR SPECTRUM
##END=
