##TITLE=31P_DE-80H_X3
 64 sc D2O
 26.2.2025
##JCAMPDX= 6.0         $$ Bruker NMR JCAMP-DX V2.0
##DATA TYPE= NMR SPECTRUM
##DATA CLASS= NTUPLES
##ORIGIN= UXNMR, Bruker Analytische Messtechnik GmbH
##OWNER= root
$$ XWIN-NMR		Version 3.5
$$ Tue Apr 22 10:05:49 2025 Russian Standard Time (UT+4h)  Yarkov@DPX200
##.OBSERVE FREQUENCY= 81.013821
##.OBSERVE NUCLEUS= ^31P
##.ACQUISITION MODE= SIMULTANEOUS
##.ACQUISITION SCHEME= undefined
##.AVERAGES= 64
##.DIGITISER RES= 17
##SPECTROMETER/DATA SYSTEM= spect
##.PULSE SEQUENCE= zgpg30
##.SOLVENT NAME= DMSO
##.SHIFT REFERENCE= (INTERNAL, DMSO, 0, 198.062)
##AUDIT TRAIL= $$ (NUMBER, WHEN, WHO, WHERE, WHAT)
$$ ##TITLE= Audit trail, XWIN-NMR		Version 3.5
$$ ##JCAMPDX= 5.01
$$ ##ORIGIN= Bruker BioSpin GmbH
$$ ##OWNER= Yarkov
$$ C:/Bruker/XWIN-NMR/data/yarkov2/nmr/P31/2/pdata/1/auditp.txt
$$ ##AUDIT TRAIL=  $$ (NUMBER, WHEN, WHO, WHERE, WHAT)
(   1,<2025-04-22 10:04:47.29 +0400>,<Yarkov>,<DPX200>,
      <created by zg, POWCHK disabled, PULCHK disabled
       configuration hash MD5:
       00 E9 B6 7A A2 85 ED C7 34 08 36 98 17 FE 4E 26
       data hash MD5: 32K
       93 E3 F4 84 C3 3B D9 01 08 C9 DD 78 C4 3D 13 9D>)
(   2,<2025-04-22 10:04:55.64 +0400>,<Yarkov>,<DPX200>,
      <Start of raw data processing
       efp BC_mod = 2 LB = 1.5 FT_mod = 6 PKNL = 1 PHC0 = 1784.265 PHC1 = 23.09541 SI = 64K 
       data hash MD5: 64K
       FB 3C 9F 11 FA C2 F2 E8 82 62 A0 B2 B9 0B EC 62>)
(   3,<2025-04-22 10:05:10.40 +0400>,<Yarkov>,<DPX200>,
      <abs ABSG = 5 
       data hash MD5: 64K
       10 60 E4 EF 59 93 C6 CA 0A 32 B1 54 7A 6B 35 18>)
$$ ##END=
$$ 
$$ hash MD5
$$ BB 16 67 CD 31 F5 5E C1 40 9E A6 A1 FF 68 A2 26
##$RELAX= 
##$RELAX= 
##$RELAX= 
##$RELAX= 
##$RELAX= 
##$RELAX= 
##$RELAX= 
##$RELAX= 
$$ Bruker specific parameters
$$ --------------------------
##$DU= <C:/Bruker/XWIN-NMR>
##$EXPNO= 2
##$NAME= <P31>
##$PROCNO= 1
##$TYPE= <nmr>
##$USER= <yarkov2>
##$AMP= (0..31)
100 100 100 100 100 100 100 100 100 100 100 100 100 100 100 100 100 100 
100 100 100 100 100 100 100 100 100 100 100 100 100 100 
##$AQSEQ= 0
##$AQ_mod= 1
##$AUNM= <au_zg>
##$AUTOPOS= <>
##$BF1= 81.014009
##$BF2= 200.13
##$BF3= 200.13
##$BF4= 200.13
##$BF5= 200.13
##$BF6= 200.13
##$BF7= 200.13
##$BF8= 200.13
##$BYTORDA= 1
##$CFDGTYP= 0
##$CFRGTYP= 5
##$CHEMSTR= <none>
##$CNST= (0..31)
1 1 145 1 1 1 1 1 1 1 1 1 1 1 1 1 1 1 1 1 1 1 1 1 1 1 1 1 1 1 1 1 
##$CPDPRG= <waltz16>
##$CPDPRG1= <>
##$CPDPRG2= <waltz16>
##$CPDPRG3= <>
##$CPDPRG4= <mlev>
##$CPDPRG5= <mlev>
##$CPDPRG6= <mlev>
##$CPDPRG7= <mlev>
##$CPDPRG8= <mlev>
##$CPDPRGB= <>
##$CPDPRGT= <>
##$D= (0..31)
0 1 0 0 0 0 0 0 0 0.06 0 0.03 2e-05 3e-06 0 0 0.0002 0 0 0 0 0 0 0 0 0 
0 0 0 0 0 0 
##$DATE= 1745301886
##$DBL= (0..7)
120 120 120 11 120 120 24 19 
##$DBP= (0..7)
150 150 150 150 150 150 150 150 
##$DBP07= 0
##$DBPNAM0= <>
##$DBPNAM1= <>
##$DBPNAM2= <>
##$DBPNAM3= <>
##$DBPNAM4= <>
##$DBPNAM5= <>
##$DBPNAM6= <>
##$DBPNAM7= <>
##$DBPOAL= (0..7)
0.5 0.5 0.5 0.5 0.5 0.5 0.5 0.5 
$$ [...]
##$SUBNAM3= <"">
##$SUBNAM4= <"">
##$SUBNAM5= <"">
##$SUBNAM6= <"">
##$SUBNAM7= <"">
##$SUBNAM8= <"">
##$SUBNAM9= <"">
##$SW= 400.765351723535
##$SWIBOX= (0..15)
0 1 3 0 0 0 0 0 0 0 0 0 0 0 0 0 
##$SW_h= 32467.5324675325
##$TD= 32768
##$TD0= 1
##$TE= 0
##$TE2= 300
##$TE3= 300
##$TEG= 300
##$TL= (0..7)
0 120 53 12 22 120 120 120 
##$TP= (0..7)
150 150 150 150 150 150 150 150 
##$TP07= 0
##$TPNAME0= <>
##$TPNAME1= <>
##$TPNAME2= <>
##$TPNAME3= <>
##$TPNAME4= <>
##$TPNAME5= <>
##$TPNAME6= <>
##$TPNAME7= <>
##$TPOAL= (0..7)
0.5 0.5 0.5 0.5 0.5 0.5 0.5 0.5 
##$TPOFFS= (0..7)
0 0 0 0 0 0 0 0 
##$TUNHIN= 0
##$TUNHOUT= 0
##$TUNXOUT= 0
##$USERA1= <user>
##$USERA2= <user>
##$USERA3= <user>
##$USERA4= <user>
##$USERA5= <user>
##$V9= 5
##$VALIST= <valist>
##$VCLIST= <CCCCCCCCCCCCCCC>
##$VD= 0
##$VDLIST= <DDDDDDDDDDDDDDD>
##$VPLIST= <PPPPPPPPPPPPPPP>
##$VTLIST= <TTTTTTTTTTTTTTT>
##$WBST= 1024
##$WBSW= 4
##$XGAIN= (0..3)
0 0 0 0 
##$XL= 0
##$YL= 0
##$YMAX_a= 3201
##$YMIN_a= -22836
##$ZGOPTNS= <>
##$ZL1= 120
##$ZL2= 120
##$ZL3= 120
##$ZL4= 120
##$ABSF1= 198.0616
##$ABSF2= -202.7028
##$ABSG= 5
##$ABSL= 3
##$ALPHA= 0
##$AQORDER= 0
##$ASSFAC= 0
##$ASSFACI= 0
##$ASSFACX= 0
##$ASSWID= 0
##$AUNMP= <proc_1d>
##$AZFE= 0.1
##$AZFW= 0.5
##$BCFW= 0
##$BC_mod= 2
##$BYTORDP= 0
##$COROFFS= 0
##$CY= -3
##$DATMOD= 1
##$DC= 0
##$DFILT= <>
##$DTYPP= 0
##$F1P= 0
##$F2P= 0
##$FCOR= 1
##$FTSIZE= 65536
##$FT_mod= 6
##$GAMMA= 0
##$GB= 0
##$INTBC= 1
##$INTSCL= 9.790993e-09
##$ISEN= 30
##$LB= 1.5
##$LEV0= 0
##$LPBIN= 0
##$MAXI= 10000
##$MC2= 0
##$MEAN= 0
##$ME_mod= 0
##$MI= 50
##$NCOEF= 0
##$NC_proc= -8
##$NLEV= 6
##$NOISF1= 182.463
##$NOISF2= 159.3651
##$NSP= 0
##$NTH_PI= 0
##$NZP= 0
##$OFFSET= 198.0616
##$PC= 4
##$PHC0= 1784.265
##$PHC1= 23.09541
##$PH_mod= 1
##$PKNL= yes
##$PPARMOD= 0
##$PSCAL= 0
##$PSIGN= 0
##$REVERSE= no
##$SF= 81.0140089999434
##$SI= 65536
##$SIGF1= 159.3651
##$SIGF2= -187.1042
##$SINO= 113.3802
##$SIOLD= 16384
##$SREGLST= <1H.CDCl3>
##$SSB= 0
##$STSI= 65536
##$STSR= 0
##$SW_p= 32467.5324675325
##$SYMM= 0
##$S_DEV= 0
##$TDeff= 32768
##$TDoff= 0
##$TI= <>
##$TILT= no
##$TM1= 0
##$TM2= 0
##$TOPLEV= 0
##$USERP1= <user>
##$USERP2= <user>
##$USERP3= <user>
##$USERP4= <user>
##$USERP5= <user>
##$WDW= 1
##$XDIM= 65536
##$YMAX_p= 309680500
##$YMIN_p= -116087453
$$ End of Bruker specific parameters
$$ ---------------------------------
##NTUPLES= NMR SPECTRUM
##VAR_NAME=  FREQUENCY,     SPECTRUM/REAL,   SPECTRUM/IMAG
##SYMBOL=    X,             R,               I
##VAR_TYPE=  INDEPENDENT,   DEPENDENT,       DEPENDENT
##VAR_FORM=  AFFN,          ASDF,            ASDF
##VAR_DIM=   65536,         65536,           65536
##UNITS=     HZ,            ARBITRARY UNITS, ARBITRARY UNITS
##FACTOR=    0.49542278885378, 1,            1
##FIRST=     16045.7642231865, 0,            0
##LAST=      -16421.768244346, 0,            0
##MIN=       -16421.768244346, -116087453,   0
##MAX=       16045.7642231865, 309680500,    0
$$ Real data points
##PAGE= N=1
##DATA TABLE= (X++(R..R)), XYDATA
$$ [...]
##PAGE= N=2
##DATA TABLE= (X++(I..I)), XYDATA
6734h787443P42087J409171P688j942176j413244J308858K598267O51330k142669
6725g568131k870103j629971j23534J147844K544332L588730L429231K365791
6717H84189J543742J402368J332252O77295n18688j637809k090859j900743j573059
6708a881312j205732l01762J045900J743427J431873J409354K261568K015178
6700F518494q51602l814534l233921k87382L81631j683547j582005K527703N209226
6691C184063J932530l002659k358182L039143N608525K304321j977242k923070
6683E807429k389246l105093l312831o22640K630886K426858o64489k477542j467963
6674c174631l5548J15579K78283J653933K913304K320492M32913q08155n91632
$$ plain form
6734 -8787443 -8045356 -6636185 -6628497 -8570673 -9983917 -8675059 -6076792 -5425462 -7568131
6725 -7568131 -10438234 -12068205 -12191739 -11043895 -8499563 -4910833 -1481602 884189
6717 884189 2427931 3830299 5162551 5839846 5321158 3683349 1592490 -308253 -1881312
6708 -1881312 -3087044 -3388806 -2342906 -599479 832394 2241748 4503316 6518494
6700 6518494 5666892 1852358 -1381563 -1668945 -1287314 -2970861 -4552866 -2025163 3184063
6691 3184063 5116593 2113934 -244248 2794895 8403420 10707741 8730499 5807429
6683 5807429 3418183 313090 -2999741 -3622381 -991495 1435363 770874 -1706668 -3174631
6674 -3174631 -3210179 -3094600 -2816317 -1162384 1750920 4071412 4504325 3696170 3104538
6665C104538L75605J226018J515939Q82151p34319k478820l114070k496466j819529
6656c538953j839483j515619N11140L343002M283270K435368K97664M28671J761175
6647F166235J223477j657638m195485m596503l973329l520551k240812P85115
6639a2009491L767541M063969J682580r90242k258272k147899j069200N17808
6631h443206J339156K27979j921723k728595j203689J254778K929945L428319
6623e117036K963837J563312k67915j307894r28214J74759J172538K103962K980957
6614C338306K898842J154315j327506k838910k958577k749154k874363k541970
6606g899017q08483J706860L151322K404597J91179j831797k562647j815229N3733
$$ plain form
6665 3104538 3480143 4706161 6222100 7104251 6369932 3891112 777042 -1719424 -3538953
6656 -3538953 -5378436 -6894055 -6382915 -3039913 1243357 3678725 3976389 4405060 6166235
6647 6166235 7389712 5732074 1536589 -3059914 -7033243 -10553794 -12794606 -12009491
6639 -12009491 -8241950 -4177981 -2495401 -3485643 -5743915 -7891814 -8961014 -8443206
6631 -8443206 -7104050 -6876071 -8797794 -11526389 -12730078 -11475300 -8545355 -5117036
6623 -5117036 -2153199 -589887 -857802 -2165696 -3093910 -2919151 -1746613 357349 3338306
6614 3338306 6237148 7391463 6063957 3225047 266470 -2482684 -5357047 -7899017
6606 -7899017 -8707500 -7000640 -3849318 -1444721 -1253542 -3085339 -5647986 -7463215 -7409482
6597g409482K059826K645443J117776r25604r62220J259421L219322K917783J205603
6588E127868o4897n84826r03629q12085k82610n51098j942166j970775J420705
6579e63513N635538N922397J918718j904394k614247j805882j437080q80405J22027
6570D393159l12396k389072k805853N911K296072O11767k146266j133869K413987
6561I33440L256844Q88855p5634J642872J572035k590805o277886m585476N35825
6552d699930L289074J621577j486910k628582j131245J288694K133977L74960
6544a238385j926415j853675p338R6746k076305k493138R89359M441497L596108
6535d71546M43816l23654J067263O12837k078691l128107j174791M34391n72371
$$ plain form
6597 -7409482 -5349656 -2704213 -1586437 -2512041 -3474261 -2214840 1004482 3922265 5127868
6588 5127868 5062971 4478145 3574516 2762431 2479821 1928723 -13443 -1984218 -563513
6579 -563513 5072025 10994422 12913140 11008746 8394499 6588617 5151537 4271132 4393159
6570 4393159 4080763 1691691 -1114162 -1108251 1187821 1799588 -346678 -1480547 933440
6561 933440 4190284 5079139 5003505 6646377 8218412 5627607 -650279 -5235755 -4699930
6552 -4699930 -1410856 210721 -1276189 -3904771 -5036016 -3747322 -1613345 -1238385
6544 -1238385 -3164800 -5018475 -5025813 -4929067 -7005372 -9498510 -8509151 -4067654 -471546
6535 -471546 -27730 -351384 715879 1328716 -749975 -3878082 -5052873 -4618482 -5190853
6526e190853j980522j339179J93965N86718M72135J386514K675051K652063J387629
6517H43521K56468j80513j59744L67898J276086J640847R43305R8103J62622Q60920
6507F109513J354412J484671J258130K02509j602375k900042k919854k666654
6499C20310l152041l279743j262857K281662M449432L458919O43926j329895j304461
6490H25252k26373M77194M57881L03068K35135l13242j432937j851760m70014
6481a995796J606655K084139N97527p72773m58627P61350J463846J356278M83669
6472E126268j399487l277725k666258R04092L755540K207861j931413l150367
6464d31489L21734L992302L293808l95351k239978p76061P87727q7022j670524
$$ plain form
6526 -5190853 -7171375 -8510554 -8316589 -7729871 -7257736 -5871222 -3196171 -544108 843521
6517 843521 1099989 919476 759732 1127630 2403716 4044563 4987868 5085971 5248593 6109513
6507 6109513 7463925 8948596 10206726 10409235 8806860 5906818 2986964 320310
6499 320310 -2831731 -6111474 -7374331 -5092669 -643237 2815682 3459608 2129713 825252
6490 825252 598879 1076073 1533954 1837022 2072157 1758915 325978 -1525782 -1995796
6481 -1995796 -389141 1694998 2292525 1519752 1061125 1822475 3286321 4642599 5126268
6472 5126268 3726781 449056 -2217202 -1313110 2442430 4650291 2718878 -431489
6464 -431489 -109755 3882547 7176355 6781004 4541026 3764965 4552692 4465670 2795146
6455B795146j158020O95266P35521j478972k671016p62948J778885J525716p67452
6446F92126j404863N41155J872702J97796k464172k522315M34194L361047L386894
6437D094564N23881k700684l540942j444889J386199K321365J126218l63749r78297
6428D23666j062190q10134J38936J119395O30531j193049k335674j829587q23523
6419e741629j02351R41343K021407J593124P2740J94499K315734K848135l8206
6410D104796k700207j512521J212593J184020p10768l80293K152037L010023J277002
6401G636682k0696K60926J7834j075630o35216J067553K41789l715285n710523
6392a932566k318505K551083L084719m78587l137308k167748P25454K872718L109456
$$ plain form
6455 2795146 1637126 2332392 3067913 1588941 -1082075 -1845023 -66138 1459578 692126
6446 692126 -712737 -171582 1701120 1898916 -565256 -3087571 -2653377 707670 4094564
6437 4094564 4618445 1917761 -1623181 -3068070 -1681871 639494 1765712 1401963 423666
6428 423666 -638524 -1448658 -1309722 -190327 440204 -752845 -3088519 -4918106 -5741629
6419 -5741629 -5843980 -4902637 -2881230 -1288106 -1215366 -1020867 1294867 4143002 4104796
6410 4104796 1404589 -107932 1104661 2288681 1577913 1197620 3349657 6359680 7636682
6401 7636682 7615986 7876912 7894746 6819116 6183900 7251453 7493242 3777957 -1932566
6392 -1932566 -4251071 -1699988 1384731 906144 -2231164 -4398912 -3673458 -800740 2308716
6383B308716J622653k63862q36722j16038m5876j279625j702577R8435K057692
6374A842796J662399j77432r93974q45569j479931k581027k159684k90948O64901
6365d358469j70367q62008K19606J999917K305988N40522j964599l453505l183376
6356h926291j815072n10429L74223J215482J870875J729879J219050J566047K441306
6347h34930J852253m56484j686057R4437K683427K740781M25430j588860k384404
6338H45593l052272l511393k420657k82583N04300o05658j136882P32611L385989
6329e540952L978422K087049p4018m18872Q38049J604665L90769j638654j868899
6320f42441Q2838J317321l90357l005292k782488M41072L061961K666486O28184
$$ plain form
6383 2308716 3931369 3667507 2830785 2714747 2668871 1389246 -313331 -214896 1842796
6374 1842796 3505195 3327763 2333789 1488220 8289 -2572738 -4732422 -5023370 -4358469
6365 -4358469 -4528836 -5390844 -5171238 -3171321 -865333 -324811 -2289410 -5742915 -8926291
6356 -8926291 -10741363 -11251792 -10877569 -9662087 -7791212 -6061333 -4842283 -3276236 -834930
6347 -834930 1017323 560839 -1125218 -1030781 1652646 4393427 4818857 3229997 845593
6338 845593 -2206679 -5718072 -8138729 -8421312 -7917012 -8522670 -9659552 -8926941 -5540952
6329 -5540952 -1562530 524519 450501 31629 869678 2474343 2865112 1226458 -642441
6320 -642441 -559603 757718 367361 -2637931 -5420419 -4979347 -1917386 749100 1377284
6311A377284o86905r75886j228894j637651j590556q93859j3432O24554J189665
6302c835680K289430L875648M291427J720685k692464m962378l165063m83423
6294b961818q76775l205133l065290K38106K590188J458302n49051k19566J403885
6285e187152J222873r39506k223667p50022K201560L779289K366691p61426k269069
6276b560429k15364L174910L699546M38549l041099l342583j008208J369973K603196
6267A118491K865676K068198K46393j617301k749289l412226l373735j360227
6259f214020K225141M095242K199034o18537l07895K161345K137632j323374l662570
6250F91998j644688J903458K631501Q95893J11970Q12478L22006k027300l231998
$$ plain form
6311 1377284 690379 -285507 -1514401 -3152052 -4742608 -5636467 -5649899 -5025345 -3835680
6302 -3835680 -1546250 2329398 6620825 8341510 5649046 686668 -2478395 -2961818
6294 -2961818 -3838593 -7043726 -10109016 -9870910 -7280722 -5822420 -6371471 -6591037 -5187152
6285 -5187152 -3964279 -4903785 -7127452 -7877474 -5675914 -1896625 470066 -291360 -2560429
6276 -2560429 -2775793 399117 4098663 4537212 1496113 -1846470 -2854678 -1484705 1118491
6267 1118491 3984167 6052365 6298758 4681457 1932168 -1480058 -4853793 -6214020
6259 -6214020 -3988879 106363 2305397 1686860 1378965 3540310 5677942 4354568 691998
6250 691998 -952690 950768 3582269 4478162 4590132 5402610 5724616 3697316 465318
6241D65318j279071J520595J800928k28745j651281j208739m90585j070004k497008
6232d638592l395647k998531j239538J355735L464394L775576K373643M21636
6224h81324j446002l112515l567252j517228K158684M607317M461797L186207
6216C889684K173032Q23481j213789k441815k122989k111620l621280m377569
6208i002865k027693J457895K295876N02875o81494p0625O70825J003188K122566
6199c729452L476788K842138N52353l84481N79355L48731k308768m100708k362662
6190e086706O54059J430706K20765n13952l29252l72751m94766K26060J241028
6181c024809J371078R24385Q23246O95455o8295m62042P07515K390330K455152
$$ plain form
6241 465318 -813753 706842 2507770 2279025 627744 -580995 -1071580 -2141584 -4638592
6232 -4638592 -8034239 -11032770 -12272308 -10916573 -7452179 -3676603 -1302960 -881324
6224 -881324 -2327326 -5439841 -9007093 -10524321 -8365637 -3758320 703477 3889684
6216 3889684 6062716 6886197 5672408 3230593 1107604 -1004016 -4625296 -9002865
6208 -9002865 -11030558 -9572663 -7276787 -6773912 -7455406 -7526031 -6855206 -5852018 -3729452
6199 -3729452 -252664 2589474 3141827 2757346 3336701 3685432 1376664 -2724044 -5086706
6190 -5086706 -4432647 -3001941 -2781176 -3295128 -3624380 -3997131 -4491897 -4265837 -3024809
6181 -3024809 -1653731 -729346 93900 789355 721060 259018 966533 3356863 5812015
6172E812015P59584q04825r75892l28984j24614r77431k240543k277765l84538
6163a542993J435620N86883j835695j754035J635042L644726O83244l927542m326899
6154e401649l32403K732123J592233j392914k357658o04805J565657J834260J57745
6145b207411j139244q3128J785979R00030k762714m581814j942688J353951R01338
6136g775701j135647L94149M853100O457950L261705l11875p73380q0055r72954
6127C917292k362950k041173o75698l66284j352873k274977k185067j020093M83613
6118g878210Q07220o45848j863639o38836J574290J470718m39238j04764L274998
6109d443309N278671L043651l12934q85777K98306K91671l47175O38027K246784
$$ plain form
6172 5812015 6571599 5766774 4790882 4461898 4337284 3359853 1119310 -1158455 -1542993
6163 -1542993 -107373 479510 -1356185 -3110220 -1475178 2169548 2852792 -1074750 -5401649
6154 -5401649 -5734052 -3001929 -1409696 -2802610 -5160268 -5765073 -4199416 -2365156 -2207411
6145 -2207411 -3346655 -3429783 -1643804 -743774 -3506488 -8088302 -10030990 -8677039 -7775701
6136 -7775701 -8911348 -8517199 -3664099 2793851 6055556 5743681 4970301 4890246 3917292
6127 3917292 1554342 -486831 -1162529 -1528813 -2881686 -5156663 -7341730 -8361823 -7878210
6118 -7878210 -7070990 -7716838 -9580477 -10219313 -8645023 -7174305 -7613543 -7718307 -4443309
6109 -4443309 835362 3879013 3566079 2680302 2978608 3270279 2923104 3561131 5807915
6100E807915J507117j400320l240713k495086p85157J04569k42947j876907m142932
6091f764461m668319j631970K838169M279622J423396k167012k605929N8194K751103
6082f487207L006020J018161r39331q28415Q21305J283692q58187l495618l670844
6073a0150424j499942M85837J128601J413408J855810J818000J609500K460901
6065h78309L611813K262048j941709m878162k960926J428596K650443m15081k586863
6056c708150M22956N690434O601570J615222l664413l853132m01901J267932p15784
6047C254734l219528l519985k473827j410909N99394M073867O334463M522370
6039H160579L827l251717l880719l714234l639208k270297P23285L057808K873107
$$ plain form
6100 5807915 7315032 5914712 2673999 178913 -606244 -501675 -744622 -2621529 -6764461
6091 -6764461 -11432780 -13064750 -10226581 -5946959 -4523563 -6690575 -9296504 -9238310 -6487207
6082 -6487207 -3481187 -2463026 -3402357 -4230772 -3409467 -2125775 -2983962 -6479580 -10150424
6073 -10150424 -11650366 -11164529 -10035928 -8622520 -6766710 -4948710 -3339210 -878309
6065 -878309 2733504 4995552 3053843 -1824319 -4785245 -3356649 -706206 -1121287 -3708150
6056 -3708150 -3285194 2405240 9006810 10622032 6957619 3104487 2702586 3970518 3254734
6047 3254734 35206 -3484779 -5958606 -7369515 -6770121 -2696254 3638209 8160579
6039 8160579 8164406 4912689 1031970 -2682264 -6321472 -8591769 -7868484 -4810676 -1937569
6030a937569J000619r87574k720238l657180k261939J236559L270879J073819
6022d982624k685770k630112K014246N967996M745673K82548k166737r15009R15367
6013E45578M29506j389344j839287m67118O89115J60018j140342j329054J85138
6004d155790K269657L320499K581449O85833p38447m56240R28363J378214j14014
5995E699524j952593j767574M63473K347396K199771Q10369m48795j694009l387847
5986B269715m383370l115936l10042J543416J485614R06203P76647K83682r41440
5977a485511j536079q48519n19710j563091j864498N89149L520070K938971p02366
5968a471584k710518p81335K207745K938873J703152K58253j081589k220543k007634
$$ plain form
6030 -1937569 -936950 -1924524 -4644762 -8301942 -10563881 -9327322 -6056443 -4982624
6022 -4982624 -7668394 -10298506 -8284260 -2316264 2429409 2711957 545220 -369789 545578
6013 545578 975084 -414260 -2253547 -2720665 -2031550 -1871532 -3011874 -4340928 -4155790
6004 -4155790 -1886133 1434366 4015815 4701648 3963201 3506961 4435324 5813538 5699524
5995 5699524 3746931 1979357 2442830 4790226 6989997 7800366 7351571 5657562 2269715
5986 2269715 -2113655 -5229591 -5539633 -3996217 -2510603 -1604400 -827753 -544071 -1485511
5977 -1485511 -3021590 -3870109 -4389819 -5952910 -7817408 -7228259 -3708189 -769218 -1471584
5968 -1471584 -4182102 -4963437 -2755692 183181 1886333 2144586 1062997 -1157546 -3165180
5959c165180m23920M58921j20181J17860K389628L877327K015705q94967j174937
5950C080256L35325J75606j616568k056116q66866n27812r50134O29547L840892
5941B044130M477147J154463k022460j582517O66030J525236J134833R81913N13384
5932H892159j054761k141053j216078J84923j46937j380239j222155J32536M55347
5923B503742r46332k522959k823999j764799j73948O61872l873q90836J85880
5914e775252K709969L278096O10082j855487p95129J948449K267907l2588j490131
5905H65916m99318Q87403O27819p10238j469090j050712j70937j13534j502791
5896c135482l058901k603178j97194J367757N00749q28719m75561M33877l4100
$$ plain form
5959 -3165180 -3589100 -3130179 -3250360 -3132500 -742872 3134455 5150160 4255193 3080256
5950 3080256 3415581 3591187 1974619 -81497 -948363 -1476175 -2426309 -1796762 2044130
5941 2044130 6521277 7675740 5653280 4070763 4736793 6262029 7396862 8378775 8892159
5932 8892159 7837398 5696345 4480267 4665190 4518253 3138014 1915859 2048395 2503742
5923 2503742 1557410 -965549 -3789548 -5554347 -5728295 -5066423 -5070296 -5961132 -5775252
5914 -5775252 -3065283 212813 822895 -1032592 -1827721 120728 2388635 2356047 865916
5905 865916 366598 1254001 1881820 1171582 -297508 -1348220 -1519157 -1632691 -3135482
5896 -3135482 -6194383 -8797561 -8994755 -7626998 -7126249 -7954968 -8430529 -7996652 -8030752
5887h030752q73544r544J781434K219620J477479J331073J511125N68018n58535
5878e83626K09218J809723J132389j698913l248857k258404j081681r90515k50621
5869f961287J867114L164962K382990J375195J376639N02909k474936m832384
5861c598798l481814J71018K078572J064327l30433Q9083J751452K961128L001809
5852C706344K140027P83721o47073j440635q88864O67322J355412n10579l765414
5843A400261m860073k130335J798133L430117K744290K065771K146828K113904
5835H708896K044507K357519J617994j382520m090079k984595L43946P49666k361777
5826E003557l855921j417442L46249k412432n952798m420631J323494N383790
$$ plain form
5887 -8030752 -8904296 -8913840 -7132406 -4912786 -3435307 -2104234 -593109 -25091 -583626
5878 -583626 -374408 1435315 2567704 868791 -2380066 -4638470 -5720151 -6710666 -6961287
5869 -6961287 -5094173 -1929211 453779 1828974 3205613 3708522 1233586 -3598798
5861 -3598798 -7080612 -6909594 -4831022 -3766695 -4097128 -4008045 -2256593 704535 3706344
5852 3706344 5846371 6630092 5983019 4542384 3653520 4320842 5676254 5165675 1400261
5843 1400261 -3459812 -5590147 -3792014 -361897 2382393 4448164 6594992 8708896
5835 8708896 10753403 13110922 14728916 13346396 9256317 6271722 6615668 7365334 5003557
5826 5003557 1147636 -269806 76443 -2335989 -8288787 -12709418 -11385924 -6002134
5818f002134N199344L287767J746504j03512k383992l106078j204154J501868
5810a064387K507222J195606j243649l044846k780875l78148K462000L680420
5802A333343K715835N13035j673875k831817k473912j335014r35901j540922j541127
5793g770355J49794K248403K857879J946114P52880j43842o92307m14796O65034
5784d01196J015165o05990k870067l212171j217788R37193J383933M83767k61612
5775d748766o1147P10912J239433J205680J109268J424436J578870O04499j191381
5766A871804k399435k556617k581439k759452k013201p093J746699K074725J876738
5757d747271K287712K534460J311162p07124j438273n2274K112861K951821J339999
$$ plain form
5818 -6002134 -802790 2484977 4231481 4127969 1743977 -1362101 -2566255 -1064387
5810 -1064387 1442835 2638441 1394792 -1650054 -4430929 -4809077 -2347077 1333343
5802 1333343 4049178 4562213 2888338 56521 -2417391 -3752405 -4688306 -6229228 -7770355
5793 -7770355 -7620561 -5372158 -2514279 -568165 184715 40873 -651434 -1066230 -401196
5784 -401196 613969 7979 -2862088 -6074259 -7292047 -6354854 -4970921 -4487154 -4748766
5775 -4748766 -4809913 -4099001 -2859568 -1653888 -544620 879816 2458686 3063185 1871804
5766 1871804 -527631 -3084248 -5665687 -8425139 -10438340 -10445433 -8698734 -6624009 -4747271
5757 -4747271 -2459559 74901 1386063 678939 -759334 -811608 1301253 4253074 5593073
5748E593073j760516l570627k081509J150569K277088j31195l251492l648414
5740e423023j081826K081778L451789J879818j733975m038606k039064K623255
5732d279854M826182K608386m27631r21898k42590n83067m67651J879956L814094
5723F205927J738799k690023m755729l816470l225050l694854k053390K640619
5715i650171O451851N792498J870791j759982l369484l209170j786707L10396
5707e349978K145246L017713K586990N13030k750788n188647m934108k521710
5699a2482252Q3436K057185L517681L698900J821516o82620j402847l10986M50394
5690c249593K2765k72170M95738J619615K227178K160566J481148O73222P51732
$$ plain form
5748 5593073 3832557 261930 -1819579 -669010 1608078 1476883 -1774609 -5423023
5740 -5423023 -6504849 -4423071 -971282 908536 -825439 -4864045 -6903109 -4279854
5732 -4279854 546328 3154714 2727083 1805185 1562595 979528 511877 2391833 6205927
5723 6205927 7944726 5254703 498974 -3317496 -6542546 -10237400 -12290790 -9650171
5715 -9650171 -3198320 2594178 4464969 2704987 -664497 -3873667 -5660374 -5349978
5707 -5349978 -3204732 -187019 2399971 2913001 162213 -5026434 -9960542 -12482252
5699 -12482252 -12398816 -10341631 -6823950 -3125050 -1303534 -1986154 -3389001 -3699987 -3249593
5690 -3249593 -3226828 -3498998 -3003260 -1383645 843533 3004099 4485247 5158469 5910201
5681E910201J541559R86751j778747m105697l178559l06056J082485L80336m89060
5672D3213r12947j484081j337839M17087J777623N94225j043548O4869K107795
5663B26397J007518j719562o67350L870804N473893K062502q10707L50391J562164
5654A1356050n78865k564563p85316J510736o9733l468933m374754l663276m327095
5645f965749m719198j624777K725191L541998J443755R22852K308545J948606
5637d18777l76676r71805P64152J314972j78342k80273K095621L144064N78134
5628E671070k325900j868099P99753K283947J680421J71018j460950k590338k211980
5619A48942n98667M05664J55565J29873R16754R13182m47181j054330J71253P55696
$$ plain form
5681 5910201 7451760 8438511 6659764 2554067 -624492 -930548 151937 532273 43213
5672 43213 -869734 -2353815 -3691654 -3274567 -1496944 -902719 -1946267 -1881398 226397
5663 226397 1233915 -485647 -1152997 2717807 8191700 10254202 9443495 9793886 11356050
5654 11356050 10777185 8212622 7427306 8938042 8868309 5399376 1024622 -2638654 -6965749
5645 -6965749 -11684947 -13309724 -10584533 -7042535 -5598780 -4675928 -2367383 -418777
5637 -418777 -795453 -1767258 -1003106 311866 133524 -146749 1948872 5092936 5671070
5628 5671070 3345170 1477071 2276824 4560771 6241192 6412210 4951260 2360922 148942
5619 148942 -449725 -44061 111504 241377 1158131 2071313 1624132 569802 741055 1496751
5609A496751j310316l447574j952207J929529L310485O41882k393638k494845
5601d219933p84869J58562L24281R86849J489315K87931j632993j445280J133091
5592c703046K827626J281058j656675k693640j382783K91427J176512J489672
5584b369849J126810K3231m48443P65933J659375n93834m561659n360341j489363
5575a1248140K722818L168428J117645J24686Q22270J525545J536233R93694m72754
5566B90425k207613j774188J371831L642042K024079j072138j407356N56948J036269
5557B460299n73294j355740m23205O8425m69417j80303R46073N94027j075813
5548h948r02114J397593J643688j962362m921258k957006J217748K037598n11054
$$ plain form
5609 1496751 186435 -3261139 -5213346 -3283817 26668 668550 -1725088 -4219933
5601 -4219933 -5004802 -4846240 -4521959 -3535110 -2045795 -1757864 -3390857 -4836137 -3703046
5592 -3703046 -875420 405638 -1251037 -3944677 -5327460 -5036033 -3859521 -2369849
5584 -2369849 -1243039 -1219808 -1668251 -902318 757057 163223 -4398436 -9758777 -11248140
5575 -11248140 -8525322 -5356894 -4239249 -4114563 -3292293 -1766748 -230515 763179 290425
5566 290425 -1917188 -3691376 -2319545 1322497 3346576 2274438 867082 1424030 2460299
5557 2460299 1887005 531265 108060 176485 -292932 -473235 472838 1066865 -8948
5548 -8948 -911062 486531 2130219 167857 -4753401 -7710407 -6492659 -4455061 -4966115
5539d966115j440117J303394M112276L428898M40490j396097r87414R9257N93833
5530A188405Q49111J386755J619052P99121m43644p47302k67481q19831k911484
5521F52702m106591k089202J650087L395139J984355l63766j803232k686220l229634
5512f596362k281875K64687K209768J866786L78065l12192j49265m0068K22398
5503d438058J242193K298944K129479P95318n75745j238846r31972N32690K525960
5494B339963L351317K087403m7802j377004j929250k553764k787841j465416Q50185
5485a532209J859459L51728k091233k729855n53920K666951M122365K845686O09842
5476E548814n88842j262265l058193n041810m058852K65897L709292K779950l51752
$$ plain form
5539 -4966115 -6406232 -5102838 -990562 2438336 2878826 1482729 495315 594572 1188405
5530 1188405 2037516 3424271 5043323 5842444 5398800 4651498 4384017 3564186 652702
5521 652702 -3453889 -5543091 -3893004 -497865 1486490 1122724 -680508 -3366728 -6596362
5512 -6596362 -8878237 -8613550 -6403782 -4536996 -4158931 -4471123 -4620388 -4660456 -4438058
5503 -4438058 -3195865 -896921 1232558 2027876 1452131 213285 -718687 -185997 2339963
5494 2339963 5691280 7778683 7730881 6353877 4424627 1870863 -916978 -2382394 -1532209
5485 -1532209 327250 678978 -1412255 -4142110 -4696030 -2029079 2093286 4938972 5548814
5476 5548814 4959972 3697707 639514 -4402296 -8461148 -8195251 -4485959 -1706009 -2057761
5467b057761j102099R44812K171617R54156k90387L44790J210588K85980j336780
5458A124916j463731n12475o76283k207985k951167j588346O08522J816149K025269
5449c825131K517063L784387M849848M424229K224476p60989l034870l763651
5441F415362l399213k940479k473186r92394J798183M077731L450139k7806l504979
5432B403358m501996l363005j845071n18732R76943K005773J405510j12782k11310
5423c761312J634050K818303J130949j808641k501151k68553J963561J637958
5415H45164m07108j497480m53409J523892K551507J799411m8656j334400p32550
5406B246371J254940K341450Q35310k061005l288294j539853J126598J899851
$$ plain form
5467 -2057761 -3159860 -2215048 -43431 910725 620338 965128 2175716 2461696 1124916
5458 1124916 -338815 -851290 -1527573 -3735558 -6686725 -8275071 -7666549 -5850400 -3825131
5449 -3825131 -1308068 2476319 7326167 11750396 13974872 13213883 10179013 6415362
5441 6415362 3016149 75670 -2397516 -3389910 -1591727 2486004 5936143 5908337 2403358
5432 2403358 -2098638 -5461643 -7306714 -7825446 -6848503 -4842730 -3437220 -3550002 -3761312
5423 -3761312 -2127262 691041 1821990 13349 -2487802 -2756355 -792794 845164
5415 845164 438056 -1059424 -1512833 11059 2562566 4361977 4313321 2978921 2246371
5406 2246371 3501311 5842761 6678071 4617066 1328772 -211081 915517 2815368
5398B815368N85132o04080p1690J489152K266712J151829j486064l839796l691010
5389a384447o51180K695673L287528J206851q24302j531760k316253l773223l830647
5380g121760j244433J427342J062642j341611k160212m03582J552161K127526
5372f101927K259578K597245J999660K817j577251j045339P31383J671027J193487
5363A730680M38737M99243J298988J814488J067105o68704j802726j323074l01012
5354B753725l16466r50873o04177N54100O99354m29963q36109N04319J961137
5345C335047J863359P57114j71173r54778j620909r85719J323295L025954J630058
5336H202248j964538m351451l844384j990547q17244l20323N83419J761489J778865
$$ plain form
5398 2815368 3400500 2796420 2724730 4213882 6480594 7632423 6146359 2306563 -1384447
5389 -1384447 -2035627 660046 3947574 5154425 4330123 2798363 482110 -3291113 -7121760
5380 -7121760 -8366193 -6938851 -5876209 -7217820 -9378032 -9781614 -8229453 -6101927
5372 -6101927 -3842349 -1245104 754556 757373 -819878 -1865217 -1133834 537193 1730680
5363 1730680 2169417 2668660 3967648 5782136 6849241 6180537 4377811 3054737 2753725
5354 2753725 2437259 1486386 882209 1436309 2135663 1705700 869591 1373910 3335047
5345 3335047 5198406 5955520 5784347 4829569 3208660 2222941 3546236 6572190 8202248
5336 8202248 6237710 1886259 -1958125 -3948672 -4765916 -5086239 -4502820 -2741331 -962466
5327i62466J23663j460264q89865J167818J704521k54248j449343J245550N444507
5318D669873N502471K63986m881532m987779j509189Q65756P28984L04019Q93009
5309A849598J365034Q87750K23669j88964j124149k614923k901253p17958K298319
5300i22877K975454M01109k703074k994406l37769K313930K721213J677565R86243
5291D117388O94479j66715j254967j347740m73181M29941J390899K579639K211277
5282H181020j496946o128241o527885j750768K884278K729152k77596j329818
5274c716804K43503J226333K36414o24790K51920J516443J219237l45865j162055
5265a155664L4453K318100L343412J722002j211723k690197j784267l01365K579
$$ plain form
5327 -962466 -838803 -2299067 -3188932 -2021114 -316593 -570841 -2020184 -774634 4669873
5318 4669873 10172344 10436330 5554798 567019 -942170 -76414 652570 956589 1849598
5309 1849598 3214632 4102382 4326051 4137087 3012938 398015 -2503238 -3221196 -922877
5300 -922877 2052577 2453686 -249388 -3243794 -3581563 -1267633 1453580 3131145 4117388
5291 4117388 4811867 4645152 3390185 2042445 1569264 1999205 3390104 5969743 8181020
5282 8181020 6684074 555833 -5972052 -7722820 -4838542 -2109390 -2386986 -3716804
5274 -3716804 -3473301 -2246968 -2010554 -2635344 -2383424 -866981 352256 6391 -1155664
5265 -1155664 -1121211 1196889 4540301 6262303 5050580 2360383 576116 274751 277330
5256B77330k96960L09517J832241K887063K465354Q11977q14744r87513L63421
5247F847686J387295O64657l31917O47836K426977J482227k437510n390454m984374
5238C12423l249427k189343n81564K302540L850832K344279M27401N87631O63339
5229D468111j747112l782672j688717J914269J400511k622995m010440q33511
5221f902556K051398J200035p58642p45213j10085q84156j500543J61100K480165
5212e008497K374888M7957j516626p23006J248951K510842K214801O93592j019798
5203H23104k085903k629931l099358l051082j621179J031930L890101O145102
5195e97216O792062M283460j147204n697583n462420j495105J470500J318203
$$ plain form
5256 277330 -19630 289887 2122128 5009191 7474545 8286522 7471778 6484265 6847686
5247 6847686 8234981 8899638 8567721 9215557 11642534 13124761 10687251 5296797 312423
5238 312423 -2937004 -5126347 -5707911 -3405371 445461 2789740 3217141 3804772 4468111
5229 4468111 2720999 -1061673 -2750390 -836121 564390 -2058605 -6069045 -6902556
5221 -6902556 -4851158 -3651123 -4409765 -5154978 -5265063 -6149219 -7649762 -7488662 -5008497
5212 -5008497 -2633609 -2585652 -4102278 -4825284 -3576333 -1065491 1149310 1842902 823104
5203 823104 -1262799 -3892730 -6992088 -10043170 -11664349 -10632419 -6742318 -597216
5195 -597216 6194846 10478306 9331102 3633519 -1828901 -3324006 -1853506 -535303
5187e35303M45576J073486K112428J855673P54017r7940q11182j474008j195253
5178B127494Q3756O71027m89969k092715k455754j789700j228210r02203k17386
5169f293660R21393K137169L096613L446624K939509J805213L33080j521841l166821
5160C697279k983103o28590J272345J40696k524418k886414k26950K304545K425148
5151E90538J140361N0043p32854j218280q34759M0154J73201l70554m38015k19279
5141a819444p94210j344950l1421K282822K780828J457272J189962K519916K757893
5132H998668J298986R91972K418731J821120k451512o086121n045188j737673
5124B08983r12761k620747l519689k661447j675835r59419L46814J778351K256238
$$ plain form
5187 -535303 -89727 983759 3096187 4951860 5705877 5607937 4796755 3322747 2127494
5178 2127494 2211250 2882277 2392308 299593 -2156161 -3945861 -5174071 -6076274 -6293660
5169 -6293660 -5372267 -3235098 -138485 3308139 6247648 8052861 8385941 6864100 3697279
5160 3697279 714176 85586 1357931 1498627 -1025791 -3912205 -4139155 -1834610 590538
5151 590538 1730899 1780942 1048088 -170192 -1004951 -964797 -791596 -1162150 -1600165 -1819444
5141 -1819444 -2613654 -3958604 -3990025 -1707203 1073625 2530897 3720859 6240775 8998668
5132 8998668 10297654 11289626 13708357 15529477 13077965 6991844 1946656 208983
5124 208983 -703778 -3324525 -6844214 -9505661 -11181496 -12140915 -11794101 -10015750 -7759512
5115g759512K217409K307276J548080m85094j638493l53943J178537L67693j335829
5106c953876j075980K58893k08011j893016j681407N21894J897597K046645L246729
5097h40532M923214L077882k870830p214293n019524J021726M198726K339216
5089c84415p06430j388391p16844j219349k303839j162276K417168M882606L613650
5080C031880O95292r1064J343793J878701M72970m62663M80696J308590J82434
5071H840629j509603j581583k50671R31494J246225K89560k333556n021664m549653
5062c938822o84589K225189R60453j839138j803835P15833K108971J558639J360331
5053F63032K086488J690256m26434k020259j356815O30642J994800J593668o93138
$$ plain form
5115 -7759512 -5542103 -3234827 -1686747 -2171841 -3810334 -4164277 -2985740 -2618047 -3953876
5106 -3953876 -5029856 -4770963 -4978974 -6871990 -8553397 -8031503 -6133906 -4087261 -840532
5097 -840532 4082682 7160564 4289734 -2924559 -7944083 -6922357 -2723631 -384415
5089 -384415 -1090845 -2479236 -3196080 -4415429 -6719268 -7881544 -5464376 -581770 3031880
5080 3031880 3727172 3636108 4979901 6858602 7331572 6868909 7349605 8658195 8840629
5071 8840629 7331026 5749443 5498772 6430266 7676491 7966051 5632495 610831 -3938822
5062 -3938822 -4623411 -2398222 -1437769 -3276907 -5080742 -4364909 -2255938 -697299 663032
5053 663032 2749520 4439776 4013342 1993083 636268 1266910 3261710 4855378 4162240
5044D162240l583602m479743j995229J785210L434997K215073J52492j276092
5036D15346k289182k887533k141820J01582K326775K754483J098764j031050j407558
5027c060193L85606J979632J157214o36001k69189J788482J919844k99058q99075
5018B067262J516206K791321M48800j358948J079651L817749J436613l247519
5010H551135l174483J328237K943731q37510m149809k450749J151388J945282
5002E307222L08036r21210j321436j716988j441462l9580O81466q01033k811590
4993b756575k568256l6978K331660L013802K881561L317499L920374K804311n44926
4984A2362472l502130l086651l81837N00182j421353k327595M3423K258029P44830
$$ plain form
5044 4162240 578638 -3901105 -5896334 -4111124 -676127 1538946 1691438 415346
5036 415346 -1873836 -4761369 -6903189 -6801607 -4474832 -1720349 -621585 -1652635 -3060193
5027 -3060193 -2674587 -694955 462259 -173742 -442931 1345551 3265395 2966337 2067262
5018 2067262 3583468 6374789 6823589 5464641 6544292 10362041 11798654 8551135
5010 8551135 5376652 6704889 9648620 8811110 4661301 2210552 3361940 5307222
5002 5307222 5615258 4694048 3372612 1655624 214162 174582 856048 55015 -2756575
4993 -2756575 -5324831 -5361809 -3030149 -16347 2865214 6182713 10103087 12907398 12362472
4984 12362472 8860342 5773691 5391854 5892036 4470683 2143088 2186511 4444540 5189370
4975E189370k089979j893734K68209J8811k528978k860374M40152L631139L696432
4966C871048J731932j27709j148394q29768J042369K697041J933077n12503k069595
4957F587498k266427k401277k284879j007494N7355r15901k296295j188685J416670
4948d299435K248357J520555K025841L221095J878645j354301j814835J835448
4940E261370N254610M696776J365167j533356k322806q63815J541567K207158
4932A5606671J60412j700518q10929O98048p8940j312609j61888J005525j272604
4923A2133168l981016j945066K423561K361682j597415k484650R99261K815727
4915A0725252N95478j155624j81366K77609r34237o99962J238652J203137j016768
$$ plain form
4975 5189370 3099391 1205657 1473866 1492677 -1036301 -3896675 -3456523 174616 3871048
4966 3871048 5602980 5475271 4326877 3497109 4539478 7236519 9169596 8657093 6587498
4957 6587498 4321071 1919794 -365085 -1372579 -1315224 -2231125 -4527420 -5716105 -4299435
4948 -4299435 -2051078 -530523 1495318 4716413 6595058 5240757 3425922 5261370
4940 5261370 10515980 15212756 16577923 15044567 12721761 11857946 13399513 15606671
4932 15606671 15767083 14066565 13255636 13953684 13874744 12562135 12400247 13405772 12133168
4923 12133168 8152152 6207086 8630647 10992329 9394914 6910264 7909525 10725252
4915 10725252 11320730 10165106 9983740 10261349 9327112 8627150 9865802 11068939 10052171
4906A0052171j782592j184681k345891l293549O13390O309625O060203R37910
4898A5366586o33109K103303J921021j274408P9825N210318M684985j390915k123473
4889B3944133L739850M708410j489088k881595L756187O410526J786071K325156
4881D2299650J0165963J0214631P98257J597281J5761500J8752045O930021J6144072
4873A22663420N5046748O1425298j6933802j24258908j49607880p2445578J3463291
4866a10647411L0903727O040732o81612J3108933J3546502l91184k832832P593730
4858d3359415R696594J236804r54698M571562L581300l720929k929941N907756
4850b5970967P632894J17880k306976M548674P965387J828345l893481k247526
$$ plain form
4906 10052171 8269579 7084898 4739007 1445458 2058848 8368473 14428676 15366586
4898 15366586 14733477 16836780 18757801 17483393 17563218 22773536 27458521 26067606 23944133
4889 23944133 27683983 32392393 30903305 28021710 31777897 38188423 39974494 42299650
4881 42299650 52465613 62680244 63478501 65075782 80837282 99589327 106519348 122663420
4873 122663420 177710168 239135466 222201664 97942756 -51665124 -124110702 -110647411
4866 -110647411 -79743684 -73702952 -74384564 -61275631 -47729129 -48120313 -50953145 -43359415
4858 -43359415 -33662821 -32426017 -33380715 -28809153 -25227853 -28948782 -31878723 -25970967
4850 -25970967 -18338073 -18220193 -20527169 -15978495 -8013108 -6184763 -10078244 -12325770
4842a2325770L24056j464553k608547M91350K571779o2149k739304j433295R37430
4833a6309003J513962K036396K830913P07126l775000m894524r11945K660823
4825a6141252J950327N8749N81764K077588K001717Q54562j25466r48237r61805
4816a0652053Q25471K706874J828754r33054j959148n54523P92494J151880J461752
4807e331553J115558p32790j714511N25162L150834K059269p19243k01467K455634
4798F06893J561859l063489n467108l208229q5096J357099K520174L041002J21393
4789b615502m677931n379021p64324L068584J897642j107789j688703l88008O64272
4780a0990780J431736J722580K58294j685762p34139K409758K621680j447058
$$ plain form
4842 -12325770 -12001714 -13466267 -16074814 -15583464 -13011685 -13073834 -15813138 -17246433 -16309003
4833 -16309003 -14795041 -12758645 -9927732 -9220606 -12995606 -17890130 -18802075 -16141252
4825 -16141252 -14190925 -14132176 -13550412 -11472824 -9471107 -8616545 -8742011 -9690248 -10652053
4816 -10652053 -9826582 -7119708 -5290954 -6224008 -8183156 -8737679 -7945185 -6793305 -5331553
4807 -5331553 -4215995 -4948785 -6663296 -6138134 -2987300 -928031 -1647274 -1848741 606893
4798 606893 2168752 -894737 -6361845 -9570074 -9655170 -8298071 -5777897 -2736895 -2615502
4789 -2615502 -7293433 -12672454 -13436778 -10368194 -8470552 -9578341 -11267044 -11655052 -10990780
4780 -10990780 -9559044 -7836464 -7578170 -9263932 -9998071 -7588313 -4966633 -6413691
4772f413691m362430k010060K486968M162925K796614Q60914p56643j752585j028616
4763f016604P72810R75039o29172j006207M11639Q4131l057502m593256j537503
4754a4596625K648902L784141L002519K831163J789099k029740n680057n082801
4746a3333399j420851J123281J783349K598651L353988K016581r17138k802647
4738g598185k769410j793064j51586J751879J716926j166684l309631r00509L718348
4729a0501916M719950J383186j053593L16451K017826M16655k327112j822118
4721f850671J694451L722007J829438j544880k977995k287416j516600j227652
4713i159318j2104K374579L668944K178081m08143j213348j58475N16310P7337
$$ plain form
4772 -6413691 -10776121 -12786181 -10299213 -6136288 -3339674 -2478760 -3235403 -4987988 -6016604
4763 -6016604 -5243794 -4268755 -4897927 -5904134 -5492495 -5408364 -8465866 -13059122 -14596625
4754 -14596625 -11947723 -8163582 -5161063 -2329900 -540801 -2570541 -8250598 -13333399
4746 -13333399 -14754250 -13630969 -11847620 -9248969 -5894981 -3878400 -4795538 -7598185
4738 -7598185 -10367595 -12160659 -12312245 -10560366 -8843440 -10010124 -13319755 -14220264 -10501916
4729 -10501916 -5781966 -4398780 -5452373 -5135922 -3118096 -2701441 -5028553 -6850671
4721 -6850671 -5156220 -1434213 395225 -1149655 -4127650 -6415066 -7931666 -9159318
4713 -9159318 -9171422 -6796843 -3127899 -949818 -1357961 -2571309 -2729784 -2213474 -2136137
4704b136137n0847N46443L22478j284821k536464k143925j138969q16174q23001
4695a0061417n12678k94248l80350J8308J019445J334894M03313m81062l08017
4686i261812K17507N11961J316097K702930L040716J607753J55592K5581j33034
4677A83291j543642k353549m04083K641045L209272J026323q41157q73030p25909
4668C18561j478299j374301J160907M472289N582225L906209J269928r78993k900106
4659I978420m199291l755593j753073m13601j024580j718535l76991J537003J157222
4650e69019n25514J82174K855310K425357k372454n443930k367220J978967Q45746
4641b990583l206694k286990L686971O535846K800756j442154j034587Q88633
$$ plain form
4704 -2136137 -2186984 -1640541 -1318063 -2602884 -5139348 -7283273 -8422242 -9238416 -10061417
4695 -10061417 -10574095 -10868343 -11248693 -11230385 -10210940 -8876046 -8472733 -8953795 -9261812
4686 -9261812 -9044305 -8532344 -7216247 -4513317 -1472601 135152 290744 316325 183291
4677 183291 -1360351 -3713900 -4117983 -1476938 1732334 2758657 1917500 1044470 318561
4668 318561 -1159738 -2534039 -1373132 3099157 8681382 12587591 13857519 12878526 9978420
4659 9978420 5779129 2023536 270463 -143138 -1167718 -2886253 -3263244 -1726241 -569019
4650 -569019 -1094533 -912359 1942951 4368308 1995854 -3448076 -5815296 -3836329 -2990583
4641 -2990583 -6197277 -8484267 -4797296 1738550 4539306 3097152 2062565 2951198
4633B951198j94481k661361k926455j735946j226963k10777K437365L571724L80655
4624C84959l926444m420257j832818k78399L2396J921656M622990M199029L80770
4615A083882k525178k090317m17785L04400N46890Q19719L02536o86287l27271
4606b989411J291490J473781j020471l866399m398942k580536L24435L560363
4598h205690N977382N620204K156197j689237k877286j519419l81671j416432
4590b335952l671136m450337k186227J696068L928285K841590K81146o46941O73662
4581c869842J931473J114113r25329j627387j3809J825287J096838j878802l530169
4572e877627j783361O21536q977k361826j817737K008585M115274J910847o87021
$$ plain form
4633 2951198 2756717 95356 -2831099 -4567045 -5794008 -6004785 -3567420 4304 384959
4624 384959 -3541485 -7961742 -9794560 -10072959 -10040563 -8118907 -3495917 703112 1083882
4615 1083882 -1441296 -3531613 -3949398 -3644998 -3098108 -2278389 -1975853 -2662140 -2989411
4606 -2989411 -1697921 -224140 -1244611 -5111010 -9509952 -12090488 -11766053 -8205690
4598 -8205690 -2228308 3391896 5548093 3858856 981570 -537849 -919520 -2335952
4590 -2335952 -6007088 -10457425 -12643652 -10947584 -7019299 -4177709 -3896563 -4543504 -3869842
4581 -3869842 -1938369 -824256 -1749585 -3376972 -3390781 -1565494 -468656 -2347458 -5877627
4572 -5877627 -7660988 -7039452 -7048429 -9410255 -11227992 -9219407 -5104133 -3193286 -3880307
4563c880307J65869K094877J168432j105288q19455R32741k06126l917725n191060
4554a0758042k375577N54031Q31414N60878J632116J951844l22114k750422k272333
4545a2948205q7736N81405l13292r7418J972307L612531L022081J145338l6033
4536c149022K4170L33918P2697k12370O26800K426882L354448K202977K45893
4527E926393n35032l86707j061731k522332k782683j379814m38857j153563j560667
4518e894993L01734K803330K741457J24147j596491k27951K372743L076842J451423
4509E152241m20584j100936r93536n83523N23871K040993K251383M01386j406059
4500E865236p20643J619631K622476J460634Q4537l63792p85270j386208r69654
$$ plain form
4563 -3880307 -3714438 -1619561 -451129 -1556417 -2375872 -1443131 -1649257 -5566982 -10758042
4554 -10758042 -13133619 -12579588 -11748174 -11187296 -9555180 -7603336 -7925450 -10675872 -12948205
4545 -12948205 -13035941 -12454536 -12767828 -12865246 -10892939 -7280408 -4258327 -3112989 -3149022
4536 -3149022 -3124852 -2790934 -2718237 -2930607 -2303807 123075 3477523 5680500 5926393
4527 5926393 5391361 5004654 3942923 1420591 -1362092 -2741906 -3180763 -4334326 -5894993
4518 -5894993 -5593259 -2789929 -48472 75675 -1520816 -1748767 623976 3700818 5152241
4509 5152241 4731657 3630721 2637185 2053662 2577533 4618526 6869909 7271295 5865236
4500 5865236 5144593 6764224 9386700 10847334 10931871 10568079 9782809 8396601 7426947
4491G426947J9290q70230l747723n040839k788372l9561j18196j555749j192692
4482g907125M45285R21744P44731J923760L334906K306355k01203q49982J95041
4473I13512m00093k962268m021789k313389o51967o62009l70098J282833K039440
4464g145828O42846n02676M65123J582268P05176p18565l72141J159539K105251
4455b079007K476144K595166J215947j794979l213262m76407L656603M116934
4447F497139K97336l588750m426724l188764j975857j184054m08252J79748M30848
4438g367330P16264J045290P61909l55678j569523k121304j964287j300053o3967
4429a2218679J746110L567167M429930L728161J890041N5398j218086k481983
$$ plain form
4491 7426947 7446237 6576007 2828284 -2212555 -5000927 -5040488 -5158684 -6714433 -7907125
4482 -7907125 -7461840 -6540096 -5795365 -3871605 -536699 1769656 1568453 718471 913512
4473 913512 513419 -2448849 -6470638 -8784027 -9435994 -10098003 -10468101 -9185268 -7145828
4464 -7145828 -6502982 -7005658 -6540535 -4958267 -4253091 -4971656 -5343797 -4184258 -2079007
4455 -2079007 397137 2992303 4208250 2413271 -799991 -1276398 2380205 6497139
4447 6497139 6794475 3205725 -1220999 -4409763 -6385620 -7569674 -7977926 -7798178 -7367330
4438 -7367330 -6651066 -5605776 -4843867 -5199545 -6769068 -8890372 -10854659 -12154712 -12218679
4429 -12218679 -10472569 -6905402 -2475472 1252689 3142730 3198128 1980042 -501941
4421e01941l909284l890542o99379M357668P242568N504220J035227k361192k985968
4412C791377j836657m13091N02643M44834p21633k167079k507382j253538O39754
4403c520772J861703J950118J212173k9326j435374k080538j028353R15790J239646
4394i14933j048699l266051k415959M098n7527k284598j489776L976489P975321
4385D78365M815209j913214m189958r98885J317523o09795l079858k563197q68582
4376g612392n77603m51589J233524K676351J537193p95409j340978k5963R06312
4367d450554N80371J04332M98535J761794L038999K800357M28871j827362r18350
4358B016993K266144L358059R50531j127955q1701J254309o17177l769150m026174
$$ plain form
4421 -501941 -4411225 -8301767 -9001146 -4643478 2599090 8103310 9138537 6777345 3791377
4412 3791377 1954720 1541629 2044272 2489106 1767473 -399606 -2906988 -4160526 -3520772
4403 -3520772 -1659069 291049 1503222 1473896 38522 -2042016 -3070369 -2154579 -914933
4394 -914933 -1963632 -5229683 -7645642 -7641544 -7699071 -9983669 -11473445 -7496956 478365
4385 478365 5293574 3380360 -809598 -1808483 -490960 -1100755 -4180613 -6743810 -7612392
4376 -7612392 -8189995 -8641584 -7408060 -4731709 -3194516 -3989925 -5330903 -5356866 -4450554
4367 -4450554 -3870183 -3765851 -3267316 -1505522 1533477 4333834 4762705 2935343 2016993
4358 2016993 4283137 7641196 8591727 7463772 7382071 8636380 8019203 4250053 223879
4349B23879j799047j094962k993316m517472l567718j175893J051932K493256
4341a1379341K615491J422653N80747J442737K506171J651583O4680M71649K067475
4332A443845J332489j851860l232644o00643K771772L131733J309920K41194K09552
4323D755358l73063j360621j314072n88683r41720k336724k849238j899513j053702
4314g961978j047578m69998J373607K458298Q73088j777622k176295J05953K193986
4305f428539K087060Q58623J01227m74104j591240k480695k087547q69499J52898
4296a0731816Q95919J317965N55141j224991j686528O30132L457468L612129J534511
4287a640070J43396J43003j69269r13604j31804K392026M131706L371677J078909
$$ plain form
4349 223879 -1575168 -2670130 -5663446 -10180918 -13748636 -14924529 -13872597 -11379341
4341 -11379341 -8763850 -7341197 -6760450 -5317713 -2811542 -1159959 -1095279 -623630 1443845
4332 1443845 2776334 924474 -2308170 -2908813 -137041 2994692 4304612 4545806 4755358
4323 4755358 4382295 3021674 1707602 1118919 177199 -2159525 -5008763 -6908276 -7961978
4314 -7961978 -9009556 -9479554 -8105947 -5647649 -4774561 -6552183 -8728478 -8622525 -6428539
4305 -6428539 -4341479 -3482856 -3381629 -3855733 -5446973 -7927668 -10015215 -10884714 -10731816
4296 -10731816 -9835897 -8517932 -7962791 -9187782 -10874310 -10244178 -6786710 -3174581 -1640070
4287 -1640070 -1496674 -1353671 -1522940 -2436544 -2568348 -176322 3955384 7327061 8405970
4278H405970j157777k431990j780133P65913K341490p864m372317n508925k027720
4269e773353J820859K517350J357997P50479N98930M37007J301642L045960L175383
4260I232254P57641j661062k202926k351044l275921l177568j024450P27028L39919
4251b636129K29630K576479M732727L170166m98588j767902J45900J891956J117461
4242H961700j327336l496750m006881k466282k57551L22383q63805j467164n52752
4233e154438q036o08258k13390K010550L380837K353898J457922K441674K548815
4224H209574n63345m016358m107286k091922j167837r57859L18749J210499m30485
4215c596270k710946k273618M22107K543245L275554K938998O56942k997119m264417
$$ plain form
4278 8405970 7248193 4816203 3036070 3801983 6143473 6135609 1763292 -3745633 -5773353
4269 -5773353 -3952494 -1435144 -77147 673332 1272262 1709269 3010911 6056871 9232254
4260 9232254 9989895 8328833 6125907 3774863 498942 -2678626 -3703076 -2976048 -2636129
4251 -2636129 -2406499 169980 4902707 8072873 7574285 5806383 5952283 7844239 8961700
4242 8961700 7634364 4137614 130733 -2335549 -2593100 -2270717 -3134522 -4601686 -5154438
4233 -5154438 -5162474 -5770732 -5984122 -3973572 -592735 1761163 3219085 5660759 8209574
4224 8209574 7646229 3629871 -477415 -2569337 -3737174 -4695033 -4376284 -3165785 -3596270
4215 -3596270 -6307216 -8580834 -8158727 -5615482 -2339928 599070 1256012 -1741107 -6005524
4206f005524j505804J099298l75474l506415m119098k748684j360506J595844
4198a6926363O697293Q924811M677413r15553j220942J579225J366374j098890
4190C083368j186182j39719j932499l848132p95543L776161K489847k531799k666141
4181c750639J992933K763799k252321n283470k554728R79608K275385M062430
4173a767003O018861L488515k397506m290554r74499N93009j966881k755618O04042
4164c447634K663826P59478q73046l46367p84601j887971j66493J600978k065102
4155d546932o471022k687099M162299J136643p922914o667759L058794K215380
4147a7722610q565989o556883O334645o273845n2232817p6156703k9800351M9253323
$$ plain form
4206 -6005524 -7511328 -6412030 -6787504 -10293919 -14413017 -17161701 -18522207 -16926363
4198 -16926363 -10229070 -1304259 3373154 2457601 1236659 2815884 4182258 3083368
4190 3083368 1897186 1757467 -175032 -4023164 -4818707 -1042546 1447301 -1084498 -3750639
4181 -3750639 -1757706 1006093 -1246228 -6529698 -9084426 -8104818 -5829433 -1767003
4173 -1767003 4251858 7740373 5342867 1052313 77814 670823 -1296058 -4051676 -3447634
4164 -3447634 -783808 -24330 -897376 -1243743 -2028344 -3916315 -4082808 -2481830 -4546932
4155 -4546932 -11017954 -13705053 -9542754 -8406111 -16329025 -22996784 -19937990 -17722610
4147 -17722610 -26288599 -32845482 -26510837 -32784682 -85017499 -161174202 -190974553 -141721230
4139a41721230P9424273M2918115r9363l395067J2379966J1163262k478903n239444
4131g048391J832475L014275r40150P00375M922760J645474n562582n702356R6875
4122g041245K519272J087217J777467L484393J276807j891451j64535K993318
4114D041243K61794n782313o627163k334298k92552j854480j507796J986793M040885
4105h067887L261836K899919L631383K919538J025822L90869j5613k766767n715698
4096b436598m653983q90434Q11541M50954J678490L737658K359595j627573k441772
4087c012122J140487L628905J634852j597691k371824j591319j397210j456078
4079e022000r20124m53291m04403J74597J454068K235578J965380J004022q63941
$$ plain form
4139 -141721230 -62296957 -19378842 -19478205 -22873272 -10493306 669956 -1808947 -7048391
4131 -7048391 -5215916 -2201641 -3141791 -2441416 2481344 4126818 -1435764 -7138120 -7041245
4122 -7041245 -4521973 -3434756 -1657289 1827104 3103911 1212460 1047925 4041243
4114 4041243 4303037 -1479276 -8106439 -10440737 -10733289 -12587769 -14095565 -12108772 -8067887
4105 -8067887 -4806051 -1906132 1725251 4644789 5670611 6061480 6045867 3279100 -2436598
4096 -2436598 -7090581 -7981015 -7169474 -6718520 -5040030 -1302372 1057223 -570350 -3012122
4087 -3012122 -1871635 1757270 3392122 1794431 -577393 -2168712 -3565922 -5022000
4079 -5022000 -5942124 -6395415 -6799818 -6625221 -5171153 -2935575 -970195 33827 -830114
4070h30114l438531m262674j207973L434124N086848L044507Q02330K13834n42280
4061B300071k405023l036350q72089J710972J687203k72711j060061M20493K054790
4052E27295J574721m89257j475838l9471J841037J300483j371352k979733j947493
4043c059608k34786K06352L11013J471873K558650J659624r32207l535531n100978
4034f655598m514614l36231N982757Q955828M888937k454037n767680l153748
4026c054386M44826N93422j520456k221908o56395Q47962M36462q39356n21683
4017f491512J691177K965348J134819j562004j255321J399977J695405j664234
4009b086345l998949j799344J912129K781054J744007K017570K704314P52313
$$ plain form
4070 -830114 -4268645 -8531319 -9739292 -6305168 -1218320 1826187 2628517 2842351 2300071
4061 2300071 -104952 -3141302 -4013391 -2302419 -615216 -887927 -1947988 -1527495 527295
4052 527295 2102016 1612759 136921 97450 1938487 3238970 1867618 -1112115 -3059608
4043 -3059608 -3294394 -3088042 -2777029 -1305156 1253494 2913118 1980911 -1554620 -6655598
4034 -6655598 -11170212 -11506443 -5523686 3432142 8321079 5867042 99362 -3054386
4026 -3054386 -2609560 -2016138 -3536594 -5758502 -6414897 -5566935 -5130473 -5969829 -6491512
4017 -6491512 -4800335 -1834987 -700168 -2262172 -3517493 -2117516 -422111 -2086345
4009 -2086345 -6085294 -7884638 -5972509 -3191455 -1447448 570122 3274436 4026749
4001D026749k676291l360476q63263Q20157m73613k521723k820735j529266J26352
3992i272109J224745P62948j201327k225132k79547K567881K568174j459j195238
3983g051064N52589K541568K510312J582244J379657J296057J58001j579470k591887
3974a201993k272435j029023m3094l94760j297753m33706K267835L138221j31339
3965a398047l872140k893939J700872L785724R93549k536677k823935r19065L35766
3956g627892N09591N76196O81063P88058J360414K098797J946095J073489P86115
3947B191926J094077P39007j84328l50932r8584j067053k591946j986018P05194
3938a548657J859162l33629l006393l028855j279257l50882n68416o25299j73544
$$ plain form
4001 4026749 1350458 -2010018 -2873281 -2053124 -2526737 -5048460 -7869195 -9398461 -9272109
3992 -9272109 -8047364 -7284416 -8485743 -10710875 -10990422 -8422541 -5854367 -5855826 -7051064
3983 -7051064 -6498475 -3956907 -1446595 135649 1515306 2811363 2969364 1389894 -1201993
3974 -1201993 -3474428 -4503451 -4546545 -4941305 -6239058 -6672764 -4404929 -1266708 -1398047
3965 -1398047 -5270187 -8164126 -6463254 -2677530 -1683981 -4220658 -7044593 -7963658 -7627892
3956 -7627892 -7118301 -6542105 -5861042 -5072984 -3712570 -1613773 332322 1405811 2191926
3947 2191926 3286003 4025010 3840682 3489750 3391166 2324113 -267833 -2253851 -1548657
3938 -1548657 310505 -23124 -3029517 -6058372 -7337629 -7688511 -8256927 -8882226 -9055770
3929i055770M64530J606901L225813L879598K374969l87144k489049l095503k621667
3920f097322j726366q39080J8602J122271K082365J661560j18644p95991J374244
3911c318361M075297L679350O78145j094079m44520j35817j745323l167389k429943
3902c902640m87677J093715J962349J385906j539085m702565l926419R03077M477752
3893d735587L338949P71774J264983L490701K904981q77089l611839k541536N04861
3884E10198K092723Q93982j606016k678288r33240J947027L002154J827924P93539
3875E850003J024056Q55380o03370j412394k68837P80980l48975k086167j655652
3866B135024N11728J684694R71194l7638m6786N84508P62736l84181k679161m248774
$$ plain form
3929 -9055770 -8591240 -6984339 -3758526 121072 2496041 2108897 -380152 -3475655 -6097322
3920 -6097322 -7823688 -8662768 -8644166 -7521895 -5439530 -3777970 -3896614 -4692605 -3318361
3911 -3318361 756936 4436286 5114431 4020352 3575832 3440015 1694692 -1472697 -3902640
3902 -3902640 -4390317 -3296602 -1334253 51653 -1487432 -6189997 -10116416 -9213339 -4735587
3893 -4735587 -1396638 -624864 640119 4130820 7035801 6158712 2546873 5337 510198
3884 510198 2602921 3496903 1890887 -787401 -1720641 226386 3228540 5056464 5850003
3875 5850003 6874059 7729439 7126069 5713675 5444838 6225818 5876843 3790676 2135024
3866 2135024 2646752 4331446 5302640 5265002 5218216 5802724 6565460 6181279 3502118 -746656
3856g46656l130242k16240J348128M65626o25361k84348K21861k73715o50177
3847c891124j59417j54393j089708j048426M08756M61514k010546l307180l85196
3838a1175720L792712M467165J855238m68047j347412j788540j342938N48584
3830e458958J703815M49972l80510K199831N129096L338457j616262l540221j476240
3821C48980n80862k740455l484427j41620L447688L374508J452184J145076K023280
3812D844352J780535M07576r05052k302500l793431l582522n95343L098291M544637
3803C496543L102137J8024l253081n072007m173077j602891r0427m16627o33370
3794h624776K77088P66666q2903p32716j43373L55405n7902J41418J728795K637593
$$ plain form
3856 -746656 -3876898 -4093138 -2745010 -2279384 -2904745 -3189093 -2967232 -3240947 -3891124
3847 -3891124 -4050541 -4204934 -5294642 -6343068 -5934312 -5472798 -7483344 -10790524 -11175720
3838 -11175720 -7383008 -2915843 -1060605 -1528652 -2876064 -4664604 -6007542 -5458958
3830 -5458958 -3755143 -3305171 -3685681 -1485850 3643246 6981703 5365441 1825220 348980
3821 348980 -231882 -2972337 -6456764 -6598384 -3150696 223812 1675996 2821072 4844352
3812 4844352 6624887 7032463 6127411 3824911 31480 -3551042 -4146385 -1048094 3496543
3803 3496543 6598680 6616704 3363623 -1708384 -5881461 -7484352 -7574779 -7991406 -8624776
3794 -8624776 -8347688 -7581022 -7663925 -8396641 -8540014 -8184609 -8242511 -8101093 -6372298 -3734705
3784c734705J309978n06197q10564o28123j474724k026776n46189J429516J353417
3775e634367J21529N90800K532845K773691L19445j971898j508872P35945J969214
3766g1668R91894r28633j749361q45339K76267o7656j013232J11093L620726N989118
3756F313209M099465o29039m225322m874085l612310j658188M56636J776608J353138
3747i99888k57070j508308j555423l34451J915841L794304L011057m00224k786423
3738H79415j446119J060279M97343k396284k985489r6962K288107J517150l7786
3729g20346K96746J057669j24655j879407j234179J367267K695380J628748K63568
3720C350791J43101J21100j254555l135257l298541r26687K249488L510830J915291
$$ plain form
3784 -3734705 -2424727 -2930924 -3741488 -4369611 -5844335 -7871111 -8417300 -6987784 -5634367
3775 -5634367 -5512838 -4922038 -2389193 384498 703943 -1267955 -2776827 -2040882 -71668
3766 -71668 920226 -8407 -1757768 -2603107 -2326840 -2394496 -3407728 -3296635 324091 6313209
3756 6313209 10412674 9783635 5558313 684228 -2928082 -4586270 -4129634 -2353026 -999888
3747 -999888 -1256958 -2765266 -4320689 -4655140 -2739299 1055005 4066062 3665838 879415
3738 879415 -566704 493575 990918 -1405366 -4390855 -4487817 -2199710 -682560 -720346
3729 -720346 -423600 634069 509414 -1369993 -2604172 -1236905 1458475 3087223 3350791
3720 3350791 3493892 3614992 2360437 -774820 -4073361 -5000048 -2750560 760270 2675561
3711B675561n00489r59053M69227Q13182j509528l948133l067102O16778L292824
3702b116733K837155P10438j122019k514464l577599l286931j292108O77556J076854
3693h607851Q92193J777629K942764K239460j57469j643602r31983L84208O31223
3684b473428K81417K87862O0963j265760k773844k731842j092334M29675N49373
3675h727918l74940j084874n64889J167430K705057K330180K56053j109931k65424
3666e669256J080877M61027j525843k113800o76051N70768M99607Q20948K563142
3657c988581L398450Q51538l405626n170469l056247K68380K160725K799378L133541
3648c008911K444888p6063k667192k434547N20729K646406J550910p08691o37022
$$ plain form
3711 2675561 2175072 1216019 1685246 2498428 988900 -2959233 -6026335 -5409557 -2116733
3702 -2116733 720422 1430860 308841 -2205623 -5783222 -9070153 -10362261 -9684705 -8607851
3693 -8607851 -7715658 -5938029 -2995265 -755805 -913274 -2556876 -3488859 -3104651 -2473428
3684 -2473428 -2192011 -1904149 -1843186 -3108946 -5882790 -8614632 -9706966 -9277291 -8727918
3675 -8727918 -9102858 -10187732 -10752621 -9585191 -6880134 -4549954 -4293901 -5403832 -5669256
3666 -5669256 -4588379 -4127352 -5653195 -7766995 -8443046 -7872278 -7372671 -6551723 -3988581
3657 -3988581 -590131 261407 -3144219 -8314688 -11370935 -11102555 -8941830 -6142452 -3008911
3648 -3008911 -564023 -640086 -3307278 -5741825 -5221096 -2574690 -1023780 -1732471 -2369493
3639b369493J567682K266381l18662l500937l781951j151975J706689K941278
3631b640988K425734M06755k363711l688144j695328K155795M121834K929996
3623A651943J349592J826410K625410N50189l599038n137935j663102L130341
3615G33810L652099n00463m010783k814339P99294J992372M57920K14788K586739
3606C111437L623882M02109l764192l819567k83487J962393R20365p76083j093628
3597B83229j256845k346318l043944k288984j133287l81039Q93622K844891L470549
3588b958126J637583o99393j213491k55763N27066P43174P33004L95076K17047
3579h73823J453300L484709L276412k75784l680035l268659l92605Q17926o82833
$$ plain form
3639 -2369493 -801811 1464570 1145908 -2355029 -6136980 -7288955 -5582266 -2640988
3631 -2640988 -215254 191501 -2172210 -5860354 -7555682 -5399887 -1278053 1651943
3623 1651943 3001535 4827945 7453355 8003544 4404506 -733429 -2396531 733810
3615 733810 4385909 3885446 -125337 -2939676 -2140382 -148010 309910 524698 3111437
3606 3111437 6735319 7137428 3373236 -446331 -729818 1232575 2152940 1376857 283229
3597 283229 -973616 -3319934 -6363878 -8652862 -9786149 -10167188 -9273566 -6428675 -2958126
3588 -2958126 -1320543 -2019936 -3233427 -3489190 -2962124 -2218950 -1485946 -1090870 -873823
3579 -873823 579477 4064186 7340598 7064814 3384779 116120 -276485 541441 -141392
3570a41392k483214l011349k744400j767716M46722K898827L681369K749737J467651
3561A096235j51013k683093m271382k262844J743582K633610r95550m197715k602024
3552a1690194J352545K342576j5113j155475J393778M662773M661167J510193
3544C062250j328011j531213k2619J000362P09407j85094r84362j576486j616607
3535b472373m67094J467575K455736J438821m84536j502688j163280j5961J633885
3526H90085L090537K578830n70975l679928l172694P26011M064036M098981J825677
3517I850560o78905k678307l638673k496337J32047J245318q04655l476858l301700
3508e847510p91378N67823k95957n92792J759379M664672M688819J895251l94122
$$ plain form
3570 -141392 -2624606 -5635955 -8380355 -10148071 -9701349 -6802522 -3121153 -371416 1096235
3561 1096235 945222 -1737871 -6009253 -8272097 -6528515 -3894905 -4890455 -9088170 -11690194
3552 -11690194 -10337649 -7995073 -8010186 -9165661 -7771883 -3109110 1552057 3062250
3544 3062250 1734239 203026 180407 1180769 1890176 1705082 720720 -855766 -2472373
3535 -2472373 -2939467 -1471892 983844 2422665 1938129 435441 -727839 -743800 890085
3526 890085 3980622 6559452 5988477 2308549 -864145 -138134 3925902 8024883 9850560
3517 9850560 9171655 6493348 2854675 358338 490385 1735703 931048 -2545810 -5847510
3508 -5847510 -6638888 -6071065 -6367022 -6959814 -5200435 -535763 4153056 6048307 5654185
3499E654185l51585K19535o00635j419762L514K165069J270089k388074l553751
3490I98585K87055M050824J908805l582784m554639P55365N488429M226268J05440
3481I683348r56436J247375K431996O66601k111740l841079l925008k073885J086357
3472B207529K842768R95109k554190l654779j377667J017712P95147j130390k337158
3463c195919j914166m84508J027928J785255J454945Q26755R97956J771670J981095
3454D251011J363121P99149P70560R86049J386979J958610J816103L59519r76349
3445A2714752n00029L84778j307470m816217n524978j869961J355033l16416m069157
3436c949665l807082O63894L433906J377912j659930j106053J990002L466219
$$ plain form
3499 5654185 5302600 5522135 4921500 3501738 3505252 5670321 6940410 4552336 998585
3490 998585 1285640 5336464 7245269 3662485 -892154 -136789 5351640 9577908 9683348
3481 9683348 8726912 9974287 12406283 13072884 10961144 7120065 3195057 1121172 2207529
3472 2207529 5050297 6045406 3491216 -163563 -1541230 -523518 271629 -858761 -3195919
3463 -3195919 -5110085 -5594593 -4566665 -2781410 -1326465 -499710 498246 2269916 4251011
3454 4251011 5614132 6413281 7183841 8169890 9556869 11515479 13331582 13691101 12714752
3445 12714752 12214723 12599501 11292031 6475814 950836 -919125 435908 119492 -3949665
3436 -3949665 -7756747 -7092853 -3658947 -2281035 -3940965 -5047018 -3057016 409203
3428D09203K010986m26357k272261l190284k414846M82444L349820L031936k65031
3419G15610k755408k069620j01107L54411m63123n83137K12841N93401L86752
3410c709380O48667J356816J335878N71222L99893R42097N24334j341665k386507
3401a658645o13622K449752L410190J247428j856852l617835l795458l074381
3393g509423j553257O91426K614230L020110K078280J039517M47606m42455k082072
3384a696038l286352k414469L47020K908370L674975L052974K139961J035664
3376E762105n51866j894547j860332o18569N52997R61896P77582l8929j500883
3367A589454k458682j588626K85403Q65006j58220n10539R13301K075348J107238
$$ plain form
3428 409203 2420189 1993832 -278429 -3468713 -5883559 -5401115 -2051295 980641 715610
3419 715610 -2039798 -4109418 -4210525 -3856114 -4319237 -4902374 -4689533 -4096132 -3709380
3410 -3709380 -3060713 -1703897 -368019 203203 603096 1545193 2069527 727862 -1658645
3401 -1658645 -2272267 177485 3587675 4835103 2978251 -639584 -4435042 -7509423
3393 -7509423 -9062680 -8371254 -5757024 -2736914 -658634 380883 828489 386034 -1696038
3384 -1696038 -4982390 -7396859 -7049839 -4141469 -466494 2586480 4726441 5762105
3376 5762105 5210239 3315692 1455360 836791 1389788 2351684 3129266 3090337 1589454
3367 1589454 -869228 -2457854 -2172451 -1307445 -1465665 -1976204 -1062903 1012445 2119683
3358B119683n85673o37704N94958J017356R7500j240828k779191m346480m066071
3349i826450m48903M225990N867398L858200J218355m30761k260964m078082l175494
3340e050711P76952L726980K891889R32895J182927J985108J07453k760892k262439
3331A530162J048406K067450n98595k251120L29013L838732L795408R80418r27080
3322I812794j190937j645282k464338k250443j308508j149989j226185L05747
3314a117141K614089K558742l32023k561433j613925O33089J120383j50151j108328
3305D3302j062344r59817j273291j535048j317676k74267J911770M230055M183278
3296C945962Q70842k652047k477680Q97687K820625M53203l637939m928078k365775
$$ plain form
3358 2119683 1534010 896306 1491264 2508620 2606120 1365292 -1413899 -5760379 -9826450
3349 -9826450 -10275353 -6049363 -181965 3676235 4894590 4463829 2202865 -1875217 -5050711
3340 -5050711 -4273759 -546779 2345110 3278005 4460932 6446040 6553493 3792601 1530162
3331 1530162 2578568 4646018 4047423 1796303 2125316 5964048 9759456 10739874 9812794
3322 9812794 8621857 6976575 4512237 2261794 953286 -196703 -1422888 -1117141
3314 -1117141 1496948 4055690 3723667 1162234 -451691 181398 1301781 1151630 43302
3305 43302 -1019042 -1978859 -3252150 -4787198 -6104874 -6379141 -4467371 -237316 3945962
3296 3945962 4816804 2164757 -312923 584764 3405389 3858592 220653 -4707425 -7073200
3287g073200J078976K380581J407400J6954m63849j63187L40200R00093J357956
3278b18076J071370j36198j027474l55687Q58488K54246k160845l273895j125067
3269f113138J980899K542641N31507j333659j825350j978810k212833j613434
3261a0022177j86534Q62449J457886K692578M052183L341682L66965j929946j483390
3252h48304k7030l14167k252844l611436l175386j524964K27419J044365L21191
3243a0161156j122655j355095L92641K764020M189294M316193L037747K10240
3235B271229k676039k932092l47516J807338J248812j56966J64171J287927Q14850
3226A481714r05049j693991j173857m14181N92228J883489J423017k210160o012616
$$ plain form
3287 -7073200 -5994224 -3613643 -2206243 -2189289 -2653138 -2816325 -2476125 -1576032 -218076
3278 -218076 853294 717096 -310378 -666065 192423 446669 -1714176 -4988071 -6113138
3269 -6113138 -4132239 -1589598 -1058091 -2391750 -4217100 -6195910 -8408743 -10022177
3261 -10022177 -10208711 -9346262 -7888376 -5195798 -1143615 2198067 2565032 635086 -848304
3252 -848304 -875334 -1189501 -3442345 -7053781 -10229167 -11754131 -11526712 -10482347 -10161156
3243 -10161156 -11283811 -12638906 -12246265 -9482245 -5292951 -976758 2060989 2271229
3235 2271229 -404810 -3336902 -3684418 -1877080 -628268 -785234 -621063 666864 1481714
3226 1481714 576665 -1117326 -2291183 -2705364 -2113136 -229647 1193370 -1016790 -7029406
3217g029406n458133q84563K821768K861523J181395M73480J207460K850424M416342
3208B440290L679934k93432l775043k017989L260303N091574J152423k994017
3200F544043k733247q29073j432659k832616j175127K367021L632508K298398
3192E839248J455903J869778J484080k64100j945631l166232m131570l241678
3184b100202N66441L979301K649184j858318l457256l35200K697136J902688l10990
3175C732784l55368Q15829J89874k143826l656632l274874j756579L80036K743877
3166c324879L909162K654279j10793k195131k397430j001034R84336K123627J314373
3157A956510p01912j764501j115156l57824o96897j047174k19039R20203J212240
$$ plain form
3217 -7029406 -12487539 -13372102 -10550334 -7688811 -6507416 -6033936 -4826476 -1976052 2440290
3208 2440290 6120224 5826792 2051749 33760 3294063 8385637 9538060 6544043
3200 6544043 3810796 2981723 1549064 -1283552 -2458679 -91658 3540850 5839248
3192 5839248 7295151 9164929 10649009 10384909 8439278 5273046 1141476 -2100202
3184 -2100202 -1533761 2445540 5094724 3236406 -220850 -556050 2141086 4043774 3732784
3175 3732784 3377416 4193245 4383119 2239293 -1417339 -4692213 -6448792 -6068756 -3324879
3166 -3324879 584283 3238562 3127769 932638 -1464792 -2465826 -1481490 642137 1956510
3157 1956510 1254598 -509903 -1625059 -1982883 -2679780 -3726954 -3945993 -3025790 -1813550
3148a813550J315355J929601J608241j009019l987709m113319j603108J52604
3140g520904l88630j023512L64907K570245L000419J214138q75637j473162n40192
3131d672328O25753Q70790L68624K77268J003507J452002O93441m91479r29114
3122h01536j017509j669120k041801o07477J741615K213382J42404j983808k307046
3113f330896j923587k195218k198798p62596R85767J423086J261673K060948L007064
3104d672557J972800o33940j889457n37780J255051J092195n96841j584637n14690
3095f109856K179579M760635N045530K192328j684879l137980j492943J55027
3087A907441p97902k799595k586907j41623J281323l9345j904196j512111O64279
$$ plain form
3148 -1813550 -498195 1431406 3039647 2030628 -1957081 -6070400 -7673508 -7520904
3140 -7520904 -7909534 -8933046 -8568139 -5997894 -2997475 -1783337 -2658974 -4132136 -4672328
3131 -4672328 -4046575 -3175785 -2807161 -2529893 -1526386 -74384 619057 127578 -801536
3122 -801536 -1819045 -3488165 -5529966 -6137443 -4395828 -2182446 -2040042 -4023850 -6330896
3113 -6330896 -8254483 -10449701 -12648499 -13411095 -12425328 -11002242 -9740569 -7679621 -4672557
3104 -4672557 -2699757 -3333697 -5223154 -5760934 -4505883 -3413688 -4010529 -5595166 -6109856
3095 -6109856 -3930277 830358 5875888 8068216 6383337 3245357 1752414 1907441
3087 1907441 1109539 -1690056 -4276963 -4418586 -3137263 -3176608 -5080804 -6592915 -5928636
3078e928636J849733Q57567o85741r24116j01624L33735K289j23947N35735J300411
3068b884594J476127J480897J853730J872376N03090j500232k050035o67137O11830
3059F96052J85528p39569k43386J026362Q24304r23625j812213q05240Q6588p56264
3049b461463j616955r3400K693611L238088O52347k123104k548087j408895m06594
3040d074452P60305K784436L974329K020442j990920m236278l141306r99363J80847
3031d721960J485240L873371M898773J962210k608297l637315k93602K539354
3023C497774J242810j598459j550187R98327J804412p73292l704942l844331j717909
3014e645797K27792J058140J548613K176819K442005J802894K69319j777224l639626
$$ plain form
3078 -5928636 -4078903 -3221336 -3907077 -4831193 -4932817 -4599082 -4596793 -4720740 -4185005 -2884594
3068 -2884594 -1408467 72430 1926160 3798536 4301626 2801394 751359 84222 696052
3059 696052 881580 142011 -101375 924987 1749291 825666 -986547 -1791787 -1705199 -2461463
3049 -2461463 -4078418 -4171818 -1478207 1759881 2412228 289124 -2258963 -3667858 -4074452
3040 -4074452 -3314147 -529711 3444618 5465060 3474140 -762138 -3903444 -4902807 -4721960
3031 -4721960 -3236720 636651 5535424 7497634 4889337 1252022 958420 3497774
3023 3497774 4740584 3142125 1591938 2590265 4394677 3621385 -83557 -3927888 -5645797
3014 -5645797 -5418005 -4359865 -2811252 -634433 1807572 3610466 3879785 2102561 -1537065
3005a537065m317075l138091n47785K037940L304572K954819J682434L67197p11271
2996I5675j815812k843230k774602o52021K709636M660447L217857l78048k512361
2987b92459j179492J567719K215825M30574o35446R13359K779048J961528n50866
2978G209790j373058j79088m4587j908610k475775M08707L537944K631781j318366
2969F488738l649832k826711j723706k193644k276320p2194K717843L142431R63051
2960E69656j617873k905168k682931j156118J304787L522443L968494K307423
2952C310713K7423q39583K08165J409246N60056k275132m633674m547110k408653
2943i188549N76775L941038O568786N998054J795392k067490j677452J046090
$$ plain form
3005 -1537065 -5854140 -8992231 -9540016 -7502076 -4197504 -1242685 439749 806946 95675
2996 95675 -1720137 -4563367 -7337969 -7989990 -5280354 -619907 2597950 2219902 -292459
2987 -292459 -1471951 95768 2311593 2742167 2106721 3020080 5799128 7760656 7209790
2978 7209790 5836732 5657644 5613057 3704447 1228672 1637379 5175323 7807104 6488738
2969 6488738 2838906 12195 -1711511 -3905155 -6181475 -6253669 -3535826 -393395 569656
2960 569656 -1048217 -3953385 -6636316 -7792434 -6487647 -2965204 1003290 3310713
2952 3310713 3338136 2498553 2706718 4115964 4676020 2400888 -2232786 -6779896 -9188549
2943 -9188549 -8611774 -4670736 1898050 7896104 9691496 7624006 5946554 6992644
2935F992644R94049k316712m272512k832734j421084k462479l212422j072498
2927i603748J480089J281671J30486J444731L989423L833605Q55033j442548j554099
2918D14643r69031l00087J178887K475663J608321o51494j708610j603708k373038
2909a928454l239424j362814K246493K986082K03031j022650J929013M548979
2901D360256K323282k131277l628528k402928k244303l202412j981642J373204
2893g534348K858040J036426p00506K37511J806455J141093r24069j596248l65013
2884d040659R15814J113056Q59760Q00260M04595j072700l137528m026471k331171
2875a0515044J241965M099605M176460J793495j253582l638633m648316l404554
$$ plain form
2935 6992644 7986693 5669981 1397469 -1435265 -2856349 -5318828 -8531250 -9603748
2927 -9603748 -8123659 -6841988 -6711502 -5266771 -1277348 2556257 3411290 1968742 414643
2918 414643 -554388 -854475 324412 2800075 4408396 3756902 2048292 444584 -1928454
2909 -1928454 -5167878 -6530692 -4284199 -1298117 -1095086 -2117736 -188723 4360256
2901 4360256 6683538 4552261 923733 -1479195 -3723498 -6925910 -8907552 -7534348
2893 -7534348 -4676308 -3639882 -4340388 -4102877 -2296422 -1155329 -2079398 -3675646 -4040659
2884 -4040659 -3124845 -2011789 -1152029 -351769 52826 -1019874 -4157402 -8183873 -10515044
2875 -10515044 -9273079 -5173474 -997014 796481 -457101 -4095734 -8744050 -12148604
2867a2148604K08971M081494N312698L532979J159326p1750r34638k249667k721970
2858c831161j053038J354909K140043J517606J476411J835843K42835l189737
2850D93711m496314j280387K908521K735807j609483m659585l036759P98278K889102
2841e257109K659910J783664Q55301l88118j239514q74344n2789L1241l37013
2832b818771m00017n79652j111374n68698J638437K867701P93909j870835n69408
2823b618708L545394M304490k50138m516158l623151l06299K44877j482675j232442
2814e934810J343369K212248m20419l659143m530495l356664j794652o17241l21546
2805a7079353j256169k183469j064711J801016L634813L095577K063500K316234
$$ plain form
2867 -12148604 -11939633 -7858139 -2545441 987538 2146864 2075114 1140476 -1109191 -3831161
2858 -3831161 -4884199 -3529290 -1389247 128359 1604770 3440613 3683448 493711
2850 493711 -4002603 -5282990 -2374469 361338 -1248145 -5907730 -8944489 -8146211 -5257109
2841 -5257109 -2597199 -813535 41766 -346352 -1585866 -2460210 -2512999 -2481758 -2818771
2832 -2818771 -3218788 -3798440 -4909814 -5478512 -3840075 -972374 -178465 -2049300 -2618708
2823 -2618708 926686 5231176 4981038 464880 -3158271 -3464570 -3219693 -4702368 -5934810
2814 -5934810 -4591441 -2379193 -2799612 -6458755 -10989250 -14345914 -16140566 -16757807 -17079353
2805 -17079353 -18335522 -20518991 -21583702 -19782686 -16147873 -13052296 -10988796 -8672562
2797h672562K739021J649568m4093l67844K68272k16101j768991j780288Q76879
2788g316139L582645L259857N56702j173132m77196P91721R11732P65508J534550
2779B436248J976602L69461k086375k664155j354451n82942p47979L24462K727340
2770C98211L321987J126183j94161J688146K992043n66859o164021p213263k982029
2761g593763P55012O12621m51077O46980K094459J054044j252903j544348O80867
2752d998108K986187L318033J617320p49355j946795j196777Q8763J62858j53343
2743h71217J151091L060637K199160j517650l833869k420502k09918r7508m01348
2734b941124J019358J972975k09748k991999k040209J475945K374963n28340l137956
$$ plain form
2797 -8672562 -5933541 -4283973 -4328066 -4695910 -4427638 -4643739 -6412730 -8193018 -7316139
2788 -7316139 -3733494 -473637 83065 -1090067 -1567263 -775542 136190 901698 2436248
2779 2436248 4412850 4782311 2695936 31781 -1322670 -1905612 -2653591 -2329129 398211
2770 398211 3720198 4846381 4652220 6340366 9332409 8765550 2601529 -4611734 -7593763
2761 -7593763 -6838751 -6226130 -6677207 -6030227 -3935768 -2881724 -4134627 -5678975 -4998108
2752 -4998108 -2011921 1306112 2923432 2174077 227282 -969495 -880732 -717874 -871217
2743 -871217 279874 3340511 5539671 4022021 188152 -2232350 -2442268 -2539776 -2941124
2734 -2941124 -1921766 51209 -158539 -3150538 -5190747 -3714802 -1339839 -1868179 -5006135
2725e006135k786561j193649m3909J549985L670189L979968J628057o72065o85783
2716D40097J17726l85932j297625n93710J226291J957429J040263p621J09767
2707B606685J177633J983763J348108o39282k151104j601764q7725L192j155384
2698A484122r81608R61413J704190l85537k677320k285663k65356Q29647J075950
2689e40162J694471J561274r53301l872909l354846O66682M113169M243533K334120
2680E892031N49851o43042j092582m2238J877795K104960o24822m089088n206632
2671a273767l697544j716324o92563L7134J607117L583147M016876J747970j561517
2662B050529k789384j263688J68721p92529k467241j911503N01719K105290K346270
$$ plain form
2725 -5006135 -7792696 -8986345 -9030254 -7480269 -3810080 169888 1797945 1125880 440097
2716 440097 557823 171891 -1125734 -1719444 -493153 1464276 2504539 2496918 2606685
2707 2606685 3784318 5768081 7116189 6476907 4325803 2724039 2636314 2639506 1484122
2698 1484122 502514 1463927 3168117 2782580 105260 -2180403 -2445759 -1616112 -540162
2689 -540162 1154309 2715583 1762282 -2110627 -5465473 -4798791 -685622 3557911 5892031
2680 5892031 6441882 5798840 4706258 4664020 6541815 8646775 8021953 3932865 -1273767
2671 -1273767 -4971311 -6687635 -7380198 -7343064 -5735947 -2152800 1864076 3612046 2050529
2662 2050529 -738855 -2002543 -1833822 -2626351 -5093592 -7005095 -6503376 -4398086 -2051816
2653b051816K578654K086557j354033o435766q210090m564826R16725M212202
2645a2822393N194569M829207K343789j718373l528541j048743K021083J616400
2637c113002j67175J200966M670432M991347J157743k242046k337508j397752
2629B763005j945917l058479k999885j748207L78746L154175M638085K717276
2621C898799o88296j174090J267733J731780j385612l076541j3269L035151K05858
2612C801513n823911p259597k289009L178228M315755K488262J053680Q31393
2604B96314J189387J971454K552011J514091j193164l558331l974178k914178
2596d116594j615283o43709j97691l36506n17828j36404M65351P34591J149003
$$ plain form
2653 -2051816 526838 2613395 1259362 -5176404 -13386494 -17951320 -17034595 -12822393
2645 -12822393 -7627824 -2798617 -454828 -2173201 -5701742 -6750485 -4729402 -3113002
2637 -3113002 -3280177 -2079211 2591221 7582568 8740311 6498265 4160757 2763005
2629 2763005 817088 -2241391 -5241276 -6989483 -6610737 -3456562 1181523 3898799
2621 3898799 3210503 2036413 3304146 5035926 3650314 573773 560504 3595655 3801513
2612 3801513 -2022398 -9281995 -11571004 -8392776 -4077021 -1588759 -535079 296314
2604 296314 1485701 3457155 6009166 7523257 6330093 2771762 -1202416 -4116594
2596 -4116594 -5731877 -6375586 -6573277 -6909783 -7427611 -7564015 -7098664 -6364073 -5215070
2587e215070K056826J990985m75533l526131l596220m55962J996755J000059j528052
2578g752343k136573m36093J265561J513476R91964Q14798R89373O79407n68296
2569d638726j974401k136362q03116N99998R74962J148543K153191K938648J805165
2560F7902n45559j724137j117019k25865K84418J203809K308962K104632N58566
2551B915709o02622q84071j465363k075697q01896J809471K108105j104086l722057
2542c822507j904313K169145L351470N14949k697856k985738m89177K462111L460728
2533E8812J593006j364657k301636o76793N81274m51458j697539q10423O65984
2524d403430J11615j280438l17456K727417M408768L324678J403523K48240l70523
$$ plain form
2587 -5215070 -3158244 -1167259 -1642792 -5168923 -8765143 -9221105 -7224350 -6224291 -7752343
2578 -7752343 -9888916 -10325009 -9059448 -7545972 -6554008 -5739210 -4749837 -4070430 -4638726
2569 -4638726 -6613127 -8749489 -9552605 -8952607 -7977645 -6829102 -4675911 -1737263 67902
2560 67902 -477657 -2201794 -3318813 -3544678 -3260260 -2056451 252511 2357143 2915709
2551 2915709 2313087 1429016 -36347 -2112044 -2913940 -1104469 1003636 -100450 -3822507
2542 -3822507 -5726820 -3557675 -206205 308744 -2389112 -5374850 -5864027 -3401916 58812
2533 58812 1651818 287161 -2014475 -2691268 -2109994 -2561452 -4258991 -5069414 -4403430
2524 -4403430 -4291815 -5572253 -5889709 -3162292 1246476 4571154 5974677 6222917 5852394
2515E852394m98458J72835M19797j344948l870884m108354j572481J281369K872638
2506g96092L430364K459262p13901l670861k627247J549505L408241O06977k711522
2497I34726k428582k33192R3220j322445j746515o29836N05215J323269K589894
2488i14246L893138M098226L235928J944592J37428k063921l490316l633517l470405
2479b63093l081986q61692K884908M417448J642396j885479j764277O05478N24956
2470B218659k314581l553870j307823J181201Q89261r51763j527644j19728K147432
2461c338856L809234L437293P60012k010788k201953l22831P42845K59943L35986
2452A470885J657826J931754j99853k750058l467979k720680j830076j060667
$$ plain form
2515 5852394 5353936 5526771 5946568 4601620 730736 -3377618 -4950099 -3668730 -796092
2506 -796092 2634272 5093534 4379633 708772 -1918475 -368970 3039271 3646248 934726
2497 934726 -1493856 -1727048 -1633828 -2956273 -4702788 -5332624 -4827409 -3504140 -914246
2488 -914246 2978892 7077118 10313046 12257638 12395066 10331145 6840829 3207312 -263093
2479 -263093 -3345079 -4206771 -1321863 3095585 4737981 2852502 1088225 1693703 2218659
2470 2218659 -95922 -3649792 -4957615 -3776414 -2887153 -3838916 -5366560 -5486288 -3338856
2461 -3338856 470378 3907671 4667683 2656895 454942 132111 874956 1134899 1470885
2452 1470885 3128711 5060465 4860612 2110554 -1357425 -4078105 -5908181 -6968848
2444f968848o89624j451525k388320j049702K379381M108547K120081m73429k10684
2435d624123J500920J425659J79060N61090J888735P66984k884820n041011l318589
2426i546095K19688K770919L932026M142882L108375J184545j20454l09266m74755
2417D907865q66770k86500J091348R93508j264700k914455j685523N33529N61442
2408A069744j136344j317988Q96052K638642J415625j540865k974920j540194
2400b490248Q41537J308525o27749k405625j439305J585975L577873L049254J541485
2391D941722O57407k01239j879763l157143k290897L00152K616780L364930K252274
2382F604223n89214l710606m429435k060387L71626J91572p52384P14416L190577
$$ plain form
2444 -6968848 -7658472 -9109997 -11498317 -12548019 -10168638 -6060091 -3940010 -4413439 -4624123
2435 -4624123 -3123203 -1697544 -1518484 -957394 931341 1698325 -1186495 -6227506 -9546095
2426 -9546095 -9326407 -6555488 -2623462 1519420 4627795 5812340 5691886 5382620 4907865
2417 4907865 4041095 3754595 4845943 5839451 4574751 1660296 -25227 508302 1069744
2408 1069744 -66600 -1384588 -488536 2150106 3565731 2024866 -950054 -2490248
2400 -2490248 -1648711 -340186 -967935 -3373560 -4812865 -3226890 350983 3400237 4941722
2391 4941722 5599129 5397890 3518127 360984 -1929913 -1629761 987019 4351949 6604223
2382 6604223 6015009 2304403 -2125032 -4185419 -3813793 -3622221 -4374605 -3660189 -469612
2373d69612K468128j210001k732109R8918L331479L391333K054336J883548J215240
2364A0031260j947344m612032k770599J421265K154989j142459l165830j357338
2356a388088N13246p89179k650949j396629J447159J719743p66088k196622m53471
2347e960878K592950M357698M254943K810722M56025j991924l283353k989167
2339B47016j842262n63390N90555J048633J78115j225180j223305N73820J968366
2330b47632J149251m41064r7507J906830K476540M44133j353498k80269J850782
2321E407566J282443j946372l816240k094531O43406R72971q59395k271280k333525
2312e014957k065932j879615j197391j72582M44920R90047K346035L764017L364152
$$ plain form
2373 -469612 1998516 788515 -1943594 -1844676 1486803 4878136 6932472 8816020 10031260
2364 10031260 8083916 3471884 701285 2122550 4277539 3135080 -30750 -1388088
2356 -1388088 -874842 -1664021 -4314970 -5711599 -4264440 -2544697 -3310785 -5507407 -5960878
2347 -5960878 -3367928 989770 5244713 8055435 8511460 6519536 3236183 247016
2339 247016 -1595246 -2158636 -1568081 -519448 -341333 -1566513 -2789818 -2215998 -247632
2330 -247632 901619 460555 363048 2269878 4746418 5190551 3837053 3556784 5407566
2321 5407566 6690009 4743637 927397 -1167134 -523728 449243 -410152 -2681432 -5014957
2312 -5014957 -7080889 -8960504 -10157895 -10330477 -9885557 -8895510 -6549475 -2785458 578694
2303E78694J114985p06274n77602N43576J148413J070413P17979O7399p08832
2294C248751j026234j025545j498813k137408j637218k66396j86156j974602l047798
2285i551419j419012R35839Q93076j106652j953506o76784N68674L02286k26043
2276a2233541M99362J872415K373027J792096J130774J016061J104473Q12048
2268a633285J26375l83880l23305Q714K92237J025651K548916L379263J432070
2259F472756k494550m645541l102290n28414j63777j181302p87701Q27863J201923
2250d401033K43085J89359J053061K35036k504386l634619j112893K284456L053363
2241d594571J652323P38682J000159J329527J438555J698933J558051M69563n18838
$$ plain form
2303 578694 1693679 987405 409803 953379 2101792 3172205 3890184 3957583 3248751
2294 3248751 2222517 1196972 -301841 -2439249 -4076467 -4342863 -4529019 -6503621 -9551419
2285 -9551419 -10970431 -10034592 -9141516 -10248168 -12201674 -12878458 -12309784 -12007498 -12233541
2276 -12233541 -11734179 -9861764 -7488737 -5696641 -4565867 -3549806 -2445333 -1633285
2268 -1633285 -1506910 -1890790 -2214095 -2205381 -1913144 -887493 1661423 5040686 6472756
2259 6472756 3978206 -667335 -3769625 -4298039 -4461816 -5643118 -6430819 -5602956 -4401033
2250 -4401033 -4157948 -3968589 -2915528 -2680492 -5184878 -8819497 -9932390 -7647934 -4594571
2241 -4594571 -2942248 -2203566 -1203407 126120 1564675 3263608 4821659 5291222 4772384
2232D772384k47189L31978n15051k480312l722031l494173k290789j95825K544667
2223e296341L903874J860068k009543l431835q08144K564143K867499N21144j033941
2214h63076o6565J748288J975424K11882k021760l158748k762523j309924M13427
2205e833575J522035J291546l9050r40046j1718K115192L266517K469066J154793
2196D994760R97503J635968J550062L42027j012560j584583j084251L70294J944126
2187H153346K094626J13382k710532m511623m900548m536602l501459j677800
2179a1477210j02689j7280p46942l81427J385732K852593K868198K033957J114960
2170b470108Q4378p66501n33386P48721J739804J677411J286553J262197J276299
$$ plain form
2232 4772384 4525195 4857173 4342122 1861810 -1860221 -5354394 -7645183 -7841008 -5296341
2223 -5296341 -1392467 467601 -1541942 -4973777 -5781921 -3217778 -350279 170865 -863076
2214 -863076 -929641 818647 2794071 3005953 984193 -2174555 -4937078 -6247002 -5833575
2205 -5833575 -4311540 -3019994 -3059044 -3999090 -4010808 -1895616 1370901 3839967 4994760
2196 4994760 5992263 7628231 9178293 9520320 8507760 6923177 5838926 6209220 8153346
2187 8153346 10247972 10361354 7650822 3139199 -1761349 -6297951 -9799410 -11477210
2179 -11477210 -11579899 -11597179 -12344121 -12725548 -11339816 -8487223 -5619025 -3585068 -2470108
2170 -2470108 -2385730 -3152231 -3685617 -2936896 -1197092 480319 1766872 3029069 4305368
2161D305368J051261Q92220N52012p37934k330940k109003M87643L092484L437708
2152H640819K166894J139095N27647m96511j492486j351018m18231L0194k5543
2143H720860M20250J297107J403107L49480j036829k165865l038484l256750k245712
2134D47164n57453M64347N06104N37659J111348J609237J421544Q54143N82568
2125F976661Q79062J407788J330953M9224j664082k189764j509369j729005l741471
2116a90003m992991k914375P19160J882885M4468j597558j422629j058397j131570
2107a0661010M21755L904543N566453K762520j460451k345223K4355J682029R00211
2098G95182l86468p20440r47687j456609q18624J549467L611673L061641J87268
$$ plain form
2161 4305368 5356629 6248849 6800861 6062927 3731987 1622984 2110627 5203111 8640819
2152 8640819 10807713 11946808 12474455 11977944 10485458 9134440 8716209 8746403 8720860
2143 8720860 9141110 10438217 11841324 12190804 11153975 8988110 5949626 2692876 447164
2134 447164 -110289 354058 860162 1397821 2509169 4118406 5539950 6394093 6976661
2125 6976661 7855723 9263511 10594464 10643688 8979606 6789842 5280473 3551468 -190003
2116 -190003 -5182994 -8097369 -7378209 -5495324 -5450856 -7048414 -8471043 -9529440 -10661010
2107 -10661010 -10239255 -6334712 -768259 1994261 533810 -1811413 -1787058 -105029 795182
2098 795182 408714 -311726 -1259413 -2716022 -3534646 -1985179 1626494 4688135 4875403
2089D875403k641315l531903k512863j061771n27168o44093J16554K181921L665538
2080g9697K724093L88070o93447j0851K54422j357085l442912l690212j671472
2071g579091R64836K221176J359574m03904q03829R68656K931229K677671O60218
2062B996536n62454p5068N35119K42928J20079R51862J502119N21109j184314
2053E047916k096930k057261j680576r79016Q5869Q09125Q14671Q38764J199125
2044A981687P59404j052161k487923j726395R3665L72535q95909j034104J129709
2035b859492L254086K571287o40484l736274m720600l510835j053124J461894
2027i233542K680513J721350n72416j703757L4345L125686M042582J591961j147998
$$ plain form
2089 4875403 2234088 -1297815 -3810678 -4872449 -5399617 -6043710 -5927156 -3745235 -79697
2080 -79697 2644396 3032466 2339019 2328168 2582590 1225505 -2217407 -5907619 -7579091
2071 -7579091 -6614255 -4393079 -3033505 -3437409 -4241238 -3272582 -341353 2336318 2996536
2062 2996536 2434082 2359014 2894133 3137061 3257140 4209002 5711121 6232230 5047916
2053 5047916 2950986 893725 -786851 -1765867 -1679998 -870873 -56202 782562 1981687
2044 1981687 2741091 1688930 -798993 -2525388 -2431723 -2059188 -2955097 -3989201 -2859492
2035 -2859492 394594 2965881 2325397 -1410877 -6131477 -9642312 -10695436 -9233542
2027 -9233542 -6553029 -4831679 -5404095 -7107852 -7073507 -3947821 94761 1686722 538724
2018E38724o75008K096896L041929N73772k486915l348688k717090k341211j713958
2009g031549L54355K665613K890581J015305p97606j129911j01811J839369L742666
2000C447012L716416J151582j404369j235829M63433N07457j040107j303646j10669
1991D191280o49610l620768n176709k865326L14841P66970j55157Q63366L112215
1982c218898L107710M21120j969216k639013l033041l690581l025996q14065N29581
1973a4332399l06082j315280n25727Q58675Q50477K44966J155191L178201L808596
1964f383382K305684N71186M103j13833m49458j38943J204536J896781M94133
1955f09193j508973j426973P19763K178701J303588o05056j659229j651698j199568
$$ plain form
2018 538724 -136284 1960612 5002541 5576313 3089398 -259290 -2976380 -5317591 -7031549
2009 -7031549 -6677194 -4011581 -1121000 -105695 -903301 -2033212 -2135023 -295654 3447012
2000 3447012 7163428 8315010 6910641 5674812 6138245 6645702 5605595 4301949 4191280
1991 4191280 3541670 -79098 -5255807 -8121133 -7806292 -7039322 -7194479 -6331113 -3218898
1982 -3218898 -111188 309932 -1659284 -4298297 -7331338 -11021919 -14047915 -14861980 -14332399
1973 -14332399 -14638481 -15953761 -16479488 -15620813 -14770336 -14525370 -13370179 -10191978 -6383382
1964 -6383382 -4077698 -3506512 -3502409 -3616242 -4065700 -4204643 -3000107 -1103326 -609193
1955 -609193 -2118166 -3545139 -2825376 -646675 656913 51857 -1607372 -3259070 -4458638
1946d458638l45715Q70331J764484K025688K254732K558340J924420R3843j372455
1937E315030j272421o25844p92314j122789l37346J051519J723789J708654J424710
1928G072988N4016k515598l717543j619251J137557P11189j626968j349536J498109
1919c55037J990164j189790k954091q7045L230404K067814j675665k986775j414385
1910c374406l923O17668J706255J910702j023599m910600m918762p61805K789675
1901g968795K991553K026891J967107J485666n85582k303734j581327O09299J998144
1892a360778J834319M68291j669365l240080k359532N98737K507240J425457o99148
1883b494859r42962N26087J174766r9553j726296j746568j09046J448043J398215
$$ plain form
1946 -4458638 -4804353 -3934022 -2169538 -143850 2110882 4669222 6593642 6687485 5315030
1937 5315030 4042609 3416765 2624451 1501662 1164316 2215835 3939624 5648278 7072988
1928 7072988 7127004 4611406 893863 -725388 412169 1123358 -503610 -1853146 -355037
1919 -355037 1635127 445337 -2508754 -2595799 634605 2702419 1026754 -1960021 -3374406
1910 -3374406 -3378329 -2760661 -1054406 856296 -167303 -5077903 -9996665 -10758470 -7968795
1901 -7968795 -4977242 -2950351 -983244 502422 -83160 -2386894 -3968221 -3358922 -1360778
1892 -1360778 473541 941832 -727533 -3967613 -6327145 -5728408 -3221168 -1795711 -2494859
1883 -2494859 -3437821 -2911734 -1736968 -1836521 -3562817 -5309385 -5418431 -3970388 -2572173
1874b572173J96609l23523M83662J217160R59677R93181K137003K156959j099265
1865D149290n123954n135419q71665K894144L050843J442129N91573J90855n78246
1856F09550j003161j051949k113369l592596k515951J175459L008321P25080j447853
1847f206469O53395M031128L078783j523510m162200k934517j155592q60478n03108
1838i582568N80769Q22279N27204K272720N587106N996414J761161k606984k550612
1829B807489K11151R30292j222898l146387l098459k276254j665881o67216P69913
1820g358250J284785L54796l79987P46497K936130L751922K128629m38446j884702
1811A141374j876043j422223r09549P3275J077412Q30668m07548m79898J316503
$$ plain form
1874 -2572173 -2375564 -2699087 -2215425 -998265 -38588 954593 3091596 5248555 4149290
1865 4149290 -974664 -6110083 -6981748 -4087604 -1036761 405368 996941 1187796 609550
1856 609550 -393611 -1445560 -3558929 -7151525 -9667476 -8492017 -5483696 -4758616 -6206469
1847 -6206469 -5553074 -1521946 1556837 33327 -4128873 -7063390 -8218982 -9079460 -9582568
1838 -9582568 -9001799 -8179520 -7652316 -5379596 207510 6203924 7965085 5358101 2807489
1829 2807489 3018640 3948932 2726034 -420353 -3518812 -5795066 -7460947 -8128163 -7358250
1820 -7358250 -6073465 -5718669 -6098656 -5352159 -2416029 1335893 3464522 3026076 1141374
1811 1141374 -734669 -2156892 -3066441 -2993166 -1915754 -1085086 -1492634 -1972532 -656029
1802f56029K408806N85991k133323k077102N79276K079407O57128j444290k057881
1793b058017k019631k675444l080341j569025J472791L972403M327278K409885
1785G79899l96175j701723j72138K473892L192286J597035R5434k18265r00250
1776D749995k400522k243312R02891M088614L780359P21244j663843k104881j905014
1767C925531j859434j737333j974555l024457l608049k278709j47527O50008N60440
1758i494085J622750L294286K812570L6591j695957o59496O35520l51285k222169
1749f021275k146023j75903J397303J547771R96483J55191j118129k127944j715886
1740i208412p5816J246778J262757M40122k05581p5035P42594J456036J253459
$$ plain form
1802 -656029 1752777 2338768 205445 -1871657 -1292381 787026 1444154 -136 -2058017
1793 -2058017 -4077648 -6753092 -9833433 -11402458 -9929667 -5957264 -1629986 779899
1785 779899 383724 -1317999 -1490137 983755 4176041 5773076 5868510 5650245 4749995
1776 4749995 2349473 106161 1009052 5097666 8878025 9599269 7935426 5830545 3925531
1767 3925531 2066097 328764 -1645791 -4670248 -8278297 -10557006 -10704533 -10054525 -9494085
1758 -9494085 -7871335 -4577049 -1764479 -1727888 -3423845 -4083341 -3447821 -3799106 -6021275
1749 -6021275 -8167298 -8343201 -6945898 -5398127 -4401644 -4246453 -5364582 -7492526 -9208412
1740 -9208412 -9284228 -8037450 -6774693 -6334571 -6540152 -6615187 -5872593 -4416557 -3163098
1731c163098O42117J288181L502493M851351K930067j019216l214408k066040
1723C751447J49894P87230J3210n75652q03320j617097k840668l104986j922372
1714f162314l40526O60584J198771J605240J661722J290996J037424J096693O81234
1705B729824o58062j701032q64359J325477K508762J618373L48361N57722J354298
1696G219364L92946k316377l830439k139207R31741K004854M16150j469161j870784
1687f60913j513003j369821n28777J935181M207418L378013j62437k469822j233906
1678A581933Q83227j1754l380528m875575k320614J464806K513391L83861k212159
1669e973412k998368j864475Q4135J600520J703203M10466p71970j05791K312020
$$ plain form
1731 -3163098 -2520981 -1232800 2269693 7121044 10051111 9031895 5817487 3751447
1723 3751447 3901341 4688571 4701781 4126129 3322809 1705712 -1134956 -4239942 -6162314
1714 -6162314 -6502840 -5842256 -4643485 -3038245 -1376523 -85527 951897 2048590 2729824
1705 2729824 2071762 370730 -493629 831848 3340610 4958983 5307344 5865066 7219364
1696 7219364 7612310 5295933 1465494 -673713 258028 2262882 2679032 1209871 -660913
1687 -660913 -2173916 -3543737 -4072514 -2137333 2070085 5448098 5285661 2815839 1581933
1678 1581933 2465160 2453406 -927122 -5802697 -8123311 -6658505 -4145114 -3761253 -5973412
1669 -5973412 -8971780 -10836255 -10752120 -9151600 -7448397 -7037931 -7809901 -7915692 -5603672
1660e603672M358668M031019J431228j447684k594467j692786l38122n05739k481639
1651d843194m424959m310352k100107M64402K018069K811393L652900M263980
1643b467868L352603M50866k713624l401693r20223J977456J827054j322896l674506
1634f892831k292537J270507L120960J847092l63042r35681M49904K382400L267325
1625A854097K166471l73755k026577q11589K034080L082999J326078l49386L09082
1616G211500J144026j055874m887979n495552j414078L039734L391349L98292
1608B331418j953977j850431p72911l59043n12182m67774P2223R98256J728226
1599g86195J232283o09237k009822j261360M75904L70818j844633l079085j228799
$$ plain form
1660 -5603672 -1245004 2786015 4217243 2769559 175092 -1517694 -1855816 -2361555 -4843194
1651 -4843194 -9268153 -13578505 -15678612 -15214210 -13196141 -10384748 -6731848 -2467868
1643 -2467868 884735 1335601 -1378023 -4779716 -5699939 -3722483 -1895429 -3218325 -6892831
1634 -6892831 -9185368 -7914861 -4793901 -2946809 -3309851 -4245532 -3795628 -1413228 1854097
1625 1854097 4020568 3646813 1620236 808647 2842727 5925726 7251804 6902418 7211500
1616 7211500 8355526 7299652 2411673 -3083879 -4497957 -1458223 1933126 2331418
1608 2331418 377441 -1472990 -2245901 -2604944 -3117126 -3584900 -3512677 -2514421 -786195
1599 -786195 446088 -163149 -2172971 -3434331 -2958427 -2587609 -4432242 -7511327 -8740126
1590h740126J820738L050460K327505J580820J384827P71740l23013q79364p89816
1581B03771p79773n02404Q74294K157989J015779j992963l204010j058976J259266
1572b027027N05902j790154k036787k79708L14629j147920k088744q95740P71142
1563h674407J098230P08292P32415P21949K11934K81211J492681K016651K51101
1554a159943j971095j627013P03960J466214k46662j055493J295330L928413K942699
1545D276410m74734j615996O43811K163835k1414l057243k588890O54932K073007
1536B053718P0163j996795j268331O16959O80755q52184j627531j113163p15893
1527d152302p09935J70833J956111K679663J160538j197560k250693j525460j30318
$$ plain form
1590 -8740126 -6919388 -3868928 -1541423 39397 1424224 2195964 1872951 993587 203771
1581 203771 -576002 -1078406 -204112 1953877 2969656 976693 -2227317 -3286293 -2027027
1572 -2027027 -1521125 -3311279 -5348066 -5627774 -5313145 -6461065 -8549809 -9445549 -8674407
1563 -8674407 -7576177 -6867885 -6135470 -5413521 -5201587 -4920376 -3427695 -1411044 -1159943
1554 -1159943 -3131038 -4758051 -4054091 -2587877 -2834539 -3890032 -2594702 1333711 4276410
1545 4276410 3801676 2185680 2829491 4993326 4971912 1914669 -674221 -19289 2053718
1536 2053718 2123881 127086 -1141245 -524286 156469 -695715 -2323246 -3436409 -4152302
1527 -4152302 -4862237 -4691404 -2735293 -55630 1104908 -92652 -2343345 -3868805 -3999123
1518c999123O53519J60055j232735k017763r63397J083309K032540J423085Q45853
$$ plain form
1518 -3999123 -3345604 -3185549 -4418284 -6436047 -7399444 -6316135 -4283595 -2860510 -2014657
$$ [...]
##END NTUPLES=NMR SPECTRUM
##END=
