##TITLE=31P_DE-80H_X3
 64 sc D2O
 26.2.2025
##JCAMPDX= 6.0         $$ Bruker NMR JCAMP-DX V2.0
##DATA TYPE= NMR SPECTRUM
##DATA CLASS= NTUPLES
##ORIGIN= UXNMR, Bruker Analytische Messtechnik GmbH
##OWNER= root
$$ XWIN-NMR		Version 3.5
$$ Mon Apr 21 14:22:46 2025 Russian Standard Time (UT+4h)  Yarkov@DPX200
##.OBSERVE FREQUENCY= 81.013821
##.OBSERVE NUCLEUS= ^31P
##.ACQUISITION MODE= SIMULTANEOUS
##.ACQUISITION SCHEME= undefined
##.AVERAGES= 64
##.DIGITISER RES= 17
##SPECTROMETER/DATA SYSTEM= spect
##.PULSE SEQUENCE= zgpg30
##.SOLVENT NAME= DMSO
##.SHIFT REFERENCE= (INTERNAL, DMSO, 0, 198.062)
##AUDIT TRAIL= $$ (NUMBER, WHEN, WHO, WHERE, WHAT)
$$ ##TITLE= Audit trail, XWIN-NMR		Version 3.5
$$ ##JCAMPDX= 5.01
$$ ##ORIGIN= Bruker BioSpin GmbH
$$ ##OWNER= Yarkov
$$ C:/Bruker/XWIN-NMR/data/yarkov2/nmr/P31/2/pdata/1/auditp.txt
$$ ##AUDIT TRAIL=  $$ (NUMBER, WHEN, WHO, WHERE, WHAT)
(   1,<2025-04-21 14:21:45.82 +0400>,<Yarkov>,<DPX200>,
      <created by zg, POWCHK disabled, PULCHK disabled
       configuration hash MD5:
       00 E9 B6 7A A2 85 ED C7 34 08 36 98 17 FE 4E 26
       data hash MD5: 32K
       ED 24 96 52 97 B7 B2 F1 BC D7 F7 2C 32 FD C7 F5>)
(   2,<2025-04-21 14:21:51.35 +0400>,<Yarkov>,<DPX200>,
      <Start of raw data processing
       efp BC_mod = 2 LB = 1.5 FT_mod = 6 PKNL = 1 PHC0 = 1798.459 PHC1 = 30.09541 SI = 64K 
       data hash MD5: 64K
       7B 42 67 10 05 DE 40 23 42 51 95 73 BB 2E 22 13>)
(   3,<2025-04-21 14:22:17.70 +0400>,<Yarkov>,<DPX200>,
      <pk PHC0 = -16.59121 PHC1 = 4.200003 
       data hash MD5: 64K
       3D 3B 78 45 D2 57 6A 45 67 13 D8 57 ED 3D 84 5B>)
$$ ##END=
$$ 
$$ hash MD5
$$ 5C 62 E4 8A 5B EC 85 89 23 74 C5 86 F7 F7 86 2F
##$RELAX= 
##$RELAX= 
##$RELAX= 
##$RELAX= 
##$RELAX= 
##$RELAX= 
##$RELAX= 
##$RELAX= 
$$ Bruker specific parameters
$$ --------------------------
##$DU= <C:/Bruker/XWIN-NMR>
##$EXPNO= 2
##$NAME= <P31>
##$PROCNO= 1
##$TYPE= <nmr>
##$USER= <yarkov2>
##$AMP= (0..31)
100 100 100 100 100 100 100 100 100 100 100 100 100 100 100 100 100 100 
100 100 100 100 100 100 100 100 100 100 100 100 100 100 
##$AQSEQ= 0
##$AQ_mod= 1
##$AUNM= <au_zg>
##$AUTOPOS= <>
##$BF1= 81.014009
##$BF2= 200.13
##$BF3= 200.13
##$BF4= 200.13
##$BF5= 200.13
##$BF6= 200.13
##$BF7= 200.13
##$BF8= 200.13
##$BYTORDA= 1
##$CFDGTYP= 0
##$CFRGTYP= 5
##$CHEMSTR= <none>
##$CNST= (0..31)
1 1 145 1 1 1 1 1 1 1 1 1 1 1 1 1 1 1 1 1 1 1 1 1 1 1 1 1 1 1 1 1 
##$CPDPRG= <waltz16>
##$CPDPRG1= <>
##$CPDPRG2= <waltz16>
##$CPDPRG3= <>
##$CPDPRG4= <mlev>
##$CPDPRG5= <mlev>
##$CPDPRG6= <mlev>
##$CPDPRG7= <mlev>
##$CPDPRG8= <mlev>
##$CPDPRGB= <>
##$CPDPRGT= <>
##$D= (0..31)
0 1 0 0 0 0 0 0 0 0.06 0 0.03 2e-05 3e-06 0 0 0.0002 0 0 0 0 0 0 0 0 0 
0 0 0 0 0 0 
##$DATE= 1745230905
##$DBL= (0..7)
120 120 120 11 120 120 24 19 
##$DBP= (0..7)
150 150 150 150 150 150 150 150 
##$DBP07= 0
##$DBPNAM0= <>
##$DBPNAM1= <>
##$DBPNAM2= <>
##$DBPNAM3= <>
##$DBPNAM4= <>
##$DBPNAM5= <>
##$DBPNAM6= <>
##$DBPNAM7= <>
##$DBPOAL= (0..7)
$$ [...]
##$SUBNAM3= <"">
##$SUBNAM4= <"">
##$SUBNAM5= <"">
##$SUBNAM6= <"">
##$SUBNAM7= <"">
##$SUBNAM8= <"">
##$SUBNAM9= <"">
##$SW= 400.765351723535
##$SWIBOX= (0..15)
0 1 3 0 0 0 0 0 0 0 0 0 0 0 0 0 
##$SW_h= 32467.5324675325
##$TD= 32768
##$TD0= 1
##$TE= 0
##$TE2= 300
##$TE3= 300
##$TEG= 300
##$TL= (0..7)
0 120 53 12 22 120 120 120 
##$TP= (0..7)
150 150 150 150 150 150 150 150 
##$TP07= 0
##$TPNAME0= <>
##$TPNAME1= <>
##$TPNAME2= <>
##$TPNAME3= <>
##$TPNAME4= <>
##$TPNAME5= <>
##$TPNAME6= <>
##$TPNAME7= <>
##$TPOAL= (0..7)
0.5 0.5 0.5 0.5 0.5 0.5 0.5 0.5 
##$TPOFFS= (0..7)
0 0 0 0 0 0 0 0 
##$TUNHIN= 0
##$TUNHOUT= 0
##$TUNXOUT= 0
##$USERA1= <user>
##$USERA2= <user>
##$USERA3= <user>
##$USERA4= <user>
##$USERA5= <user>
##$V9= 5
##$VALIST= <valist>
##$VCLIST= <CCCCCCCCCCCCCCC>
##$VD= 0
##$VDLIST= <DDDDDDDDDDDDDDD>
##$VPLIST= <PPPPPPPPPPPPPPP>
##$VTLIST= <TTTTTTTTTTTTTTT>
##$WBST= 1024
##$WBSW= 4
##$XGAIN= (0..3)
0 0 0 0 
##$XL= 0
##$YL= 0
##$YMAX_a= 8816
##$YMIN_a= -18230
##$ZGOPTNS= <>
##$ZL1= 120
##$ZL2= 120
##$ZL3= 120
##$ZL4= 120
##$ABSF1= 0
##$ABSF2= 0
##$ABSG= 0
##$ABSL= 0
##$ALPHA= 0
##$AQORDER= 0
##$ASSFAC= 0
##$ASSFACI= 0
##$ASSFACX= 0
##$ASSWID= 0
##$AUNMP= <proc_1d>
##$AZFE= 0.1
##$AZFW= 0.5
##$BCFW= 0
##$BC_mod= 2
##$BYTORDP= 0
##$COROFFS= 0
##$CY= -3
##$DATMOD= 1
##$DC= 0
##$DFILT= <>
##$DTYPP= 0
##$F1P= 0
##$F2P= 0
##$FCOR= 1
##$FTSIZE= 65536
##$FT_mod= 6
##$GAMMA= 0
##$GB= 0
##$INTBC= 1
##$INTSCL= 9.790993e-09
##$ISEN= 30
##$LB= 1.5
##$LEV0= 0
##$LPBIN= 0
##$MAXI= 10000
##$MC2= 0
##$MEAN= 0
##$ME_mod= 0
##$MI= 50
##$NCOEF= 0
##$NC_proc= -8
##$NLEV= 6
##$NOISF1= 182.463
##$NOISF2= 159.3651
##$NSP= 0
##$NTH_PI= 0
##$NZP= 0
##$OFFSET= 198.0616
##$PC= 4
##$PHC0= 1781.868
##$PHC1= 34.29541
##$PH_mod= 1
##$PKNL= yes
##$PPARMOD= 0
##$PSCAL= 0
##$PSIGN= 0
##$REVERSE= no
##$SF= 81.0140089999434
##$SI= 65536
##$SIGF1= 159.3651
##$SIGF2= -187.1042
##$SINO= 113.3802
##$SIOLD= 16384
##$SREGLST= <1H.CDCl3>
##$SSB= 0
##$STSI= 65536
##$STSR= 0
##$SW_p= 32467.5324675325
##$SYMM= 0
##$S_DEV= 0
##$TDeff= 32768
##$TDoff= 0
##$TI= <>
##$TILT= no
##$TM1= 0
##$TM2= 0
##$TOPLEV= 0
##$USERP1= <user>
##$USERP2= <user>
##$USERP3= <user>
##$USERP4= <user>
##$USERP5= <user>
##$WDW= 1
##$XDIM= 65536
##$YMAX_p= 108485092
##$YMIN_p= -272644316
$$ End of Bruker specific parameters
$$ ---------------------------------
##NTUPLES= NMR SPECTRUM
##VAR_NAME=  FREQUENCY,     SPECTRUM/REAL,   SPECTRUM/IMAG
##SYMBOL=    X,             R,               I
##VAR_TYPE=  INDEPENDENT,   DEPENDENT,       DEPENDENT
##VAR_FORM=  AFFN,          ASDF,            ASDF
##VAR_DIM=   65536,         65536,           65536
##UNITS=     HZ,            ARBITRARY UNITS, ARBITRARY UNITS
##FACTOR=    0.49542278885378, 1,            1
##FIRST=     16045.7642231865, 0,            0
##LAST=      -16421.768244346, 0,            0
##MIN=       -16421.768244346, -272644316,   0
##MAX=       16045.7642231865, 108485092,    0
$$ Real data points
##PAGE= N=1
##DATA TABLE= (X++(R..R)), XYDATA
$$ [...]
##PAGE= N=2
##DATA TABLE= (X++(I..I)), XYDATA
7476b703462j508039j76293J33567j03638K49979O52998k84789k150182k587245
$$ -2703462 -4211501 -4387794 -4254227 -4357865 -4107886 -3454888 -3739677 -5889859 -8477104
7467h477104m35386K259810K761687J444653J092640K407237K705381K46756k510199
$$ -8477104 -8912490 -6652680 -3890993 -2446340 -1353700 1053537 3758918 4005674 1495475
7458A495475k260946J59545J094247l44417j322180k73342N57688p54433j946614
$$ 1495475 -765471 -605926 488321 143904 -1178276 -1451618 -893930 -1648363 -3594977
7449c594977L06325M817243O633084L364520j940115n044036n339226m881314
$$ -3594977 -3288652 1528591 8161675 11526195 9586080 4542044 -797182 -5678496
7441e678496m403592k750598J57555K243167J959402M94263J61413J480816K914194
$$ -5678496 -10082088 -12832686 -12675131 -10431964 -8472562 -7978299 -7816886 -6336070 -3421876
7432c421876K934845J360478j000936l000815l507494k043510N83597K635669
$$ -3421876 -487031 873447 -127489 -3128304 -6635798 -8679308 -8095711 -5460042
7424e460042K676348O65805j744468k160139L14657L484368L910220J076521j576181
$$ -5460042 -2783694 -2117889 -3862357 -6022496 -5707839 -2223471 1686749 2763270 1187089
7415A187089r82970J432337J798424q60737l567844l605992j592926K52992J093600
$$ 1187089 204119 1636456 3434880 2574143 -993701 -4599693 -6192619 -5939627 -4846027
7406d846027J599274K167824K196932J002285r63841j981444p06635J730994K319512
$$ -4846027 -3246753 -1078929 1118003 2120288 1156447 -824997 -1531632 199362 2518874
7397B518874j37824l006799l068188p88654P39284L68768k31440n6632j07287
$$ 2518874 2381050 -625749 -3693937 -4482591 -3743307 -3374539 -3605979 -3662611 -3769898
7388c769898o85169k93989J499357K681188J911627P80276R87536J232164o56189
$$ -3769898 -4455067 -4749056 -3249699 -568511 1343116 2123392 3110928 4343092 3686903
7379C686903l766752m920410l049144n16542J51793p95221j178343K97614K587300
$$ 3686903 -79849 -5000259 -8049403 -8565945 -8414152 -9209373 -10387716 -10090102 -7502802
7370g502802L440498J977179j4939l9397J836875K863003J274365j235268j848740
$$ -7502802 -4062304 -2085125 -2100064 -2139461 -302586 2560417 3834782 2599514 750774
7361G50774m85325J92206j570521m277208m934651k528228Q33226K307042J440061
$$ 750774 265449 457655 -1112866 -5390074 -10324725 -12852953 -12019727 -9712685 -8272624
7352h272624K54517K72080O92021K62064m37827j99945L58469k47508j398037
$$ -8272624 -8018107 -7746027 -7054006 -6791942 -7229769 -7429714 -7071245 -7318753 -8716790
7343h716790q01579J869526M040862L578102J201549j078552k236519k290380
$$ -8716790 -9518369 -7648843 -3607981 -29879 1171670 93118 -2143401 -4433781
7335d433781j592843o60649L83776K119843M282877M697437J957439j585860k437031
$$ -4433781 -6026624 -6687273 -6303497 -4183654 99223 4796660 6754099 5168239 2731208
7326B731208j054900q57549k397354k775895j262394o64194j770561j512704J038125
$$ 2731208 1676308 818759 -1578595 -4354490 -5616884 -6281078 -8051639 -9564343 -8526218
7317h526218J965070q35313l109334p40070L383743M102510K143703J808680L075580
$$ -8526218 -6561148 -7396461 -10505795 -11245865 -7862122 -3759612 -1615909 192771 3268351
7308C268351K298444n10294j388867O16525J873772K82348j928192k536750k133661
$$ 3268351 5566795 5056501 3667634 4284159 6157931 6440279 4512087 1975337 -158324
7299a58324j465895J9994J694759J480753m87817j256695M01575J920715J062417
$$ -158324 -1624219 -1604225 90534 1571287 1083470 -173225 228350 2149065 3211482
7290C211482p39229j086888l16981l18593j203194j212601N93231K819204K962816
$$ 3211482 2472253 1385365 1068384 749791 -453403 -1666004 -1072773 1746431 4709247
7281D709247J37670l290737l757278r50143J329760K14237k283877k691579j337300
$$ 4709247 4846917 1556180 -2201098 -3151241 -1821481 -1607244 -3891121 -6582700 -7920000
7272g920000q12161r41010L79396K287864J770015o67842j129471J072323J956145
$$ -7920000 -8732161 -9673171 -9293775 -7005911 -5235896 -5903738 -7033209 -5960886 -4004741
7263d004741k81272j752632R87805N208526N852060K481031r74679j771406p31977
$$ -4004741 -4286013 -6038645 -5050840 157686 6009746 8490777 7516098 5744692 5012715
7254E012715O1954l02769j224868j528369r56923p04433j547833k138662j011169
$$ 5012715 5074669 4771900 3547032 2018663 1061740 357307 -1190526 -3329188 -4340357
7245d340357N31731K39386j075621p95090O21019J81886j986248k242866K98228
$$ -4340357 -3808626 -3569240 -4644861 -5439951 -4818932 -4637046 -6623294 -8866160 -8567932
7236h567932K035316J202279Q42517K744053L434559J44247l565196k931907M47787
$$ -8567932 -6532616 -5330337 -4487820 -1743767 1690792 1835039 -1730157 -4662064 -4214277
7227d214277J276498j335683l390606k481550k22456J363259J996542J716690
$$ -4214277 -2937779 -4273462 -7664068 -10145618 -10368074 -9004815 -7008273 -5291583
7219e291583M73830p35980p10379J36145N76342M67847K53642j34390k35839J189966
$$ -5291583 -4817753 -5553733 -6264112 -6127967 -5551625 -5083778 -4830136 -4964526 -5200365 -4010399
7209d010399L394657K996742j165256m894908l747205P15385L473621L061753
$$ -4010399 -615742 2381000 1215744 -3679164 -7426369 -6710984 -3237363 -175610
7201a75610J884088R83013p56867k697005k507798n66032r5805k097251l803296
$$ -175610 1708478 2691491 1934624 -762381 -3270179 -3836211 -3932016 -6029267 -9832563
7192i832563l122968j269217P0656J054380J953195J865833N00061r78012j882022
$$ -9832563 -12955531 -14224748 -14154092 -13099712 -11146517 -9280684 -8780623 -9758635 -11640657
7183a1640657k701569l111365j584643J942385M991771N253881K939371j85455
$$ -11640657 -14342226 -17453591 -19038234 -17095849 -12104078 -6850197 -3910826 -4096281
7175d096281k580128l289579k142152j72478J355940K451697L706438M533666
$$ -4096281 -6676409 -9965988 -12108140 -12280618 -10924678 -8472981 -4766543 -232877
7167b32877L798159J802248j92821j877855l308630l314511j215486O18863p02662
$$ -232877 3565282 5367530 5174709 3296854 -11776 -3326287 -4541773 -3922910 -4625572
7158d625572l700630l832103j13783L264141K921579L37404j442824j726376j029907
$$ -4625572 -8326202 -12158305 -12272088 -9007947 -6086368 -5748964 -7191788 -8918164 -9948071
7149i948071P92550L087684L750215K236072Q61493J087062J076515p44287k378818
$$ -9948071 -9155521 -6067837 -2317622 -81550 779943 1867005 2943520 2199233 -179585
7140a79585j455775N73416Q48174p0309M35931J994961J712693m86797j166964
$$ -179585 -1635360 -1061944 -213770 -284079 151852 2146813 3859506 3372709 2205745
7131B205745J017111K749215J029713k221013l212904j951371j590397k863409
$$ 2205745 3222856 5972071 7001784 4780771 1567867 -383504 -1973901 -4837310
7123d837310k746336L45862L074395J414656l224094n249784k118660K687826
$$ -4837310 -7583646 -7237784 -4163389 -2748733 -5972827 -11222611 -13341271 -10653445
7115a0653445M744471L879900K513599J343674m24150k050688j778812m6205P33050
$$ -10653445 -5908974 -2029074 484525 1828199 1404049 -646639 -2425451 -2471656 -1738606
7106a738606j94770j006549l89661P65749J298894J302700J097499N68470R1615
$$ -1738606 -1933376 -2939925 -3329586 -2563837 -1264943 37757 1135256 1703726 1795341
7097A795341L40555P28213j31289k035829l222518l128899k958688l029252j996907
$$ 1795341 2135896 2864109 2732820 696991 -2525527 -5654426 -8613114 -11642366 -13639273
7088a3639273L83292K087441J636485Q7218q89866r84919l38869J181325K657209
$$ -13639273 -13255981 -11168540 -9532055 -9444837 -10334703 -11319622 -11658491 -10477166 -7819957
7079g819957K269456Q6316j419116r03128J02411L13448Q40903K296002K540305
$$ -7819957 -5550501 -5464185 -6883301 -7786429 -7684018 -7370570 -6529667 -4233665 -1693360
7070a693360L2103k837437k799957m49594J062848P20958K1538k40580m81818
$$ -1693360 -1661257 -4498694 -7298651 -7748245 -6685397 -5964439 -5942901 -6183481 -6665299
7061f665299l37885Q51894J987258J425077n5914k13810R69776J288539q3034
$$ -6665299 -7003184 -6151290 -4164032 -2738955 -2794869 -3008679 -2038903 -750364 -833398
7052h33398j693253k539616k881718k163788P45842M465051N372837K517992l69785
$$ -833398 -2526651 -5066267 -7947985 -10111773 -9365931 -4900880 471957 2989949 2620164
7043B620164K34414K821999L225950M27805k526979k917822j385662l34517r69215
$$ 2620164 2854578 5676577 8902527 9330332 6803353 3885531 2499869 2165352 1196137
7034A196137k519887l350249k257577N64979L276892L705573J605752q20839j411714
$$ 1196137 -1323750 -4673999 -6931576 -6366597 -3089705 615868 2221620 1400781 -10933
7025a0933n74779j66406k29345J081113L722168M389152R47758l670363m957572
$$ -10933 -585712 -752118 -981463 99650 3821818 8210970 9158728 5488365 530793
7016E30793l063262j979750k903733k646715M39045L249213K869933J072520Q61730
$$ 530793 -2532469 -4512219 -7415952 -10062667 -9623622 -6374409 -3504476 -2431956 -1570226
7007a570226J525094O90347r53219r52390L09375K96447j098917j502100m12059
$$ -1570226 -45132 645215 -308004 -1260394 -951019 -654572 -1753489 -3255589 -3667648
6998c667648Q9130o38439n07213J605587L782228L940862K548748J245951M91749
$$ -3667648 -3578518 -4216957 -4724170 -3118583 663645 4604507 7153255 8399206 8890955
6989H890955l45373j750761l504617m443612k994278P04846L736115L318504L29868
$$ 8890955 8545582 6794821 3290204 -1153408 -4147686 -3442840 293275 3611779 3941647
6980C941647k157999l196800m107488m816212l538632n22808J395079J019103
$$ 3941647 1783648 -1413152 -5520640 -10336852 -13875484 -14398292 -13003213 -11984110
6972a1984110L42591O37635L87691j105603j500718N89150K395420J055243j458683
$$ -11984110 -11641519 -11003884 -10616193 -11721796 -13222514 -12633364 -10237944 -9182701 -10641384
6963a0641384j138159J893155L862288L207051K062019J863123J272960m80765
$$ -10641384 -11779543 -9886388 -6024100 -2817049 -755030 1108093 2381053 1900288
6955A900288j440880P1885K520837L195927J733200k23085j725425k891507l238477
$$ 1900288 459408 531293 3052130 6248057 7981257 7758172 6032747 3141240 -97237
6946i7237j896125L42218J234511J86586o21121M42642J595464L02509k203528
$$ -97237 -1993362 -1651144 -416633 -230047 -851168 -408526 1186938 1489447 -714081
6937g14081k133811R49407K846528Q76574j876954j276053J461436J932860l36074
$$ -714081 -2847892 -1898485 948043 1824617 -52337 -1328390 133046 2065906 1729832
6928A729832j487985P6271J332253J9509j834195j891128j332851j858775j916931
$$ 1729832 241847 318118 1650371 1669880 -164315 -2055443 -3388294 -5247069 -7164000
6919g164000M78592L255138K592839j150034l560450k225329N74072J738694J092606
$$ -7164000 -6685408 -3430270 -837431 -1987465 -5547915 -7773244 -7199172 -5460478 -4367872
6910d367872K33616q6570n3658K52858O97689P57904K98413O0894O97223J787755
$$ -4367872 -4134256 -4220826 -4274484 -4021626 -3323937 -2566033 -2267620 -2206726 -1509503 278252
6900B78252K290646J613601N9647j348230j468469j22300J299304J001604j137838
$$ 278252 2568898 4182499 4242146 2893916 1425447 1303147 2602451 3604055 2466217
6891B466217l156666k963037m20028K567774L686149J998970j303598l769269
$$ 2466217 -690449 -3653486 -4073514 -1505740 2180409 4179379 2875781 -893488
6883h93488l754110j889001k77765k30079j131813j562621j010897j68432J61852
$$ -893488 -4647598 -6536599 -6814364 -7044443 -8176256 -9738877 -10749774 -10918206 -10756354
6874a0756354N544L0185O74216J617422K079785J611678O78505M47649J645927
$$ -10756354 -10750810 -10720625 -10046409 -8428987 -6349202 -4737524 -4059019 -3611370 -1965443
6865a965443L386221L650358J657303p10073j086434p907k32817k283803l094175
$$ -1965443 1420778 5071136 6728439 6018366 4931932 4924025 4691208 2407405 -686770
6856f86770o23696K532389K736290O65694k95776J95686n38711k643305k802366
$$ -686770 -1310466 1221923 3958213 4623907 4328131 4523817 3985106 1341801 -1460565
6847a460565p903K112407Q90360j290584j290614k27869p99937k362702k517276
$$ -1460565 -1468468 643939 1534299 243715 -1046899 -1274768 -2074705 -4437407 -6954683
6838f954683j538372j254561j119556M43899J975350P54767j867508j605482J961178
$$ -6954683 -8493055 -9747616 -10867172 -10423273 -8447923 -7693156 -9560664 -11166146 -9204968
6829i204968M245953K382585j061891k648208k488609k101956j366090j19965
$$ -9204968 -4959015 -2576430 -3638321 -6286529 -8775138 -10877094 -12243184 -12363149
6821a2363149J66380r28412r61988J587856L967536K894248o5938o02626J732187
$$ -12363149 -12196769 -13125181 -14087169 -12499313 -8531777 -5637529 -5703467 -6306093 -4573906
6812d573906K943816Q70398j572810q23070K276352L850912K055816j129571k782577
$$ -4573906 -1630090 -759692 -2332502 -3155572 -879220 2971692 5027508 3897937 1115360
6803A115360k255298j177693j038165j526309j372938j97535J194443K103737
$$ 1115360 -1139938 -2317631 -3355796 -4882105 -6255043 -6452578 -5258135 -3154398
6795c154398K559390K587865J947981R41631M22721N16126L89385k02938l89666
$$ -3154398 -595008 1992857 3940838 4882469 5305190 5821316 6210701 6007763 5618097
6786E618097J65062N25758K95561N06637J373465R58417j845519m477175l544453
$$ 5618097 5783159 6308917 6604478 7111115 8484580 9442997 7597478 3120303 -424150
6777d24150K80821L049119K961967K052666K134127K141269P04268j237156k105056
$$ -424150 -143329 2905790 5867757 7920423 10054550 12195819 12900087 11662931 9557875
6768I557875k002788j609108m66070J636245K953333J770804p05509j774472j222025
$$ 9557875 7555087 5945979 5479909 7116154 10069487 11840291 11134782 9360310 8138285
6759H138285j477672l477378m693289k568003J546681L538994J277172k996440
$$ 8138285 6660613 3183235 -1510054 -4078057 -2531376 1007618 2284790 -711650
6751g11650n186093l579734k06178J742389J264776k3904m30696j43320k29204
$$ -711650 -5897743 -9477477 -9683655 -7941266 -6676490 -6700394 -7131090 -7274410 -7503614
6742g503614o32353l33376P91655J553424J158087K94243J053L31217Q71528J815588
$$ -7503614 -8135967 -8469343 -7677688 -6124264 -4966177 -4671934 -4670881 -4339664 -3468136 -1652548
6732a652548L339875M201756K439394j874360n565653n246428j141493K956579
$$ -1652548 1687327 5889083 8328477 6454117 888464 -4357964 -5499457 -2542878
6724b542878L765836J668140o36160j572669j608161j305029k33481J671946L091578
$$ -2542878 1222958 2891098 2254938 682269 -925892 -2230921 -2464402 -792456 2299122
6715B299122K788338J344496K88076n7391n99839j476862j403364M42778K818421
$$ 2299122 5087460 6431956 6720032 6662641 6062802 4585940 3182576 3625354 6443775
6706F443775L535281J892818n90457j856918j420126p19949j395809l274311m391213
$$ 6443775 9979056 11871874 11281417 9424499 8004373 7284424 5888615 2614304 -1776909
6697a776909l261357p56275Q45672N03964n80054o56130N50183J785760J777042
$$ -1776909 -5038266 -5794541 -4948869 -4444905 -5024959 -5681089 -5130906 -3345146 -1568104
6688a568104M53022j134720j932321j933329j915875k052027j432396M04027K156641
$$ -1568104 -1115082 -2249802 -4182123 -6115452 -8031327 -10083354 -11515750 -11111723 -8955082
6679h955082K169493Q15892J6331L57391L86018o92181j371673j21459K054094
$$ -8955082 -6785589 -5969697 -5953366 -5595975 -5209957 -5902138 -7273811 -7395270 -5341176
6670e341176K941976K202727J421822J421433J242774L9235j448198j964984j410201
$$ -5341176 -2399200 -196473 1225349 2646782 3889556 3928791 2480593 515609 -894592
6661h94592p29820n92832p81791q08367o86500q09400j113174q33324M46614J852482
$$ -894592 -1624412 -2217244 -2999035 -3807402 -4493902 -5303302 -6416476 -7249800 -6803186 -4950704
6651d950704K139266J393958P29780K61074j114020l371174m472115l055935o52634
$$ -4950704 -2811438 -1417480 -687700 -426626 -1540646 -4911820 -9383935 -12439870 -13092504
6642a3092504M19840L33996R89674K587670L183105J825481K13279M47111K298301
$$ -13092504 -12672664 -12338668 -11348994 -8761324 -5578219 -3752738 -3539459 -3092348 -794047
6633g94047L445757J941841j694598m453035l367156J100115M784613M076260
$$ -794047 2651710 4593551 2898953 -1554082 -4921238 -3821123 963490 5039750
6625E039750q4326l727902m604223l533831j612060J213884M171796M778802J667404
$$ 5039750 4955424 1227522 -3376701 -6910532 -8522592 -7308708 -3136912 1641890 3309294
6616C309294k864671m671111j963039K847758N353832L332859q37762k531032
$$ 3309294 444623 -4226488 -6189527 -3341769 2012063 5344922 4507160 1976128
6608A976128l89360J694435k25894m266983m883348m67025M537367N582787K869044
$$ 1976128 1586768 3281203 3055309 -1211674 -6095022 -6562047 -2024680 3558107 6427151
6599F427151p05000l152708l370849o86474L190582M322635J294018k217994k199340
$$ 6427151 5722151 2569443 -801406 -1487880 1702702 6025337 7319355 5101361 2902021
6590B902021L14057J455900L68052n76982l36616l98540j526957k425082k104813
$$ 2902021 3216078 4671978 5040030 4463048 4126432 3727892 2200935 -224147 -2328960
6581b328960j215997n82288l29095o75478j803674k794272k314945m37858J559368
$$ -2328960 -3544957 -4127245 -4456340 -5131818 -6935492 -9729764 -12044709 -12482567 -10923199
6572a0923199K815046K897927J141829j935714l441503j099754K917779M135162
$$ -10923199 -8108153 -5210226 -4068397 -6004111 -9445614 -10545368 -7627589 -3492427
6564c492427J815605l06640J28893J000694n9756j557766q17640J452745K236809
$$ -3492427 -1676822 -1983462 -1854569 -853875 -913631 -2471397 -3289037 -1836292 400517
6555D00517P36233r38059j264581j030131j198807j124849K7707J336206J075461
$$ 400517 1136750 198691 -1065890 -2096021 -3294828 -4419677 -4391970 -3055764 -1980303
6546a980303o01394j347606K71731K303505J559626j833477l880427j648618K748839
$$ -1980303 -2581697 -3929303 -3657572 -1354067 205559 -1627918 -5508345 -7156963 -4408124
6537d408124M639594K317968j571947l593192k777450n74377R67672R60774N06657
$$ -4408124 231470 2549438 977491 -2615701 -5393151 -5967528 -4999856 -4039082 -3532425
6528c532425J280091K632343J651514k340043n263090l085640K136317M541362
$$ -3532425 -2252334 380009 2031523 -308520 -5571610 -8657250 -6520933 -1979571
6520a979571K295271o87959j113143l21106o37836j486305j384206q69708q68082
$$ -1979571 315700 -372259 -1485402 -1806508 -2444344 -3930649 -5314855 -6184563 -7052645
6511g052645l78853J587460L439807K956909O99183q14182n37711M65648J098926
$$ -7052645 -7431498 -5844038 -2404231 552678 1251861 437679 -100032 365616 1464542
6502A464542J064240J70545j409660k451290j748700J71598J487011J158173j46321
$$ 1464542 2528782 2699327 1289667 -1161623 -2910323 -2738725 -1251714 -93541 -239862
6493b39862r98014n97214N06821R17072K7644j109716j359244j249321j622366
$$ -239862 -1237876 -1835090 -1328269 -411197 -383553 -1493269 -2852513 -4101834 -5724200
6484e724200j379967R14900L604420L369278M17570j378186n00447M0212j650285
$$ -5724200 -7104167 -6189267 -2584847 784431 1202001 -176185 -676632 -636420 -2286705
6475b286705k804989j138972M50201j389528m119895k807208J880171M509924
$$ -2286705 -5091694 -6230666 -5780465 -7169993 -11289888 -14097096 -12216925 -7707001
6467g707001L043544R87131J113048J867060J239389R0499k00218k49080r68822
$$ -7707001 -4663457 -3676326 -2563278 -696218 543171 633670 433452 184372 -784450
6458g84450j690019j497263n74099P74623K519294L584755K330753o83368k538696
$$ -784450 -2474469 -3971732 -4545831 -3771208 -1251914 2332841 4663594 3980226 1441530
6449A441530j689701N4224L92693m67944r22861m42142L84110J027516J170125
$$ 1441530 -248171 -193947 198746 -269198 -1192059 -1634201 -1250091 -222575 947550
6440I47550P12304L09814P35848J304595M65324j566137k605819j700662o26252
$$ 947550 1659854 1969668 2705516 4010111 4475435 2909298 303479 -1397183 -2023435
6431b023435j062316k034638j652221r1135O77862n57049k936245m191532k358086
$$ -2023435 -3085751 -5120389 -6772610 -6863745 -6185883 -6742932 -9679177 -13870709 -16228795
6422a6228795K046802N459231M605307P27155j594857l62934J664477J756004
$$ -16228795 -14181993 -8722762 -4117455 -3390300 -4985157 -5348091 -3683614 -1927610
6414a927610J090114J638553J968128m14036m092653m868716j614083K154463
$$ -1927610 -837496 801057 2769185 2355149 -1737504 -6606220 -8220303 -6065840
6406f065840K950071J056282r83205j479469l87376J371695K473550K128705J013885
$$ -6065840 -3115769 -2059487 -3042692 -4522161 -4909537 -3537842 -1064292 1064413 2078298
6397B078298M41661M66259r0582j517545k359960j313994Q57422K015289R97414
$$ 2078298 2519959 2986218 2895636 1378091 -981869 -2295863 -1438441 576848 1574262
6388A574262j030844j618540K82589K638572K262441j049402l610009k405503
$$ 1574262 543418 -1075122 -792533 1846039 4108480 3059078 -550931 -2956434
6380b956434O42390J162688j493388l324727j428349J987895K888006P70255j337988
$$ -2956434 -2314044 -1151356 -2644744 -5969471 -7397820 -5409925 -2521919 -1751664 -3089652
6371c089652j235424K22692J076379P06744m2998j08797Q14706J910729J789821
$$ -3089652 -4325076 -4102384 -3026005 -2319261 -2362259 -2471056 -1656350 254379 2044200
6362B044200L4607j898548k171009r60253l03343j219546k165480j243583R72429
$$ 2044200 2078807 180259 -1990750 -2951003 -3254346 -4473892 -6639372 -7882955 -6910526
6353f910526K185473J572561O47523O62879P63505k10145j304087n95073J589593
$$ -6910526 -4725053 -3152492 -2504969 -1842090 -1078585 -1288730 -2592817 -3187890 -1598297
6344a598297K507973O64719j861644j955059N29327K685998K216218j79774k225963
$$ -1598297 909676 1574395 -287249 -2242308 -1712981 973017 3189235 3009461 783498
6335G83498k619224j534957L60070K254088K988911J800700m61920j756961j022109
$$ 783498 -1835726 -3370683 -3010613 -756525 2232386 4033086 3571166 1814205 792096
6326G92096N80036J064411j33727j804314k491186j814648n34241J38217m58975
$$ 792096 1372132 2436543 2302816 498502 -1992684 -3807332 -4341573 -4203356 -4662331
6317d662331j531589j308492P27118K498086J548673j448960l027853j298050
$$ -4662331 -6193920 -7502412 -6775294 -4277208 -2728535 -4177495 -7205348 -8503398
6309h503398J606522K481066J012900p27323j622411k249193k633647j507037
$$ -8503398 -6896876 -4415810 -3402910 -4130233 -5752644 -8001837 -10635484 -12142521
6301a2142521J481505M318298M502145J787821j645710l426299k900121j045947
$$ -12142521 -10661016 -6342718 -1840573 -52752 -1698462 -5124761 -8024882 -9070829
6293i070829R63024K712107L983467L883506J656772j508374k885364j327016
$$ -9070829 -8107805 -5395698 -1412231 2471275 4128047 2619673 -265691 -1592707
6285a592707J081751J605685J55689j284948j578306j106067k63761P50033J023066
$$ -1592707 -510956 1094729 1250418 -34530 -1612836 -2718903 -2982664 -2232631 -1209565
6276a209565j33358j467037j126156K44608P4157k081810l497870k149673O71859
$$ -1209565 -1342923 -2809960 -3936116 -3691508 -3617351 -5699161 -9197031 -11346704 -10674845
6267a0674845K733228L542224L192637R27819k863949n100238l291395O03835
$$ -10674845 -7941617 -4399393 -1206756 -278937 -3142886 -8243124 -11534519 -10930684
6259a0930684K363048J038083m80147l90623l93048k081820l584300k017380K038438
$$ -10930684 -8567636 -7529553 -8009700 -8400323 -8793371 -10875191 -14459491 -16476871 -14438433
6250a4438433M902187M438875K324124J154973J038778L89417r83502j556223
$$ -14438433 -9536246 -5097371 -2773247 -1618274 -579496 -190079 -1173581 -2729804
6242b729804p82455r9711m96700q64350j32430N11542m63640j901143j326644
$$ -2729804 -3512259 -3611970 -4108670 -4973020 -5105450 -4593908 -5057548 -6958691 -8285335
6233h285335J084726K560240J887094Q36720P92166O68810m92331j322108m31856
$$ -8285335 -7200609 -4640369 -2753275 -1916555 -1124389 -455579 -947910 -2270018 -2701874
6224b701874R52208Q32988l52758n39997P00950J696222J176458l33140j561422
$$ -2701874 -1749666 -916678 -1269436 -1809433 -1108483 587739 1764197 1431057 -130365
6215a30365j799221j210414n19215k07279J37299R81427J474519L61877j629786
$$ -130365 -1929586 -3140000 -3659215 -3866494 -3729195 -2747768 -1273249 -911372 -2541158
6206b541158k321388j465884j174151k052909j838339L91544J745763J4830k109532
$$ -2541158 -4862546 -6328430 -7502581 -9555490 -11393829 -11002285 -9256522 -9241692 -11351224
6197a1351224q71110K580132M052588K682007J159586N21251o55361j987415r99634
$$ -11351224 -12222334 -9642202 -5589614 -2907607 -1748021 -1226770 -1882131 -3869546 -4869180
6188d869180K072964L598411K096130N13120J195222K292740J395390n44384j476308
$$ -4869180 -2796216 802195 2898325 3411445 4606667 6899407 8294797 7750413 6274105
6179F274105j680010k294775k745175k197011j529654j459060q16255Q30306J191619
$$ 6274105 4594095 2299320 -445855 -2642866 -4172520 -5631580 -6447835 -5617529 -4425910
6170d425910j083346l021982j306541K129070K733987M69191m48469J228175J917114
$$ -4425910 -5509256 -8531238 -9837779 -7708709 -4974722 -4505531 -4954000 -3725825 -1808711
6161a808711j97038j583271Q97310M496529M465507R72248j764697j947467j828158
$$ -1808711 -2005749 -3589020 -2691710 1804819 6270326 7242574 5477877 3530410 1702252
6152A702252k944246l418038j262531K208041M022315L126307P97544j437384
$$ 1702252 -1241994 -4660032 -5922563 -3714522 307793 3434100 4231644 2794260
6144B794260k716640k308459N8131L033367M048577J714536k412319m902141l514391
$$ 2794260 77620 -2230839 -2172708 860659 4909236 6623772 4211453 -690688 -4205079
6135d205079N82337L653719K926529n35186l060029k700461j266123j237149k040488
$$ -4205079 -3622742 30977 2957506 2422320 -637709 -3338170 -4604293 -5841442 -7881930
6126g881930j381644M83032O84068j475029k543391L48682M817316N896236K451458
$$ -7881930 -9263574 -8780542 -8096474 -9571503 -12114894 -11766212 -6948896 -1052660 1398798
6117A398798j677394k800429j227652N08983J199374J510092K160828K789627
$$ 1398798 -278596 -3079025 -4306677 -3797694 -2598320 -1088228 1072600 3862227
6109C862227K413031N57293j901239l124655k090962J03512J314200N40653j552602
$$ 3862227 6275258 6832551 4931312 1806657 -284305 -180793 1133407 1674060 121458
6100A21458l774956m965611l872169j75047M078022N603929L287995m25175k165240
$$ 121458 -3653498 -8619109 -12491278 -12666325 -8588303 -2984374 303621 -121554 -2286794
6091b286794r57517J498856L021938K749057J289930k20513j190142j734312j775978
$$ -2286794 -3244311 -1745455 1276483 4025540 5315470 5094957 3904815 2170503 394525
6082C94525o50779J633009L340646K554202k66504k522433k480683r49540K76735
$$ 394525 -256254 1376755 4717401 7271603 7005099 4482666 2001983 1052443 1329178
6073A329178N43743M68930P73018J418223J534983L21554j559299k171649q26509
$$ 1329178 1872921 2341851 3114869 4533092 6068075 6389629 4830330 2658681 1832172
6064A832172M90621k84834k151491k557014j369584o83139q98588j75291J656816
$$ 1832172 2322793 2037959 -113532 -2670546 -4040130 -4723269 -5621857 -5797148 -4140332
6055d140332J972930l95086k741752k340140k46739R54677R80660R10976M14492
$$ -4140332 -2167402 -2562488 -5304240 -7644380 -7891119 -6936442 -5955782 -5044806 -4630314
6046d630314j134890k208686r52669J368684J892377P16217O92316K419206K713289
$$ -4630314 -5765204 -7973890 -8926559 -7557875 -5665498 -4949281 -4256965 -1837759 875530
6037H75530n73736m689284n002196q16774L623984L910138K11746l202413k934424
$$ 875530 301794 -4387490 -9389686 -10206460 -6582476 -2672338 -2460592 -5663005 -8597429
6028h597429j91908J180827j89304j853129j562814l47196j55747n33759L6016
$$ -8597429 -8789337 -7608510 -7797814 -9650943 -11213757 -11560953 -11716700 -12250459 -12214443
6019a2214443R64157N27762p64000o98062R02966J787838R16842j74084k85831
$$ -12214443 -11250286 -10722524 -11486524 -12184586 -11281620 -9493782 -8576940 -8751024 -9036855
6010i036855k71234p84423o41336J073012L042060L443331K339736R88241k7268
$$ -9036855 -9308089 -10092512 -10733848 -9660836 -6618776 -3175445 -835709 152532 125264
6001A25264o12491k82971R34254J553511K56032j973029k885051j957600q41275
$$ 125264 -487227 -770198 164056 1717567 1973599 570 -2884481 -4842081 -5683356
5992e683356p21608p61063J38363J201614O78202j481891l180711k838322j449416
$$ -5683356 -6404964 -7166027 -7027664 -5826050 -5147848 -6629739 -9810450 -12648772 -14098188
5983a4098188r15965r75427M96430L869327O293715N112866J478738j077489r23211
$$ -14098188 -15014153 -15989580 -15493150 -11623823 -5330108 -217242 1261496 184007 -739204
5974g39204N70572J691726K108291J866115P05330r39552j817958j529617j091356
$$ -739204 -168632 1523094 3631385 5497500 6202830 5263278 3445320 1915703 824347
5965H24347j222238j357128j063655j021857j555680j517888p4602J396479R59839
$$ 824347 -397891 -1755019 -2818674 -3840531 -5396211 -6914099 -6988701 -5592222 -4632383
5956d632383p27449p67215K088134N298643N217204J301036l223054m827256l144881
$$ -4632383 -5359832 -6127047 -4038913 1259730 6476934 7777970 4554916 -272340 -3417221
5947c417221o91141L40659J98569M32631J554200K552899K300506O85249j425873
$$ -3417221 -4108362 -3767703 -3569134 -3136503 -1582303 970596 3271102 3956351 2530478
5938B530478k766750k583810j604917j504566k512572k400260N98394M513334
$$ 2530478 -236272 -2820082 -4424999 -5929565 -8442137 -10842397 -10244003 -5730669
5930e730669N530824L186785J101235J671756K665103R90752k292014l556356
$$ -5730669 -199845 2986940 4088175 5759931 8425034 9415786 7123772 3567416
5922C567416k080403p80593j452256k304701j316429M89379J066090Q77926J793483
$$ 3567416 1487013 706420 -745836 -3050537 -4366966 -3877587 -2811497 -1933571 -140088
5913a40088L122195J767536k820991o418580m878625K18558L419555K473295N91323
$$ -140088 2982107 4749643 1928652 -4489928 -9368553 -9149995 -5730440 -3257145 -2665822
5904b665822R74858K205130J309070r22879j079799J251759K574953O80115k305683
$$ -2665822 -1690964 514166 1823236 900357 -179442 1072317 3647270 4327385 2021702
5895B021702l318333k297607j018982l0650J060591J600711O05817j036075j253865
$$ 2021702 -1296631 -3594238 -4613220 -4643870 -3583279 -1982568 -1376751 -2412826 -3666691
5886c666691K34701J382841O14574j197986k101323j421773j29005N94827N62946
$$ -3666691 -3431990 -2049149 -1434575 -2632561 -4733884 -6155657 -6284662 -5689835 -5126889
5877e126889M66849Q22611J229666R50490J28419k60877Q7872K15053n48660j222042
$$ -5126889 -4660040 -3837429 -2607763 -1657273 -1528854 -1789731 -1701859 -1486806 -2035466 -3257508
5867c257508l94589J627811L006816K613917J143028o1226m44821l27877k14421
$$ -3257508 -3652097 -2024286 982530 3596447 4739475 4678249 4233428 3905551 3691130
5858C691130l39034o37554j063141j877631l140832l785835k259690J044139L026690
$$ 3691130 3352096 2714542 1651401 -226230 -3367062 -7152897 -9412587 -8368448 -5341758
5849e341758J189667k727895m312797j845641J781239L123435K214399J265769
$$ -5341758 -4152091 -6879986 -11192783 -13038424 -11257185 -8133750 -5919351 -4653582
5841d653582J100446R58560Q40691J551623K480300J739342p87629k592779j917188
$$ -4653582 -3553136 -2594576 -1753885 -202262 2278038 4017380 3229751 636972 -1280216
5832a280216k65023j569r04721j156629p16379j097411k064441j422243J245875
$$ -1280216 -1545239 -1546808 -2451529 -3608158 -4324537 -5421948 -7486389 -8908632 -7662757
5823g662757L310194K901788J585021J359686J230618n90474k779030k520806
$$ -7662757 -4352563 -1450775 134246 1493932 2724550 2134076 -644954 -3165760
5815c165760k07542J028964L51066O8051R04781M64548j880023k512614R58706
$$ -3165760 -3373302 -2344338 -1993272 -1925221 -1020440 -555892 -2435915 -4948529 -3989823
5806c989823M889460M225677q3818k697697j838505q36159j608408j659912O41616
$$ -3989823 899637 5125314 5041496 2343799 505294 -330865 -1939273 -3599185 -2957569
5797b957569K294218L99212k552906k133236J102321K356527k16880l066514k686443
$$ -2957569 -663351 -264139 -2817045 -4950281 -3847960 -1491433 -1708313 -4774827 -7461270
5788g461270r5699J651244J757305J408045J061844L66227k20217K8581L53994
$$ -7461270 -7556969 -5905725 -4148420 -2740375 -1678531 -1312304 -1532521 -1503940 -1149946
5779a149946o34942k391741k701456r29243Q33134P48518j55885L65548K542805
$$ -1149946 -1784888 -4176629 -6878085 -7807328 -6974194 -6225676 -6381561 -6016013 -3473208
5770c473208M426342M427577K684337J51298k298626l731880l382161j615704
$$ -3473208 953134 5380711 8065048 8216346 5917720 2185840 -1196321 -2812025
5762b812025Q4897O26997K68319k62754q69292j657674k026804j191482N21227
$$ -2812025 -2727128 -2100131 -1831812 -2094566 -2963858 -4621532 -6648336 -7839818 -7318591
5753g318591J846992K184037K109898J979215J079178r01424k417673j612698
$$ -7318591 -5471599 -3287562 -1177664 801551 1880729 979305 -1438368 -3051066
5745c051066Q38083K061133O10524j722315k504002j606101l67224P85195K098460
$$ -3051066 -2212983 -151850 458674 -1263641 -3767643 -5373744 -5740968 -4955773 -2857313
5736b857313K857889K067323L18041r44952j578920k162723j954427j10455J538436
$$ -2857313 576 2067899 2385940 1440988 -137932 -2300655 -4255082 -4365537 -2827101
5727b827101L74167k189300j788282J958706M011349J549101j466817q36386J000732
$$ -2827101 -2452934 -4642234 -6430516 -4471810 -460461 1088640 -378177 -1214563 -213831
5718b13831m59313l599570l149627Q53455K984791J124407r06475k75242J041825
$$ -213831 -673144 -4272714 -7422341 -6568886 -3584095 -2459688 -3366163 -3641405 -2599580
5709b599580J067098J133989K002859J504409r62247j921498O56749L043765R58958
$$ -2599580 -1532482 -398493 1604366 3108775 2146528 225030 881779 3925544 4884502
5700D884502l774567n870332l776539l64037J900311K701532K077923M93874j63667
$$ 4884502 1109935 -4760397 -8536936 -8900973 -7000662 -4299130 -2221207 -1727333 -1891000
5691a891000J131095K193223O42161j887804j990272P7599J043525R5720m52094
$$ -1891000 -759905 1433318 2075479 187675 -1802597 -1724998 -681473 -585753 -1037847
5682a037847K2446o57559k833721l426696q60537J831679J238449j565035k856427
$$ -1037847 -1015401 -1672960 -4506681 -7933377 -8793914 -6962235 -5723786 -7288821 -10145248
5673a0145248j260396J430908L302581L990501L786636K887033J673338P20717
$$ -10145248 -11405644 -9974736 -6672155 -2681654 1104982 3992015 5665353 6386070
5665F386070K89720J15165l70855j562868l042914l601506k522055o37881N94994
$$ 6386070 6675790 6790955 6420100 4857232 1814318 -1787188 -4309243 -4947124 -4352130
5656d352130P40712K94471m41669j176868r26759Q44596K645230K340546J94219
$$ -4352130 -3611418 -3316947 -3758616 -4935484 -5862243 -5017647 -2372417 -31871 162348
5647A62348j236065m97700J150003J857886J213901k81427j981852k653871j018042
$$ 162348 -1073717 -1571417 -421414 1436472 2650373 2368946 387094 -2266777 -3284819
5638c284819K235357M372770L632995J206463o79717j438073j796272j895434
$$ -3284819 -1049462 3323308 6956303 8162766 7483049 6044976 4248704 2353270
5630B353270j157275L60779J638135J786339R70952K09901K45007M23099q18871
$$ 2353270 1195995 1556774 3194909 4981248 5952200 6162101 6407108 6830207 6011336
5621F011336l601351n354699l411264J277768M690145M298053J505977q83186
$$ 6011336 2409985 -2944714 -6355978 -5078210 -388065 3909988 5415965 4532779
5613D532779j850485j912065j368562l28958L98432j37088j761505l156260k908909
$$ 4532779 2682294 770229 -598333 -927291 -528859 -665947 -2427452 -5583712 -8492621
5604h492621n27220K828885M594154L004357n55734k648838j744127K01966P07340
$$ -8492621 -9019841 -6190956 -1596802 1407555 851821 -1797017 -3541144 -3339178 -2631838
5595b631838k10106r87382j074209j030455r28184j98196J182189K407824K635801
$$ -2631838 -2841944 -3829326 -4903535 -5933990 -6862174 -7060370 -5878181 -3470357 -834556
5586h34556J528693n21714k240911k249264o14774J015807J341612O79867j23383
$$ -834556 694137 172423 -2068488 -4317752 -4932526 -3916719 -2575107 -1895240 -2018623
5577b018623r17438j594710j394843p2612J065633N79628j124973k294383j892686
$$ -2018623 -2936061 -4530771 -5925614 -5998226 -4932593 -4352965 -5477938 -7772321 -9665007
5568i665007l08881J427781K211789J284223p83552k008087j051358R74919J854574
$$ -9665007 -9973888 -8546107 -6334318 -5050095 -5833647 -7841734 -8893092 -7918173 -6063599
5559f063599J060819l2238n00257r32842j831448k283679j121828J273688L247520
$$ -6063599 -5002780 -5035018 -5535275 -6468117 -8299565 -10583244 -11705072 -10431384 -7183864
5550g183864L800627L509659L314838L004191J606925q47549k895222l371858
$$ -7183864 -3383237 126422 3441260 6445451 8052376 7204827 4309605 937747
5542I37747k765850k166691j700897j020453n06780n43159k75139J051703J984751
$$ 937747 -1828103 -3994794 -5695691 -6716144 -7222924 -7766083 -8041222 -6989519 -5004768
5533e004768M40561k557289l357364o57413K536992L138400J682444J81648j175839
$$ -5004768 -4564207 -7121496 -10478860 -11136273 -8599281 -5460881 -3778437 -3596789 -4772628
5524d772628k764184l137583j072450J369430J247784m37986M0555K988680M160722
$$ -4772628 -7536812 -10674395 -11746845 -10377415 -9129631 -9567617 -9527062 -6538382 -2377660
5515b377660J126183k622307k442963Q82080K524753N69926j776932j429042J09982
$$ -2377660 -1251477 -3873784 -6316747 -5434667 -2909914 -2339988 -4116920 -5545962 -5435980
5506e435980n25095l104156l857118q97817L017270M299253L038037J730921J009251
$$ -5435980 -5961075 -9065231 -12922349 -13820166 -10802896 -6503643 -3465606 -1734685 -725434
5497g25434m90949k427579k266702N15626K677584J606665p56384q53135J221988
$$ -725434 -1216383 -3643962 -5910664 -5395038 -2717454 -1110789 -1867173 -2720308 -1498320
5488a498320K288217J145066l2288M11424J179476O07699n22886m57596N55229
$$ -1498320 789897 1934963 1902675 2314099 3493575 4101274 3578388 3120792 3676021
5479C676021N92860j035810k708908k519608m72866J664163K155001O47747j793845
$$ 3676021 4268881 3233071 524163 -1995445 -2468311 -804148 1350853 1998600 204755
5470B04755l510739l283403j157272J498944L011289K693314J105790p23851j896468
$$ 204755 -3305984 -6589387 -7746659 -6247715 -3236426 -543112 562678 -161173 -2057641
5461b057641j785915n96177K39565m69137j569717p02316J777968K304428q23956
$$ -2057641 -3843556 -4439733 -4200168 -4669305 -6239022 -6941338 -5163370 -2858942 -3682898
5452c682898m188840l706234l69190J818899K007674K339974K633744M43667l251032
$$ -3682898 -7871738 -11577972 -11947162 -10128263 -8120589 -5780615 -3146871 -2703204 -5954236
5443e954236l930611p36926J479489j25377j761121K45833K836250J347469k363516
$$ -5954236 -9884847 -10621773 -9142284 -9267661 -11028782 -10782949 -7946699 -6599230 -8962746
5434h962746k720105P71929L307637K447767O09580r750q7500k13608M46489J625848
$$ -8962746 -11682851 -10910922 -7603285 -5155518 -4545938 -4555688 -4643188 -4856796 -4410307 -2784459
5424b784459J616207K36645q65700j198696j645512j678662J53625K704342K896923
$$ -2784459 -1168252 -931607 -1797307 -2996003 -4641515 -6320177 -6166552 -3462210 -565287
5415e65287N43826j147739o62850n068l88727r7672J615935K260081J06225k610031
$$ -565287 -21461 -1169200 -1832050 -1837118 -2225845 -2323517 -707582 1552499 1658724 -951307
5405i51307k956217j270530L20117R75755P08060p04719k291765j802201Q48536
$$ -951307 -3907524 -5178054 -4857937 -3882182 -3174122 -3878841 -6170606 -7972807 -7124271
5396g124271K563876J678007P03487J757440K370974l19360l783308l228406R24851
$$ -7124271 -4560395 -2882388 -2178901 -421461 1949513 1630153 -2153155 -5381561 -4456710
5387d456710L636790K834976J408799J163703j07887l566878n744277l299582
$$ -4456710 -819920 2015056 3423855 4587558 4479671 912793 -4831484 -8131066
5379h131066J453128L332024J153766j455042j545401j16340M27477m33671j623472
$$ -8131066 -6677938 -3345914 -2192148 -3647190 -5192591 -5308931 -4881454 -5315125 -6938597
5370f938597k292814k058197n78552J695674L045483K246328N33455K80135J647818
$$ -6938597 -9231411 -11289608 -11868160 -10172486 -7127003 -4880675 -4347220 -4067085 -2419267
5361b419267K217441N27981j706986k101183q70896P2604K27084N76180J100864
$$ -2419267 -201826 326155 -1380831 -3482014 -4352910 -4280306 -4053222 -3477042 -2376178
5352b376178O31518n88597n09660J641946L737562L432496J098843j188814k410598
$$ -2376178 -1744660 -2333257 -2842917 -1200971 2536591 5969087 7067930 5879116 3468518
5343C468518k854331k494693r65302R52241J508506K60748j010117o12070N89366
$$ 3468518 614187 -1880506 -2845808 -1893567 -385061 -124313 -1134430 -1746500 -1157134
5334a157134L96698j175373j411947J084764L625547K827712k62572j424212M57132
$$ -1157134 -760436 -1935809 -3347756 -2262992 1362555 4190267 3927695 2503483 2960615
5325B960615J861353L64347j844225k305331k426823l861271m077604l51236M032941
$$ 2960615 4821968 5186315 3342090 1036759 -1390064 -5251335 -9328939 -9680175 -5647234
5316e647234L254483k069512n163272k860672M89842M37136j483914j638661J40131
$$ -5647234 -2392751 -4462263 -9625535 -12486207 -11996365 -11559229 -13043143 -14681804 -14541673
5307a4541673J942767L204080L700406K253589n25237j146172J863212M684717
$$ -14541673 -12598906 -9394826 -5694420 -3440831 -3966068 -5112240 -3249028 1435689
5299A435689L301062o26087k737697k546974k636956k945218q72526L196086N256372
$$ 1435689 4736751 4110664 1372967 -1174007 -3810963 -6756181 -7628707 -4432621 823751
5290H23751L444426N42685n56115n79991j386880k471463k150966n57162O55608
$$ 823751 4268177 4810862 4254747 3674756 2287876 -183587 -2334553 -2891715 -2236107
5281b236107P50032L44203j88996j213554k504953k638464o04374K376006L733895
$$ -2236107 -1486075 -1141872 -1330868 -2544422 -5049375 -7687839 -8292213 -5916207 -2182312
5272b182312K504630L59407r15840j680927k889548l624129k388733l4682J252679
$$ -2182312 322318 681725 -234115 -1915042 -4804590 -8428719 -10817452 -10852134 -9599455
5263i599455J440370K091843K533922L71776l502834m569634j138115K656320
$$ -9599455 -8159085 -6067242 -3533320 -3161544 -6664378 -11234012 -12372127 -9715807
5255i715807K737881N09325m55358J34926N43445Q60025J783240J876511K7191
$$ -9715807 -6977926 -6468601 -6923959 -6789033 -6245588 -5385563 -3602323 -1725812 -1698621
5246a698621j307990M92195L134223K188576j999864m599562l112100J98478K506078
$$ -1698621 -3006611 -2514416 619807 2808383 808519 -3791043 -6903143 -6704665 -4198587
5237d198587L059689J636460j602316m276576l536406k59415J839181J597513
$$ -4198587 -1138898 497562 -1104754 -5381330 -8917736 -9177151 -7337970 -5740457
5229e740457J305403J864310J199650j307693k812227j409864P49346J002513
$$ -5740457 -4435054 -2570744 -1371094 -2678787 -5491014 -6900878 -6151532 -5149019
5221e149019J52850N42183K128954K783397J385052r68190k148301p73592K224580
$$ -5149019 -4996169 -4453986 -2325032 458365 1843417 875227 -1273074 -2046666 177914
5212A77914L809555K088682r69013k050669j126650p52134j245112l43348K004346
$$ 177914 3987469 6076151 5107138 3056469 1929819 1177685 -67427 -410775 1593571
5203A593571K710806P01888j064104o17128p1250j254584k132970q51908J55540
$$ 1593571 4304377 5006265 3942161 3325033 3253783 1999199 -133771 -985679 -830139
5194h30139j842336m506928l595611K82971K707453K208714J346366J372599N91547
$$ -830139 -2672475 -7179403 -10775014 -10492043 -7784590 -5575876 -4229510 -2856911 -2265364
5185b265364j315823j861036k45321O33646j077335k765332j502727J066055J444899
$$ -2265364 -3581187 -5442223 -5687544 -5053898 -6131233 -8896565 -10399292 -9333237 -7888338
5176g888338R8398N77415L392802M791805K383790j567741m039211n238750o264439
$$ -7888338 -7789940 -7212525 -3819723 972082 3355872 1788131 -2251080 -7489830 -13754269
5167a3754269n556771j363550L769802N182020K634886O39026J564316K525039
$$ -13754269 -19311040 -20674590 -16904788 -11722768 -9087882 -8448856 -6884540 -4359501
5159d359501Q70556j177743m19702J838874K006271M0064q96628K54474J244532
$$ -4359501 -3488945 -4666688 -5086390 -3247516 -1241245 -1201181 -2097809 -1843335 -598803
5150e98803N66302n69691p35273j37692M91598P46999J24187j256609j623522
$$ -598803 -32501 -602192 -1337465 -1475157 -983559 -236560 -112373 -1368982 -2992504
5141b992504N45529L680165M501078K302746m21721j661825j785717j609295j115131
$$ -2992504 -2446975 1233190 5734268 8037014 7615293 5953468 4167751 2558456 1443325
5132A443325o16501r09446j628139j395713n3021J073129J284609J032862M32054
$$ 1443325 826824 -82622 -1710761 -3106474 -3159495 -2086366 -801757 231105 663159
5123F63159o57186j276515m42342O73918J81297j239658j357411l52685l74675
$$ 663159 5973 -1270542 -1712884 -1038966 -857669 -2097327 -3454738 -3807423 -4182098
5114d182098j243495n05309J736364K192645j84847k105660j026936J202907J733776
$$ -4182098 -5425593 -5930902 -4194538 -2001893 -2186740 -4292400 -5319336 -4116429 -2382653
5105b382653N34063j100921k723903l451974j682807J732964L158187J347597
$$ -2382653 -1848590 -2949511 -5673414 -9125388 -10808195 -9075231 -5917044 -4569447
5097d569447k09104J212052K966265J363721k102454k861844P518K979969L249938
$$ -4569447 -4778551 -3566499 -600234 763487 -1338967 -4200811 -4193293 -1213324 2036614
5088B036614J443150n36490j663380j698954q72680R6516N46114K14216j050484
$$ 2036614 3479764 2943274 1279894 -419060 -1291740 -1195224 -649110 -434894 -1485378
5079a485378k783471l275982j502206M12323m51139k751276j969384K462301N481052
$$ -1485378 -4268849 -7544831 -9047037 -8634714 -9085853 -11837129 -13806513 -11344212 -5863160
5070e863160L903572J123806J149493K223237P30390j999031k007958L04776Q45396
$$ -5863160 -1959588 -835782 313711 2536948 3267338 1268307 -739651 -434875 410521
5061D10521j366114k855174j253321J718025L325307K895083J322645k82399j165678
$$ 410521 -955593 -3810767 -5064088 -3346063 -20756 2874327 4196972 3914573 2748895
5052B748895j495670j954867k001205k16920K464103K498739j135562m252562
$$ 2748895 1253225 -701642 -2702847 -2919767 -455664 2043075 907513 -3345049
5044c345049k853382J149850K918459J287353j183635k821724l565164k595737
$$ -3345049 -6198431 -5048581 -2130122 -842769 -2026404 -4848128 -8413292 -11009029
5036a1009029N96304L667438L771968J741311M09810j60216j812914l528296k065489
$$ -11009029 -10412725 -6745287 -2973319 -1232008 -822198 -982414 -2795328 -6323624 -8389113
5027h389113K418298N492434M120865J38479k662178k425656J57414K903661L582423
$$ -8389113 -5970815 -478381 3642484 3780963 1118785 -1306871 -1149457 1754204 5336627
5018E336627K025555M55589L56758L87516q36538k004360j740710j629560l183553
$$ 5336627 7362182 7817771 8174529 8562045 7725507 5721147 3980437 2350877 -832676
5009h32676l993153j105232L358527M473446J430211k123300l756884l870763
$$ -832676 -4825829 -5931061 -2572534 1900912 3331123 1207823 -2549061 -6419824
5001f419824k488252P26137L499587K793653j27397q55220J636099L829679L286013
$$ -6419824 -8908076 -8181939 -4682352 -1888699 -2016096 -2871316 -1235217 2594462 5880475
4992E880475J170146j198341l965369o154610n540420k177427J244485L051365
$$ 5880475 7050621 5852280 1886911 -4267699 -9808119 -11985546 -10741061 -7689696
4984g689696L447589K085479j267786l880395k388685J741850L569855J905342
$$ -7689696 -4242107 -2156628 -3424414 -7304809 -9693494 -7951644 -4381789 -2476447
4976b476447N27228J501590K211726M89024j839301k437411j694233o97640O84446
$$ -2476447 -1949219 -447629 1764097 2253121 413820 -2023591 -3717824 -4415464 -3731018
4967c731018K156419K397353J326704L98716J22975j34710j19372N49053L42361
$$ -3731018 -1574599 822754 2149458 2548174 2671149 2536439 2417067 2966120 3308481
4958C308481j877355l629757k119779N41527M24599j306710n78775J614202N32661
$$ 3308481 1431126 -2198631 -4318410 -3776883 -3352284 -4658994 -5237769 -3623567 -3090906
4949c090906l220879l714096K76595L097622J915591P46167K125837K526145j93699
$$ -3090906 -6311785 -10025881 -9749286 -6651664 -4736073 -3989906 -1864069 662076 468377
4940D68377j960035L19979K913635J398798k535154m814065m777232l306264P4276
$$ 468377 -1491658 -1171679 1741956 3140754 605600 -4208465 -8985697 -12291961 -12217685
4931a2217685M254861N240821J735530k040564k439527j091041o26833m10214
$$ -12217685 -7962824 -2722003 -986473 -3027037 -5466564 -6557605 -7184438 -7594652
4923g594652M16077M02904o24935j97472J861164K164211p6082j201679P5500
$$ -7594652 -7178575 -6775671 -7400606 -7598078 -5736914 -3572703 -3648785 -4850464 -4774964
4914d774964J82282k223927l295921j283569Q5163j069132j190677J303335K414786
$$ -4774964 -4592682 -6816609 -10112530 -11396099 -11310936 -12380068 -13570745 -12267410 -9852624
4905i852624K89883j030190M06082O72145j752762k367587M66212K019607P00823
$$ -9852624 -9562741 -10592931 -10186849 -9514704 -11267466 -13635053 -13168841 -11149234 -10448411
4896a0448411J055017L116905M50921o208996o720290O62370L925524k229118
$$ -10448411 -9393394 -6276489 -5825568 -12034564 -18754854 -18092484 -14166960 -16396078
4888a6396078o540026j809519J902398k832599o004014m14351K431710n278531
$$ -16396078 -22936104 -24745623 -22843225 -25675824 -31679838 -32094189 -29662479 -34941010
4880c4941010r878918k457719l01642j4909721k3659532j0387378q745280n1996697
$$ -34941010 -44819928 -47277647 -47579289 -62489010 -86148542 -96535920 -105281200 -157277897
4872a57277897r5348569n6654777N8435742J40698561J14431639L1339042j2380149
$$ -157277897 -252626466 -309281243 -250845501 -110146940 4284699 35623741 23243592
4865B3243592j434013R865163k996066j2179894j649811P129977j83988p428288
$$ 23243592 21809579 31674742 28678676 16498782 14848971 21978948 21794960 14366672
4857A4366672j759840M728765Q04299m655407k458917O82256j969361m093817
$$ 14366672 12606832 17335597 18139896 13484489 11025572 11707828 9738467 5644650
4849E644650k52075L260892J280641p98074J145381K111911n30618q71555K948128
$$ 5644650 5392575 8653467 9934108 9136034 10281415 12393326 11862708 10991153 13939281
4840A3939281L043274l554471p279546j764000M626811K560361l412703l975610
$$ 13939281 16982555 13428084 6148538 4384538 9011349 11571710 8159007 4183397
4832D183397k13922Q52062r22907o65841J660514K236404P49925m72232j475559
$$ 4183397 3969475 4821537 3898630 3232789 4893303 7129707 7879632 7407400 5931841
4823E931841k888795k727332k97667O85744k003219m340234k363835J102814J502070
$$ 5931841 3043046 315714 18047 703791 -1299428 -5639662 -8003497 -6900683 -5398613
4814e398613J26099Q44549K922122L056983J620961J135429R88355q59707k922959
$$ -5398613 -5272514 -4427965 -1505843 1551140 3172101 4307530 5295885 4436178 1513219
4805A513219k136882P04758K018369P79576r28908j396359k20493K469736M998190
$$ 1513219 -623663 81095 2099464 2879040 1950132 553773 333280 2803016 7801206
4796G801206M644777J701454J9006Q89391M20107l436591n909074k670028K089276
$$ 7801206 12445983 14147437 14166443 15055834 15475941 12039350 6130276 3460248 5549524
4787E549524J441281l314686m756622r49219K543385K298809J418654K628685
$$ 5549524 6990805 3676119 -1080503 -2029722 513663 2812472 4231126 6859811
4779F859811L385499R03478k635397l333560j030406J407307K175155J533722
$$ 6859811 10245310 11148788 8513391 5179831 4149425 5556732 7731887 9265609
4771I265609J84078j395461k732923l574931l779277k872718p87376J122805J343654
$$ 9265609 9449687 8054226 5321303 1746372 -2032905 -4905623 -5692999 -4570194 -3226540
4762c226540L93125K9326M01301J15660p19375k9801K744071M957008M027220
$$ -3226540 -2833415 -2804089 -2402788 -2287128 -3006503 -3036304 -292233 4664775 8691995
4753H691995P86505j957773k949210k926995k431729j065915J080631K758246
$$ 8691995 9478500 7520727 4571517 1644522 -787207 -1853122 -772491 1985755
4745A985755K820897J398324n56684k311790l548381l956830l214957j350262
$$ 1985755 4806652 6204976 5648292 3336502 -211879 -4168709 -7383666 -8733928
4737h733928J141740L421980M387590L172803L23297j930073j819149m55153n42880
$$ -8733928 -7592188 -4170208 217382 3390185 3713482 1783409 -35740 -490893 -1033773
4728a033773k307505k744593j87527K516302J799164j155034j919433O61906K897241
$$ -1033773 -3341278 -6085871 -6273398 -3757096 -1957932 -3112966 -5032399 -4370493 -1473252
4719a473252J812335q50181j728092m96519O11334M05760k08441j35389N57773
$$ -1473252 339083 -511098 -2239190 -2735709 -2124375 -1718615 -1927056 -2062445 -1504672
4710a504672J085327Q63346Q024q54265j467486k254014l031592k209890J104310
$$ -1504672 -419345 444001 452025 -402240 -1869726 -4123740 -7155332 -9365222 -8260912
4701h260912M670212M994414J844409j302788j819831p35976k46970p31302j478362
$$ -8260912 -3590700 1403714 3248123 1945335 125504 -610472 -857442 -1588744 -3067106
4692c067106k305380k899384k278320n34072L77455p30295k121659j370893J229698
$$ -3067106 -5372486 -8271870 -10550190 -11084262 -10706807 -11437102 -13558761 -14929654 -13699956
4683a3699956L243889L426005K784491K505896K271397J064399r69012k062021
$$ -13699956 -10456067 -7030062 -4245571 -1739675 531722 1596121 627109 -1434912
4675a434912p44414J753324K281667j2039j776333J03037L480929L575176J9520
$$ -1434912 -2179326 -426002 1855665 1843626 67293 170330 3651259 7226435 7245955
4666G245955k580801j516070O95291J096866L50410j03854j134531l234543l895590
$$ 7245955 4665154 3149084 3844375 4941241 5291651 5187797 4053266 818723 -3076867
4657c076867j071759K973511M475889L046792R78970l98874q89916P572J689203
$$ -3076867 -4148626 -1175115 3300774 6347566 7326536 6927662 6037746 6045318 7734521
4648G734521J576976j179117l195656j547180J198369Q41580j416990q45908K864275
$$ 7734521 9311497 8132380 4936724 3389544 4587913 5429493 4012503 3166595 6030870
4639F030870M960091L202080Q79012R61772J818861P90086j603367l273974l682261
$$ 6030870 10990961 14193041 15072053 16033825 17852686 18642772 17039405 13765431 10083170
4630A0083170l348870k376209j034609m6881P07654J887228K562034Q95772k303555
$$ 10083170 6734300 4358091 3323482 3276601 3984255 5871483 8433517 9329289 7025734
4621G025734l601767j816348k8165q90334k532561j523130K040988M950240N145893
$$ 7025734 3423967 1607619 1579454 689120 -1843441 -3366571 -1325583 3624657 8770550
4612H770550L255334O81691j677766l033092k726681r99515Q80446J321724m87796
$$ 8770550 12025884 12707575 11029809 7996717 5270036 4270521 5150967 6472691 5984895
4603E984895l315266m110666j235112K523696K453250j855134n187288l062763
$$ 5984895 2669629 -1441037 -2676149 -152453 2300797 445663 -4741625 -7804388
4595g804388K650051O320578N121024R85449k696854m063337l059062q53202Q84195
$$ -7804388 -5154337 1166241 6287265 7272714 4575860 512523 -2546539 -3399741 -2515546
4586b515546J334830J162005J202136J175222M39688p94461j848448k323917j790333
$$ -2515546 -1180716 -18711 1183425 2358647 2798335 2003874 155426 -2168491 -3958824
4577c958824K5162J852602J326985j662762l625880j566581K667129M473547K305137
$$ -3958824 -3933662 -2081060 -754075 -2416837 -6042717 -7609298 -4942169 -468622 1836515
4568A836515j014475k518389k131559j177522k37408N38714P39760M36718M53370
$$ 1836515 822040 -1696349 -3827908 -5005430 -5242838 -4704124 -3964364 -3527646 -3074276
4559c074276R98739R94144m36244k606884m106844m307474l445754j916591j87183
$$ -3074276 -2075537 -1081393 -1517637 -4124521 -8231365 -12538839 -15984593 -17901184 -18088367
4550a8088367J084501J513526J339842J011056Q10652J095753K195507L557028
$$ -18088367 -17003866 -15490340 -14150498 -13139442 -12328790 -11233037 -9037530 -5480502
4542e480502L666550J701417j005092k067564p78167R70878R37018p19704j627795
$$ -5480502 -1813952 -112535 -1117627 -3185191 -3963358 -2992480 -2055462 -2775166 -4402961
4533d402961k46057J944729J981287r82528m424090n154042k658659P87345K777798
$$ -4402961 -4649018 -2704289 -723002 -1705530 -6129620 -11283662 -13942321 -13154976 -10377178
4524a0377178K703891J400332O1990k67249Q13699K444443L042222K090491Q42726
$$ -10377178 -7673287 -6272955 -6210965 -6478214 -5664515 -3220072 -177850 1912641 2755367
4515B755367N85825Q07175Q0395j627401k855122k893043k648439k674698j844636
$$ 2755367 3341192 4148367 4228762 2601361 -253761 -3146804 -5795243 -8469941 -10314577
4506a0314577O28573K903489K272982q91962k976819j581831J487102K779951
$$ -10314577 -9686004 -6782515 -4509533 -5401495 -8378314 -9960145 -8473043 -5693092
4498e693092J457900m49575j148779p35078n9638L90889L18738k83073n07258
$$ -5693092 -4235192 -4684767 -5833546 -6568624 -6628262 -6237373 -5918635 -6201708 -6708966
4489f708966P24244K760043L232580Q34646k680042m137642k161656J824480N225406
$$ -6708966 -5984722 -3224679 7901 842547 -1837495 -5975137 -8136793 -6312313 -1086907
4480a086907O167289M336975J079505j280419j142480Q41008K264057J314871
$$ -1086907 5080382 9417357 10496862 9216443 8073963 8914971 11179028 12493899
4472A2493899j483160l986496m681845l944181l064477k457732j387394N32600
$$ 12493899 11010739 7024243 2342398 -1601783 -4666260 -7123992 -8511386 -7978786
4464g978786K330247K779188K027494J228925P34534k32563j858910k883776k272244
$$ -7978786 -5648539 -2869351 -841857 387068 1121602 889039 -969871 -3853647 -6125891
4455f125891q64209j56332J07047J607094M453959O034454M040266j67678k802060
$$ -6125891 -6990100 -7146432 -7039385 -5432291 -978332 5056122 9096388 8928710 6126650
4446F126650k213395n74047l74045r36478j21616J585983J279916j829561m582579
$$ 6126650 3913255 3339208 2965163 2028685 1907069 3493052 4772968 2943407 -1639172
4437a639172l931360r86715Q67770O33956K10218Q23598J420435R78113L24427
$$ -1639172 -5570532 -6557247 -5689477 -5055521 -4845303 -4021705 -2601270 -1623157 -1298730
4428a298730O24238J407354J263343j60924j725454k072576r01339P97227J639137
$$ -1298730 -674492 732862 1996205 1835281 109827 -1962749 -2864088 -2066861 -427724
4419d27724J232379N19686M09673N78282L34138J7279L54330R02047N85524m61867
$$ -427724 804655 1324341 1734014 2312296 2646434 2663713 3018043 3920090 4505614 4043747
4409D043747j132198j251178j586646k067477j877557j290051j230310r33336
$$ 4043747 2911549 1660371 73725 -1993752 -3871309 -5161360 -6391670 -7325006
4401g325006J286856M417173N002382K284494j24719K91888J064669p31218l017503
$$ -7325006 -6038150 -1620977 3381405 5665899 5541180 5833068 6897737 6166519 3149016
4392C149016j913801J522796K516840m7756k152446j043344J173893J600653M24332
$$ 3149016 1235215 2758011 5274851 5227095 3074649 2031305 3205198 4805851 5230183
4383E230183j060229k960645m991340m952169j822520J545824J717320n18324
$$ 5230183 4169954 1209309 -3782031 -8734200 -10556720 -9010896 -7293576 -7811900
4375g811900j342478P37917L338666L951074K884583J814185J143092L3524j582219
$$ -7811900 -9154378 -8416461 -5077795 -1126721 1757862 3572047 4715139 4748663 3166444
4366C166444k183753m11324K586692L622561J234935j881933k054758J85834P86622
$$ 3166444 982691 571367 3158059 6780620 8015555 6133622 4078864 4264698 5051320
4357E051320j509396k862845l16779L054548K449354j235545k636984k9976K347713
$$ 5051320 3541924 679079 362300 3416848 5866202 4630657 1993673 1963697 4311410
4348D311410J026436j753768k094356l16062L22715r79529j762205m95309J276868
$$ 4311410 5337846 3584078 1489722 1173660 1496375 516846 -1245359 -1740668 -463800
4339d63800J604103R27916J044391K285845K940164J414286j682619l945867l605964
$$ -463800 1140303 2068219 3112610 5398455 8338619 9752905 8070286 4124419 518455
4330E18455j317172O33495O64109q85902k586480l281120k615397r46997Q87689
$$ 518455 -798717 -165222 498887 -387015 -2973495 -6254615 -8870012 -9817009 -8929320
4321h929320K031501K055586R70156p77210j969736j120830J592814L511504K243932
$$ -8929320 -6897819 -4842233 -3872077 -4649287 -6619023 -7739853 -6147039 -2635535 -391603
4312c91603q82373j978620M06948L314968L265962M32911k299182l009164j983815
$$ -391603 -1273976 -3252596 -2845648 469320 3735282 4168193 1869011 -1140153 -3123968
4303c123968l73499P55973O24948n88247j600140j509475q68325m31049K17932
$$ -3123968 -3497467 -2741494 -2116546 -2704793 -4304933 -5814408 -6682733 -7113782 -6895850
4294f895850J606138K869339K745194J401416n3673j156244j864693j695376o57939
$$ -6895850 -5289712 -2420373 324821 1726237 1672564 516320 -1348373 -3043749 -3701688
4285c701688n8453n30553l69802J807277L731538J897579k937853n976652m606813
$$ -3701688 -3760141 -4290694 -4660496 -2853219 878319 2775898 -161955 -6138607 -10745420
4276a0745420j277909P69644J445921J824508J226176j040774k969362j809765
$$ -10745420 -12023329 -11253685 -9807764 -7983256 -6757080 -7797854 -10767216 -12576981
4268a2576981K016629N252477N689834L945393J746352J95223l15881K4333L64246
$$ -12576981 -10560352 -5307875 381959 4327352 6073704 6268927 5953046 5977379 6341625
4259F341625q7716j072771j607470j256402n42603j57755k31190m22798m81960
$$ 6341625 6253909 5181138 3573668 2317266 1774663 1616908 1385718 962920 480960
4250D80960n20281n19490K60522K461158M837131M682227J311935k201118k735315
$$ 480960 -39321 -558811 -298289 2162869 7000000 11682227 12994162 10793044 8057729
4241H057729j430425j643392l390732l324300m42016J963654J404769j25439L37675
$$ 8057729 6627304 4983912 1593180 -1731120 -2173136 -209482 1195287 1069848 1407523
4232A407523K221378K803719J169177j421956l585303m381210l300155j287104
$$ 1407523 3628901 6432620 7601797 6179841 2594538 -1786672 -5086827 -6373931
4224f373931k73257l81413M87330K936486M361611K848369L68995k68056M82721
$$ -6373931 -6647188 -7028601 -6541271 -3604785 756826 3605195 3974190 3706134 4188855
4215D188855L89266q68813k051784k690292k671876j328800O81293O83059k161380
$$ 4188855 4578121 3709308 1657524 -1032768 -3704644 -5033444 -4352151 -3669092 -5830472
4206e830472m486619l191298r8012J138553O30803J021691K473973K921854K049883
$$ -5830472 -10317091 -13508389 -13606401 -12467848 -11837045 -10815354 -8341381 -5419527 -3369644
4197c369644J218244N30255n24039q66146K16010O09198j343325l059558j483790
$$ -3369644 -2151400 -1621145 -2145184 -3011330 -2795320 -2186122 -3529447 -6589005 -8072795
4188h072795J421907J790828M46758Q76042K358599J379012j199490j111487J407650
$$ -8072795 -6650888 -4860060 -4413302 -3537260 -1178661 200351 -999139 -2110626 -702976
4179g02976J542699j682805l514807j264267K025772L171936K640250J483565
$$ -702976 839723 -843082 -4357889 -5622156 -3596384 -424448 2215802 3699367
4171C699367l27552j586254q57758k9745j584497l002456l10533L732227K819251
$$ 3699367 3371815 1785561 927803 898058 -686439 -3688895 -3999428 -267201 2552050
4162B552050k074057l914100j541337l86599q95829K213802P529649O596458p49498
$$ 2552050 477993 -3436107 -4977444 -5364043 -6259872 -4046070 3483579 10080037 9330539
4153I330539m233192q84967k39632n604723o599743M19056K463327n874028o688907
$$ 9330539 5097347 4212380 3972748 -1631975 -8231718 -7812662 -5349335 -11223363 -17912270
4144a7912270J2818073L1945478K2488257o576329j9457986n668969Q083001J935006
$$ -17912270 -5094197 26851281 49339538 42763209 23305223 17636254 25719255 27654261
4136B7654261j0189679q824997O66661K670681j827792j538823L553204M383040
$$ 27654261 17464582 8639585 9306246 11976927 10149135 8610312 12163516 16546556
4128A6546556j63328l211182k756580k492022k936784j817341m52330j176269
$$ 16546556 16383228 13172046 10415466 7923444 4986660 3169319 2716989 1540720
4120A540720j502482J339529L601589O18829m236619m245672o7705K184091J171762
$$ 1540720 38238 1377767 4979356 5598185 1361566 -2884106 -2951811 -767720 404042
4111D04042P21407J735017J464349O836M22840K589384L095710J172879n95851
$$ 404042 1125449 2860466 4324815 4331651 4754491 7343875 10439585 11612464 11016613
4102A1016613j112818j453313j418602j03748R43028l05987k222137j830180m9675
$$ 11016613 9903795 8450482 7031880 6928132 7871160 7565173 5343036 3512856 3463181
4093C463181l4923j538778j746379o49043o52578j610902j132405O52011J282052
$$ 3463181 3428258 1889480 143101 -505942 -1158520 -2769422 -3901827 -3249816 -1967764
4084a967764N56453N06498J171821P46142l89389o4072J433702J597871J13132
$$ -1967764 -1411311 -904813 267008 1013150 623761 559689 1993391 3591262 3704394
4075C704394p67778j26698P83013J189646J077915k76400k730090l595538j200717
$$ 3704394 2936616 2809918 3592931 4782577 5860492 5584092 2854002 -741536 -1942253
4066a942253J514327J014822j125713j211360o9376j085525l193764k262419J171365
$$ -1942253 -427926 586896 -538817 -1750177 -1819553 -2905078 -6098842 -8361261 -7189896
4057g189896K238571P9433o96317K079564M893725M728220K899728J173387o97144
$$ -7189896 -4951325 -4871892 -5568209 -3488645 1405080 6133300 9033028 10206415 9509271
4048I509271k111018j510854m09885k088513n072011m012607J243675M185110
$$ 9509271 7398253 5887399 5477514 3389001 -1683010 -5695617 -4451942 -266832
4040b66832J851231m79160J298465K910514n75398n659471n718737j289980J770935
$$ -266832 1584399 1105239 2403704 5314218 4738820 -920651 -6639388 -7929368 -6158433
4031f158433J596560J066586J025542n56519l024592k800416M09806K265170K85795
$$ -6158433 -4561873 -3495287 -2469745 -3026264 -6050856 -8851272 -8441466 -6176296 -5890501
4022e890501k297934j339622K372169M474749K851828j13539j063990J16501P75723
$$ -5890501 -8188435 -9528057 -7155888 -2681139 170689 57150 -1006840 -890339 -114616
4013a14616k48469q53194O60267K183142P86465k215817k837504n76387J113157
$$ -114616 -363085 -1216279 -556012 1627130 2413595 197778 -2639726 -3216113 -2102956
4004b102956P02195M07563J173274O76274j734842k838398r48200R02949K91957
$$ -2102956 -1400761 -993198 180076 856350 -878492 -3716890 -4665090 -3762141 -3470184
3995c470184m25304J079260K409697R82821o47770Q42903L165590K116887r14080
$$ -3470184 -3895488 -2816228 -406531 576290 -71480 771423 3937013 6053900 5139820
3986E139820j305891O49845M41208k486113l711295j492440N30432l28447j937571
$$ 5139820 3833929 4483774 4924982 2438869 -1272426 -2764866 -2234434 -2562881 -4500452
3977d500452j699954m27492J71034K98656M87472K68500k675J123131L216136
$$ -4500452 -6200406 -6627898 -6456864 -6158208 -5670736 -5402236 -5404911 -4281780 -1065644
3968a065644L550856J098679j702236k521118j928172j346677q16439k07651k08083
$$ -1065644 2485212 3583891 1881655 -639463 -2567635 -3914312 -4730751 -4938402 -5146485
3959e146485o70605k71482R28794J008272m95883j452105p63602k53252j057519
$$ -5146485 -5817090 -6088572 -5159778 -4151506 -4647389 -6099494 -6863096 -7116348 -8173867
3950h173867j137071J049039L106515K158693l43986q08661R17869J847268R73705
$$ -8173867 -9310938 -8261899 -5155384 -2996691 -3340677 -4149338 -3231469 -1384201 -410496
3941d10496L12083Q00296Q52677j69744m16219R16243J326214j342253m862414
$$ -410496 -98413 701883 1554560 1384816 968597 1884840 3211054 1868801 -2993613
3932b993613m985009j112817K917777L802464K297812J077693R45796O30040o95526
$$ -2993613 -7978622 -9091439 -6173662 -2371198 -73386 1004307 1950103 2580143 1884617
3923A884617k282613k899092j854745P45578L528810M023687J063858k894577
$$ 1884617 -397996 -3297088 -5151833 -4406255 -877445 3146242 4210100 1315523
3915A315523l836265j160395J476768J339382K61609J027725K236342K61645m274732
$$ 1315523 -2520742 -3681137 -2204369 -864987 -603378 424347 2660689 2922334 -1352398
3906a352398n832660j063691O047056Q290653L437545l421209n596401j742068
$$ -1352398 -7185058 -8248749 -2201693 6088960 9526505 6105296 508895 -1233173
3898a233173L311280M238172R30211k187441k009976p1314N68893m22982j307906
$$ -1233173 2078107 6316279 7246490 5059049 3049073 2977759 3546652 3123670 1815764
3889A815764j425843j192332j62230J979335L230879J387902j811708k225225
$$ 1815764 389921 -802411 -964641 1014694 4245573 5633475 3821767 1596542
3881A596542N06748K034066j48384k888692k305676O78969K564868K402949J414788
$$ 1596542 2103290 4137356 3988972 1100280 -1205396 -526427 2038441 4441390 5856178
3872E856178m56213l756537o326235m888860k2751L796455L837415K007558J178655
$$ 5856178 5399965 1643428 -4682807 -9571667 -9594418 -5797963 -1960548 47010 1225665
3863A225665J274214O66663n19555p13852L10840R68662K87313o62776m55809
$$ 1225665 2499879 3166542 2646987 1933135 2243975 3212637 3499950 2837174 2381365
3854B381365M38447K66299j181993j784280k06476J316313n06593m856317o818936
$$ 2381365 2819812 3086111 1904118 119838 -86638 1229675 723082 -4133235 -10952171
3845a0952171l637767J514438L912906L237706K438490K352492J098645j624812
$$ -10952171 -14589938 -13075500 -9162594 -5924888 -3486398 -1133906 -35261 -1660073
3837a660073l377172k776294j331283m82797K93019J176489P50574j083730j652262
$$ -1660073 -5037245 -7813539 -9144822 -9627619 -9334600 -8158111 -7407537 -8491267 -10143529
3828a0143529N97241L056520K684683Q23205Q38052K311435J673539j592540l559328
$$ -10143529 -9546288 -6489768 -3805085 -2981880 -2143828 167607 1841146 248606 -3310722
3819c310722j665035J704725L151344K715567K178859J492412k43395j903972
$$ -3310722 -4975757 -3271032 -119688 2595879 4774738 6267150 6023755 4119783
3811D119783j508432M07938J250148j0983j937220l207216l800063l460453j415821
$$ 4119783 2611351 3019289 4269437 4258454 2321234 -885982 -4686045 -8146498 -9562319
3802i562319J565361K925282J454876p37746p79226J335746K923640J970039o76709
$$ -9562319 -7996958 -5071676 -3616800 -4354546 -5133772 -3798026 -874386 1095653 418944
3793D18944k336313j231641J629983L237529J744412j205386k184560l5030K921641
$$ 418944 -1917369 -3149010 -1519027 1718502 3462914 2257528 72968 37938 2959579
3784B959579L892707K413491l40717l361495n743001o137572l887017j59734L137263
$$ 2959579 6852286 9265777 8925060 5563565 -179436 -6317008 -10204025 -10363759 -7226496
3775g226496M982065M988847K768891r75929l738711l532870j495300l42408n63342
$$ -7226496 -2244431 2744416 5513307 4537378 798667 -2734203 -4229503 -4571911 -5135253
3766e135253k09350J492781K611283J456965p21278j272055O18695L238067M245818
$$ -5135253 -5344603 -3851822 -1240539 216426 -504852 -1776907 -1158212 2079855 6325673
3757F325673K627934n33764k738241k325183n09354j33895j843600k892432r36579
$$ 6325673 8953607 8419843 5681602 3356419 2847065 2713170 869570 -2022862 -2959441
3748b959441K316001L185095J056725j006010q09889L28973N78371P85068K334641
$$ -2959441 -643440 2541655 3598380 2592370 1782481 2111454 2689825 3474893 5809534
3739E809534L483296J248008l227701m921780j900284J346169J57920l457684
$$ 5809534 9292830 10540838 7313137 2391357 491073 1837242 1995162 -1462522
3731a462522m019635q29186J675778J412410J249920K859066L163901j7761l090663
$$ -1462522 -5482157 -6311343 -4635565 -3223155 -1973235 885831 4049732 4031971 941308
3722I41308j763428J928402K546335n03476k680972j669799o137J59893K53330
$$ 941308 -822120 1106282 3652617 3149141 468169 -1201630 -1207767 -1047874 -794544
3713g94544J683832K930350K273846M96803j055456k458259l365175j894258K158272
$$ -794544 889288 3819638 6093484 6590287 5534831 3076572 -288603 -2182861 -24589
3704b4589N185322L767201m84348k827633j460624Q04177P74168j390345l109977
$$ -24589 5160733 8927934 8443586 5615953 4155329 4959506 5733674 4343329 1233352
3695A233352k609346n51877J010795R97892M62828R87462K225471K236614L68616
$$ 1233352 -1375994 -1927871 -917076 80816 543644 1531106 3756577 5993191 6361807
3686F361807j651808j979875o09631J410287L121597L379038J249506k245276
$$ 6361807 4709999 2730124 2120493 3530780 6652377 10031415 11280921 9035645
3678I035645m371789l728085j566829N78801K415944L120928J016712k947223
$$ 9035645 4663856 935771 -631058 -52257 2363687 5484615 6501327 3554104
3670C554104m318035p87449L649261L776177M57981j370300o08772p36046k726893
$$ 3554104 -763931 -1551380 2097881 5874058 6332039 4961739 4352967 3616921 890028
3661H90028k800635R14483M236812K677337j909985l991157j709425J811723L400817
$$ 890028 -1910607 -996124 3240688 5918025 4008040 16883 -1692542 119181 3519998
3652C519998K818287J102712j056048k648735k316811k03736J446977P47640j368944
$$ 3519998 6338285 7440997 6384949 3736214 1419403 1215667 2662644 3410284 2041340
3643B041340k186196o11104J393226J284995p56950k087862j205422K55853P2732
$$ 2041340 -144856 -755960 637266 1922261 1165311 -922551 -2127973 -1872120 -1799388
3634a799388j158643q71264J589633L802345L353252O00959k214640l409291k785119
$$ -1799388 -2958031 -3829295 -2239662 1562683 4915935 5516894 3302254 -107037 -2892156
3625b892156j196031J21422N38497P40601J653671K666509K284459P11029q7026
$$ -2892156 -4088187 -3966765 -3428268 -2687667 -1033996 1632513 3916972 4628001 4540975
3616D540975M45885L40233j512291l022473k101396l60445o81814k245683j553234
$$ 4540975 4986860 5327093 3814802 792329 -1309067 -1669512 -2351326 -4597009 -6150243
3607f150243J679972L451937J436466j437024j507763L73859J070355M69050Q12981
$$ -6150243 -4470271 -1018334 418132 -1018892 -2526655 -2152796 -1082441 -613391 199590
3598A99590J729627J78267m055365o680006m555183j07380K241404J797732J043674
$$ 199590 1929217 2107484 -1947881 -8627887 -13183070 -13290450 -11049046 -9251314 -8207640
3589h207640J130303J220472J446056K900902M464680L104425j413469m976507
$$ -8207640 -7077337 -5856865 -4410809 -1509907 2954773 6059198 4645729 -330778
3581c30778m128984m61215K024166K142680J708021J699970J100371m96900j552770
$$ -330778 -4459762 -4920977 -2896811 -754131 953890 2653860 3754231 3257331 1704561
3572A704561o72647J404378K709941K184084M35418j140968j720679j711996j977064
$$ 1704561 1031914 2436292 5146233 7330317 7765735 6624767 4904088 3192092 1215028
3563A215028k391482j893988l16475Q73558N30119m38342n13326P3506l7876q60845
$$ 1215028 -1176454 -3070442 -3386917 -2513359 -1983240 -2421582 -2934908 -2861402 -2899278 -3760123
3553c760123r37732L27754J738735J941761Q32061p79214j838358j462804J45358
$$ -3760123 -4697855 -4370101 -2631366 -689605 142456 -636758 -2475116 -3937920 -3792562
3544c792562J316040P37860m78403j05177J852174K936287J747123k01768r59001
$$ -3792562 -2476522 -1738662 -2217065 -2322242 -470068 2466219 4213342 4011574 3052573
3535C052573p55034q85283j244247m80509J920677M799615O293666N100633J385145
$$ 3052573 2297539 1412256 168009 -312500 1608177 6407792 12701458 17802091 19187236
3526A9187236k917161n251826m600528k243355j63050P34739O49830M9018o56860
$$ 19187236 16270075 11018249 6417721 4174366 4011316 4746055 5395885 5444903 4788043
3517D788043j201135j621273j881681j424555l231J167298N00404j514723k563321
$$ 4788043 3586908 1965635 83954 -1340601 -1343832 -176534 323870 -1190853 -3754174
3508c754174j717853o38254o73029o62249Q30581K705631K772597R96202p45003
$$ -3754174 -5472027 -6110281 -6783310 -7445559 -6614978 -3909347 -1136750 -140548 -885551
3499h85551j468655j615242j244209M3908J384811J115290m95319j005374P52823
$$ -885551 -2354206 -3969448 -5213657 -5169749 -3784938 -2669648 -3164967 -4170341 -3417518
3490c417518K717419K427805M98736m19682N30889J455979O57358j089828k009294
$$ -3417518 -700099 1727706 2226442 1806760 2337649 3793628 4450986 3361158 1351864
3481A351864j926761k040835k498590j879689K93638J987980J114074j169989
$$ 1351864 -574897 -2615732 -5114322 -6994011 -6700373 -4712393 -3598319 -4768308
3473d768308j553384R23673L446044L353377J686774J209263K135179K000455
$$ -4768308 -6321692 -5398019 -1951975 1401402 3088176 4297439 6432618 8433073
3465H433073m24603l084480l165002n49157J984690J633487j593717m689764m528980
$$ 8433073 8008470 4923990 1758988 1209831 3194521 4828008 3234291 -1455473 -5984453
3456e984453j304332J442455Q94790j656074k683244j065830R29767J312309R55080
$$ -5984453 -7288785 -5846330 -4951540 -6607614 -9290858 -10356688 -9426921 -8114612 -7159532
3447g159532J592672K858863K878534J027675j393923k980693l407940k774166
$$ -7159532 -5566860 -2707997 170537 1198212 -195711 -3176404 -6584344 -9358510
3439i358510j030423J343270K928837K605740J109662N45425J900843L527533
$$ -9358510 -10388933 -9045663 -6116826 -3511086 -2401424 -1855999 44844 3572377
3431C572377K926457L0329k380365k184615p72756r42721k554544k476385O61844
$$ 3572377 6498834 6529163 4148798 1964183 1191427 248706 -2305838 -4782223 -4120379
3422d120379L931652L922419J381077k98332j98676n32601k177400k841591j075122
$$ -4120379 -188727 3733692 5114769 4816437 4617761 4085160 1907760 -933831 -2008953
3413b008953P27624j79347k317425j968745J201352L771401L720037K628870K011763
$$ -2008953 -1281329 -1460676 -3778101 -5746846 -4545494 -774093 2945944 5574814 7586577
3404G586577P83634j828541l702613k775594n92598J9534n28811L99888K820634
$$ 7586577 8370211 6541670 2839057 63463 -529135 -509601 -1038412 -638524 2182110
3395B182110L748221J964683p5759k18647K58827q06270k836606l450916j829101
$$ 2182110 5930331 7895014 7819255 7600608 7859435 7053165 4216559 765643 -1063458
3386a063458O19445K190849K054573J83647k415580l786432k687727j65872J466660
$$ -1063458 -444013 1746836 3801409 3985056 1569476 -2216956 -4904683 -5070555 -3603895
3377c603895J197577J39420j48910N31798J108783Q16555L09791P52848J729234
$$ -3603895 -2406318 -2266898 -2415808 -1884010 -775227 41328 351119 1103967 2833201
3368B833201J087326k065352n113703m658157j307757O56347q79084k758648r45308
$$ 2833201 3920527 1855175 -3258528 -7916685 -9224442 -8568095 -9447179 -12205827 -13151135
3359a3151135L819141O968730N835785K276470k31709l25585P52970J226141O88447
$$ -13151135 -9331994 -2363264 3472521 5748991 5517282 5191697 5944667 7170808 7859255
3350G859255J22911K15329J93417q63374k060465j645079J30191J165989R16558
$$ 7859255 7982166 8197495 8390912 7527538 5467073 3821994 3952185 5118174 6034732
3341F034732J140783K260910J802202j534341m790549m504287j640939K28570
$$ 6034732 7175515 9436425 11238627 9704286 4913737 409450 -1231489 -1002919
3333a002919J77349J09313P91501J151857R91428J055787P24563j002117k421055
$$ -1002919 -825570 -716257 75244 1227101 2218529 3274316 3998879 2996762 575707
3324E75707p46146K890029L913686P66667k730998k870638n40929J454573K337077
$$ 575707 -170439 2719590 6633276 7399943 4668945 1798307 1257378 2711951 5049028
3315E049028K511448J667064Q5908n77566p0905o69658l189725m533080k210760
$$ 5049028 7560476 9227540 9313448 8735882 8664977 7995319 4805594 272514 -1938246
3306a938246J127963J379257o58550q38416J446254K519237P28953r43306M4864
$$ -1938246 -810283 568974 -89576 -927992 518262 3037499 3766452 2823146 2868010
3297B868010J797208J224059j333107l136754l039083k096999j129497J53301
$$ 2868010 4665218 5889277 4556170 1419416 -1619667 -3716666 -4846163 -4692862
3289d692862J696240K432777J534856m25551j872586j525816O02580L127755M186463
$$ -4692862 -2996622 -563845 971011 545460 -1327126 -2852942 -2250362 877393 5063856
3280E063856K781502l38099k964141l030121o73677J415895Q04393j359159j388749
$$ 5063856 7845358 7507259 4543118 1512997 839320 2255215 3059608 1700449 311700
3271C11700J770840M380991K845576q77994j877999M76624J782762k88844k268781
$$ 311700 2082540 6463531 9309107 8431113 6553114 7029738 8812500 8523656 6254875
3262F254875o44767K143666J376514k272355l414150j34743L037240J784826k120049
$$ 6254875 5610108 7753774 9130288 6857933 3443783 3309040 6346280 8131106 6011057
3253F011057m054855k877156r46492L17055J359194J753331K09819k264425k487531
$$ 6011057 1956202 -920954 -1867446 -1550391 -191197 1562134 1771953 -492472 -2980003
3244b980003L38014K810367J820879j144000k197104j43731K629589L398063J361203
$$ -2980003 -2641989 168378 1989257 845257 -1351847 -1495578 1134011 4532074 5893277
3235E893277k516463n975389o368203l163807O62394J633510K9481p92136P42123
$$ 5893277 3376814 -2598575 -8966778 -12130585 -11468191 -9834681 -9805200 -10597336 -9855213
3226i855213K533952K318753Q08035Q2930N36963J022413J081248J421200K358510
$$ -9855213 -7321261 -5002508 -4194473 -4111543 -3574580 -2552167 -1470919 -49719 2308791
3217B308791K957795K087576l3962j717280j530634n5710Q26844N35130L51635
$$ 2308791 5266586 7354162 7320200 5602920 4072286 4016576 4843420 5378550 5730185
3208E730185P64182J56364k177361l670099j905906J072068J427536l94660n40490
$$ 5730185 6494367 6650731 4473370 803271 -1102635 -30567 1396969 1002309 461819
3199D61819J435765J654650j028417k377214Q4469K275316J21363l159592j813227
$$ 461819 1897584 3552234 2523817 146603 231072 2506388 2627751 -531841 -2345068
3190b345068K976580M459421M04021m015334m133255j521272l1939k00831j38039
$$ -2345068 631512 5090933 5494954 1479620 -2653635 -4174907 -4206846 -4407677 -4545716
3181d545716O88530J159268O58730l05633r61179q20605k9844N01696J16609n25282
$$ -4545716 -3857186 -2697918 -2039188 -2344821 -3306000 -4126605 -4156449 -3654753 -3538144 -4063426
3171d063426m09339K03148M08708L00957L26331j82448j655982k279968j34784
$$ -4063426 -4472765 -4269617 -3860909 -3559952 -3233621 -3416069 -5072051 -7352019 -7486803
3162g486803L110778L861000J924002O46606J286252J197343j062937k818591
$$ -7486803 -4376025 -515025 1408977 2055583 3341835 4539178 3476241 657650
3154F57650j784126j6989l73613j783676j421570M22502J109843J5266j126949
$$ 657650 -1126476 -1143465 -1517078 -3300754 -4722324 -4299822 -3189979 -3174713 -4301662
3145d301662j464661j689767j959743j761634j426488j428703p66407J517206
$$ -4301662 -5766323 -7456090 -9415833 -11177467 -12603955 -14032658 -14799065 -13281859
3137a3281859L847170L875273K248573J639199K218996J448265j221877k946041
$$ -13281859 -9434689 -5559416 -3310843 -1671644 547352 1995617 773740 -2172301
3129b172301k004237m58101l67634k61816J882848M264292L230369j130974m508394
$$ -2172301 -4176538 -4634639 -5002273 -5264089 -3381241 883051 4113420 2982446 -1525948
3120a525948l766666m44640J808722J378482p22385k887226m085456l684384j575599
$$ -1525948 -5292614 -5737254 -3928532 -2550050 -3272435 -6159661 -10245117 -13929501 -15505100
3111a5505100J316449L464838M043270L469901K540372J484494K22567q33902
$$ -15505100 -14188651 -10723813 -6680543 -3210642 -670270 814224 1036791 202889
3103B02889r05778J58530J507075K096929J520697n1403k106121l583947l204258
$$ 202889 -702889 -544359 962716 3059645 4580342 4528939 2422818 -1161129 -4365387
3094d365387r37427J219360J133556o90414j464946J92966K143494J501312j308089
$$ -4365387 -5302814 -4083454 -2949898 -3640312 -5105258 -4912292 -2768798 -1267486 -2575575
3085b575575l069473k268314r46203j144677j532267K72149L219750L661705P76089
$$ -2575575 -5645048 -7913362 -8859565 -10004242 -11536509 -11264360 -8044610 -4382905 -3606816
3076c606816j885483j540453q4131n84155k147026j573156J114120K629682J857498
$$ -3606816 -5492299 -7032752 -7116883 -7701038 -9848064 -11421220 -10307100 -7677418 -5819920
3067e819920J417135K741844L275196P77509k531146l098134j328662n07413j524986
$$ -5819920 -4402785 -1660941 1614255 2391764 -139382 -3237516 -4566178 -5073591 -6598577
3058f598577j986967m08786J712606K568574K342623J918014J123862o15330k968144
$$ -6598577 -8585544 -8994330 -7281724 -4713150 -2370527 -452513 671349 56019 -2912125
3049b912125m795030m900027k639224J204847M265140M646598L119989J826210
$$ -2912125 -7707155 -12607182 -15246406 -14041559 -9776419 -5129821 -2009832 -183622
3041a83622J032394p13671l073655l333194n36883K341265K356360O65261J80200
$$ -183622 848772 135101 -2938554 -6271748 -6808631 -4467366 -2111006 -1445745 -1265545
3032a265545Q02574Q4385k166887l306760k083318l95510J9894j6501P09826J594923
$$ -1265545 -462971 -378586 -2545473 -5852233 -7935551 -8331061 -8311167 -8327668 -7617842 -6022919
3022f022919J706164J445307J082036l18393k531111k924563l23361J851357k2796
$$ -6022919 -4316755 -2871448 -1789412 -2107805 -4638916 -7563479 -7886840 -6035483 -6058279
3013f058279l554571l073055J624264M387077J859705j658213j328224R95026
$$ -6058279 -9612850 -12685905 -11061641 -6674564 -4814859 -6473072 -7801296 -6806270
3005f806270J002018l99872O42400L211029K617495j239189k891121N7517L128156
$$ -6806270 -5804252 -6204124 -5561724 -2350695 266800 -972389 -3863510 -3805993 -677837
2996f77837K307706P6707N04125K423856J941785r62570k906197k633968j820529
$$ -677837 1629869 1706576 2210701 4634557 6576342 5613772 2707575 73607 -1746922
2987a746922j160922K74858J875318J449545r55349k280790o27987K040298K516204
$$ -1746922 -2907844 -2632986 -757668 691877 -263472 -2544262 -3172249 -1131951 1384253
2978A384253J68521k692486l307423j003614K049606K898093J287824M6638Q81378
$$ 1384253 1552774 -1139712 -4447135 -5450749 -3401143 -503050 784774 831412 1712790
2969A712790J573898l73594l043210k582017M05446J105265k307412n648036m531784
$$ 1712790 3286688 2913094 -130116 -2712133 -2306687 -1201422 -3508834 -9156870 -13688654
2960a3688654q2650L222457L111335R01033r23869o81106J645343M061137M205274
$$ -13688654 -13771304 -10548847 -7437512 -6536479 -7460348 -8141454 -6496111 -2434974 1770300
2951A770300K232821O20569N07982L60441p93749j414866m46964K86988q89458
$$ 1770300 4003121 4623690 5131672 5492113 4698364 3283498 2836534 3123522 2234064
2942B234064k189157r93094J645121K283326K36423j574169j018782N01376L53520
$$ 2234064 44907 -948187 696934 2980260 3216683 1642514 623732 1125108 1478628
2933A478628j934955m252739m155112j486763J033420P29608j276230j082891
$$ 1478628 -456327 -4709066 -8864178 -10350941 -9317521 -8587913 -9864143 -10947034
2925a0947034K337370N085953L946892J308465J154662K403161Q33089l349411
$$ -10947034 -8609664 -3523711 423181 1731646 2886308 5289469 6122558 2773147
2917B773147n086391k190599J428950K002758R68410J149078J636984J31232k161533
$$ 2773147 -2313244 -4503843 -3074893 -1072135 -103725 1045353 2682337 2813569 652036
2908F52036j991942P12162K690527K102850L93082o89235j227583j768179k053674
$$ 652036 -1339906 -627744 2062783 4165633 4558715 3869480 2641897 873718 -1179956
2899a179956j939127j870818j693251m71659J686637L027466K428995J173363
$$ -1179956 -3119083 -4989901 -6683152 -7154811 -5468174 -2440708 -11713 1161650
2891A161650J165984K128716K018849L0936k219613k808032j696276k66802M85127
$$ 1161650 2327634 4456350 6475199 6506135 4286522 1478490 -217786 -484588 539
2882E39N55582L50795L47998R02340J533859Q95489j398907l339053k505698N57277
$$ 539 556121 906916 1254914 2157254 3691113 4586602 3187695 -151358 -2657056 -2099779
2872b099779K787001K659463J622539Q27326p89400l421222m258359j532100J465662
$$ -2099779 687222 3346685 4969224 5796550 5007150 1585928 -2672431 -4204531 -2738869
2863b738869M46930k971484l110836J066258M186187K770029K25426N70250J655841
$$ -2738869 -2291939 -5263423 -8374259 -7308001 -3121814 -351785 -126359 443891 2099732
2854B099732p53634n132770n961594k320056P29539J7287j304788O92088M402784
$$ 2099732 1346098 -3786672 -9748266 -12068322 -11338783 -11321496 -12626284 -11934196 -7531412
2845g531412N031020J353227k837932l555964p34633K538673L424364J642141
$$ -7531412 -2500392 -1147165 -3985097 -7541061 -8275694 -5737021 -2312657 -670516
2837f70516p29481j353226J89669K180334K670764J339128n84000j760963j843973
$$ -670516 -1399997 -2753223 -2563554 -383220 2287544 3626672 3042672 1281709 -562264
2828e62264j447173j309013j403502r58488L55017J457344P63427j779440m152131
$$ -562264 -2009437 -3318450 -4721952 -5680440 -5325423 -3868079 -3104652 -4884092 -9036223
2819i036223m178947j737209J202665K569333K039652R99125Q05261J263685J134957
$$ -9036223 -13215170 -14952379 -13749714 -11180381 -9140729 -8141604 -7336343 -6072658 -4937701
2810d937701R4459n98601N8029J047200N77577j135546j749660N0315K435137
$$ -4937701 -4843242 -5441843 -5383814 -4336614 -3759037 -4894583 -6644243 -6593928 -4158791
2801d158791K538129J95189j617001l83349K694200L864502J238644k761105m046613
$$ -4158791 -1620662 -1425473 -3042474 -3425823 -731623 3132879 4371523 1610418 -2436195
2792b436195j595900J528084K092350M00934q51738m95550n9323j116608l003152
$$ -2436195 -4032095 -2504011 -411661 -10727 -862465 -1358015 -1417338 -2533946 -5537098
2783e537098l832932k819740p84972J094916K234751K529962K062405J190820
$$ -5537098 -9370030 -12189770 -12974742 -11879826 -9645075 -7115113 -5052708 -3861888
2775c861888N78994O82095J100759Q11593n40347j819746j592161j25621P73520
$$ -3861888 -3282894 -2600799 -1500040 -688447 -1228794 -3048540 -4640701 -4766322 -3992802
2766c992802K53728l86739K35166J461479J787455J270230J084031J181921L16451
$$ -3992802 -3739074 -4125813 -3890647 -2429168 -641713 628517 1712548 2894469 3210920
2757C210920j561458k755768k138542m90755R55813J820050J848453N57009j389296
$$ 3210920 1649462 -1106306 -3244848 -3735603 -2779790 -959740 888713 1445722 56426
2748E6426j942508k34140J726154J491222l97791j100594O33221K827771K797725
$$ 56426 -1886082 -2120222 -394068 1097154 699363 -401231 231990 3059761 5857486
2739E857486J67149l027621m445037l231726l48777K279008L117753K043200K52367
$$ 5857486 6024635 2997014 -1448023 -4679749 -5028526 -2749518 368235 2411435 2663802
2730B663802r20013j243038j566398k333255k412590l27904L137381M853741K939058
$$ 2663802 1743789 500751 -1065647 -3398902 -5811492 -6139396 -3002015 1851726 4790784
2721D790784n67949k176554j387945p35265j683350k762598k190455k78511J529649
$$ 4790784 4222835 2046281 658336 -76929 -1760279 -4522877 -6713332 -6991843 -5462194
2712e462194K288243J572141l56442j838510j298524k752q13482l331016l498935
$$ -5462194 -3173951 -1601810 -1958252 -3796762 -5095286 -5098038 -5911520 -9242536 -12741471
2703a2741471J38382L255853J853186j545263j850408Q20019K236967J493468
$$ -12741471 -12603089 -9347236 -7494050 -9039313 -10889721 -10069702 -7832735 -6339267
2695f339267J710859L346082K682617j301675l852486j336592K818132K886939
$$ -6339267 -4628408 -1282326 1400291 98616 -3753870 -5090462 -2272330 614609
2687F14609j168581m432006m143774k190785r37971l8038J856149M416194N780045
$$ 614609 -553972 -4985978 -9129752 -11320537 -12258508 -12296546 -10440397 -6024203 -244158
2678b44158M585096J486622j147040j502798n03860p12470k666407l887520k517431
$$ -244158 4340938 5827560 4680520 3177722 2673862 1961392 -705015 -4592535 -7109966
2669g109966j64197N97329M4353K85694J360119J126334q98641k199260p48785
$$ -7109966 -7274163 -6676834 -6632481 -6346787 -4986668 -3860334 -4758975 -6958235 -7707020
2660g707020K017985L144693K063896J052328J883511L270636K435555j158718
$$ -7707020 -5689035 -2544342 -480446 571882 2455393 5726029 8161584 7002866
2652G002866m735565n371122l314721j036271L21998J730168L584799M385832
$$ 7002866 2267301 -3103821 -6418542 -7454813 -7132815 -5402647 -1817848 2567984
2644B567984K924836J22953k283199l464054l126586j194228J024685J227430
$$ 2567984 5492820 5615773 3332574 -131480 -3258066 -4452294 -3427609 -2200179
2636b200179p76778k072200m85270K276546L302439K507894J567075N69778j165360
$$ -2200179 -2976957 -5049157 -5534427 -3257881 44558 2552452 4119527 4689305 3523945
2627C523945k262850r15445J243578O93905k441572m201332k801846j045305j254647
$$ 3523945 1261095 345650 1589228 2283133 -158439 -4359771 -7161617 -8206922 -9461569
2618i461569j415728J146545M933519O075575L506163k22308k431835k502048
$$ -9461569 -10877297 -9730752 -4797233 1278342 4784505 4562197 2130362 -371686
2610c71686j167926M08806R80947M7970j533824k413406j935149k02912K101630
$$ -371686 -1539612 -1130806 -149859 -101889 -1635713 -4049119 -5984268 -6187180 -4085550
2601d085550L437217K202205j122769l642590l120233p14777N40766m91743k000371
$$ -4085550 -648333 1553872 431103 -3211487 -6331720 -7046497 -6505731 -6997474 -8997845
2592h997845j793096N0070J352566L85147j924538k745639p58661J921764K479398
$$ -8997845 -10790941 -10740871 -9388305 -9003158 -10927696 -13673335 -14431996 -12510232 -10030834
2583a0030834J388759J590990L729535M815845K629994q82664k242203p48790
$$ -10030834 -8642075 -7051085 -3321550 1494295 4124289 3241625 999422 250632
2575B50632J489307K447176J534478o41737k320717j662936P25532J771557N5769
$$ 250632 1739939 4187115 5721593 5079856 2759139 1096203 1821735 3593292 3649061
2566C649061j742794o66068J914309K326962J15028j687438j395000n25455m90008
$$ 3649061 1906267 1240199 3154508 5481470 5596498 3909060 2514060 1988605 1498597
2557A498597m96281J99519M69482p25032k254509k265596p46162O17326P04950
$$ 1498597 1002316 1201835 1671317 946285 -1308224 -3573820 -4319982 -3702656 -2997706
2548b997706K06114N79585K039864K892270J527313r93955j808350k86434P47769
$$ -2997706 -2791592 -2212007 -172143 2720127 4247440 3253485 1445135 1158701 1906470
2539A906470p38627k634387j950725M30684J458890R68522J199252K030462J101030
$$ 1906470 1167843 -1466544 -3417269 -2986585 -1527695 -559173 640079 2670541 3771571
2530C771571j168854j330472J179228K411438J90497k233919j592941K03517j79111
$$ 3771571 2602717 1272245 2451473 4862911 5053408 2819489 1226548 1430065 1250954
2521A250954j745890j329117P75694J679516R49859M80944J94576j694629m194112
$$ 1250954 -494936 -1824053 -1048359 631157 1581016 2061960 2256536 561907 -3632205
2512c632205l690740M65388M238807M251149J867223K81345L6845n07278j914901
$$ -3632205 -7322945 -6857557 -2618750 1632399 3499622 3780967 3817812 3310534 1395633
2503A395633k937672k398647n36077J246903J572195N77890R8959J318900K611808
$$ 1395633 -1542039 -3940686 -4476763 -3229860 -1657665 -1079775 -980816 338084 2949892
2494B949892J473027j516588k974613j512137K24058l82742k026445j646211J059636
$$ 2949892 4422919 2906331 -68282 -1580419 -1356361 -1739103 -3765548 -5411759 -4352123
2485d352123L556068M097347L257681K083668O97018r09856k109838k283427j508866
$$ -4352123 -796055 3301292 6558973 8642641 9339659 8429803 6319965 4036538 2527672
2476B527672l21355O94992J003093L63354q27350j750294j796419q87439O22773
$$ 2527672 2206317 2901309 3904402 4267756 3440406 1690112 -106307 -993746 -370973
2467c70973K118942K930905K599537J065954j096440k518298j888168K14146J135206
$$ -370973 1747969 4678874 7278411 8344365 7247925 4729627 2841459 3055605 4190811
2458D190811p07223l024711k124183J783968M292383K645705p56202k298719j999361
$$ 4190811 3483588 458877 -1665306 118662 4411045 7056750 6300548 4001829 2002468
2449B002468j920379j936726m85147J688436K192447J033341M56448P13250k43201
$$ 2002468 82089 -1854637 -2339784 -651348 1541099 2574440 3030888 3744138 3500937
2440C500937k168486j692325K101633M939492L019992j394211l289101j733640
$$ 3500937 1332451 -359874 1741759 6681251 9701243 8307032 5017931 3284291
2432C284291P8893J94989m17952r24017j647816j934993m54990J674808J294351
$$ 3284291 3363184 3558173 3140221 2216204 568388 -1366605 -1821595 -146787 1147564
2423A147564k041430m586099l395479l93782O34605p29452j670308l82222K084699
$$ 1147564 -893866 -5479965 -8875444 -9269226 -8634621 -9364073 -11034381 -11416603 -9331904
2414i331904L783668L828067K502012Q25411J0330L82682R94658R84075P64825
$$ -9331904 -5548236 -1720169 781843 1607254 1617584 2000266 2994924 3978999 4743824
2405D743824J010708J133344m9138k457291m565834m892521l120146l27868J385528
$$ 4743824 5754532 6887876 6838738 4381447 -184387 -5076908 -8197054 -8524922 -7139394
2396g139394N79138j416090j424780J320023L468015J957340j452863k616158
$$ -7139394 -6560256 -7976346 -9401126 -8081103 -4613088 -2655748 -4108611 -6724769
2388f724769p12963J573169K704939L369806L164143N93481k737431k487395J783161
$$ -6724769 -7437732 -5864563 -3159624 210182 3374325 3967806 1230375 -1257020 526141
2379E26141M584683K168262j670359j601861P06770m44808n077954p003094l276135
$$ 526141 5110824 7279086 5608727 4006866 4713636 4268828 -809126 -7812220 -11088355
2370a1088355J589232K678790J071555L51661O39654k02850j920781k299403j100345
$$ -11088355 -9499123 -6820333 -5748778 -5397117 -4757463 -4960313 -6881094 -9180497 -10280842
2361a0280842k03316k46612L534R53310J390553P70162J67076L10608L92798l42733
$$ -10280842 -10484158 -10730770 -10727236 -9773926 -8383373 -7613211 -7446135 -7135527 -6742729 -7085462
2351g085462j134724p55636P60368K188196K476049J616053M92333O8183M62728
$$ -7085462 -8220186 -8975822 -8215454 -6027258 -3551209 -1935156 -1442823 -1374640 -911912
2342i11912Q87959P57575M26421K90233j48634j219417j690692j05632K600774
$$ -911912 -23953 733622 1160043 1450276 1301642 82225 -1608467 -1714099 886675
2333H86675L738342K544449J227260J349825J246298j077591m063591m272266
$$ 886675 4625017 7169466 8396726 9746551 10992849 9915258 5851667 1579401
2325A579401j392345J124275P67632j107701j968237j563933j212080j249559
$$ 1579401 187056 1311331 2078963 971262 -996975 -2560908 -3772988 -5022547
2317e022547j064931o95482n45731j19966J137846K154208J403483k73405k65709
$$ -5022547 -6087478 -6782960 -7328691 -7448657 -6310811 -4156603 -2753120 -3026525 -3292234
2308c292234J832358L066515J201386j932925l003691j749774p93214j514319
$$ -3292234 -1459876 1606639 2808025 875100 -2128591 -3878365 -4671579 -6185898
2300f185898k407288j681509M44919K580245L740192L488249J889366P7570l62517
$$ -6185898 -8593186 -10274695 -9829776 -7249531 -3509339 -21090 1868276 1945846 1583329
2291A583329N61317R54798k56902j510993q64112Q89579J198233m66100j753178
$$ 1583329 2144646 3099444 2842542 1331549 467437 1357016 2555249 2089149 335971
2282C35971p68819J394657K379427J603308L62484l73893q52774j355317j511994
$$ 335971 -432848 961809 3341236 4944544 5307028 4933135 4080361 2725044 1213050
2273A213050j264929j414915k300002k663741j153499J237597J818643j00625
$$ 1213050 -51879 -1466794 -3766796 -6430537 -7584036 -6346439 -4527796 -4628421
$$ [...]
##END NTUPLES=NMR SPECTRUM
##END=
