##TITLE=31P_DE-80H_X3
 64 sc D2O
 26.2.2025
##JCAMPDX= 6.0         $$ Bruker NMR JCAMP-DX V2.0
##DATA TYPE= NMR SPECTRUM
##DATA CLASS= NTUPLES
##ORIGIN= UXNMR, Bruker Analytische Messtechnik GmbH
##OWNER= root
$$ XWIN-NMR		Version 3.5
$$ Mon May 12 16:07:18 2025 Russian Standard Time (UT+4h)  Yarkov@DPX200
##.OBSERVE FREQUENCY= 81.013821
##.OBSERVE NUCLEUS= ^31P
##.ACQUISITION MODE= SIMULTANEOUS
##.ACQUISITION SCHEME= undefined
##.AVERAGES= 64
##.DIGITISER RES= 17
##SPECTROMETER/DATA SYSTEM= spect
##.PULSE SEQUENCE= zgpg30
##.SOLVENT NAME= DMSO
##.SHIFT REFERENCE= (INTERNAL, DMSO, 0, 198.062)
##AUDIT TRAIL= $$ (NUMBER, WHEN, WHO, WHERE, WHAT)
$$ ##TITLE= Audit trail, XWIN-NMR		Version 3.5
$$ ##JCAMPDX= 5.01
$$ ##ORIGIN= Bruker BioSpin GmbH
$$ ##OWNER= Yarkov
$$ C:/Bruker/XWIN-NMR/data/yarkov2/nmr/P31/2/pdata/1/auditp.txt
$$ ##AUDIT TRAIL=  $$ (NUMBER, WHEN, WHO, WHERE, WHAT)
(   1,<2025-05-12 16:06:21.06 +0400>,<Yarkov>,<DPX200>,
      <created by zg, POWCHK disabled, PULCHK disabled
       configuration hash MD5:
       00 E9 B6 7A A2 85 ED C7 34 08 36 98 17 FE 4E 26
       data hash MD5: 32K
       42 77 B7 64 EE 5B 3C 93 46 1E C0 D4 9B 4B 78 30>)
(   2,<2025-05-12 16:06:31.64 +0400>,<Yarkov>,<DPX200>,
      <Start of raw data processing
       efp BC_mod = 2 LB = 1.5 FT_mod = 6 PKNL = 1 PHC0 = 1796.481 PHC1 = -5.904567 SI = 64K 
       data hash MD5: 64K
       FF E1 0F DE D2 F5 BF 6E EE 62 10 E3 65 AC 81 C0>)
(   3,<2025-05-12 16:06:56.14 +0400>,<Yarkov>,<DPX200>,
      <pk PHC0 = 10.34941 PHC1 = 15 
       data hash MD5: 64K
       21 32 0B 88 F0 77 D1 10 85 3A AF C1 DF 5E F3 74>)
$$ ##END=
$$ 
$$ hash MD5
$$ 2E 95 26 30 BB 2C FC C1 F6 6B DC 4C ED B3 70 68
##$RELAX= 
##$RELAX= 
##$RELAX= 
##$RELAX= 
##$RELAX= 
##$RELAX= 
##$RELAX= 
##$RELAX= 
$$ Bruker specific parameters
$$ --------------------------
##$DU= <C:/Bruker/XWIN-NMR>
##$EXPNO= 2
##$NAME= <P31>
##$PROCNO= 1
##$TYPE= <nmr>
##$USER= <yarkov2>
##$AMP= (0..31)
100 100 100 100 100 100 100 100 100 100 100 100 100 100 100 100 100 100 
100 100 100 100 100 100 100 100 100 100 100 100 100 100 
##$AQSEQ= 0
##$AQ_mod= 1
##$AUNM= <au_zg>
##$AUTOPOS= <>
##$BF1= 81.014009
##$BF2= 200.13
##$BF3= 200.13
##$BF4= 200.13
##$BF5= 200.13
##$BF6= 200.13
##$BF7= 200.13
##$BF8= 200.13
##$BYTORDA= 1
##$CFDGTYP= 0
##$CFRGTYP= 5
##$CHEMSTR= <none>
##$CNST= (0..31)
1 1 145 1 1 1 1 1 1 1 1 1 1 1 1 1 1 1 1 1 1 1 1 1 1 1 1 1 1 1 1 1 
##$CPDPRG= <waltz16>
##$CPDPRG1= <>
##$CPDPRG2= <waltz16>
##$CPDPRG3= <>
##$CPDPRG4= <mlev>
##$CPDPRG5= <mlev>
##$CPDPRG6= <mlev>
##$CPDPRG7= <mlev>
##$CPDPRG8= <mlev>
##$CPDPRGB= <>
##$CPDPRGT= <>
##$D= (0..31)
0 1 0 0 0 0 0 0 0 0.06 0 0.03 2e-05 3e-06 0 0 0.0002 0 0 0 0 0 0 0 0 0 
0 0 0 0 0 0 
##$DATE= 1747051580
##$DBL= (0..7)
120 120 120 11 120 120 24 19 
##$DBP= (0..7)
150 150 150 150 150 150 150 150 
##$DBP07= 0
##$DBPNAM0= <>
##$DBPNAM1= <>
##$DBPNAM2= <>
##$DBPNAM3= <>
##$DBPNAM4= <>
##$DBPNAM5= <>
##$DBPNAM6= <>
##$DBPNAM7= <>
##$DBPOAL= (0..7)
$$ [...]
##$SUBNAM2= <"">
##$SUBNAM3= <"">
##$SUBNAM4= <"">
##$SUBNAM5= <"">
##$SUBNAM6= <"">
##$SUBNAM7= <"">
##$SUBNAM8= <"">
##$SUBNAM9= <"">
##$SW= 400.765351723535
##$SWIBOX= (0..15)
0 1 3 0 0 0 0 0 0 0 0 0 0 0 0 0 
##$SW_h= 32467.5324675325
##$TD= 32768
##$TD0= 1
##$TE= 0
##$TE2= 300
##$TE3= 300
##$TEG= 300
##$TL= (0..7)
0 120 53 12 22 120 120 120 
##$TP= (0..7)
150 150 150 150 150 150 150 150 
##$TP07= 0
##$TPNAME0= <>
##$TPNAME1= <>
##$TPNAME2= <>
##$TPNAME3= <>
##$TPNAME4= <>
##$TPNAME5= <>
##$TPNAME6= <>
##$TPNAME7= <>
##$TPOAL= (0..7)
0.5 0.5 0.5 0.5 0.5 0.5 0.5 0.5 
##$TPOFFS= (0..7)
0 0 0 0 0 0 0 0 
##$TUNHIN= 0
##$TUNHOUT= 0
##$TUNXOUT= 0
##$USERA1= <user>
##$USERA2= <user>
##$USERA3= <user>
##$USERA4= <user>
##$USERA5= <user>
##$V9= 5
##$VALIST= <valist>
##$VCLIST= <CCCCCCCCCCCCCCC>
##$VD= 0
##$VDLIST= <DDDDDDDDDDDDDDD>
##$VPLIST= <PPPPPPPPPPPPPPP>
##$VTLIST= <TTTTTTTTTTTTTTT>
##$WBST= 1024
##$WBSW= 4
##$XGAIN= (0..3)
0 0 0 0 
##$XL= 0
##$YL= 0
##$YMAX_a= 3593
##$YMIN_a= -20032
##$ZGOPTNS= <>
##$ZL1= 120
##$ZL2= 120
##$ZL3= 120
##$ZL4= 120
##$ABSF1= 0
##$ABSF2= 0
##$ABSG= 0
##$ABSL= 0
##$ALPHA= 0
##$AQORDER= 0
##$ASSFAC= 0
##$ASSFACI= 0
##$ASSFACX= 0
##$ASSWID= 0
##$AUNMP= <proc_1d>
##$AZFE= 0.1
##$AZFW= 0.5
##$BCFW= 0
##$BC_mod= 2
##$BYTORDP= 0
##$COROFFS= 0
##$CY= -3
##$DATMOD= 1
##$DC= 0
##$DFILT= <>
##$DTYPP= 0
##$F1P= 0
##$F2P= 0
##$FCOR= 1
##$FTSIZE= 65536
##$FT_mod= 6
##$GAMMA= 0
##$GB= 0
##$INTBC= 1
##$INTSCL= 9.790993e-09
##$ISEN= 30
##$LB= 1.5
##$LEV0= 0
##$LPBIN= 0
##$MAXI= 10000
##$MC2= 0
##$MEAN= 0
##$ME_mod= 0
##$MI= 50
##$NCOEF= 0
##$NC_proc= -8
##$NLEV= 6
##$NOISF1= 182.463
##$NOISF2= 159.3651
##$NSP= 0
##$NTH_PI= 0
##$NZP= 0
##$OFFSET= 198.0616
##$PC= 4
##$PHC0= 1806.83
##$PHC1= 9.095433
##$PH_mod= 1
##$PKNL= yes
##$PPARMOD= 0
##$PSCAL= 0
##$PSIGN= 0
##$REVERSE= no
##$SF= 81.0140089999434
##$SI= 65536
##$SIGF1= 159.3651
##$SIGF2= -187.1042
##$SINO= 113.3802
##$SIOLD= 16384
##$SREGLST= <1H.CDCl3>
##$SSB= 0
##$STSI= 65536
##$STSR= 0
##$SW_p= 32467.5324675325
##$SYMM= 0
##$S_DEV= 0
##$TDeff= 32768
##$TDoff= 0
##$TI= <>
##$TILT= no
##$TM1= 0
##$TM2= 0
##$TOPLEV= 0
##$USERP1= <user>
##$USERP2= <user>
##$USERP3= <user>
##$USERP4= <user>
##$USERP5= <user>
##$WDW= 1
##$XDIM= 65536
##$YMAX_p= 88396896
##$YMIN_p= -434119215
$$ End of Bruker specific parameters
$$ ---------------------------------
##NTUPLES= NMR SPECTRUM
##VAR_NAME=  FREQUENCY,     SPECTRUM/REAL,   SPECTRUM/IMAG
##SYMBOL=    X,             R,               I
##VAR_TYPE=  INDEPENDENT,   DEPENDENT,       DEPENDENT
##VAR_FORM=  AFFN,          ASDF,            ASDF
##VAR_DIM=   65536,         65536,           65536
##UNITS=     HZ,            ARBITRARY UNITS, ARBITRARY UNITS
##FACTOR=    0.49542278885378, 1,            1
##FIRST=     16045.7642231865, 0,            0
##LAST=      -16421.768244346, 0,            0
##MIN=       -16421.768244346, -434119215,   0
##MAX=       16045.7642231865, 88396896,     0
$$ Real data points
##PAGE= N=1
##DATA TABLE= (X++(R..R)), XYDATA
$$ [...]
##PAGE= N=2
##DATA TABLE= (X++(I..I)), XYDATA
6763E573926j687592r96867O4744P75132J667346J847776J03219k136468k221827
6754B989389l67414N89649n82592k289027l203441l722545l773763k084458J037059
6745a1407143K729990J362523o06359J02732K679350L231368L57064k903997l248339
6736g702811j091424P70206R42912L94795L86232Q15368N91541r64195k983159
6727h840535l316531p93496K643282L486537J024555j493301j238353M99649R36484
6718g091709K78527O21602J592993Q65530j138978j109088J666589L564119K218718
6709A468303L03273J040208K907515K234388r14860l085199k629352j183232l66440
6700b25396q8409j84542j001670j931923j600276l7220J124830J035068O56288
$$ plain form
6763 5573926 3886334 2889467 2954211 3729343 5396689 7244465 7347684 5211216 2989389
6754 2989389 2621975 3211624 2629032 340005 -2863436 -6585981 -10359744 -12444202 -11407143
6745 -11407143 -8677153 -7314630 -7920989 -7818257 -5138907 -1907539 -1550475 -4454472 -7702811
6736 -7702811 -8794235 -8024029 -7081117 -6686322 -6300090 -5484722 -4893181 -5857376 -8840535
6727 -8840535 -12157066 -12950562 -10307280 -6820743 -5796188 -7289489 -8527842 -8028193 -7091709
6718 -7091709 -6813182 -6191580 -4598587 -3733057 -4872035 -5981123 -4314534 -750415 1468303
6709 1468303 1771576 2811784 5719299 7953687 7038827 3953628 1324276 141044 -225396
6700 -225396 -313805 -498347 -1500017 -3431940 -5032216 -5069436 -3944606 -2909538 -2253250
6691b253250J075270K101505K798503K360520M93467k073318l653063l102786
6683b253152r47474J534978L335389L212638J22297m342937o107432l548377k48476
6674i242546K7603j106610K3882K316986J642601j399385j542546K480642N300201
6665a499172L180484m51470j003558M21475K29573j341913j670928q43049p49710
6656c728268j031835k88238K75922j114843k425344l59824L320521L277596j156983
6647c231296m406830k855633K12666M68454q88569r0188K685315M048152L082782
6638i75147K085434K021907J156994j176385k802194k060138k94538P25743J626048
6629C07724L394815M235026J451220l951801p458998o425435k966500n03188N30173
$$ plain form
6691 -2253250 -1177980 923525 3722028 6082548 6576015 4502697 849634 -2253152
6683 -2253152 -3200626 -1665648 1669741 4882379 5004676 661739 -5445693 -8994070 -9242546
6674 -9242546 -9214943 -10321553 -10297671 -7980685 -6338084 -7737469 -9280015 -6799373 -1499172
6665 -1499172 1681312 1229842 226284 647759 877332 -464581 -2135509 -2978558 -3728268
6656 -3728268 -4760103 -5048341 -4772419 -5887262 -8312606 -8672430 -5351909 -2074313 -3231296
6647 -3231296 -7638126 -10493759 -10281093 -9812639 -10701208 -10791396 -8106081 -4057929 -975147
6638 -975147 1110287 3132194 4289188 3112803 310609 -1749529 -2044067 -1318324 307724
6629 307724 3702539 7937565 9388785 5436984 -2022014 -8447449 -11413949 -11917137 -11386964
6620a1386964J949780M201212N401587L715566m27959m348940n054825k026928
6612g977471J664892K417770N94617j23201J449472J958888p06961l048709j149645
6603d920348K459489K219371j589802l193509n45526J813933N89952j339364o26895
6594e132699R62379M78385p41224J42385K181891K520819J389448J027714J314245
6585D143343N67065o14389l27323Q19824P62023o3527J56769K98706k367433o562476
6575c187418p362386l130711J995978L928115L280286K563573K144379J279377
6567A511193N36209O78162Q42601l4424j197763j231805l04688J87750m21762
6558E65473j467429j810660q77799N43766O67438j054628k466230j213206J597027
$$ plain form
6620 -11386964 -9437184 -5235972 165615 3881181 3453222 -895718 -5950543 -7977471
6612 -7977471 -6312579 -3894809 -3300192 -3423393 -1973921 -15033 -721994 -3770703 -4920348
6603 -4920348 -2460859 -241488 -1831290 -5024799 -5570325 -3756392 -3166440 -4505804 -5132699
6594 -5132699 -4170320 -3691935 -4433159 -4290774 -2108883 411936 1801384 2829098 4143343
6585 4143343 4710408 4096019 3768696 4588520 5350543 5287016 5443785 5742491 3375058 -3187418
6575 -3187418 -10549804 -13680515 -11684537 -7756422 -4476136 -1912563 231816 1511193
6567 1511193 2047402 2725564 3568165 3533741 2335978 1104173 799485 987235 565473
6558 565473 -901956 -2712616 -3590415 -3046649 -2379211 -3433839 -5900069 -7113275 -5516248
6549e516248K580950J056876R2752J676897L514054K365706j333510m119536l695203
6540c377262j039123J027960O13801j270651j487630J354947M345018L657515
6532C824575J030k342475j858784j313845k171909k072222J7540P98126j654482
6523f772446l340284l17299L989122L301129j550854l584502l25604K858057J431352
6514d311329k006348k735389o91821J083823J505044J573001J667972J680256
6506b234791K183411L005431K317193m65220k700011k174959j000824k528862
6498c598632n595804n694114j678090K518337L599211K902412L173334M182844
6490a90502L729108J228287j779390l690271l816496k196771J63997J619790J621931
$$ plain form
6549 -5516248 -2935298 -1878422 -1785670 -108773 3405281 5770987 4437477 317941 -3377262
6540 -3377262 -4416385 -3388425 -2774624 -4045275 -5532905 -4177958 167060 3824575
6532 3824575 3825605 1483130 -375654 -1689499 -3861408 -5933630 -5916090 -5117964 -6772446
6523 -6772446 -10112730 -10430029 -6440907 -3139778 -4690632 -8275134 -8600738 -5742681 -4311329
6514 -4311329 -6317677 -9053066 -9744887 -8661064 -7156020 -5583019 -3915047 -2234791
6506 -2234791 -51380 2954051 5271244 4806024 2106013 -68946 -1069770 -3598632
6498 -3598632 -9194436 -14888550 -16566640 -14048303 -10449092 -7546680 -4373346 -190502
6490 -190502 3538606 4766893 2987503 -702768 -4519264 -6716035 -6552038 -4932248 -3310317
6481c310317J315783J431552Q87166j051030k621025j745465N44287J318665j2856
6472c243240j201403q63654m4041L18285P61365J244682L98949j761785k857642
6463g248484j646452j66161k39164k03831J961431M251604L123063o57639k701051
6454c526684j493263j92861j071431j994087l63787K496130L452916K039653L38893
6445c14521k59412P1110R63588J940455J780305j63177k340826k541212r15550
6436a779240K26491k85392j017054k24356J692863K842634K289431J094903R37659
6427E777939J997588K521075Q51522k237589m018421k920068l96964Q42722k09102
6418B208702k305696l663205l378092j563867R87728L219053M289106L724145
$$ plain form
6481 -3310317 -1994534 -562982 324184 -726846 -3347871 -5093336 -4549049 -3230384 -3243240
6472 -3243240 -4444643 -5308297 -5352338 -5034053 -4272688 -3028006 -2629057 -4390842 -7248484
6463 -7248484 -8894936 -9061097 -9300261 -9504092 -7542661 -3291057 -167994 -825633 -3526684
6454 -3526684 -5019947 -5212808 -6284239 -8278326 -8642113 -6145983 -2693067 -653414 -314521
6445 -314521 -573933 -502823 460765 2401220 4181525 4018348 1677522 -863690 -1779240
6436 -1779240 -1552749 -1838141 -2855195 -3079551 -1386688 1455946 3745377 4840280 5777939
6427 5777939 7775527 10296602 11148124 8910535 4892114 1972046 1575082 2417804 2208702
6418 2208702 -96994 -3760199 -7138291 -8702158 -7714430 -4495377 -206271 3517874
6410C517874J410767j805213l759996k723709N4274J204226l94859j799955j36904
6401d433495K984652L517424O31902k285440k318455k65117J449676J957449J807969
6392C046565J200749m9443j427831j904496j138739J72370J041740R18628n3166
6383A806377j104341j375851p44984l0657j44558j056934j718968j092242O40007
6374d822151J977084J584621n9219j017050j49794J521641K101533R44693r20547
6365A160811j910566r89627J555111L765356L319480K06976k652839k667929p69915
6356A016858J00779q64673j616001o34487R65220J411235P32410J78184K75278
6347A564803N90745P86331Q52863N45995n29617k120217l078671k318570j63717
$$ plain form
6410 3517874 4928641 3123428 -636568 -3360277 -3306003 -2101777 -2496636 -4296591 -4433495
6401 -4433495 -1448843 2068581 2700483 415043 -1903412 -2168529 -718853 1238596 3046565
6392 3046565 4247314 4197871 2770040 865544 -273195 -100825 940915 1859543 1806377
6383 1806377 702036 -673815 -1418799 -1449456 -1594014 -2650948 -4369916 -5462158 -4822151
6374 -4822151 -2845067 -1260446 -1319665 -2336715 -2486509 -964868 1136665 2081358 1160811
6365 1160811 -749755 -1739382 -184271 3581085 6900565 7107541 4454702 1786773 1016858
6356 1016858 1117637 252964 -1363037 -1997524 -1032304 378931 1111341 1289525 1564803
6347 1564803 2155548 2941879 3794742 4340737 3811120 1690903 -1387768 -3706338 -3870055
6338c870055J501230J053958p92261j633895n24178P31332M22869k85093P00760
6329b695333K639138K743038O79106n04952J123339L364832K991179J58378k164249
6320H334476k207042j067100p04062j610295k542232k003578j31290R81538k44369
6311a193954k224526j831921Q78677J967423q10997m052769l066345J319231L754720
6302e260461J850359r19171o73622J678475K635188J227074n52020j262895j393906
6293b670979j349512l03933K132446M416362M300847J229587k991371n729552
6285i66105n568371l177315m83543J077798J550306J671828J500626N46932p41580
6276d589424p61247J115873K954020K236554o08663k244509o81551J883487J859759
$$ plain form
6338 -3870055 -2368825 -1314867 -2107128 -3741023 -4265201 -3533869 -3111000 -3396093 -2695333
6329 -2695333 -56195 2686843 3365949 2860997 3984336 7349168 10340347 10498725 8334476
6320 8334476 6127434 5060334 4356272 2745977 203745 -1799833 -1931123 -949585 -1193954
6311 -1193954 -3418480 -5250401 -4371724 -2404301 -3215298 -7268067 -10334412 -9015181 -5260461
6302 -5260461 -3410102 -4329273 -5002895 -3324420 -689232 537842 -14178 -1277073 -2670979
6293 -2670979 -4020491 -4324424 -2191978 2224384 6525231 7754818 4763447 -966105
6285 -966105 -6534476 -9711791 -10195334 -9117536 -7567230 -5895402 -4394776 -3847844 -4589424
6276 -4589424 -5350671 -4234798 -1280778 955776 347113 -1897396 -2578947 -695460 1164299
6267A164299r42331l075055j922259J331016L718642L976139K969812J748302
6259H968565O39631n2178J17028Q18764P79658q23078l124851m287054l459827
6250d23342j665317n61031o17073q98184m97075M38785J270966J792766K115434
6241I55929K142107J723463R53878j31909j543417k476445j485722J336760L331779
6232D806423K192939o49023j666991q4327J354570Q23176p8157N32937J663617
6223H895164J408342J88712k48892K36837N52941O56761J053477P51491j607674
6214A1887159m776362n745839l904540j866518j489299j510129l12383J223423
6206f494488J436866P68701P50504J081888K9743k393458l745700k268303P56329
$$ plain form
6267 1164299 221968 -2853087 -4775346 -3444330 274312 4250451 7220263 8968565
6259 8968565 9608196 9556018 9673046 10491810 11271468 10448390 7323539 3036485 -423342
6250 -423342 -2088659 -2649690 -3266763 -4164947 -4662022 -4223237 -2952271 -1159505 955929
6241 955929 3098036 4821499 5775377 5643468 4100051 1623606 137884 1474644 4806423
6232 4806423 6999362 6350339 4683348 4599021 5953591 6776767 6698610 7231547 8895164
6223 8895164 10303506 10492218 10243326 10480163 11033104 11689865 12743342 13494833 11887159
6214 11887159 7110797 1364958 -2539582 -4406100 -5895399 -7405528 -7717911 -6494488
6206 -6494488 -5057622 -4288921 -3538417 -2456529 -2426786 -4820244 -8565944 -10834247 -10077918
6197a0077918K618384K240449P69629k06731J8256J412922L388301M515722L232152
6188G911166k09425l148614l073894o13525J154322M23027j494762k324733j590245
6179b966683n33552k66751q20288j376404q78198Q89782K471203K026211j41516
6170a596196j725847j666439j431280j996367j758229N49132K874038K575187
6162d176001O69232J21321Q79048L53716j416240j264973J558153L341134J364974
6153A430364j833721k180805L40229K467359K355252R06535n08019j298700j186313
6144D92181l68376J50302l26907j207682j603545j443608q70160J96730J070905
6135c910160N14843j000946j154001P51230K269662J522515J33757K19456Q17459
$$ plain form
6197 -10077918 -7459534 -5219085 -4449456 -4656187 -4637931 -3225009 163292 4679014 7911166
6188 7911166 7701741 4553127 1479233 865708 2020030 2443057 948295 -1376438 -2966683
6179 -2966683 -3500235 -3766986 -4587274 -5963678 -6841876 -5952094 -3480891 -1454680 -1596196
6170 -1596196 -3322043 -4988482 -6419762 -8416129 -10174358 -9625226 -6751188 -4176001
6162 -4176001 -3506769 -3385448 -2506400 -2152684 -3568924 -4833897 -3275744 65390 1430364
6153 1430364 -403357 -2584162 -2243933 223426 2578678 3485213 2977194 1678494 492181
6144 492181 123805 274107 -52800 -1260482 -2864027 -4307635 -5177795 -4981065 -3910160
6135 -3910160 -3395317 -4396263 -5550264 -4799034 -2529372 -1006857 -873100 -653644 163815
6126A63815K01393n51036P4051J35215k775042n959735m274325J738616N680363
6117e566685M223654J133569O00308J465297Q90745n33715j002207j445415l256581
6108c491030m530217k691785P74951K215266J298869P46581J301203J031687l26406
6099c670881l33954J903574L844131L347928J677619R04954N27273j172542l736687
6090C291415m740578l102049n35701N91583q6087r35829o28466K55406L88236
6081e502070j3461O49989K577530L470097J443769k053113l771769k398673P01914
6072d895787L631838N019149L734695j7355l479941l687684j327399Q7406p03704
6063a638782j129890P01406K681634J890278r15711k429514j310535O76425J535075
$$ plain form
6126 163815 365208 -185828 -111777 23438 -2751604 -8711339 -12985664 -11247048 -5566685
6117 -5566685 -1343031 -209462 390846 1856143 2746888 2213173 1210966 -234449 -3491030
6108 -3491030 -8021247 -10713032 -9938081 -7722815 -6423946 -5677365 -4376162 -3344475 -3670881
6099 -3670881 -4004835 -2101261 1742870 5090798 6768417 7673371 8200644 7028102 3291415
6090 3291415 -1449163 -4551212 -5086913 -4495330 -4581417 -5517246 -6145712 -5890306 -5502070
6081 -5502070 -5515531 -4865542 -2288012 1182085 2625854 572741 -3199028 -5597701 -4895787
6072 -4895787 -1263949 3755200 7489895 7472540 3992599 304915 -1022484 -935078 -1638782
6063 -1638782 -2768672 -2067266 614368 2504646 1588935 -840579 -2151114 -1474689 60386
6054F0386J141524N73714P39045J663617K286918J324565r23735k342698j508349
6045C014987L93571J242329O49350l96973j565367k994438l673419k200086P19051
6036d810995K428977J499366o83595j937545j632713n97546J69067K35195P8476
6027e251313Q20194K608761L455434J298923k647576m618701l077131p12030l65480
6018h488919r87746J78434K805596L747286J876975j12301M10271K462494L214289
6009E106379J920937L83046P3415M79630M41212j89864q19692j175879j312290
6000D906894j033732k10031M43530j80305k019213l410833k775978m04256J854125
5991b829799K387461J018064j094355k261825j542828J09618N34162r76902k414275
$$ plain form
6054 60386 1201910 1775624 2514669 4178286 6465204 7789769 6866034 4523336 3014987
6045 3014987 3408558 4650887 5300237 4903264 3337897 343459 -3329960 -5530046 -4810995
6036 -4810995 -2382018 -882652 -1566247 -3503792 -5136505 -5734051 -5564984 -5329789 -5251313
6027 -5251313 -4431119 -1822358 1633076 2931999 284423 -4334278 -7411409 -8123439 -8488919
6018 -8488919 -9476665 -9298231 -6492635 -2745349 -868374 -980675 -570404 1892090 5106379
6009 5106379 7027316 7410362 7483777 7963407 8404619 8214755 7395063 6219184 4906894
6000 4906894 3873162 3663131 4106661 3926356 1907143 -1503690 -4279668 -4683924 -2829799
5991 -2829799 -442338 575726 -518629 -2780454 -4323282 -4213664 -3679502 -4656404 -7070679
5982g070679j697977J58958N07514o01624j77078K874014N371552M174732P23248
5973D262660j223372q37588k45093k26858N81655K059580J769651r27345k985860
5964B227430j952837K97683O17296n30737k96639J533534K160949M49073j242186
5955C263566q69737L06425J36014j013132j194461J3591J261999J598446J160798
5946D663509J56031j163108j722462o01729J050237Q38508j525472l334458k467698
5937d106642n13555o20316k887883l901280j225066L231720N379403L627635K48703
5928g67281j646532j354278n08729o04290j365494j533733p23240J7600k93664
5919h779641q79318P7540K576256L716583J020434l447021m448596o2528N126335
$$ plain form
5982 -7070679 -8768656 -8609698 -8102184 -8703808 -8880886 -6006872 -635320 3539412 4262660
5973 4262660 3039288 2201700 1956607 1729749 2311404 4370984 6140635 5213290 2227430
5964 2227430 274593 572276 1189572 658835 362196 1895730 4056679 4505752 3263566
5955 3263566 2393829 2700254 2836268 1823136 628675 642266 1904265 3502711 4663509
5946 4663509 4819540 3656432 1933970 1332241 2382478 3220986 1695514 -1638944 -4106642
5937 -4106642 -4620197 -5240513 -8128396 -12029676 -13254742 -10023022 -4643619 -1015984 -767281
5928 -767281 -2413813 -3768091 -4276820 -4881110 -6246604 -7780337 -8503577 -8485977 -8779641
5919 -8779641 -9658959 -9581419 -7005163 -3288580 -2268146 -5715167 -10163763 -10226291 -5099956
5910e099956N352896R67954k325191j260601J154278P14429j964150k975103r78090
5901f413534J437762J865355Q86867K65300M03656O13552N70676M14839J10631
5892A55104m45913j014532j200846q94383l89750k34823p22872j206055m76655
5883f430725J452114K640987J527341n68499q45406J187363L056104K702367Q05513
5874E527159p86461j312004j049753n10990n25711j801164l589926m112568l009440
5865a1170858j832973j335384k09936K175230L798544K707748K13489p74142M84062
5856e944220K424629L718072L845555K229860q34354l213048l304808k574847
5848c653161l131971l703270j359903L103037N360467L773882J679234J987493
$$ plain form
5910 -5099956 252940 1220894 -1104297 -2364898 -1210620 -496191 -2460341 -5435444 -6413534
5901 -6413534 -4975772 -3110417 -2223550 -1958250 -1554594 -941042 -370366 44473 155104
5892 155104 -290809 -1305341 -2506187 -3400570 -3790320 -4025143 -4748015 -5954070 -6430725
5883 -6430725 -4978611 -2337624 -810283 -1378782 -2224188 -1036825 2019279 4721646 5527159
5874 5527159 4740698 3428694 2378941 1867951 1342240 -458924 -4048850 -8161418 -11170858
5865 -11170858 -13003831 -14339215 -14549151 -12373921 -8575377 -5867629 -5654140 -6428282 -5944220
5856 -5944220 -3519591 198481 4044036 6273896 5439542 2226494 -1078314 -3653161
5848 -3653161 -6785132 -10488402 -11848305 -8745268 -3384801 389081 2068315 4055808
5840D055808K917365J446303j633174l000046j690447l4256k20899j840587k721687
5831b721620j191795K130331M368991L189707r3075j715051k90001J523358J116838
5822F317683n86978j375995j257858j406384j360266o7548J340594P25009j466071
5813H62186k405031q03588J559185K487439J704181K33015r94356j563792j700465
5804f21226j964128k041000o31431K205562L795222J998541j355148k763411k064382
5795c441401k008951l058519k454167N74588K550717R62397j383646l20134L410170
5786e168946N228308L085594m79315k483996k734552k326329j432655M2207J125804
5777e143880O40994j042890k128920j321910P11921J929586J092630o29340p73908
$$ plain form
5840 4055808 6973173 8419476 6786302 3786256 2095809 2061553 1840654 67 -2721620
5831 -2721620 -3913415 -1783084 2585907 5775614 5682539 3967488 3677487 5200845 6317683
5822 6317683 5730705 4354710 3096852 1690468 330202 262654 1603248 2328257 862186
5813 862186 -1542845 -2346433 -787248 1700191 3404372 3637387 2643031 1079239 -621226
5804 -621226 -2585354 -4626354 -5257785 -3052223 742999 2741540 1386392 -1377019 -3441401
5795 -3441401 -5450352 -8508871 -10963038 -10388450 -7837733 -6875336 -8258982 -8579116 -5168946
5786 -5168946 59362 3144956 2665641 181645 -2552907 -4879236 -6311891 -6269684 -5143880
5777 -5143880 -4502886 -5545776 -7674696 -8996606 -8284685 -6355099 -5262469 -5891809 -6665717
5768f665717J367219L573959L344113R85501j121992j782403j827514j774540
5760c901374o36708K077708M741658N302589L674929J262174j042777k977581
5752H500618l727466k443496M6631J647240J456447N11182k00003r38356j793828
5743C058969j653116J47940K202248K436927N59059j933542l469532l120280o39411
5734b410738K661727L928622J643710j861837k813997q46083P12108l25438k179200
5725a491126k061748J7157J760585J526225m72049k785199l516943j644574J400058
5716g267614K621049R98614j077505j091206K48858N49729n57852j320229r05021
5707g801177m31333q30072j360699p79886J046444L126327M315841M089029K728760
$$ plain form
5768 -6665717 -5298498 -1724539 1619574 2605075 1483083 -299320 -2126834 -3901374
5760 -3901374 -4538082 -2460374 2281284 7583873 11258802 12520976 11478199 8500618
5752 8500618 4773152 2329656 2376287 4023527 5479974 5991156 5791153 4852797 3058969
5743 3058969 1405853 1553793 3756041 6192968 6752027 4818485 1348953 -1771327 -2410738
5734 -2410738 250989 4179611 5823321 3961484 1147487 301404 1013512 688074 -1491126
5725 -1491126 -3552874 -3535717 -1775132 -248907 -720956 -3506155 -7023098 -8667672 -7267614
5716 -7267614 -4646565 -3647951 -4725456 -5816662 -5567804 -5018075 -5575927 -6896156 -7801177
5707 -7801177 -8232510 -9062582 -10423281 -11203167 -10156723 -7030396 -2714555 1374474 4103234
5698D103234Q82294j048995k787786l670784l123856j672091m66506K21959Q29967
5689f732564J000574J09111o54212P92653L733373M610447J973910j251739k152945
5680A428608j621528j542371j218966K83225R56073j087930l411346k363365R95401
5671g582199K433787J092291K3946O45513J160404O18149K51145L45789k42918
5662a254093j102962p04148Q2138q00050j862475L01171M122830L675602k113728
5653C44285o799764n704409k168070r02750n74830K134548N585359N931448L702701
5644A548518K173979J490106l02651k207108j595868N42744P66939r84394j459736
5635b7471K33736J508429R60058J656m92370j280639j952483o93311K264927M063622
$$ plain form
5698 4103234 4985528 3936533 1148747 -2522037 -5645893 -7317984 -7784490 -7562531 -6732564
5689 -6732564 -5731990 -5622879 -6277091 -5484438 -1751065 2859382 4833292 3581553 1428608
5680 1428608 -192920 -1735291 -2954257 -2671032 -1714959 -2802889 -6214235 -8577600 -7582199
5671 -7582199 -5148412 -4056121 -4032175 -3386662 -2226258 -1608109 -1356964 -1011175 -1254093
5662 -1254093 -2357055 -3061203 -2979065 -3779115 -5641590 -5340419 -1217589 2458013 344285
5653 344285 -6455479 -12159888 -14327958 -15230708 -15805538 -13670990 -8085631 -2154183 1548518
5644 1548518 3722497 5212603 4909952 2702844 1106976 1649720 2416659 1432265 -27471
5635 -27471 206265 1714694 2674752 2676408 2184038 903399 -1049084 -1742395 522532 4586154
5625D586154K977617K39379k285378l709393l304014r17074J446392J231613j004094
5616g38798k069620n79647J644932K785553K835664J894993l48418k698119k804810
5607g8270m53102J805705K065141R47918l52535j509043k054214j405841m35404
5598a469645o06533j221810k04599K083142K897144J540447L76258N05276L2399
5589C932079j866170k742034q91511J576970K119400J455437J399922J539022
5581F523115P57534r5075K47567J093916J327716J313049J004705j290090n340706
5572E541731o888352l072655K137844K621958j019810k464293N62064L040342
5564D58829P83967l163089l450315k70399J681562L65745j426891r22549Q80283
$$ plain form
5625 4586154 7563771 7803150 5517772 1808379 -1495635 -2412709 -966317 265296 -738798
5616 -738798 -2808418 -3388065 -1743133 1042420 3878084 5773077 5424659 2726540 -78270
5607 -78270 -531372 1274333 3339474 4287392 3934857 2425814 371600 -1034241 -1469645
5598 -1469645 -2076178 -3297988 -3502587 -1419445 1477699 3018146 3394404 3899680 3932079
5589 3932079 2065909 -676125 -1567636 9334 2128734 3584171 4984093 6523115
5581 6523115 7280649 7185574 7433141 8527057 9854773 11167822 12172527 10882437 5541731
5572 5541731 -1346621 -4419276 -2281432 340526 -679284 -3143577 -2581513 458829
5564 458829 1242796 -1920293 -5370608 -5641007 -3959445 -3593700 -5020591 -5943140 -5062857
5555e062857J366427Q8564j169758j108301j76415O29861R64328R30242P47027
5546b790882J007828K167439L140294J812359j702778l747584j400636K767668
5538A253708L313866n82397l684859k010588J773298K651486K46130j722385j256921
5529a8662J51547R12786J183460J211491O10764k50478l69439K095l84304j391843
5519A657417j519852n98467j06184k64853N45342K378364K508622l54811k997754
5510A247824j707105K101627L544727J146136j334699o88911J245164Q53383j663296
5501D744850k792694j058678R73521N71518j514638k573900j670091k71179J40240
5492c451051m60740j360184j944154j691127m12542J236473K287011K607072K725403
$$ plain form
5555 -5062857 -3696430 -3607866 -4777624 -5885925 -6062340 -5432479 -4468151 -3537909 -2790882
5546 -2790882 -1783054 384385 3524679 5337038 3634260 -113324 -1513960 1253708
5538 1253708 4567574 3985177 300318 -1710270 63028 2714514 2960644 1238259 -18662
5529 -18662 132885 1045671 2229131 3440622 4051386 3800908 3431469 3433564 3049260 1657417
5519 1657417 137565 -460902 -567086 -831939 -286597 2091767 4600389 4245578 1247824
5510 1247824 -459281 1642346 5187073 6333209 4998510 4309599 5554763 6408146 4744850
5501 4744850 1952156 893478 1866999 2438517 923879 -1650021 -3320112 -3591291 -3451051
5492 -3451051 -3911791 -5271975 -7216129 -8907256 -9319798 -8083325 -5796314 -3189242 -463839
5483d63839K542559J313632q56480k617650k931037k057478n91656J311352L021930
5474a328667K975319M56240k762461l922679k363510j02097P34272K19268R5747
5465e998568J474607L467039M063675K282577o42431k383654j802741J28448J620180
5456B209132J833005J219531N18286j85627j306959k742953l372745k203825k6241
5447d058396J054354K45531p75516k18439J267018J634845K93810j461430k268413
5438d286636j590474M52925K564645K466270l59450k920710k127407P25411J763144
5429c312282L48862m40641O93696J348775J65828n12462J077296K665634J621732
5420C656438o76132j213406M6445R76657J022599J133233J284843Q79017M96279
$$ plain form
5483 -463839 2078720 3392352 2535872 -81778 -3012815 -5070293 -5661949 -4350597 -1328667
5474 -1328667 1646652 2102892 -659569 -4582248 -6945758 -7047855 -6313583 -6094315 -5998568
5465 -5998568 -4523961 -1056922 3006753 5289330 4646899 2263245 460504 588952 2209132
5456 2209132 4042137 5261668 5779954 5594327 4287368 1544415 -1828330 -4032155 -4058396
5447 -4058396 -3004042 -2758511 -3534027 -3752466 -2485448 -850603 -556793 -2018223 -4286636
5438 -4286636 -5877110 -5424185 -2859540 -393270 -752720 -3673430 -5800837 -5075426 -3312282
5429 -3312282 -2963420 -3404061 -2710365 -1361590 -1195762 -1708224 -630928 2034706 3656438
5420 3656438 2980306 1766900 1813345 2790002 3812601 4945834 6230677 7109694 7605973
5411G605973O99332K96865j648473l413688k973801j417945r47710p76450J296624
5402a279273L985513L364092r88469m473221l390592M69264K649557J424864j047901
5393G13834j798162k66291J193710J80343k169654k016007J616871M460261K803349
5384D718254o00093m91514K442995K276124k784275p082257n554534o07598K083308
5375e599590J362138N87266J740323L141575K716275R07888k47780K57387J289645
5366F155127J053445l97825j024267j1263K62479k426437n895748n751139j639536
5357i675164K073637K393616J008113M08019K37062n03770p07813P17661K173626
5348a875013J469510q45066k430005k208528p46367J008400J760877K66927k598494
$$ plain form
5411 7605973 8305305 8602170 6953697 3540009 566208 -851737 -1799447 -2575897 -1279273
5402 -1279273 2706240 6070332 5081863 608642 -2781950 -2312686 336871 1761735 713834
5393 713834 -1084328 -1350619 -156909 23434 -2146220 -4162227 -2545356 1914905 4718254
5384 4718254 4118161 3626647 6069642 8345766 5561491 -1520766 -7075300 -7682898 -5599590
5375 -5599590 -4237452 -3650186 -1909863 1231712 3947987 4855875 4608095 4865482 6155127
5366 6155127 7208572 6810747 5786480 5775217 6037696 3611259 -2284489 -8035628 -9675164
5357 -9675164 -7601527 -5207911 -4199798 -3791779 -3554717 -4058487 -4766300 -4048639 -1875013
5348 -1875013 -405503 -1250569 -3680574 -5889102 -6635469 -5627069 -3866192 -3599265 -6197759
5339f197759l834577k105758K52389P81513K84950M64344O14774k68185l07199
5330a0315508K372201N067696L432256j380293l319595p9753L422974K320460
5322A520438j337573k196173N89093L004960K486290O81392l85596j460326l657307
5313g54802n287787l742620K49817K882868K182802M36331N90220K149018K549955
5304A255802J236951j36369q96223j882654k703574j516680J403605K723452N56410
5295D0720k305235j959651J391302M190241M308673K549023J30432k526552m433664
5286A385289m012149j313896J384277K048736Q86134n74664j277961r88874J25502
5277b337606J474692K136646J610595L25656q41707j395189j491251j561917j715975
$$ plain form
5339 -6197759 -10032336 -12138094 -11885705 -11104192 -10819242 -10354898 -9740124 -10008309 -10315508
5330 -10315508 -7943307 -2875611 556645 -823648 -4143243 -4222996 -800022 1520438
5322 1520438 182865 -2013308 -1424215 1580745 4067035 4748427 4362831 2902505 -754802
5313 -754802 -6042589 -9785209 -9535392 -6652524 -4469722 -4033391 -3443171 -1294153 1255802
5304 1255802 2492753 2356384 1460161 -422493 -3126067 -4642747 -3239142 -515690 40720
5295 40720 -2264515 -4224166 -2832864 1357377 5666050 8215073 8345505 5818953 1385289
5286 1385289 -2626860 -3940756 -2556479 -507743 378391 -196273 -1474234 -2463108 -2337606
5277 -2337606 -862914 1273732 2884327 3209983 2368276 973087 -518164 -2080081 -3796056
5268c796056j523101n71018Q10829J770799J863642J261788J55990j220821j970407
5259c218355j088912R72186K442947K485376K163792K504938K872472K265283
5251A1399727J014956p8250j218348k712709l505112k431779m88664L4627j295563
5242G18885k470233j929998n40144k0233n71575r80170m29079O72844J442166
5233d107537J395714N40002q16069j976924k012284p46846M40296j63871k108739
5224i556258k648361k00611L042259L567883R97190j757967k420895j337463L33641
5215i980582J961774K580805J209265j086602j781736n21513K88037l43207j18613
5206g792372K333422M308337K973075J17571n57609O76970L30052k288507l786577
$$ plain form
5268 -3796056 -5319157 -5890175 -5079346 -3308547 -1444905 -183117 -27127 -1247948 -3218355
5259 -3218355 -4307267 -3335081 -892134 1593242 3757034 6261972 9134444 11399727
5251 11399727 12414683 12336433 11118085 8405376 4900264 2468485 1979821 2014448 718885
5242 718885 -1751348 -3681346 -4221490 -4241723 -4813298 -5793468 -6222547 -5549703 -4107537
5233 -4107537 -2711823 -2171821 -2987890 -4964814 -6977098 -7723944 -7283648 -7447519 -9556258
5224 -9556258 -12204619 -12405230 -9362971 -5795088 -4797898 -6555865 -8976760 -10314223 -9980582
5215 -9980582 -8018808 -5438003 -4228738 -5315340 -7097076 -7618589 -7330552 -7673759 -7792372
5206 -7792372 -5458950 -1150613 1822462 1940033 1382424 2059394 2389446 100939 -3685638
5197c685638j983491Q90163J593668L3564j479259j492899m90053M38610R13831
5188e261504J441035K519641L518947L055763J046500o19266n92352j84078j279516
5179C645170l050465l043988j174814J5054m86352l67040K235606N122100M328010
5170G223281o10646n584337o431680l329044R1271J290260J157530J597670K373271
5161b222424J894416K97303m73805K75378J077783J048678J276128K335167K593469
5152H102093P11905j887973k907620k139996q40298M16107J362803R70077j049206
5143B737892k738733k068228K38686J933006K235699J660384J78799j999688k942417
5134g64600j066605J916720K755290R47843j115640j809151j597146j144851o32599
$$ plain form
5197 -3685638 -5669129 -4778966 -3185298 -3151734 -4630993 -6123892 -6613945 -6175335 -5261504
5188 -5261504 -3820469 -1300828 2218119 5273882 6320382 5701116 5108764 4924686 3645170
5179 3645170 594705 -2449283 -3624097 -3609043 -4095395 -4462435 -2226829 2895271 7223281
5170 7223281 6612635 1028298 -5403382 -8732426 -8641155 -7350895 -6193365 -4595695 -2222424
5161 -2222424 -328008 -30705 -504510 -229132 848651 1897329 3173457 5508624 8102093
5152 8102093 8813998 6926025 4018405 1878409 1038111 1454218 2817021 3787098 2737892
5143 2737892 -841 -2069069 -1830383 102623 2338322 3998706 4177505 2177817 -764600
5134 -764600 -1831205 85515 2840805 3788648 2673008 863857 -733289 -1878140 -2510739
5125b510739o84333j591791j956607m95456J272470P46296j710669l113593j974825
5116a2019247N14217K933546M393643L438471l50364l847145l246111K66617J562277
5107f354096j017739l367568k110134O82882J568690J003175J461284K798817
5099e334689K826216J194814k16781l05276J10802P5157j68819J52817J146286
5090e19473J934804J509326M3430j087125j113226q62218j029340p43619N14321
5081a353120R98619q09711k920228k169998P23259J901789J67069j568017j228570
5072f258908l91303q67445j663478j124550L36235J334085J444258Q07237l87317
5063f771186j110862j19959J803096K195249K74093j939911k443469j266130O49451
$$ plain form
5125 -2510739 -3195072 -4786863 -6743470 -7238926 -5966456 -5220160 -6930829 -10044422 -12019247
5116 -12019247 -11505030 -8571484 -4177841 -739370 -1089734 -4936879 -8182990 -7916373 -6354096
5107 -6354096 -7371835 -10739403 -12849537 -12166655 -10597965 -9594790 -8133506 -5334689
5099 -5334689 -2508473 -1313659 -1530440 -1835716 -1724914 -1649757 -1818576 -1665759 -519473
5090 -519473 1415331 2924657 2968087 1880962 767736 -94482 -1123822 -1867441 -1353120
5081 -1353120 -354501 -1164212 -4084440 -6254438 -5531179 -3629390 -3462321 -5030338 -6258908
5072 -6258908 -6650211 -7517656 -9181134 -10305684 -9969449 -8635364 -7191106 -6383869 -6771186
5063 -6771186 -7882048 -8002007 -6198911 -4003662 -3729569 -5669480 -8112949 -9379079 -8729628
5054h729628K396018K672816Q12540j457597j719350m39401j40285j046653q16726
5045h468266J140285K623727K501572K021663J541177k76394k974827l817957
5037e709020k055118l7506J012491K374672L813646K717543r02352l065083j818549
5028c669276k64167j018064k044333j109238j43171j405260k898097j624941J346436
5019a2830111K747195J758377k13612k040800k563702n05797K792558L548232
5011g307660R13400j146813J18647K133368J821464M71915K93158J53050j273986
5002c823457j929991j72475J463354N95054n52345N22777J619281J03238j607588
4993c782152k81119J874023R95625j542705k062427j410422k423975l307462n96070
$$ plain form
5054 -8729628 -6333610 -3660794 -2848254 -4305851 -6025201 -6464602 -6604887 -7651540 -8468266
5045 -8468266 -7327981 -4704254 -2202682 -181019 1360158 1083764 -1891063 -5709020
5037 -5709020 -7764138 -7801644 -6789153 -4414481 -600835 2116708 1214356 -1850727 -3669276
5028 -3669276 -3933443 -4951507 -6995840 -8105078 -8248249 -9653509 -12551606 -14176547 -12830111
5019 -12830111 -10082916 -8324539 -8538151 -10578951 -13142653 -13648450 -10855892 -7307660
5011 -7307660 -6394260 -7541073 -7422426 -5289058 -3467594 -2995679 -2702521 -2549471 -3823457
5002 -3823457 -5753448 -5925923 -4462569 -3867515 -4419860 -3897083 -2277802 -2174564 -3782152
4993 -3782152 -4063271 -2189248 -1193623 -2736328 -4798755 -6209177 -8633152 -11940614 -12536684
4984a2536684L266937K666034j913654m365065k189745J343412L782606N542514
4976d403645N525405J579991l950197n481836k148929J072550J109219J87470
4968f509972M84215P83767l9577q80845j122549j477421j371008N42403K928895
4959f662092K969778J102256K98579P69537M7076j756840j811612M2782P96673
4950d203863k84669n68759R08742J957115J490254Q91565N70834n93408k014013
4941a846202j768745l29194J86000J43545J384224K719130J371722j553268k216795
4932a909583m00209M30707q33135j941463j969217j938302j352869P75961K381973
4923f756137J080927r28519k63625J300185J35300j927242p80956J773689J006106
$$ plain form
4984 -12536684 -9269747 -6603713 -8517367 -12882432 -15072177 -13728765 -9946159 -4403645
4976 -4403645 1121760 2701751 -1248446 -6730282 -8879211 -7806661 -6697442 -6509972
4968 -6509972 -6025757 -5241990 -5281567 -6162412 -7284961 -8762382 -10133390 -9590987 -6662092
4959 -6662092 -3692314 -2590058 -2291479 -1521942 -1474866 -3231706 -5043318 -5000536 -4203863
4950 -4203863 -4488532 -5057291 -4148549 -2191434 -701180 190385 761219 167811 -1846202
4941 -1846202 -3614947 -3944141 -3758141 -3614596 -2230372 488758 1860480 307212 -1909583
4932 -1909583 -2309792 -1879085 -2712220 -4653683 -6622900 -8561202 -9914071 -9138110 -6756137
4923 -6756137 -5675210 -6603729 -6867354 -5567169 -5431869 -7359111 -8140067 -6366378 -5360272
4914e360272j746823j647136K38988n85957k395189m10842K390586p70917p031595
4905a7319157o883452j95862L755795K412161K413233N196447M516977O8643j036403
4896g071618J485869L35991l898636k689357K812030J900302m996635n275991
4888a7398045K246913M101726k294140l517094K602885J124578r191491q971916
4880c1296584M654622P175708q711668j4580754J920279Q430108r890532k640020
4872d4938841P0794185J48698487J27049722P454282r2145195q9927195l2363282
4865I4622163m626075j5231926j9005420n253398j269120j2261550j4841026l190776
4857A8942872L703101l67423j306345M386051L652039n355756q112955p12140
$$ plain form
4914 -5360272 -7107095 -8754231 -8515243 -9101200 -11496389 -11907231 -9516645 -10287562 -17319157
4905 -17319157 -24202609 -24398471 -20642676 -18230515 -15817282 -10620835 -6103858 -6035215 -7071618
4896 -7071618 -5585749 -5249758 -9148394 -11837751 -9025721 -7125419 -12122054 -17398045
4888 -17398045 -15151132 -11049406 -13343546 -16860640 -14257755 -13133177 -22324668 -31296584
4880 -31296584 -26641962 -19466254 -28177922 -42758676 -40838397 -32408289 -42298821 -44938841
4872 -44938841 25855344 174553831 301603553 309057835 216912640 126985445 94622163
4865 94622163 89996088 74764162 55758742 50505344 49236224 36974674 22133648 18942872
4857 18942872 22645973 22278550 20972205 25358256 29010295 23654539 15541584 14829444
4849A4829444L113572k765444p079360k766707J715871k76501k544370J72460
4841D398965K584761M63518j270065R59651K398016j06450j766467M95230J900518
4832A0057677p60715k734953l24707K128680M26137j904974n05019J930334J032839
4823I345299j381657j032589J395676K109511L86268j675547k976292l313234
4815B857435j946597O41230J876631M82500j539147k151924j857619j387528J06780
4806b918239K557162L574510J772596q67740j904855j529128j016915k64771J229380
4797F32000K634624K841266K117415J417967R37682K46310q18980j880510k210114
4788E917660j320610K26334J250679J554375J833718J659477k52639k912475l131746
$$ plain form
4849 14829444 17943016 15177572 8098212 5331505 7047376 6770875 4226505 4398965
4841 4398965 6983726 7447244 6177179 7136830 9534846 9428396 7661929 8157159 10057677
4832 10057677 9296962 6562009 6237302 8365982 8792119 6887145 6382126 8312460 9345299
4823 9345299 7963642 6931053 8326729 10436240 10822508 9146961 6170669 2857435
4815 2857435 910838 1552068 3428699 3911199 2372052 220128 -1637491 -3025019 -2918239
4806 -2918239 -361077 3213433 4986029 4118289 2213434 684306 -332609 -597380 632000
4797 632000 3266624 6107890 8225305 9643272 10580954 10827264 10008284 8127774 5917660
4788 5917660 4597050 4823384 6074063 7628438 9462156 11121633 10868994 7956519 4824773
4779D824773m05827J477929M7180k064160j936185j281767k525770l492232j068003
4770f424062K597357L065295P26304n63236j40781j13986M8184K253746M278742
4761E727563K153077k383709l494216m34947J546463R0870j334722o99643p94985
4752C75751l029790m004290j292794K423103L872905L457661K550251P82601j606760
4743C528638k628523j833715j156924j106544n8827J715711J922593R87656J626056
4734B996121K733382L6881n450829o776576j895867K095666l7098l456568j770421
4725a1525309K568983L382485J215099Q87627K152287Q51271k532120l208875
4717f208552m20255J434288K97586q85065K08920K081505K865354K778555K234218
$$ plain form
4779 4824773 4418946 5896875 5944055 3879895 1943710 661943 -1863827 -5356059 -6424062
4770 -6424062 -3826705 -761410 -35106 -598342 -739123 -853109 -804925 1448821 5727563
4761 5727563 7880640 5496931 2002715 1567768 3114231 3205101 1870379 1170736 375751
4752 375751 -2654039 -6658329 -7951123 -5528020 -1655115 1802546 4352797 5135398 3528638
4743 3528638 900115 -933600 -2090524 -3197068 -3255895 -1540184 382409 1370065 2996121
4734 2996121 5729503 5766384 315555 -6461021 -8356888 -6261222 -6298320 -9754888 -11525309
4725 -11525309 -8956326 -5573841 -4358742 -3471115 -1318828 -467557 -2999677 -6208552
4717 -6208552 -6628807 -5194519 -4896933 -5781998 -5573078 -3491573 -626219 2152336 4386554
4708D386554J017220j11135j39392k28083k222983m883386m994959k239718M46950
4699h968932J434724J845945K264835J614620m8219r87836q57559j157945j777536
4690f637903l79728L356425N921850M398636M77760j911278j352101M61851J583247
4681E918759J456927M04381r74372j914270j849140q48514L75985Q32523K7664
4672C429943j146093r07122J158825K917034J969810j187401l586468l329769
4664f81241j536383n61777j187258j927640p84992K319485M852022M017823K7596
4655D537635l823434m644966k504867O93651L254285L961860K247298n98092j996685
4646A126685j282927p14230j828130k745655j175812J708927K984226K187304
$$ plain form
4708 4386554 5403774 5292639 5153247 4925164 2702181 -2181205 -7176164 -9415882 -8968932
4699 -8968932 -7534208 -5688263 -3423428 -1808808 -1857027 -2844863 -3702422 -4860367 -6637903
4690 -6637903 -7017631 -3661206 2260644 6659280 7137040 5225762 3873661 4335512 5918759
4681 5918759 7375686 7780067 6805695 4891425 3042285 2193771 2569756 3402279 3429943
4672 3429943 2283850 1376728 2535553 5452587 7422397 6234996 2648528 -681241
4664 -681241 -2217624 -2779401 -3966659 -5894299 -6679291 -4359806 492216 4510039 4537635
4655 4537635 714201 -3930765 -6435632 -5741981 -2487696 1474164 3721462 3123370 1126685
4646 1126685 -156242 -870472 -2698602 -5444257 -6620069 -4911142 -1926916 260388
4638B60388J103817M55815l06039o93715L12064J787816J734230K54024p89365
4629D119035j019284j598000k212581j226625Q33405J220144p44055k401602k007513
4620e037076j263864j855005k164602M2705L472535M615078K543132K4964k89183
4611H8684R61637J201819n07596k343929k337824j172122j089293k188246j811345
4602i198215J398240M812560N099798K638455K87696r49327k092236k850503j622985
4593b476517J035266K282147J127552j57613K50907J220938R90866l12932j609176
4584B351438k243568j579083N96661K501147J692298j123269k342024o32028J172123
4575C93695Q66389K62601J437061K695178J414356j443243k975400k696265k016392
$$ plain form
4638 260388 1364205 1820020 1513981 820266 1132330 2920146 4654376 4908400 4119035
4629 4119035 3099751 1501751 -710830 -1937455 -1104050 116094 -627961 -3029563 -5037076
4620 -5037076 -6300940 -8155945 -10320547 -10277842 -6805307 -2190229 352903 377867 88684
4611 88684 1050321 2252140 1744544 -599385 -2937209 -4109331 -5198624 -7386870 -9198215
4602 -9198215 -7799975 -2987415 2112383 4750838 5038534 4089207 1996971 -853532 -2476517
4593 -2476517 -1441251 840896 1968448 1810835 2061742 3282680 4273546 3960614 2351438
4584 2351438 107870 -1471213 -874552 1626595 3318893 2195624 -146400 -778428 393695
4575 393695 1260084 1522685 2959746 5654924 7069280 5626037 2650637 -45628 -2062020
4566b062020j010991Q24146J924624N48967j440082n38948K839509M557488K838882
4557H481575N01767K00721Q43676K85818j221536k158333k224710j883033j008110
4548A817835L14196Q81511j36225j630903j794293l91011J080539R87596j144230
4539a4985m159747n747214m401913j297169R38571J564572K250796L773288M341206
4530b752595K622626M21149Q4498O70123m64152k838651k860786O86069M100069
4521c31650L464038k09349k821896k776317j898760j300921L20289L259390M736461
4512B441285K613604q47755j877577o32979m02434j915208k398624q72044q3368
4503c975100j231214r39148L100450O936732N422753J58473k872655k341747k416282
$$ plain form
4566 -2062020 -3073011 -2248865 -324241 224726 -1215356 -1754304 1085205 5642693 8481575
4557 8481575 8983342 9184063 10027739 10313557 9092021 6933688 4708978 2825945 1817835
4548 1817835 2132031 3013542 2877317 1246414 -547879 -938890 141649 1129245 -14985
4539 -14985 -4174732 -9921946 -14323859 -15621028 -14682457 -13117885 -10867089 -7093801 -2752595
4530 -2752595 -129969 291180 375678 1045801 581649 -2257002 -5117788 -4431719 -331650
4521 -331650 3132388 2923039 101143 -2675174 -4573934 -5874855 -5554566 -2295176 2441285
4512 2441285 5054889 4207134 2329557 1696578 1294144 -621064 -3019688 -3891732 -3975100
4503 -3975100 -5206314 -6145462 -3045012 3891720 9314473 9472946 6600291 4258544 1842262
4494A842262m605504n113218k112725L32709r87634k792587q64590K697533L038427
4485h565327P07511N61845L690616N968665M717772J845936l97601k213420l408791
4476B907206k037070J776915L994275J507368l304688n488681l594844n85503
4468d825022L86838q58347k131377j262514J795239M572043M478410J924466k41210
4459C838526p69127j472406l588758m962240l036475R12985L182540K554209J208893
4450b131853Q55828N35189r76795k615095k293353K08947K831563L490598K059075
4441A964104Q3837j047496j304254j325865j110066k44093P10057L69153j404891
4432c309514k776066k140260m3862K069834L858680N362682N348554K555096j635326
$$ plain form
4494 1842262 -2763242 -7876460 -9989185 -9656476 -10644110 -13436697 -14301287 -11603754 -8565327
4485 -8565327 -7857816 -7295971 -3605355 2363310 7081082 8927018 8529417 6315997 2907206
4476 2907206 870136 2647051 6641326 8148694 4844006 -644675 -4239519 -4825022
4468 -4825022 -4438184 -5296531 -7427908 -8690422 -6895183 -2323140 2155270 4079736 3838526
4459 3838526 3069399 1596993 -1991765 -6954005 -9990480 -9077495 -5894955 -3340746 -2131853
4450 -2131853 -1276025 -740836 -1717631 -4332726 -6626079 -6417132 -3585569 -94971 1964104
4441 1964104 2047941 1000445 -303809 -1629674 -2739740 -2983833 -2273776 -1904623 -3309514
4432 -3309514 -6085580 -8225840 -8269702 -6199868 -2341188 3021494 8370048 10925144 9289818
4423I289818l996870l434049k260914k633023l437444k253767P24706K677850
4415e323693J913561p8643q93371l01573m8484j133040k465686k392413p16694
4406a1440036J273951K343821K374809K094668K116766K209518J472864m76055
4398A970306k552596l109368j951432n94529j55721m7397N47391J070123N59449
4389d263774p69117k136706l378440m144071l128291P3397L408109M717163M566698
4380e055032M454615L622800Q45663j819268j234752J273738J240206j706217
4372A621753l001836q42549O78033j293846l307004j574076J443090J290525r69983
4363e955893q83421J864929L380711K023376P2657p59716j205278j705696j405975
$$ plain form
4423 9289818 5292948 1858899 -402015 -3035038 -6472482 -8726249 -8001543 -5323693
4415 -5323693 -3410132 -3488775 -4382146 -4683719 -4732203 -5865243 -8330929 -10723342 -11440036
4406 -11440036 -10166085 -7822264 -5447455 -3352787 -1236021 973497 2446361 1970306
4398 1970306 -582290 -3691658 -5643090 -6237619 -6393340 -6440737 -5893346 -4823223 -4263774
4389 -4263774 -5032891 -7169597 -10548037 -14692108 -17820399 -17747002 -14338893 -9621730 -5055032
4380 -5055032 -600417 3022383 3868046 2048778 814026 2087764 3327970 1621753
4372 1621753 -1380083 -2222632 -1544599 -2838445 -6145449 -7719525 -6276435 -4985910 -5955893
4363 -5955893 -6839314 -4974385 -1593674 429702 502359 -257357 -1462635 -3168331 -4574306
4354d574306j64445J184890K378399L185361K310115n20251k724833k160646p23191
4345a808907j276166k746541k319112q14313j081939k286220j137987J769010
4337a1702175K465826N15981k51198J436421K381934J048875Q5703R53349J254218
4328a811066l88844j611516p90225L12607O73434K092105M552415M287722k10881
4319G105751m554908m444789j519629L61408J017305K189579L142787K263561
4311E561065O15436M045m28717k182324m032636m026643k827674j910553n84198
4302i812199J913235L550610K314812N7262q964J846842K806549J845899Q7580
4293D601626j671574k814330j920511J026832L079470K004761j72266l88049O31203
$$ plain form
4354 -4574306 -4738751 -3553861 -1175462 2009899 4320014 3799763 1074930 -1085716 -1808907
4345 -1808907 -3085073 -5831614 -8150726 -8965039 -10046978 -12333198 -13471185 -11702175
4337 -11702175 -9236349 -8720368 -8971566 -7535145 -5153211 -4104336 -4018633 -3065284 -1811066
4328 -1811066 -2199910 -3811426 -4601651 -4289044 -3615610 -1523505 3028910 7316632 7105751
4319 7105751 2550843 -1893946 -3413575 -3052167 -2034862 154717 3297504 5561065
4311 5561065 6176501 6180546 5751829 3569505 -463131 -4489774 -7317448 -9228001 -9812199
4302 -9812199 -7898964 -4348354 -2033542 -1976280 -1985244 -138402 2668147 4514046 4601626
4293 4601626 2930052 115722 -1804789 -777957 2301513 4306274 4134008 3745959 4377162
4284D377162K98766q69525l11644J633879J937185k65357k553680k961512j930209
4275f44935o17865K48784O1902r97505j459174n38866L50648j43053r57080n81220
4265e278364K08357m7412o56672n0934J378530K002763J258061o35050l487417
4256e308138n802175m919691q18893K544176K138480k86365j574669j476352r14550
4247a6418177O99361L074695L350000O56170r75643J394997M069358K179850k328227
4238d297616l848412j822880k73920l65153L31513J975393J869766k59289j592956
4229h283554j068509n03789q58177j239751j328620j369249o37712R09090J171838
4220a3208433n53399j125544J355472L124006M28611l456426k889313J022192
$$ plain form
4284 4377162 4675928 3806403 3494759 5128638 7065823 6800466 4246786 1285274 -644935
4275 -644935 -1262800 -1014016 -952114 -1949619 -3408793 -3947659 -3597011 -3740064 -4697144 -5278364
4265 -5278364 -5070007 -5117419 -5774091 -5825025 -4446495 -2443732 -1185671 -1820721 -5308138
4256 -5308138 -11110313 -16030004 -16848897 -14304721 -12166241 -12452606 -14027275 -15503627 -16418177
4247 -16418177 -15718816 -12644121 -9294121 -8637951 -9613594 -8218597 -4149239 -1969389 -4297616
4238 -4297616 -8146028 -9968908 -10242828 -10607981 -10276468 -8301075 -6431309 -6690598 -8283554
4229 -8283554 -9352063 -9855852 -10714029 -11953780 -13282400 -14651649 -15289361 -14380271 -13208433
4220 -13208433 -13761832 -14887376 -13531904 -10407898 -9979287 -13435713 -16325026 -15302834
4212a5302834K509961N03039q20071K91664J384091J092037M70542k52191j185124
4203a1308886n06530K346378L563720M61088k855262j430577K167456K208979
4195e353634p83665k304115k163378k792343k821132m69726O74200k041358l037166
4186b1092317K566391P988591M431177l321287m210528N15437O42874m449709
4178a6929371o100730k861112q30150L74981N472874R554011M065132n222799
4170a2477164n344417P37164q41897q518024p756286P98483J841019n103990n188401
4161d1853513R42824k463872j2044114p763387N235560k55736j9520306j6199657
4153i3922201O528867k222660m2741558k7772069Q9723001K07579180J84712142
$$ plain form
4212 -15302834 -12792873 -12289834 -13109905 -12818241 -11434150 -10342113 -9871571 -10123762 -11308886
4203 -11308886 -11815416 -9469038 -5905318 -5444230 -8299492 -9730069 -7562613 -5353634
4195 -5353634 -6137299 -8441414 -10604792 -13397135 -16218267 -16687993 -16013793 -18055151 -21092317
4186 -21092317 -18525926 -10537335 -6106158 -9427445 -13637973 -13122536 -12479662 -16929371
4178 -16929371 -23030101 -25891213 -26721363 -26346382 -20873508 -11319497 -7254365 -12477164
4170 -12477164 -17821581 -17084417 -17926314 -26444338 -34200624 -33402141 -31561122 -36665112 -41853513
4161 -41853513 -40910689 -43374561 -55418675 -63182062 -57946502 -58202238 -77722544 -93922201
4153 -93922201 -87393334 -89615994 -132357552 -160129621 -70406620 137172560 321884702
4146C21884702L4604244q7392152q7863126l0996104j1699503k7439233k5665450
4139H5433378n112101j579594j4946665j5357626j264103K543089o693454q465804
4131C4557120M55240L016855l877747n615827Q74258L091057k029228m302984
4123B6168744j443042j490217m362672j777417M588797M328415k301700m440663
4115A9270245j28166J664836j228347j324438K600536K820160k231518m783366
4107A6659942j866896N11910p11182j611442o28301p10433j234487J343368M457495
4098A6209974J990555m035425n329738r80286J783269M93610j49953R78323j90063
4089A0770266k990240j912532K278378K535226j686900k754055J798869N064436
$$ plain form
4146 321884702 356488946 269096794 181233668 150237564 138538061 111098828 85433378
4139 85433378 80321277 78741683 63795018 48437392 47173289 49716378 43022924 34557120
4131 34557120 35012360 38029215 34151468 28535641 29409899 32500956 30471728 26168744
4123 26168744 24725702 23235485 18872813 17095396 21684193 26012608 23710908 19270245
4115 19270245 19142079 20806915 19578568 18254130 20854666 23674826 21443308 16659942
4107 16659942 14793046 15304956 14593774 12982332 12354031 11643598 10409111 11752479 16209974
4098 16209974 18200529 14165104 8835366 7855080 9638349 10131959 9982006 10960329 10770266
4089 10770266 7780026 5867494 8145872 10681098 8994198 6240143 8039012 13103448
4081A3103448K780365o10100j104522q83464j656638j110278Q66579P08604j374200
4072A0719794o89075K813266L203059j082389m120492k554870l13969l16655N8015
4063G716684J904329J571218j752041l183414p06449J091990m05844j316910O69684
4054E589247J535384j109067k832823l36231K345284J072041j280077n70354J403829
4045E817233J121957k26709k4864M14451j072687k877768k650273j395848o72284
4036a566792N29423K587862L064403J209510L59218K321722L838286K276989K44895
4027A4865516N96923J392324K5609j909670k140646j965982k733953k193738J134419
4018G070802L827858K502905n27623j099830M17574R26491j69513j634336l383806
$$ plain form
4081 13103448 15883813 15273713 14169191 13285727 11629089 10518811 11385390 12093994 10719794
4072 10719794 10030719 12843985 16047044 14964655 10844163 8289293 7975324 7658669 7716684
4063 7716684 9621013 11192231 9440190 6256776 5550327 6642317 6236473 4919563 5589247
4054 5589247 7124631 6015564 3182741 2846510 5191794 6263835 4983758 4413404 5817233
4045 5817233 6939190 6712481 6687617 7102068 6029381 3151613 501340 -894508 -1566792
4036 -1566792 -1037369 1550493 4614896 5824406 6183624 8505346 12343632 14620621 14865516
4027 14865516 15462439 16854763 16880372 14970702 12830056 10864074 8130121 5936383 7070802
4018 7070802 10898660 13401565 12873942 11774112 12191686 13118177 12948664 11314328 7930522
4009G930522m949593m013737k53016K523455J768736K71546J040011J988876J82135
4000F488935k374824k210591m20953p7619m89169P16132K369946J982744R45286
3991F929887K101899L982908K890469o44761k734830k383533j831105j575669
3983F735265j31796J692684J202857j370406k795936j899158q64770j110764j337335
3974A20641l31471J049874J338893R3040j904757k839343j219363J720309K673740
3965G01563P39094j105043o99943J78249k21428j15937J941526L172573R28635
3956E519289k019871j491983J150712J351828j018808j847113L29139K810623
3948D783816L716418L671473K776842M90026j598816j268900K00761k44589j845827
$$ plain form
4009 7930522 2980929 -1032808 -1285824 1237631 3006367 3277913 4317924 6306800 6488935
4000 6488935 4114111 1903520 1482567 1404948 915779 1631911 4001857 5984601 6929887
3991 6929887 9031786 13014694 15905163 15260402 12525572 10142039 8310934 6735265
3983 6735265 6603469 8296153 9499010 8128604 5332668 3433510 2568740 1457976 120641
3974 120641 -210830 839044 2177937 2270977 366220 -2473123 -3692486 -1972177 701563
3965 701563 1440657 335614 -364329 -186080 -407508 -523445 1418081 4590654 5519289
3956 5519289 3499418 2007435 3158147 4509975 3491167 1644054 1973193 4783816
3948 4783816 8500234 12171707 14948549 15438575 13839759 12570859 12771620 12527031 10681204
3939A0681204r32366K409495L588418N20188l113111l237537l16299K687945M066621
3930A6354558L521819J306713j287748k613115k701855k854409l120869k402446
3922F202648r12264N4679O90539K180842L659773K765115l51443k546576j964028
3913I779285k31066L52425m31473j424721j645668p15019P41404J265614N76110
3904H266891M86435J963269K759693O93369k194475k229006J94772J350830M2538
3895A1334316j303333j256261j012894j108524m46297P48230O80361n57762p53886
3886F323950M86787J014625R4489l97153L54377O79382k25340q24145l36212j75931
3876F994829j033331j459695o41695J43599j3904l52444n16778j287771k411214
$$ plain form
3939 10681204 9748838 12158333 15746751 16266939 13153828 9916291 9599992 12287937 16354558
3930 16354558 19876377 21183090 19895342 17282227 14580372 11725963 8605094 6202648
3922 6202648 5290384 5345063 6035602 8216444 11876217 14641332 14289889 11743313 9779285
3913 9779285 9548219 9900644 9469171 8044450 6398782 5683763 6425167 7690781 8266891
3904 8266891 8753326 10716595 13476288 14169657 11975182 9746176 9940948 11291778 11334316
3895 11334316 10030983 8774722 7761828 6653304 6207007 6955237 7635598 7077836 6323950
3886 6323950 6810737 7825362 7919851 7522698 7877075 8556457 8331117 7506972 7170760 6994829
3876 6994829 5961498 4501803 3860108 4003707 3989803 3637359 3120581 1832810 -578404
3867e78404k367865j011364K06620R54828J952160K144955k25375l301550k733036
3858d959031J673827M825860L680612J407159J725715L064665J641879k530241
3850A0530445n998335o389395m107941j029541P65718M38960m28808K00884J584629
3841d433384J530757O74186J573699L494890K897763j52593j511029k90337n68987
3832C214965l369252l588677J148195N118831L355599m3184R85083M125891L126659
3823A4074110j203602k825030j044450o87125k507974j922731J969453L958368
3815I811019J278490k155563k558274j436483j166327p02527J042499J984041
3807F096875M88509j342586j252146n86778j301456k020087n55335J765801J878632
$$ plain form
3867 -578404 -2946269 -3957633 -3751013 -2796185 -844025 1300930 1075555 -2225995 -4959031
3858 -4959031 -3285204 1540656 5221268 6628427 8354142 11418807 13060686 10530445
3850 10530445 4532110 -1857285 -5965226 -6994767 -6229049 -5790089 -6218897 -6018013 -4433384
3841 -4433384 -2902627 -2228441 -654742 2840148 5737911 5585318 4074289 3783952 3214965
3832 3214965 -154287 -3742964 -2594769 2524062 5879661 5836477 6821560 10947451 14074110
3823 14074110 12870508 10045478 9001028 8313903 5805929 3883198 5852651 9811019
3815 9811019 11089509 8933946 6375672 4939189 3772862 3070335 4112834 6096875
3807 6096875 6585384 5242798 3990652 3403874 2102418 82331 -473004 1292797 3171429
3798C171429j29314j191753N1612J422221L37222k914944n434667m546831m82225
3789i717250L483470M151200J852865j06478L91258J946647J949338k5984j923269
3780B001797j612625Q17835K738516J299592l022162n942671m049123P17758L437826
3771c613257K575475J142080J447122K079490J287072J66592L47715Q88987m8096
3762F273180k016822l102425k815667k078887j161164M19811K412568L790213
3754A720807L844251K417423p0400k041596j755093r9698m45538l765763n943155
3745f138762k873246L208251O090204L702448Q2011r73737k91004j66911n09955
3736B129299l01337m1561k25389L40778K036100K273119r85572n002347n131746
$$ plain form
3798 3171429 3042115 1850362 1901974 3324195 3661417 746473 -4688194 -9235025 -9717250
3789 -9717250 -6233780 -2082580 -229715 -336193 55065 2001712 3951050 3925066 2001797
3780 2001797 389172 1207007 3945523 5245115 2222953 -3719718 -7768841 -7051083 -3613257
3771 -3613257 -1037782 104298 1551420 3630910 4917982 5084574 5432289 6321276 6273180
3762 6273180 4256358 1153933 -1661734 -3740621 -4901785 -4481974 -2069406 1720807
3754 1720807 5565058 7982481 7912081 5870485 4115392 4015694 3570156 -195607 -6138762
3745 -6138762 -9012008 -5803757 286447 3988895 4070906 3097169 2806165 2639254 2129299
3736 2129299 1827962 1786401 1561012 1901790 3937890 6211009 5225437 223090 -4908656
3727d908656j339161J730842J358206r7073M09698K250868K879279J533390o79854
3718C137539k592747l169280j590547J062939J806554n48454l025880k009770
3710f929646J879792M693539M191891J701404n29952j462563r49775L91764Q79028
3701C865482o09803k582809k516840n63260N67513k48179r42769K88634K102197
3692f39834K024549m8312j768617j108333J507634L408810K104345j724450m281373
3683e25581l056764k11374N85466l58450K84618K854209L831137J773403j94405
3674D982259K45358P71685j157957l505247k893413j62212J127697J06134j075189
3665a560885j185119q88320o15517l83496q60207j891885j205287K341216N487950
$$ plain form
3727 -4908656 -6247817 -4516975 -3158769 -3255842 -2846144 -595276 2284003 3817393 3137539
3718 3137539 544792 -2624488 -4215035 -3152096 -1345542 -1893996 -4919876 -6929646
3710 -6929646 -5049854 -356315 3835576 5536980 5007028 3544465 2594690 2986454 3865482
3701 3865482 3255679 672870 -1843970 -2407230 -1839717 -2087896 -3030665 -2742031 -639834
3692 -639834 1384715 1336403 -432214 -1540547 -32913 3375897 5480242 3755792 -525581
3683 -525581 -3582345 -3793719 -3208253 -3566703 -3282085 -427876 3403261 5176664 4982259
3674 4982259 5227617 5999302 4841345 1336098 -1557315 -1719527 -591830 -485696 -1560885
3665 -1560885 -2746004 -3634324 -4249841 -4633337 -5493544 -7385429 -8590716 -6249500 -761550
3656g61550M184786l71612l168026k388599r26087q75627q80728J15051N77540
3647d494852m43282j191601j74187J430797K045787J928273J569092L49967j453587
3638d33593j737314L11060K206237J430011r94199k289150j796165r22703m31712
3629d657528N0496N88018Q92837J242766K004278K779048L114465L245905L164090
3620A2424375K123592K06153j043146r41006j071983k605272l830430k724235
3612B538048o32737n17735k301665l091912j889328q11932j067180r14113R62741
3603g725813K815150K621028J454018J677548L093994L368048J644938o10793
3595H338118k224319l470207m271252l418621o50483K097700K864940K030234
$$ plain form
3656 -761550 3423236 3051624 -116402 -2505001 -3431088 -4306715 -5187443 -5072392 -4494852
3647 -4494852 -4938134 -6129735 -6303922 -4873125 -2827338 -899065 670027 1019994 -433593
3638 -433593 -2170907 -1859847 346390 1776401 782202 -1506948 -3303113 -4225816 -4657528
3629 -4657528 -4607032 -4019014 -3126177 -1883411 120867 2899915 6014380 9260285 12424375
3620 12424375 14547967 14754120 13710974 12769968 11697985 9092713 5262283 2538048
3612 2538048 1905311 1387576 -914089 -4006001 -5895329 -6707261 -7774441 -8688554 -7725813
3603 -7725813 -4910663 -2289635 -835617 841931 3935925 7303973 8948911 8338118
3595 8338118 6113799 2643592 -1627660 -5046281 -5696764 -3599064 -734124 1296110
3587A296110J228540Q56785K35025m14607j24101P05853L88199j216367j842078
3578A113359n4942K200843K099167k726j151205j87167P22980m53351k578748
3569A708210l099670j627813j88284l08446j244081j255970K68037K287971L202286
3560b57760K260528K43972j147652q92742L15689R37696M42307k62410m13756
3551A225872o44621j902445l539211l596428j259851J843816L364941K668492
3543a839435R93333k58706o23889l42297J03002K77575K34394M87793J047935
3534G9705R92548j75796j328030j082881J4984J77370q85756j537487p35352O14284
3524c866411J254111J043433L41631n92978j047401k27500J203129J552549O96512
$$ plain form
3587 1296110 2524650 3381435 3616460 3201853 3077752 3783605 4171804 2955437 1113359
3578 1113359 1058417 3259260 5358427 5355701 4204496 4017329 4740309 4286958 1708210
3569 1708210 -1391460 -3019273 -3207557 -3516003 -4760084 -6016054 -5748017 -3460046 -257760
3560 -257760 2002768 2246740 1099088 206346 522035 1459731 1902038 1639628 1225872
3551 1225872 581251 -1321194 -4860405 -8456833 -9716684 -7872868 -4507927 -1839435
3543 -1839435 -846102 -1104808 -1728697 -2070994 -1967992 -1690417 -1456023 -968230 79705
3534 79705 1072253 896457 -431573 -1514454 -1499470 -1322100 -2207856 -3745343 -4480695 -3866411
3524 -3866411 -2612300 -1568867 -1227236 -1820214 -2867615 -3095115 -1891986 -339437 357075
3515C57075L96372J170710J007272j302740l519751k706003O89662L462061L423148
3506B977806R04315k473287m831192m733973k445940K17755K237511M138864N442093
3497A433952L860956q04911m416543l267017O47845K529436J517156P07788J387560
3488C596222J544507J77332j003876r30856o85814p43417K7736J572635J980292
3479E534761Q31299K79698J399495K209571R52662j103873j854197j277400n88800
3470F383216k85977m62431j426221k779578l340740k761611j646363J59864L065913
3461c093928N251465L841532m00046k828481j034314J910815K312657Q04867r6499
3452F668068l55306j067592j188065P01542K960145K834615P87431m88331n14155
$$ plain form
3515 357075 753447 1924157 2931429 1628689 -1891062 -4597065 -3907403 -445342 2977806
3506 2977806 3882121 1408834 -3422358 -8156331 -10602271 -10384516 -8147005 -4008141 1433952
3497 1433952 5294908 4489997 73454 -3193563 -2545718 -16282 1500874 2208662 3596222
3488 3596222 5140729 5318061 4314185 3383329 2697515 1954098 1981834 3554469 5534761
3479 5534761 6366060 6645758 8045253 10254824 11207486 10103613 8249416 6972016 6383216
3470 6383216 6097239 5634808 4208587 1429009 -1911731 -4673342 -6319705 -6159841 -3093928
3461 -3093928 2157537 5999069 5599023 2770542 1736228 3647043 5959700 6764567 6668068
3452 6668068 6312762 5245170 4057105 4758647 7718792 10553407 11340838 10852507 10338352
3443A0338352j042088k155615j997235n99698n16948k619290m122405k387602
3435e102529J252524L128715J653072j225882k541969j374555O10523J278755
3427b321346L36046p97405j074230p24806M717J517652L507474M348522L079177
3418G875801R62078j92008l83364q29599j768213k214620j522169j21786J040319
3409B846439J210754M74819K76P45112J721969R21786j667130l672790l580106
3400i98871k433301j502060m99462O51124O94833n65334j095488N6262N92054
3391e100243j324268l371631k264515R87247K475443J076452o64735q49027k00671
3382i235948K00015L32365L12651M11544J703950M308246N586014L013272j491372
$$ plain form
3443 10338352 9296264 7140649 5143414 4543716 4026768 1407478 -2714927 -5102529
3435 -5102529 -3850005 -721290 931782 -294100 -2836069 -4210624 -3600101 -2321346
3427 -2321346 -1985300 -2782705 -3856935 -4581741 -4577024 -3059372 448102 4796624 7875801
3418 7875801 8837879 8645871 8262507 7432908 5664695 3450075 1927906 1806120 2846439
3409 2846439 4057193 4532012 4532288 5277400 6999369 7921155 6254025 2581235 -998871
3400 -998871 -3432172 -4934232 -5433694 -4782570 -4087737 -4653071 -5748559 -5692297 -5100243
3391 -5100243 -6424511 -9796142 -12060657 -11073410 -8597967 -7521515 -8186250 -9035277 -9235948
3382 -9235948 -9035933 -8703568 -8390917 -7979373 -6275423 -1967177 3618837 6632109 5140737
3373E140737l295402j182231J474065K027025J602853J780303J578493k47790
3365H878053k347460k475433o36347J288054K025749J539991M0240k130636l939489
3356B242722m143233k520477k58206J018777P59969Q5362L88273J242436P48060
3347d36317j514594l272580k448070J8266J689760J809242J307727P79022L17624
3338a749920L65347P78770R2720k215955l882018k636950L10395K236626L106607
3329c594378M524508N484761L303504j128644l212065r07470K387946K805371
3321I663533Q45145o20474p13951o91744j212883j496519p25134P82844J635260
3312G466077N98305j674083k730252j212222J164388J935315J114560K74142l10053
$$ plain form
3373 5140737 1845335 663104 2137169 4164194 5767047 7547350 9125843 8878053
3365 8878053 6530593 4055160 3418813 4706867 6732616 8272607 8312847 6182211 2242722
3356 2242722 -1900511 -4420988 -4679194 -3660417 -2900448 -2815086 -2426813 -1184377 -436317
3347 -436317 -1950911 -5223491 -7671561 -7653295 -5963535 -4154293 -2846566 -2067544 -1749920
3338 -1749920 -1384573 -605803 -513083 -2729038 -6611056 -9248006 -8937611 -6700985 -3594378
3329 -3594378 930130 6414891 9718395 8589751 5377686 4470216 6858162 9663533
3321 9663533 10508678 9888204 9174253 8482509 7269626 5773107 5047973 5830817 7466077
3312 7466077 8064382 6390299 3660047 2447825 3612213 5547528 6662088 6936230 6626177
3303F626177j196493j675159r30504k49400j073466j993243j038120L32810m58054
3294a655452k001527q72463K067455K732812R93174Q49188K837933K605769j283049
3285F273840m388278l755374k220839k229262j284477K349162M808793K379242
3277A932807k262780m340943l655279k366929j15300L501167N233541K636826
3269E63110p46007l10412K168256J863066p74869j398807K38691L38189j671236
3260B69981k401299j026254m11369j250804q63240J289511K333141J386616J071125
3251C97408K228919K146502j78503j754999p66928L29239o04454j587112j73527
3242C6545K253846K750667R87057j320128l088346l818531k779806l11112J609354
$$ plain form
3303 6626177 5429684 3754525 2824021 2574621 1501155 -492088 -1530208 -1197398 -1655452
3294 -1655452 -3656979 -4529442 -2461987 270825 1263999 2113187 4951120 7556889 6273840
3285 6273840 1885562 -1869812 -4090651 -6319913 -7604390 -5255228 -446435 1932807
3277 1932807 -329973 -4670916 -8326195 -10693124 -10808424 -7307257 -2073716 563110
3269 563110 -182897 -493309 1674947 3538013 2763144 1364337 1603028 1941217 269981
3260 269981 -2131318 -3157572 -3568941 -4819745 -5682985 -4393474 -2060333 -673717 397408
3251 397408 2626327 4772829 4594326 2839327 2072399 2401638 1797184 210072 36545
3242 36545 2290391 5041058 6028115 4707987 1619641 -2198890 -4978696 -5289808 -3680454
3233c680454J764108J237774J347942J728194J621927J220478M66788j542213
3225D164544m491000n955867m242682q02727J620726K148666J863733J791803
3217c902804J951659J779418Q08933n98240j215140m43038N86235N88574O1274
3208c83129Q434j86607j250756j533810O84924L141463J870188k434995m696951
3199d781239k788614k0235J015152K101527M433310M896606J235283k897954k650200
3190E43636Q64814K629960J104039r11006j541128j555114j292573L2794J801387
3181A676809K167822J052669J22381j54206n90808p34136M71005J509823m40473
3172E080886m344659n244935j070887L838246M432708J491547m55685K01020J024741
$$ plain form
3233 -3680454 -1916346 -678572 669370 2397564 4019491 5239969 5706757 4164544
3225 4164544 -326456 -6282323 -10525005 -11327732 -9707006 -7558340 -5694607 -3902804
3217 -3902804 -1951145 -171727 637206 38966 -1176174 -1619212 -1032977 -444403 -383129
3208 -383129 -374695 -561302 -1812058 -3345868 -2660944 480519 2350707 -84288 -4781239
3199 -4781239 -7569853 -7590088 -6574936 -4473409 -40099 4856507 6091790 3193836 543636
3190 543636 1408450 4038410 5142449 4231443 2690315 1135201 -157372 -124578 1676809
3181 1676809 3844631 4897300 5019681 4865475 4274667 3540531 4011536 5521359 5080886
3172 5080886 736227 -4508708 -5579595 -1741349 2691359 4182906 3727221 3928241 4952982
3163D952982L38159l79037L68987J292470L36601k026308l384653k676054j161138
3154b337991r7974Q33356J992450K143353N8166k794602l147334k5236L564078
3145A88266M027561J347038j215378j027552J356962L406528L450179J979452
3137A3513056M85781m96335j675672l232844l710618j813292J154747K269747
3129F494570O01076j719690k536370k145138j817990j440025j66202J533204K135476
3120I38911J049345q54806k402277k827769j772448K92222J829266J483166l39987
3111b604377j777276j378428O95879L013933L959541K878431O63824j048978j485789
3102B916760j079447k61078J048482K459098K902228K075888R19578p3721j649101
$$ plain form
3163 4952982 5291141 4912104 5281091 6573561 6910162 4883854 1499201 -1176853 -2337991
3154 -2337991 -2435965 -1602609 389841 2533194 2591360 -203242 -3350576 -3375812 188266
3145 188266 4215827 5562865 4347487 3319935 4676897 8083425 11533604 13513056
3137 13513056 13998837 13502502 11826830 8593986 4883368 3070076 4224823 6494570
3129 6494570 7095646 5375956 2839586 694448 -1123542 -2563567 -2729769 -1196565 938911
3120 938911 1988256 1133450 -1268827 -4096596 -5869044 -5576822 -3747556 -2264390 -2604377
3111 -2604377 -4381653 -5760081 -5064202 -2050269 1909272 4787703 5451527 4402549 2916760
3102 2916760 1837313 1576235 2624717 5083815 7986043 10061931 10981509 10907788 9258687
3093I258687l898163n062106l691800q21501J488059K545413K400152M51537k908153
3084b37875m625204k182000K044917L098751L84573j294075J200987M729181M541502
3075G660757P50654k790326m103197m202094l605483j360970K129704M353064
3067a167891L852530K016987O64676k14027j093688j241003k11734M78971o06130
3058B478691k060489j349080J111181K241155R30583l58518L45835J463454P37457
3049E540269r40724j137812R930J63020j197443j918062o33658J345034K287303
3040C517857K137371J496461L31857j200104k084370j747128j001058q40965j251532
3031f41611j791003k190045j832687r1156K091350K574369J014702j59952Q77979
$$ plain form
3093 9258687 5360524 298418 -3393382 -4214883 -2726824 -181411 2218741 2670278 -237875
3084 -237875 -4863079 -7045079 -5000162 -1901411 -1516838 -2810913 -1609926 3119255 7660757
3075 7660757 8411411 5621085 1517888 -2684206 -6289689 -7650659 -5520955 -1167891
3067 -1167891 2684639 4701626 5366302 5152275 4058587 2817584 2605850 3084821 2478691
3058 2478691 418202 -930878 180303 2421458 3352041 2993523 3339358 4802812 5540269
3049 5540269 4599545 3461733 3471663 3634683 2437240 519178 -114480 1230554 3517857
3040 3517857 5655228 7151689 7483546 6283442 4199072 2451944 1450886 609921 -641611
3031 -641611 -2432614 -4622659 -6455346 -6546502 -4455152 -1880783 -866081 -1026033 -148054
3022a48054K626407K628506J137017K54641M29717K21993q43160j531507j139763
3013C635797n03661m31520p78376j390615k374839l001196j923267P72537L038694
3004b956446L260596K188894J613095J931098K061472J325636L59688M5856K28407
2995A0058296o1616j221820k323349k095396n68701Q05608Q59530o3097r52306
2986D437149j493803j814561j453048J74587K253810K772050R54576j246828j173024
2977C410908J060413K169350m10573m775354o032230j919016M228219P061677
2969D793394M880356N13555k545648l042815j442754J096663K650816J511517
2961H415084j549212l401444k104733P19855K017589P79048j500960k809639k115713
$$ plain form
3022 -148054 2478353 5106859 6243876 6498517 6928234 7150227 6307067 4775560 3635797
3013 3635797 3132136 2700616 1922240 531625 -1843214 -4844410 -6767677 -5995140 -2956446
3004 -2956446 304150 2493044 4106139 6037237 8098709 9424345 9784033 9829889 10058296
2995 10058296 9996680 8774860 6451511 4356115 3787414 4593022 5452552 5389455 4437149
2986 4437149 2943346 1128785 -324263 -149676 2104134 4876184 5830760 4583932 3410908
2977 3410908 4471321 6640671 6230098 1454744 -4577486 -6496502 -2268283 4793394
2969 4793394 9673750 10187305 7641657 4598842 3156088 4252751 6903567 8415084
2961 8415084 6865872 3464428 1359695 2079550 4097139 4876187 3375227 565588 -1550125
2952a550125J72683K275316K279975O4095k584811l944953l480351j165079K473021
2943e460229N375167N206477K345718m14711j727433k729672l610909k597826
2935c613418Q9737J089683o99521j345861J918735N318971M041088J46256p08045
2926F237625J501451J617191j644810l736032k185914k23634n95034j351081l84308
2917g64546Q00687Q43538J524481L603365L872848M07679k911976j831037J177936
2908F722975N11612l589077n246807j902420K150587K302267n54816k639333k472880
2899d717892j081858P95183L020762M465267L492887L33202k478083k681041n96997
2890E51430J718797K978382L274673K538898J89470k918123m040212j894036Q23610
$$ plain form
2952 -1550125 -1377442 897874 3177849 3241944 657133 -3287820 -6768171 -7933250 -5460229
2943 -5460229 -85062 5121415 7467133 7052422 5324989 2595317 -1015592 -3613418
2935 -3613418 -3523681 -2433998 -3133519 -4479380 -2560645 2758326 6799414 6945670 6237625
2926 6237625 7739076 9356267 7711457 3975425 1789511 1565877 970843 -380238 -764546
2917 -764546 36141 879679 2404160 6007525 9880373 10288052 7376076 5545039 6722975
2908 6722975 7234587 3645510 -1601297 -3503717 -1353130 949137 394321 -2245012 -4717892
2899 -4717892 -5799750 -5004567 -1983805 2481462 5974349 6307551 3829468 1148427 551430
2890 551430 2270227 5248609 8523282 11062180 11251650 8333527 4293315 2399279 3222889
2881C222889O42819j798422k898352j651086o22923j080960j012231O19946J427598
2872c150722k04545j755085n00592J815055J802579k4327l62720J420702K837391
2863A877736K744987K450586K302328Q96812j580288k586077j101958M71388j36794
2854E338720j800580j892357K19486L003249M670969L979048O01676l743036n733084
2845D644091l796129l90926O98615r99458k361207j094410J225201J453336q42246
2836a463133k843855k162491L28002K092406K274534J885369J125351j209908
2828B6275m832089o578797l927886J187163M251637L475059J164521r7910l35037
2819e667064o05535p30581n7323Q48848Q75638R3041m77414m06817k2945O61739
$$ plain form
2881 3222889 3865708 2067286 -831066 -2482152 -3105075 -4186035 -5198266 -4578320 -3150722
2872 -3150722 -3355267 -5110352 -5610944 -3795889 -1993310 -2017637 -2380357 -959655 1877736
2863 1877736 4622723 7073309 9375637 10272449 8692161 6106084 5004126 5475514 5338720
2854 5338720 3538140 1645783 1865269 4868518 9539487 13518535 14120211 10377175 4644091
2845 4644091 847962 457036 1155651 156193 -2205014 -3299424 -2074223 -620887 -1463133
2836 -1463133 -4306988 -6469479 -6141477 -4049071 -1774537 110832 1236183 26275
2828 26275 -4805814 -11384611 -15312497 -14125334 -9873697 -6398638 -5234117 -5332027 -5667064
2819 -5667064 -6272599 -7003180 -7060503 -6211655 -5336017 -5242976 -5720390 -6127207 -6150152 -5488413
2809e488413J935732L199076K898786K52142l422108n573346m623937j352683
2801a2174751J752195K713623J967947J786753L321463M700984L202486p66387
2793F504313l473090k421195M19564J450567K98379m04778M54666R72883j79425
2784C621884j378901q18220M56252L26100j031780j716935j071493l083R00583
2775g15593J540887J266938j80522j206907j25636J927151K178925K10257j591077
2766C304423j575273m15973R66053K450876L225386J875859j092139l040016k458595
2757C240601o03258P10584R89842L41122r65548j815243j326355p03197j497128
2748a628580k328538p61622J771296J435031j124002p71311L501537N777704K270667
$$ plain form
2809 -5488413 -3552681 -353605 2545181 2797323 -624785 -6198131 -10822068 -12174751
2801 -12174751 -10422556 -7708933 -5740986 -3954233 -632770 4068214 7270700 6504313
2793 6504313 3031223 610028 1029592 2480159 2778538 2373760 2828426 3801309 3621884
2784 3621884 2242983 1424763 1881015 2207115 1175335 -541600 -1613093 -1616176 -715593
2775 -715593 825294 2092232 1911710 704803 579167 2506318 4685243 4895500 3304423
2766 3304423 1729150 1313177 2279230 4730106 7955492 9831351 8739212 5699196 3240601
2757 3240601 2637343 3347927 4337769 4678891 3713343 1898100 571745 -131452 -1628580
2748 -1628580 -3957118 -4718740 -2947444 -1512413 -2636415 -3407726 93811 5871515 8142182
2739H142182k385623k453049K35179N52856j007188k78569K408116K922154R26824
2730I062882J50547J330750J043055j904369m391047m247350k889848j817701
2722c663081p36289J41020m8423k79820J003354K097754K70207k346461p06008
2713d267747M616278O920494L202277j475165k115882o36643r72132k378406k068121
2704H24953o44031l13656n27431L89795J550390J264298M38699O90296J046721
2695D720034j2166j149441l92494R11048O4761k222854k630548j52580K789554
2686A925314L716078K157557r29404l648744l984423k070033m36624l48477J01126
2677c517630K178891L435039J515846j398887j797681m74019o18398j807577q65806
$$ plain form
2739 8142182 5756559 3303510 3538689 4091545 3084357 2805788 5213904 8136058 9062882
2730 9062882 9213429 10544179 11587234 9682865 5291818 1044468 -1845380 -3663081
2722 -3663081 -4399370 -4258350 -4306773 -4586593 -3583239 -1485485 -1215278 -3561739 -4267747
2713 -4267747 348531 7269025 10471302 8996137 6880255 6243612 5271480 2893074 824953
2704 824953 180922 -132734 -660165 -270370 1280020 2544318 2983017 3673313 4720034
2695 4720034 4707868 3558427 3165933 4076981 4141742 1918888 -711660 -864240 1925314
2686 1925314 5641392 7798949 6869545 3220801 -763622 -2833655 -3270279 -3618756 -3517630
2677 -3517630 -1338739 2096300 3612146 2213259 415578 -58441 -676839 -2484416 -3350222
2668c350222J876184K417638k55897k257281j032048Q07128J07987j894917k084995
2659e666423m29882N43769n0558n10360L95054J441202P18939j477339k536308
2650g571906p11218K270093L146738J570250M85521J361953J739400n21638l152491
2641a383298k753160k44506P28903k62408k14406J830836L252391K454880J249228
2632D658460J404045K001372J668089P52165j42440j415853k931533l367311k303472
2623C23522r55840O6182J468941K866534K321689l62898k503305k352465j574562
2614g02202k002025k400854q92652J492637K432424J913041J452152R93995m67530
2605A818986j993749j567920K61158N93446j430094l117173k239786l67350m39519
$$ plain form
2668 -3350222 -1474038 943600 687703 -1569578 -2601626 -1794498 -1686511 -3581428 -5666423
2659 -5666423 -6096305 -5552536 -5603094 -6113454 -5718400 -4277198 -3558259 -5035598 -7571906
2650 -7571906 -8283124 -6013031 -2866293 -1296043 -810522 551431 2290831 1769193 -1383298
2641 -1383298 -4136458 -4380964 -3652061 -3914469 -4128875 -2298039 954352 3409232 4658460
2632 4658460 6062505 8063877 9731966 10484131 10341691 8925838 5994305 2626994 323522
2623 323522 -632318 -566136 902805 3769339 6091028 5728130 3224825 872360 -702202
2614 -702202 -2704227 -5105081 -5997733 -4505096 -2072672 -159631 1292521 2286516 1818986
2605 1818986 -174763 -1742683 -1481525 -888079 -2318173 -5435346 -7675132 -8042482 -8482001
2596h482001k363934l111344r34359K371713M037601L739306L114818K683931
2588A055731J327075q89510j693527K6169J661970J23304l422328m841068k682851
2579i335035L94657J929938K197087J776828N1806k220982k056881J460788M505236
2570a296558L139609j064577l137100j351885J355711K146726J435395J012992
2562B240313J459766K096038J906401J55728k667843m583680m039369j769132
2554e201778N50198K674783M893291N587750K571020k932704o420577n182929
2546c460946j110824K392952M055457M151761K646800j36089k590578l508135
2538B440398l518474l247970j601025J896572M478846L013398r27938k245078
$$ plain form
2596 -8482001 -10845935 -13957279 -14891638 -12519925 -8482324 -4743018 -1628200 1055731
2588 1055731 2382806 1493296 -200231 -174062 1487908 1611212 -1811116 -6652184 -9335035
2579 -9335035 -8940378 -7010440 -4813353 -3036525 -2984719 -5205701 -7262582 -5801794 -1296558
2570 -1296558 1843051 778474 -2358626 -3710511 -2354800 -208074 1227321 2240313
2562 2240313 3700079 5796117 7702518 7858246 5190403 606723 -3432646 -5201778
2554 -5201778 -4651580 -1976797 2916494 8504244 11075264 8142560 1721983 -3460946
2546 -3460946 -4571770 -2178818 1876639 6028400 8675200 8539111 5948533 2440398
2538 2440398 -1078076 -4326046 -5927071 -4030499 448347 3461745 2533807 288729
2530B88729Q24235M174030L612193L16720j790873j796964j716797j997611r32796
2521I80866J289488J649964j081582l671486k648892P33468K349778Q66404j165070
2512f97062j509296q43262o67107r07252p71254m80166p64187j322353r22137
2503h884076J015641L404803M155333K113595j293819k905931j226245J497776
2495b122923J897825j37248j477772k90664J526311J432848l2572l15319J334347
2486A814833K881864K254729j50328j971326j398834Q82848K229263Q43794k045763
2477E341080l532825k468656m70158N73525N39288J28957n04957j164343r90040
2468b548129K61377J337003J118913J88708m30690r43797j656836j373108R20986
$$ plain form
2530 288729 1112964 5286994 8899187 9215907 7425034 5628070 3911273 1913662 980866
2521 980866 2270354 3920318 2838736 -832750 -3481642 -2748174 -398396 468008 -697062
2512 -697062 -2206358 -3049620 -3716727 -4623979 -5395233 -5875399 -6639586 -7961939 -8884076
2503 -8884076 -7868435 -4463632 -308299 1805296 511477 -2394454 -3620699 -2122923
2495 -2122923 -225098 -362346 -1840118 -2130782 -604471 828377 795805 480486 1814833
2486 1814833 4696697 6951426 6801098 4829772 3430938 4313786 6543049 7386843 5341080
2477 5341080 1808255 -660401 -1130559 -557034 -17746 111211 -393746 -1558089 -2548129
2468 -2548129 -2286752 -949749 169164 357872 -72818 -1016615 -2673451 -4046559 -3125573
2459c125573L452787L277373N74629j144711R1065J843517P53359k646400m573978
2450a497932k923784K90274J746443P38856o23534n33160M06052N29318l24687
2441b192154o82781K14270J109546M77770j123914j510474L36058K816387L548748
2432B993456K183184O09927L16404N30384j15794q86102J78681K578690L057398
2423A1446228M21829j737265J38424L745895L578352j206471n636227o056839
2415D693926m246003l002126j767662P27951K890872K715273J434065J375973
2407D822269K007767J323424m62049j844956l045994m590550m463351q43189L368397
2398c728232L420345p4663j582746J082271L745568K722221J56020j86042J158082
$$ plain form
2459 -3125573 327214 3604587 4179216 3034505 3125570 4969087 5722446 3076046 -1497932
2450 -1497932 -4421716 -4131442 -2384999 -1646143 -2269677 -2802837 -2396785 -1867467 -2192154
2441 -2192154 -2874935 -2660665 -1551119 -1073349 -2197263 -3707737 -3371679 -555292 2993456
2432 2993456 5176640 5786567 6102971 6633355 6517561 5631459 5810140 8388830 11446228
2423 11446228 11868057 10130792 10269216 14015111 17593463 16386992 10750765 4693926
2415 4693926 447923 -2554203 -4321865 -3593914 -703042 2012231 3446296 4822269
2407 4822269 6830036 8153460 7691411 5846455 2800461 -1790089 -6253440 -7096629 -3728232
2398 -3728232 -307887 -382550 -1965296 -883025 2862543 5584764 5740784 5554742 6712824
2389F712824J033569r89892k357477j623491j49569P4711j234419k331753r96083
2380a861580K703948N248835L258866j451438l190561N5491L436249J892463k700993
2371G391280m388513j491556J710141J425369j022158k031635o97826P75439N64861
2362B235402m52445r9963K016608L626855K497986n37589k432557j703182O1705
2353E212820O76487k54345j932940l619772m350425k972418K87615L366658M388510
2344H02190L172339M43719k715139m236744k391305J148084K222078j84253k037510
2335c776541k45487K447756J894004p34517j059387J206178K006135k50267k431968
2326i44094k079933p45214l36873J12876J773344L074484K126807J21260l22164
$$ plain form
2389 6712824 7746393 6756501 4399024 2775533 2625964 2700675 1466256 -865497 -1861580
2380 -1861580 842368 6091203 9350069 7898631 4708070 4763561 8199810 10092273 7391280
2371 7391280 3002767 1511211 3221352 4646721 3624563 1592928 895102 1670541 2235402
2362 2235402 1782957 1682994 3699602 7326457 9824443 9286854 6854297 5151115 5212820
2353 5212820 5889307 5634962 3702022 82250 -4268175 -7240593 -6952978 -3586320 802190
2344 802190 3974529 4418248 1703109 -2533635 -4924940 -3776856 -1554778 -1739031 -3776541
2335 -3776541 -4022028 -1574272 319732 -414785 -1474172 -267994 1738141 1487874 -944094
2326 -944094 -3024027 -3769241 -4106114 -3993238 -2219894 854590 2981397 3102657 2780493
2317B780493Q89163J319299m18279k810286l314920j225789J519296K365685J135980
2308B240642L51818J712538L261259J926934j799926m333920m117260l349278
2300d107193l880531m337840k836351k3695K416982M140058N072198M041433P94540
2291A279601k263679k772492j562868q15180m74335Q25868K455729K531773J354548
2282E58965Q93985J008309m68487l448909m791496k920004j75238J021597J419517
2273f901761K177210J659822j698692n119003m063401J123291M884751L699496
2265d238287N09813R8016K485218L635594J594189j001122q72529J622767L343718
2256G177377K379812m6334j471153j101502m63732j268684k993167l210835o36581
$$ plain form
2317 2780493 3669656 4988955 4570676 1760390 -1554530 -2780319 -1261023 1104662 2240642
2308 2240642 2592460 4304998 7566257 9493191 7693265 3359345 -757915 -4107193
2300 -4107193 -7987724 -12325564 -15161915 -15185610 -12768628 -8628570 -3556372 485061 1279601
2291 1279601 -984078 -3756570 -5319438 -6134618 -6608953 -5783085 -3327356 -795583 558965
2282 558965 1452950 2461259 1992772 -1456137 -6247633 -9167637 -9342875 -8321278 -6901761
2273 -6901761 -4724551 -3064729 -4763421 -9882424 -13945825 -12822534 -7937783 -4238287
2265 -4238287 -3728474 -3630458 -1145240 2490354 4084543 3083421 2210892 3833659 7177377
2256 7177377 9557189 9510855 8039702 6938200 6474468 5205784 2212617 -998218 -1634799
2247a634799K879992M335881L142496J422884P65847K94658j315379l333236l850497
2238B707847k408297l76642R57575J428974J195192J05846j718823l334549l491381
2229d934258j772364O98633J963569J343136O13141J738947L453025K323891j818386
2220C609334m203480j215062M061866N743349L081893L80877l15429j437693l966527
2211E739128m535904j224520K041527Q52730k829219l542879k48301L080587L835234
2202C168383L139349J838352j134414m968725n721946j573349L428370L938494
2194B114514J03000l127757k703299n86175N9346q36836j165511k74437L10723
2185f106432l63280r12332N12545L434653N301341M384399J464065j398950k759333
$$ plain form
2247 -1634799 1245193 5581074 8723570 10146454 10912301 11206959 9891580 6558344 2707847
2238 2707847 299550 -77092 880483 2309457 3504649 3610495 1891672 -1442877 -4934258
2229 -4934258 -6706622 -6007989 -4044420 -2701284 -2088143 -349196 3103829 5427720 3609334
2220 3609334 -594146 -1809208 2252658 7996007 11077900 11458777 11143348 9705655 5739128
2211 5739128 1203224 -21296 2020231 2872961 43742 -3499137 -3747438 -666851 3168383
2202 3168383 6307732 8146084 7011670 2042945 -3679001 -5252350 -1823980 2114514
2194 2114514 2217514 -910243 -3613542 -4199717 -4140371 -4977207 -6142718 -6417155 -6106432
2185 -6106432 -6469712 -7382044 -6869499 -3434846 1866495 6250894 7714959 6316009 3556676
2176C556676k327352q74792j13619j370690l518229l489779p1903L980675N150404
2167I21391L431901J483719M04877r97519k790304k750225J15184L120092K921217
2158E860333j73539k729452k471821m44770J002662R49396J80688l25074m15963
2149A432460m81550p37810j040956j171112r41198j20149J239938K360041K308524
2140B848188J256911L52737k7997p90594k123355k344660k95493K126199J931092
2131B933028p84426k784433j997955J77409J399746J219766M50096n36387j521089
2122a444245j694372o17101P94238J359135J119267Q30927O18171J05562n58874
2113E12708p40351k38997L66752K33401q95457j947274j017330K259745N079955
$$ plain form
2176 3556676 1229324 354532 240913 -1129777 -4648006 -8137785 -8209688 -4229013 921391
2167 921391 4353292 5837011 6241888 5244369 2454065 -296160 -180976 2939116 5860333
2158 5860333 5686794 2957342 485521 40751 1043413 1992809 2173497 1848423 1432460
2149 1432460 950910 213100 -827856 -1998968 -2940166 -3060315 -1820377 539664 2848188
2140 2848188 4105099 4457836 4429839 3639245 1515890 -828770 -1124263 1001936 2933028
2131 2933028 2148602 -635831 -2633786 -2456377 -1056631 163135 613231 76844 -1444245
2122 -1444245 -3138617 -3755718 -2961480 -1602345 -483078 347849 966020 1071582 512708
2113 512708 -227643 -466640 -99888 133513 -761944 -2709218 -3726548 -1466803 3613152
2104C613152M029817l11714l333960k005899J392641K734540J467587K85573N41508
2095H413245P64177l42511j915887k603684k385801j881524j189975l20091K05348
2086a256703Q7597k4284O21422J608574J631784J00989j902569k513186j002136
2077b648512J274769K138129Q79694j039538j728179q46500M54214J094508J030422
2068F09007Q88004J146512J691105J928149J318915j95470k311233m541207n926386
2059e392604n144235j885080K035305L989233L120834R01079p16639q09645M05170
2050c496582J649986J153024j269045l120254k192315q7516l5642j479324n64049
2041i441717L274703N454664K983114r49098k049766r59658m82083p4741K142924
$$ plain form
2104 3613152 7642969 7331255 3997295 1991396 3384037 6118577 7586164 7871737 8413245
2095 8413245 9177422 8834911 6919024 4315340 1929539 48015 -1141960 -1462051 -1256703
2086 -1256703 -1169106 -1193390 -571968 1036606 2668390 2769379 866810 -1646376 -2648512
2077 -2648512 -1373743 764386 1644080 604542 -1123637 -1970137 -1515923 -421415 609007
2068 609007 1497011 2643523 4334628 6262777 7581692 7386222 5074989 533782 -5392604
2059 -5392604 -10536839 -12421919 -10386614 -6397381 -3276547 -2375468 -3092107 -3901752 -3496582
2050 -3496582 -1846596 -693572 -1962617 -5082871 -7275186 -7362702 -7398344 -8877668 -9441717
2041 -9441717 -6167014 -712350 2270764 1321666 -728100 -1687758 -2169841 -2244582 -101658
2032a01658M231811K662772j368188l085728j342901K87126j24946l40278J214598
2023B032608K631844K125602O52061n85627j766483k267959n13088K430537K795448
2014G534943l64076l070708k084883N75756J230267l36739j945245k514549j846047
2005b821281N49601L667001M377009J399958k108322k548050m32482J493816K336253
1996E913503K462378J261111j225964k528361j049550P34816o5245j765620p82219
1987B954849K229182L344853J674794K12280M78716N45141j050837l003277l636779
1978C748922k818900j120584M85015L90313j483269k057113J046288M865605M434743
1969G491020K99956k065917o07361Q53723j55261n37874K456435N686732M480823
$$ plain form
2032 -101658 4130153 6792925 5424737 2339009 996108 1283234 1158288 818010 2032608
2023 2032608 4664452 6790054 7442115 6856488 5090005 2822046 2308958 4739495 7534943
2014 7534943 7170867 4100159 2015276 2591032 3821299 3484560 1539315 -975234 -2821281
2005 -2821281 -2271680 1395321 5772330 7172288 5063966 2515916 2083434 3577250 5913503
1996 5913503 8375881 9636992 8411028 5882667 4833117 5567933 5502688 3737068 2954849
1987 2954849 5184031 8528884 10203678 10415958 10894674 11439815 10388978 7385701 3748922
1978 3748922 930022 -190562 294453 684766 -798503 -2855616 -1809328 3056277 7491020
1969 7491020 7790976 5725059 5117698 5971421 5816160 5278286 7734721 13421453 17902276
1960A7902276m54285m346864m621774k452064L87693K835802L500997J381329
1952A4133110k207492m357903l493407p06718J481404J221445r77216k339618
1944B753605p97855K011230K466660j43144k752579l044245k116063j607824j090585
1935d320800K0994P16544O05502J324593L436655M429322K524242J71830N22279
1926I431161K243353J487036k010863m430287l298859l57863J267731M03434j901875
1917B832968l566847k897628l22900J581180J091872m57994r54676p09712j292325
1908d696062k316278k002752l18034J063695J626437K321255L107055K676652
1900A461968R29260m36033k86366O15055R61014L15378q42109j504004r99088
$$ plain form
1960 17902276 17447991 13101127 8479353 6027289 6414982 9250784 12751781 14133110
1952 14133110 11925618 7567715 4074308 3367590 4848994 6070439 5093223 2753605
1944 2753605 1955750 3966980 6433640 6290496 3537917 493672 -1622391 -3230215 -4320800
1935 -4320800 -4299806 -3583262 -2977760 -1653167 1783488 6212810 8737052 8908882 9431161
1926 9431161 11674514 13161550 11150687 6720400 3421541 3063678 4331409 4734843 2832968
1917 2832968 -733879 -3631507 -3954407 -2373227 -1281355 -1739349 -2694025 -3403737 -4696062
1908 -4696062 -7012340 -9015092 -9333126 -8269431 -6642994 -4321739 -1214684 1461968
1900 1461968 2391228 1955195 1668829 2283884 3244898 3560276 2718167 1214163 215075
1891B15075k33798q60338k253938j483821J830457L319768k21823n069985n100975
1882i859378n68080K711834K294490J597413K903322L688742J955905L3873P1565
1873D829686J04340j828380l243917r78559L113521M339300J648483j593105k426539
1864C964830r16707J356835K787651K181828j47189k168870k561449k354424k680826
1855e38321k533119q53832Q02361L99624j009724p60384J191891K479947K272848
1846A451291J924633J726382J80369k781641m595803l325508k29870K007143K174354
1837a468650Q89489n42248q36898M99896K353184K885449J775032O36436P45012
1828F936702J336541Q58352p84221k010822j487106J14563N93479j129623l094253
$$ plain form
1891 215075 -18723 -879061 -3132999 -4616820 -2786363 533405 311582 -4758403 -9859378
1882 -9859378 -10427458 -7715624 -5421134 -3823721 -920399 2768343 4724248 4758121 4829686
1873 4829686 4934026 3105646 -138271 -1116830 1996691 6335991 7984474 6391369 3964830
1864 3964830 3048123 4404958 7192609 9374437 9227248 7058378 4496929 2142505 -538321
1855 -538321 -3071440 -3925272 -3122911 -2723287 -3733011 -4493395 -3301504 -821557 1451291
1846 1451291 3375924 5102306 5282675 2501034 -2094769 -5420277 -5650147 -3643004 -1468650
1837 -1468650 -579161 -1121409 -1958307 -1458411 894773 3780222 5555254 6191690 6936702
1828 6936702 8273243 9131595 8347374 6336552 4849446 4964009 5557488 4427865 1333612
1819A333612k263393J247169L595256K063455j192762k190447m97290J060644
1811C156244J167533J255508J920552J461930q45500k787627k238009j39983J243126
1802D193774J388228J061862K85193j179370k246525j556458J96081Q26000l87044
1793B581741j832416j916110r55981j88895R2445N11731J117262Q99045p67164
1784d58342k654191k549208J09341L203238M225386L001863J255991J57174k97579
1775E993673L3335J383733K563318J606344j297775l437319l177152j996264j539537
1766A32356p46560J779520M213953L460100O2188k081154j227996J04856l47012
1757E350251r62287O64958L142014K840035p05503l921277m060278k388264j415059
$$ plain form
1819 1333612 -929781 317388 3912644 5976099 4783337 2592890 2095600 3156244
1811 3156244 4323777 5579285 7499837 8961767 8116267 5328640 3090631 2950648 4193774
1802 4193774 5582002 6643864 6929057 5749687 3503162 1946704 2142785 2968785 2581741
1793 2581741 749325 -1166785 -2122766 -2311661 -2219216 -1707485 -590223 308822 -458342
1784 -458342 -3112533 -5661741 -5552400 -2349162 1876224 4878087 6134078 6291252 5993673
1775 5993673 6027008 7410741 9974059 11580403 10282628 6845309 3668157 1671893 132356
1766 132356 -614204 1165316 5379269 8839369 8901557 6820403 5592407 5697263 5350251
1757 5350251 4387964 5052922 8194936 11034971 10329468 6408191 2347913 -40351 -1455410
1748a455410j113585R0443J845096J987407J04995j456263j036489l7545l09914
1739a381265r50604o5337J443164R34085j285636j744993P60160K871171J816825
1730B397570k04707J16445J411743j44228m067019n689281l207416r6868O63251
1721h820510N17405J466109K245092J355008N88948J855848L053607J269917j732529
1712A798895j783769R59496K353521J167669O28754K174059K613693k90408l585235
1703F036675l417942m58685J917919K319223J338224p20125k996633l071767j42487
1694H04402K566366J962734j33283k35417N60017j436976n084580m824163M89853
1685e331047M758637L158911j181838k521720q00244k17623j821381k352276r6445
$$ plain form
1748 -1455410 -2568995 -2478552 -633456 1353951 1458946 2683 -1033806 -1071351 -1381265
1739 -1381265 -2331869 -2397206 -954042 -19957 -1305593 -3050586 -2290426 580745 2397570
1730 2397570 2192863 2309308 3721051 3576823 -490196 -6179477 -9386893 -9483761 -8820510
1721 -8820510 -8303105 -6836996 -4591904 -3236896 -2647948 -792100 2261507 3531424 1798895
1712 1798895 15126 974622 3328143 4495812 5124566 7298625 9912318 9621910 6036675
1703 6036675 2618733 2160048 4077967 6397190 7735414 7015289 4018656 946889 804402
1694 804402 3370768 5333502 5200219 4964802 5524819 4087843 -996737 -5820900 -5331047
1685 -5331047 -572410 2586501 1404663 -1117057 -1917301 -2134924 -3956305 -6308581 -6405026
1676f405026K300309J919151l27474j241639M14976K598869K593923K12129j937124
1667A28094j507580O77633J660180J60537j951523k312963q09618R62807J699695
1658a292738J118660j46970p53172P1078J067115L62057j326362j171338J246418
1649h25252K654593J019723j034975m06279J286891K75514k947343l795528k34378
1640d007034M158294M779202J377478k275876k854767q40012K78912j678805m308155
1631e370763l357771R76337L471825J189211k106434j854770M06027N32965p47130
1622f860503K42777K478297J403523k378816k814186J704797N106752L150974
1614B033615k78642l61303J005452j27151k209113j328807J389831J696068m90940
$$ plain form
1676 -6405026 -4104717 -2185566 -2513040 -3754679 -3339703 -740834 1853089 2065218 128094
1667 128094 -1379486 -701853 958327 1118864 -832659 -3145622 -3955240 -2992433 -1292738
1658 -1292738 -174078 -321048 -1074220 -1003142 63973 426030 -900332 -2071670 -825252
1649 -825252 1829341 2849064 1814089 1407810 2694701 2970215 22872 -3772656 -4007034
1640 -4007034 151260 4930462 6307940 4032064 1177297 337285 616197 -1062608 -5370763
1631 -5370763 -8728534 -7752197 -4280372 -3091161 -5197595 -7052365 -6646338 -6113373 -6860503
1622 -6860503 -6617726 -4139429 -2735906 -5114722 -7928908 -6224111 -1117359 2033615
1614 2033615 1754973 1393670 2399122 2271971 62858 -1265949 123882 1819950 1329010
1605A329010j553638p44395o71272j723794j386691O50626J592730M50788n09690
1596b566326j33717j21853j261756j708440m88382O52845M82867L18150J184587
1587c642025J748707Q80471j65877N0492Q62340J040787P28324L80261l12412
1578A571068j123715r77487k35676r17995l012484l234456J52975L735859L284135
1569g57776j11631j776869l02043J126197K25735j167426m81226J722300K865402
1560A342663J743204n16135j901478j135963J288975L222387K890156J035165
1552G968974j02657k6822n37198k494082l946373k870195l02853J063059N01468
1543g46679m32768o52687n22249k04504P41342J655482R28037j057665j316775
$$ plain form
1605 1329010 -224628 -969023 -1640295 -3364089 -4750780 -4100154 -2507424 -2056636 -2566326
1596 -2566326 -2700043 -2821896 -4083652 -5792092 -6280474 -5627629 -5144762 -4826612 -3642025
1587 -3642025 -1893318 -1012847 -1178724 -1128232 -265892 774895 1503219 1883480 1571068
1578 1571068 447353 -530134 -765810 -1683805 -4696289 -7930745 -7777770 -4041911 -757776
1569 -757776 -869407 -2646276 -2948319 -1822122 -1596387 -2763813 -3245039 -1522739 1342663
1560 1342663 3085867 2569732 668254 -467709 821266 4043653 6933809 7968974
1552 7968974 7866317 7839495 7302297 4808215 861842 -2008353 -2311206 -1248147 -746679
1543 -746679 -1179447 -1832134 -2354383 -2558887 -1817545 -162063 765974 -291691 -1608466
1534a608466J517074M163368K589513k029274m425190k380487N28073M59194j483410
$$ plain form
1534 -1608466 -91392 4071976 6661489 4632215 207025 -2173462 -1645389 -1186195 -2669605
$$ [...]
##END NTUPLES=NMR SPECTRUM
##END=
