##TITLE=31P_DE-80H_X3
 64 sc D2O
 26.2.2025
##JCAMPDX= 6.0         $$ Bruker NMR JCAMP-DX V2.0
##DATA TYPE= NMR SPECTRUM
##DATA CLASS= NTUPLES
##ORIGIN= UXNMR, Bruker Analytische Messtechnik GmbH
##OWNER= root
$$ XWIN-NMR		Version 3.5
$$ Fri Apr 11 16:01:36 2025 Russian Standard Time (UT+4h)  Yarkov@DPX200
##.OBSERVE FREQUENCY= 81.013821
##.OBSERVE NUCLEUS= ^31P
##.ACQUISITION MODE= SIMULTANEOUS
##.ACQUISITION SCHEME= undefined
##.AVERAGES= 64
##.DIGITISER RES= 17
##SPECTROMETER/DATA SYSTEM= spect
##.PULSE SEQUENCE= zgpg30
##.SOLVENT NAME= DMSO
##.SHIFT REFERENCE= (INTERNAL, DMSO, 0, 198.062)
##AUDIT TRAIL= $$ (NUMBER, WHEN, WHO, WHERE, WHAT)
$$ ##TITLE= Audit trail, XWIN-NMR		Version 3.5
$$ ##JCAMPDX= 5.01
$$ ##ORIGIN= Bruker BioSpin GmbH
$$ ##OWNER= Yarkov
$$ C:/Bruker/XWIN-NMR/data/yarkov2/nmr/P31/2/pdata/1/auditp.txt
$$ ##AUDIT TRAIL=  $$ (NUMBER, WHEN, WHO, WHERE, WHAT)
(   1,<2025-04-11 16:00:44.93 +0400>,<Yarkov>,<DPX200>,
      <created by zg, POWCHK disabled, PULCHK disabled
       configuration hash MD5:
       00 E9 B6 7A A2 85 ED C7 34 08 36 98 17 FE 4E 26
       data hash MD5: 32K
       4C 87 59 83 C2 44 FB F5 77 C5 2B 41 A2 9F 2F 0D>)
(   2,<2025-04-11 16:00:52.51 +0400>,<Yarkov>,<DPX200>,
      <Start of raw data processing
       efp BC_mod = 2 LB = 1.5 FT_mod = 6 PKNL = 1 PHC0 = 1796.659 PHC1 = 30.09541 SI = 64K 
       data hash MD5: 64K
       83 1F 08 3B D3 07 B3 11 16 8F 69 7D B5 4F 36 07>)
(   3,<2025-04-11 16:01:02.21 +0400>,<Yarkov>,<DPX200>,
      <abs ABSG = 5 
       data hash MD5: 64K
       F8 D4 46 DB 74 C1 AD 1C 7C AA AB E7 B1 A8 78 10>)
(   4,<2025-04-11 16:01:15.71 +0400>,<Yarkov>,<DPX200>,
      <pk PHC0 = 1.799999 PHC1 = 0 
       data hash MD5: 64K
       56 19 F2 90 38 D4 24 8E F7 71 0A 93 44 DD D1 89>)
$$ ##END=
$$ 
$$ hash MD5
$$ 6F AB AB 5F D4 C4 E0 00 51 15 34 0D 71 9B 9E 5D
##$RELAX= 
##$RELAX= 
##$RELAX= 
##$RELAX= 
##$RELAX= 
##$RELAX= 
##$RELAX= 
##$RELAX= 
$$ Bruker specific parameters
$$ --------------------------
##$DU= <C:/Bruker/XWIN-NMR>
##$EXPNO= 2
##$NAME= <P31>
##$PROCNO= 1
##$TYPE= <nmr>
##$USER= <yarkov2>
##$AMP= (0..31)
100 100 100 100 100 100 100 100 100 100 100 100 100 100 100 100 100 100 
100 100 100 100 100 100 100 100 100 100 100 100 100 100 
##$AQSEQ= 0
##$AQ_mod= 1
##$AUNM= <au_zg>
##$AUTOPOS= <>
##$BF1= 81.014009
##$BF2= 200.13
##$BF3= 200.13
##$BF4= 200.13
##$BF5= 200.13
##$BF6= 200.13
##$BF7= 200.13
##$BF8= 200.13
##$BYTORDA= 1
##$CFDGTYP= 0
##$CFRGTYP= 5
##$CHEMSTR= <none>
##$CNST= (0..31)
1 1 145 1 1 1 1 1 1 1 1 1 1 1 1 1 1 1 1 1 1 1 1 1 1 1 1 1 1 1 1 1 
##$CPDPRG= <waltz16>
##$CPDPRG1= <>
##$CPDPRG2= <waltz16>
##$CPDPRG3= <>
##$CPDPRG4= <mlev>
##$CPDPRG5= <mlev>
##$CPDPRG6= <mlev>
##$CPDPRG7= <mlev>
##$CPDPRG8= <mlev>
##$CPDPRGB= <>
##$CPDPRGT= <>
##$D= (0..31)
0 1 0 0 0 0 0 0 0 0.06 0 0.03 2e-05 3e-06 0 0 0.0002 0 0 0 0 0 0 0 0 0 
0 0 0 0 0 0 
##$DATE= 1744372844
##$DBL= (0..7)
120 120 120 11 120 120 24 19 
##$DBP= (0..7)
150 150 150 150 150 150 150 150 
##$DBP07= 0
$$ [...]
##$SUBNAM3= <"">
##$SUBNAM4= <"">
##$SUBNAM5= <"">
##$SUBNAM6= <"">
##$SUBNAM7= <"">
##$SUBNAM8= <"">
##$SUBNAM9= <"">
##$SW= 400.765351723535
##$SWIBOX= (0..15)
0 1 3 0 0 0 0 0 0 0 0 0 0 0 0 0 
##$SW_h= 32467.5324675325
##$TD= 32768
##$TD0= 1
##$TE= 0
##$TE2= 300
##$TE3= 300
##$TEG= 300
##$TL= (0..7)
0 120 53 12 22 120 120 120 
##$TP= (0..7)
150 150 150 150 150 150 150 150 
##$TP07= 0
##$TPNAME0= <>
##$TPNAME1= <>
##$TPNAME2= <>
##$TPNAME3= <>
##$TPNAME4= <>
##$TPNAME5= <>
##$TPNAME6= <>
##$TPNAME7= <>
##$TPOAL= (0..7)
0.5 0.5 0.5 0.5 0.5 0.5 0.5 0.5 
##$TPOFFS= (0..7)
0 0 0 0 0 0 0 0 
##$TUNHIN= 0
##$TUNHOUT= 0
##$TUNXOUT= 0
##$USERA1= <user>
##$USERA2= <user>
##$USERA3= <user>
##$USERA4= <user>
##$USERA5= <user>
##$V9= 5
##$VALIST= <valist>
##$VCLIST= <CCCCCCCCCCCCCCC>
##$VD= 0
##$VDLIST= <DDDDDDDDDDDDDDD>
##$VPLIST= <PPPPPPPPPPPPPPP>
##$VTLIST= <TTTTTTTTTTTTTTT>
##$WBST= 1024
##$WBSW= 4
##$XGAIN= (0..3)
0 0 0 0 
##$XL= 0
##$YL= 0
##$YMAX_a= 18510
##$YMIN_a= -3854
##$ZGOPTNS= <>
##$ZL1= 120
##$ZL2= 120
##$ZL3= 120
##$ZL4= 120
##$ABSF1= 198.0616
##$ABSF2= -202.7028
##$ABSG= 5
##$ABSL= 3
##$ALPHA= 0
##$AQORDER= 0
##$ASSFAC= 0
##$ASSFACI= 0
##$ASSFACX= 0
##$ASSWID= 0
##$AUNMP= <proc_1d>
##$AZFE= 0.1
##$AZFW= 0.5
##$BCFW= 0
##$BC_mod= 2
##$BYTORDP= 0
##$COROFFS= 0
##$CY= -3
##$DATMOD= 1
##$DC= 0
##$DFILT= <>
##$DTYPP= 0
##$F1P= 0
##$F2P= 0
##$FCOR= 1
##$FTSIZE= 65536
##$FT_mod= 6
##$GAMMA= 0
##$GB= 0
##$INTBC= 1
##$INTSCL= 9.790993e-09
##$ISEN= 30
##$LB= 1.5
##$LEV0= 0
##$LPBIN= 0
##$MAXI= 10000
##$MC2= 0
##$MEAN= 0
##$ME_mod= 0
##$MI= 50
##$NCOEF= 0
##$NC_proc= -8
##$NLEV= 6
##$NOISF1= 182.463
##$NOISF2= 159.3651
##$NSP= 0
##$NTH_PI= 0
##$NZP= 0
##$OFFSET= 198.0616
##$PC= 4
##$PHC0= 1798.459
##$PHC1= 30.09541
##$PH_mod= 1
##$PKNL= yes
##$PPARMOD= 0
##$PSCAL= 0
##$PSIGN= 0
##$REVERSE= no
##$SF= 81.0140089999434
##$SI= 65536
##$SIGF1= 159.3651
##$SIGF2= -187.1042
##$SINO= 113.3802
##$SIOLD= 16384
##$SREGLST= <1H.CDCl3>
##$SSB= 0
##$STSI= 65536
##$STSR= 0
##$SW_p= 32467.5324675325
##$SYMM= 0
##$S_DEV= 0
##$TDeff= 32768
##$TDoff= 0
##$TI= <>
##$TILT= no
##$TM1= 0
##$TM2= 0
##$TOPLEV= 0
##$USERP1= <user>
##$USERP2= <user>
##$USERP3= <user>
##$USERP4= <user>
##$USERP5= <user>
##$WDW= 1
##$XDIM= 65536
##$YMAX_p= 311072922
##$YMIN_p= -90601066
$$ End of Bruker specific parameters
$$ ---------------------------------
##NTUPLES= NMR SPECTRUM
##VAR_NAME=  FREQUENCY,     SPECTRUM/REAL,   SPECTRUM/IMAG
##SYMBOL=    X,             R,               I
##VAR_TYPE=  INDEPENDENT,   DEPENDENT,       DEPENDENT
##VAR_FORM=  AFFN,          ASDF,            ASDF
##VAR_DIM=   65536,         65536,           65536
##UNITS=     HZ,            ARBITRARY UNITS, ARBITRARY UNITS
##FACTOR=    0.49542278885378, 1,            1
##FIRST=     16045.7642231865, 0,            0
##LAST=      -16421.768244346, 0,            0
##MIN=       -16421.768244346, -90601066,    0
##MAX=       16045.7642231865, 311072922,    0
$$ Real data points
##PAGE= N=1
##DATA TABLE= (X++(R..R)), XYDATA
$$ [...]
##PAGE= N=2
##DATA TABLE= (X++(I..I)), XYDATA
$$ plain form
6780 1246034 -191376 388557 1935793 2210777 994582 -21643 134404 1209950 3357871
6771 3357871 6925752 10430985 10971246 7492763 2135750 -2269710 -4556781 -4594014 -2247315
6762 -2247315 1741342 5222327 6501606 6072536 5499754 5343782 5138146 4654623 4177974
6753 4177974 4054931 4646855 5985150 6899887 5641226 2342125 -231998 356008 3289269
6744 3289269 5629856 5546711 3372630 546387 -1084094 74323 3637303 6787200 7113923
6735 7113923 5325849 3690166 2737750 1455769 -158496 -1283064 -2635023 -5835927
6727 -5835927 -10057204 -11947905 -9879947 -6139909 -3777636 -3072578 -2355325 -821394 876434
6718 876434 1899481 1968213 1409744 987947 943175 55539 -3061752 -7382733 -9694058
$$ packed form
6780A246034j437410N79933J547236K74984j216195j016225J56047J075546K147921
6771C357871L567881L505233N40261l478483n357013m405460k287071l7233K346699
6762b247315L988657L480985J279279m29070n72782j55972k05636m83523m76649
6753D177974j23043N91924J338295R14737j258661l299101k574123N88006K933261
6744C289269K340587q3145k174081k826243j630481J158417L562980L149897L26723
6735G113923j788074j635683r52416j281981j614265j124568j351959l200904
6727e835927m221277j890701K067958L740038K362273P05058P17253J533931J697828
6718H76434J023047O8732n58469m21797m4772q87636l117291m320981k311325
$$ plain form
6709 -9694058 -8168592 -4450594 -1400639 24853 812697 1994512 3735340 5539024
6701 5539024 6609731 6633320 6484742 7241556 8417535 8508276 7409704 6607652 6712538
6692 6712538 6858617 7056831 8644110 11233082 11783498 8600826 4128946 1664644 1238541
6683 1238541 1066734 1124017 2306344 3469233 2630479 478505 -426392 378257 1084536
6674 1084536 1215324 2171070 3869989 4136004 2462513 1429677 2808575 4673057 4238230
6665 4238230 1727379 -481407 -1155298 -759270 274461 1905313 3551607 4417508 4678182
6656 4678182 5142048 5751259 5453757 3758896 1672992 736507 1459316 2963823 4050441
6647 4050441 4338263 4211373 3986012 3808659 4315064 6255382 8905815 10014727 8411993
$$ packed form
6709i694058J525466L717998L049955J425492P87844J181815J740828J803684
6701E539024J070707K3589j48578P56814J175979R0741j098572q02052J04886
6692F712538J46079J98214J587279K588972N50416l182672m471880k464302m26103
6683A238541j71807N7283J182327J162889q38754k151974r04897Q04649P06279
6674A084536J30788R55746J698919K66015j673491j032836J378898J864482m34827
6665D238230k510851k208786o73891L96028J033731J630852J646294Q65901K60674
6656D678182M63866O09211k97502j694861k085904r36485P22809J504507J086618
6647D050441K87822j26890k25361j77353N06405J940318K650433J108912j602734
$$ plain form
6638 8411993 5747848 4365238 4355834 4323600 4163656 4865690 5942175 5545294 3401007
6629 3401007 1285303 24665 -1646999 -4320104 -6264602 -5924109 -4130687 -2291563
6621 -2291563 -128163 2930594 5559861 5933641 4547849 3691012 4473454 5991344 7121514
6612 7121514 7654369 7822535 7991988 8712816 10083800 11355643 12010374 12577998 13305344
6603 13305344 12893320 10181811 6509392 4470269 4412706 4071080 1963641 -622073 -1619802
6594 -1619802 -558458 1870581 5131100 8475086 10318873 9572436 7335177 5975554
6586 5975554 6380531 7125979 6757414 5995406 6739682 9186038 11149533 10822879 9286334
6577 9286334 9076803 10602751 11477611 9771228 6554176 4374631 4256684 5225710 5981789
$$ packed form
6638H411993k664145j382610r404l2234j59944P02034J076485l96881k144287
6629C401007k115704j260638j671664k673105j944498L40493J793422J839124
6621b291563K163400L058757K629267L73780j385792q56837P82442J517890J130170
6612G121514N32855J68166J69453P20828J370984J271843O54731N67624P27346
6603A3305344m12024k711509l672419k039123n7563l41626k107439k585714r97729
6594a619802J061344K429039L260519L343986J843787p46437k237259j359623
6586E975554M04977P45448l68565p62008P44276K446356J963495l26654j536545
6577I286334k09531J525948Q74860j706383l217052k179545j17947R69026P56079
$$ plain form
6568 5981789 5900443 4959080 3789553 3371652 3729414 3549177 2128131 846818 1253321
6559 1253321 2508589 2634847 1674705 1219467 994906 -1202762 -5481702 -8578549 -8021079
6550 -8021079 -5102669 -1963518 1695573 6271880 8891128 6427071 1240286 -342070
6542 -342070 3797475 8499605 8258490 4265230 1916469 3435118 6304673 8166407 9715134
6533 9715134 12085899 14249895 14687981 13944536 13643830 13744881 12496615 9074414 4953598
6524 4953598 2243822 1382334 1018078 -4578 -1038726 -481969 1678982 2978876 1203258
6515 1203258 -2317979 -3791062 -1777077 855376 1011715 -299839 123011 2479350 3473602
6506 3473602 1112506 -2625511 -4737147 -4575126 -3120262 -964107 1269127 2135364 1088988
$$ packed form
6568E981789q1346r41363j169527m17901L57762j80237j421046j281313M06503
6559A253321J255268J26258r60142m55238k24561k197668m278940l096847N57470
6550h021079K918410L139151L659091M576307K619248k464057n186785j582356
6542c42070M139545M702130k41115l993260k348761J518649K869555J861734J548727
6533I715134K370765K163996M38086p43445l00706J01051j248266l422201m120816
6524D953598k709776q61488l64256j022656j034148N56757K160951J299894j775618
6515A203258l521237j473083K013985K632453J56339j311554M22850K356339R94252
6506C473602k361096l738017k111636J62021J454864K156155K233234Q66237j046376
$$ plain form
6497 1088988 -45873 629533 2052971 1581587 -996516 -3019904 -2508620 -48460 3065086
6488 3065086 6249097 8438371 7793251 4285600 1060628 1265074 4182652 6160332 5018483
6479 5018483 2070774 -53417 -63265 1750932 4472044 6847294 7398088 5375184 1774848
6470 1774848 -1143350 -1806821 -853353 -430237 -1698796 -3270331 -2746530 123562 2652213
6461 2652213 2175687 -703195 -2577196 -735205 4364512 9788210 12521711 11436227
6453 11436227 7956543 5014510 4480972 5265814 4633708 1661117 -1453821 -1958754 479664
6444 479664 4025840 6940137 8527232 8592189 7438441 6229193 6009799 6319510 5920308
6435 5920308 4793377 3976926 3436760 1986928 -155952 -809195 989346 3122912 3464036
$$ packed form
6497A088988j134861O75406J423438m71384k578103k023388N11284K460160L113546
6488C065086L184011K189274o45120l507651l224972K04446K917578J977680j141849
6479E018483k947709k124191r848J814197K721112K375250N50794k022904l600336
6470A774848k918198o63471R53468M23116j268559j571535N23801K870092K528651
6461B652213m76526k878882j874001J841991N099717N423698K733501j085484
6453A1436227l479684k942033n33538P84842o32106k972591l114938n04933K438418
6444D79664L546176K914297J587095O4957j153748j209248k19394L09711l99202
6435E920308j126931q16451n40166j449832k142880o53243J798541K133566L41124
$$ plain form
6426 3464036 3190203 4760899 7695051 9050357 7783433 6030077 5813655 6787459 7672048
6417 7672048 7714711 6121759 2339011 -2063900 -3883927 -2017342 1006110 2500045 2861460
6408 2861460 3791126 4990911 4692913 2444954 -470525 -2617608 -2936235 -806741 2645082
6399 2645082 4340867 2362873 -1461542 -4004086 -5015382 -6605795 -9180315 -10504708
6391 -10504708 -8882441 -5005073 -479813 3376164 5175573 4253725 2357280 2411499 4894426
6382 4894426 7301908 7796264 7383411 7688325 8560626 8926678 8257875 6162899 2285464
6373 2285464 -2178390 -4476465 -3189749 70017 2822338 4170310 4226224 2962320 1054380
6364 1054380 153936 593056 235445 -2655603 -6755200 -9649219 -10998822 -11615959 -10812253
$$ packed form
6426C464036k73833J570696K934152J355306j266924j753356k16422R73804Q84589
6417G672048M2663j592952l782748m402911j820027J866585L023452J493935L61415
6408B861460R29666J199785k97998k247959k915479k147083l18627K129494L451823
6399B645082J695785j977994l824415k542544j011296j590413k574520j324393
6391a0504708J622267L877368M525260L855977J799409r21848j896445N4219K482927
6382D894426K407482M94356m12853L04914Q72301L66052o68803k094976l877435
6373B285464m463854k298075J286716L259766K752321J347972N5914j263904j907940
6364A054380r00444M39120l57611k891048m099597k894019j349603o17137Q03706
$$ plain form
6355 -10812253 -7425968 -2728572 559405 1990164 3440869 5327059 5560795 3148163
6347 3148163 478841 671451 4142929 8873301 12726711 14462689 13695857 11200671 8670902
6338 8670902 7201924 6343812 5140658 3502330 2029494 1125400 884138 1316970 2075005
6329 2075005 2362680 1709377 573956 -229242 -430290 -245435 329500 1712146 4184430
6320 4184430 7328243 10074364 11388460 10996357 9364847 6995150 4068814 888101
6312 888101 -1832523 -3434689 -3692856 -2590890 -444934 1505731 1773694 668885 522625
6303 522625 2671008 5280018 5776743 4515253 3917060 4513532 4416808 2901516 1826539
6294 1826539 2521387 3679557 3964858 4763714 8186639 13422739 17210360 17566518 15413198
$$ packed form
6355a0812253L386285M697396L287977J430759J450705J886190K33736k412632
6347C148163k669322J92610L471478M730372L853410J735978p66832k495186k529769
6338H670902j468978q58112j203154j638328j472836r04094k41262M32832P58035
6329B075005K87675o53303j135421q03198k01048J84855N74935J382646K472284
6320D184430L143813K746121J314096l92103j631510k369697k926336l180713
6312H88101k720624j602166k58167J101966K145956J950665K67963j104809j46260
6303E22625K148383K609010M96725j261490n98193N96472r6724j515292j074977
6294A826539O94848J158170K85301P98856L422925N236100L787621L56158k153320
$$ plain form
6285 15413198 12772794 10857488 9830961 9016758 7176491 3765830 161265 -1380507
6277 -1380507 -323470 1407735 1638862 196955 -1443332 -2118737 -1906073 -1303591 -225708
6268 -225708 1673895 3790585 4432695 2648743 -51061 -874426 1009499 3386595 3811725
6259 3811725 2569337 1779887 2294051 2965323 2851280 2581983 3064055 3988680 4362383
6250 4362383 3816168 2800937 2097658 2633916 4976561 8108027 9323246 6667137 1567924
6241 1567924 -2032735 -1617377 1525013 4183733 4689096 3871333 3307082 3686902 4713001
6232 4713001 5562234 5295631 3649078 1642874 656361 737790 776327 627190 1753369
6223 1753369 4834362 7919221 8529100 7079557 6541753 8620104 11679210 12859775 11187516
$$ packed form
6285A5413198k640404j915306j026527q14203j840267l410661l604565j541772
6277a380507J057037J731205K31127j441907j640287o75405K12664O02482J077883
6268b25708J899603K116690O42110j783952k699804q23365J883925K377096M25130
6259C811725j242388p89450N14164O71272j14043k69297M82072R24625L73703
6250D362383n46215j015231p03279N36258K342645L131466J215219k656109n099213
6241A567924l600659M15358L142390K658720N05363q17763n64251L79820J026099
6232D713001Q49233k66603j646553k006204r86513Q1429L8537j49137J126179
6223A753369L080993L084859O09879j449543n37804K078351L059106J180565j672259
$$ plain form
6214 11187516 8157787 6054925 5993172 6885789 6214923 2645551 -2071460 -4775266 -4487721
6205 -4487721 -3117532 -2522385 -2517583 -2331547 -2244641 -2639746 -2898552 -2588693 -2454127 -2742692
6195 -2742692 -1860255 1374398 5128910 6471932 5374426 4444599 4784551 4593703 2381868
6186 2381868 -717446 -2750689 -3105734 -1870086 971308 4210542 5068394 2255043 -1630268
6177 -1630268 -2786560 -695846 2032418 3822778 5719658 8422591 10103832 8709858
6169 8709858 5109445 2183737 1199644 671698 -945830 -2791474 -2791372 -700469 1370653
6160 1370653 1811362 1804525 3646549 7241377 9828085 9591852 8035329 7624358 8269780
6151 8269780 7960974 6394746 5775019 7461803 9649080 9545944 6699531 2958220 71718
$$ packed form
6214A1187516l029729k102862o1753Q92617o70866l569372m717011k703806K87545
6205d487721J370189N95147M802J86036Q6906l95105k58806L09859J34566k88565
6195b742692Q82437L234653L754512J343022j097506r29827L39952j90848k211835
6186B381868l099314k033243l55045J235648K841394L239234Q57852k813351l885311
6177a630268j156292K090714K728264J790360J896880K702933J681241j393974
6169H709858l600413k925708r84093n27946j617528j845644J02K090903K071122
6160A370653M40709o837J842024L594828K586708k36233j556523m10971O45422
6151H269780l08806j566228o19727J686784K187277j03136k846413l741311k886502
$$ plain form
6142 71718 -1311040 -967235 892934 3051799 4257113 5030446 7155901 10877462 13852576
6133 13852576 13729903 10853789 7460543 4896715 2797024 687433 -925599 -1427145
6125 -1427145 -1145265 -824202 -376184 1146390 4141764 7406791 8967729 8036119 5782562
6116 5782562 3975737 3252508 3077819 2881665 2497207 1861880 1272455 1658073 3267149
6107 3267149 4132894 1673344 -3489645 -7144156 -6332493 -3114281 -1629143 -2494843 -2468168
6098 -2468168 706203 5537979 9144650 10159449 8659584 5311859 1792360 423982
6090 423982 1952617 4701039 6964000 8987706 11334473 12716624 11447039 8285191
6082 8285191 5752134 4883119 4726379 5085425 7315736 11336321 13891196 11789172 6044044
$$ packed form
6142G1718j382758L43805J860169K158865J205314P73333K125455L721561K975114
6133A3852576j22673k876114l393246k563828k099691k109591j613032n01546
6125a427145K81880L21063M48018J522574K995374L265027J560938r31610k253557
6116E782562j806825p23229j74689j96154l84458o35327n89425L85618J609076
6107C267149Q65745k459550n162989l654511Q11663L218212J485138q65700K6675
6098b468168L174371M831776L606671J014799j499865l347725l519499j368378
6090D23982J528635K748422K262961K023706K346767J382151j269585l161848
6082H285191k533057q69015j56740L59046K230311M020585K554875k102024n745128
$$ plain form
6073 6044044 934252 -812944 -133603 1197425 3366501 7047690 10513198 10594762 6723888
6064 6723888 2110769 31417 410524 1261903 2061313 3632843 5400889 5351863 3259690
6055 3259690 1770882 3011310 5581466 6387739 4575860 2297282 2130724 4895498 9497462
6046 9497462 13724735 15498156 14471778 12296400 10516068 8707682 5824870 2801625
6038 2801625 1991255 3778676 5498087 4668821 2116153 691658 1655979 3761951 5770881
6029 5770881 8297792 12246451 16259918 17256327 13974777 9048848 6567546 7840052
6021 7840052 10468282 11460508 10086329 7377985 4140185 501543 -3269372 -6610698
6013 -6610698 -9066085 -10027743 -8466285 -3987667 1865754 6423476 8442404 9293521 11174043
$$ packed form
6073F044044n109792j747196O79341J331028K169076L681189L465508Q1564l870874
6064F723888m613119k079352L79107Q51379P99410J571530J768046m9026k092173
6055C259690j488808J240428K570156Q06273j811879k278578j66558K764774M601964
6046I497462M227273J773421j026378k175378j780332j808386k882812l023245
6038B801625q10370J787421J719411q29266k552668j424495R64321K105972K008930
6029E770881K526911L948659M013467R96409l281550m925929k481302J272506
6021G840052K628230R92226j374179k708344l237800l638642l770915l341326
6013f610698k455387r61658J561458M478618N853421M557722K018928Q51117J880522
$$ plain form
6004 11174043 14440418 17175127 17470306 15796500 14560706 15133274 15960256 14341184 9653789
5995 9653789 3889591 -607656 -2665318 -1937072 987713 3789591 3782257 1036999 -1491282
5986 -1491282 -1784022 -824520 12178 1026536 1912945 288415 -4430782 -7883562 -5408123
5977 -5408123 1276592 5971197 6035400 4483456 4185940 4517963 4680017 5820931 7820452
5968 7820452 7867600 4945357 2552589 3953798 7282788 8505866 7110045 5495650 4418577
5959 4418577 2724815 721958 177134 1026317 1177091 -161878 -1580422 -2129196 -2355929
5950 -2355929 -2301469 -996109 1227851 2167731 675800 -1543804 -2238226 -1380840 -546970
5941 -546970 -604663 -1131643 -1374741 -796868 869582 3336220 5764463 7489892 8464028
$$ packed form
6004A1174043L266375K734709K95179j673806j235794N72568Q26982j619072m687395
5995I653789n764198m497247k057662P28246K924785K801878p334k745258k528281
5986a491282k92740R59502Q36698J014358Q86409j624530m719197l452780K475439
5977e408123O684715M694605O4203j551944k97516L32023J62054J140914J999521
5968G820452M7148k922243k392768J401209L328990J223078j395821j614395j077073
5959D418577j693762k002857n44824Q49183J50774j338969j418544n48774k26733
5950b355929N4460J305360K223960R39880j491931k219604o94422Q57386Q33870
5941e46970n7693n26980k43098N77873J666450K466638K428243J725429R74136
$$ plain form
5932 8464028 8742251 7983352 5881784 2963103 706797 717260 3431451 7474477 10680575
5923 10680575 11991646 11927137 11164858 9668817 7603553 5784374 4324140 2231558 -262078
5914 -262078 -395913 3959431 10598301 14704346 14037246 10458739 6797832 4626480 4835514
5905 4835514 7289270 9219132 6979521 925105 -3859064 -3419283 509716 3597962
5897 3597962 4538957 5211227 6743419 8223039 8833747 8888655 8730745 8402600 8345099 8825938
5887 8825938 8807176 6952130 3630363 364748 -2471958 -5504807 -7903838 -7385398 -3518859
5878 -3518859 901391 3123168 3641641 4588382 5978730 5542266 2161071 -2287213 -5135785
5869 -5135785 -5809714 -5565423 -5045327 -3458330 -441497 2526145 3784115 4037700 5551076
$$ packed form
5932H464028K78223p58899k101568k918681k256306J0463K714191M043026L206098
5923A0680575J311071o4509p62279j496041k065264j819179j460234k092582k493636
5914b62078j33835M355344O638870M106045o67100l578507l660907k171352K09034
5905D835514K453756J929862k239611o054416m784169M39781L928999L088246
5897C597962R40995O72270J532192J479620O10708N4908j57910l28145n7501M80839
5887H825938j8762j855046l321767l265615k836706l032849k399031N18440L866539
5878c518859M420250K221777N18473R46741J390348m36464l381195m448284k848572
5869e135785o73929K44291N20096J586997L016833K967642J257970K53585J513376
$$ plain form
5860 5551076 8415444 9415687 6074619 648030 -1944665 186443 4295117 7077236
5852 7077236 8038981 8080894 7140316 5067399 3211614 2889934 3136645 2214412 912432
5843 912432 1882676 5416185 8215102 7398525 4031329 1485147 1588222 3594948 5826835
5834 5826835 6894785 6020479 3595378 1162924 -193116 -1137685 -2926691 -5513320 -7822366
5825 -7822366 -9343245 -10223950 -10189206 -8702127 -6081655 -3368236 -1272568 -144755 -304249
5816 -304249 -1131322 -748897 1500088 3055112 1088798 -3007786 -5094333 -4279707 -3906689
5807 -3906689 -5623279 -6316424 -3178212 1480436 3518178 2539412 870890 -943444 -3816946
5798 -3816946 -6620665 -7016997 -5367724 -4230485 -4155128 -3448178 -2029068 -1816485 -2922687
$$ packed form
5860E551076K864368J000243l341068n426589k592695K131108M108674K782119
5852G077236R61745M1913r40578k072917j855785l21680K46711r22233j301980
5843I12432R70244L533509K798917q16577l367196k546182J03075K006726K231887
5834E826835J067950q74306k425101k432454j356040r44569j789006k586629k309046
5825g822366j520879q80705L4744J487079K620472K713419K095668J127813j59494
5816c04249q27073L82425K248985J555024j966314m096584k086547Q14626L73018
5807c906689j716590o93145L138212M658648K037742r78766j668522j814334k873502
5798c816946k803719l96332J649273J137239P5357P06950J419110K12583j106202
$$ plain form
5789 -2922687 -3204545 -2343698 -2551335 -4025930 -3736587 -776746 924533 -1704951 -5519776
5780 -5519776 -5123075 -226429 4552892 6029031 5079580 3499272 1670075 -104999 -501915
5771 -501915 1519843 5484680 9833400 12828105 13330602 11633671 9191511 6853395 4156645
5762 4156645 1107811 -621692 438668 3589016 7086568 9958404 11418941 10339455
5754 10339455 7415160 6176975 9048275 13458504 14777711 12355161 9588333 8545805
5746 8545805 8029367 7117710 6992167 8175759 9098088 8929863 9210755 10849713 11637014
5737 11637014 8839812 3058194 -2151588 -3735102 -1273253 3294749 7120915 8484310
5729 8484310 8107371 7813523 7920850 7266752 5683174 4467248 4057358 3358425 2019930
$$ packed form
5789b922687k81858Q60847k07637j474595K89343K959841J701279k629484l814825
5780e519776L96701M896646M779321J476139r49451j580308j829197j775074l96916
5771e01915K021758L964837M348720K994705N02497j696931k442160k338116k696750
5762D156645l048834j729503J060360L150348L497552K871836J460537j079486
5754A0339455k924295j238185K871300M410229J319207k422550k766828j042528
5746H545805n16438r11657j25543J183592R22329j68225K80892J638958P87301
5737A1637014k797202n781618n209782j583514K461849M568002L826166J363395
5729H484310l76939k93848J07327o54098j583578j215926m09890o98933j338495
$$ plain form
5720 2019930 1225120 1356979 1119392 122361 106951 2163342 4817662 6402643 7193708
5711 7193708 7515476 6112569 2723646 126581 741419 2740193 2551597 171810 -1101025
5702 -1101025 300727 2375585 2714067 1056494 -1344603 -2815760 -1807029 1629894
5694 1629894 4959353 5521245 3507446 1017566 -953239 -2488056 -2822926 -1310325 375305
5685 375305 141946 -814741 336327 2859271 2938975 -11337 -1832747 -30625 2395513
5676 2395513 2028705 290758 322210 1495079 934873 -1253982 -2185928 -819216 1086590
5667 1086590 2384253 3825372 5751335 7115435 7303305 6986901 6871369 7186742 8336692
5658 8336692 10340029 11810588 11339908 9690005 8568558 7440889 4155538 -850626
$$ packed form
5720B019930p94810J31859k37587r97031j5410K056391K654320J584981P91065
5711G193708L21768j402907l388923k597065O14838J998774j88596k379787j272835
5702a101025J401752K074858L38482j657573k401097j471157J008731L436923
5694A629894L329459N61892k013799k489880j970805j534817l34870J512601J685630
5685C75305k33359r56687J151068K522944P9704k950312j821410J802122K426138
5676B395513l66808j737947L1452J172869n60206k188855r31946J366712J905806
5667A086590J297663J441119J925963J364100J87870l16404j15532L15373J149950
5658H336692K003337J470559m70680j649903j121447j127669l285351n006164
$$ plain form
5650 -850626 -3742190 -1999780 2260035 5366828 6724951 8273160 10477412 11352789 9564459
5641 9564459 6613764 5175766 6229980 8508510 10202879 10492281 9550807 7818217 5748401
5632 5748401 3955512 2868543 2076355 657697 -1484909 -3236358 -3703329 -3411723 -3428872
5623 -3428872 -3915553 -4339463 -4481951 -4250501 -3149530 -1208009 110642 -514503 -2039289
5614 -2039289 -2092196 -224256 1619714 2047193 1730089 1474334 804886 -456523 -940266
5605 -940266 543584 3295778 5990428 8337931 10121170 10026325 7412839 4260752 3087138
5596 3087138 3314823 1987090 -1752400 -5029491 -4817258 -1523184 1936307 3480277 3280618
5587 3280618 2569402 2029186 1308505 -190616 -2028760 -2604144 -982185 1483331 2483235
$$ packed form
5650h50626k891564J742410M259815L106793J358123J548209K204252Q75377j788330
5641I564459k950695j437998J054214K278530J694369K89402r41474j732590k069816
5632E748401j792889j086969p92188j418658k142606j751449m66971K91606j7149
5623c428872m86681m23910j42488K31450J100971J941521J318651o25145j524786
5614b039289n2907J867940J843970M27479l17104k55755o69448j261409m83743
5605i40266J483850K752194K694650K347503J783239r4845k613486l152087j173614
5596C087138K27685j327733l739490l277091K12233L294074L459491J543970j99659
5587C280618p11216n40216p20681j499121j838144n75384J621959K465516R99904
$$ plain form
5578 2483235 1685682 1028785 1825297 3084707 3473349 3417137 3809650 3726522 1445540 -2422484
5568 -2422484 -4768058 -3611127 -516068 1626992 2318775 3608891 6732656 9948073
5560 9948073 10445405 7772707 4378910 2708630 2681128 2665055 2194319 2317149 3149070
5551 3149070 2777759 3308 -2760010 -1436896 4498270 10590835 12340421 10278465
5543 10278465 8571818 9484314 11358706 11967578 11404806 10621131 9162058 6309649 3297258
5534 3297258 2133748 2533268 2135939 19773 -1976065 -2106933 -1065645 -277939 600242
5525 600242 2709746 5384912 6586974 5987955 5814966 7825642 10606168 11026255 7997660
5516 7997660 3753196 1235610 1056854 1718608 2312103 3609323 5937230 7311075 5375140
$$ packed form
5578B483235p97553o56897P96512J259410L88642n6212L92513q3128k280982l868024
5568b422484k345574J156931L095059K143060O91783J290116L123765L215417
5560I948073M97332k672698l393797j670280k7502j6073m70736J22830Q31921
5551C149070l71311k774451k763318J323114N935166O092565J749586k061956
5543A0278465j706647R12496J874392O08872n62772p83675j459073k852409l012391
5534C297258j163510L99520l97329k116166j995838j30868J041288P87706Q78181
5525F00242K109504K675166J202062n99019j72989K010676K780526M20087l028595
5516G997660m244464k517586j78756O61754N93495J297220K327907J373845j935935
$$ plain form
5507 5375140 880546 -2619754 -2970736 -1617710 -754401 18101 2519723 6593986 9995829
5498 9995829 11485920 12146097 13187625 13907408 12676021 9280540 5625771 4191988 5749327
5489 5749327 8368178 9094111 7105865 4674286 4273914 5472457 5858486 4422867 2397013
5480 2397013 976315 42599 -609895 -536291 262373 999324 1559148 2952207 5616089
5471 5616089 8594153 11090745 13304175 14801827 13886728 10218246 6572057 5844781 7176729
5462 7176729 7294216 5277390 3625710 4420664 6693238 8333720 8666873 7995763 6208963
5453 6208963 3433518 1088619 549485 1038960 338674 -2275109 -5025927 -5923122 -5031870
5444 -5031870 -3891098 -3515251 -3783749 -4174540 -4016281 -2333071 1207646 4985233 6442304
$$ packed form
5507E375140m494594l500300l50982J353026Q63309P72502K501622M074263L401843
5498I995829J490091O60177J041528P19783j231387l395481l654769j433783J557339
5489E749327K618851P25933j988246k431579m00372J198543L86029j435619k025854
5480B397013j420698r33716o52494P3604P98664P36951N59824J393059K663882
5471E616089K978064K496592K213430J497652r15099l668482l646189p27276J331948
5462G176729J17487k016826j651680P94954K272574J640482L33153o71110j786800
5453F208963k775445k344899n39134M89475p00286k613783k750818q97195Q91252
5444e031870J140772L75847k68498l90791J58259J683210L540717L777587J457071
$$ plain form
5435 6442304 5157955 3728739 4462008 6214897 6171315 4188793 3282890 5462120 8917502
5426 8917502 10241407 8128069 3924861 -385616 -3599942 -5356880 -5834412 -5220646 -3244938
5417 -3244938 71324 3143811 3770016 2000974 473366 790397 1324930 343283 -476741
5408 -476741 1563912 5231637 6150179 2836805 -1120543 -1997338 -374757 1010201 1568278
5399 1568278 2596277 4078852 4509430 3780486 3967492 6512174 9965326 11333128 9095976
5390 9095976 4580513 858626 373666 2933001 5718063 5804862 3026520 -10463 -936321
5381 -936321 -81751 563190 376728 1038887 4013544 7831290 9038330 6208324 2205341
5372 2205341 1487490 5218435 9927947 11336598 8755543 5105567 3287757 3685910 5088132
$$ packed form
5435F442304j284349j429216P33269J752889m3582j982522r05903K179230L455382
5426H917502J323905k113338m203208m310477l214326j756938m77532O13766J975708
5417c244938L316262L072487O26205j769042j527608L17031N34533r81647q20024
5408d76741K040653L667725R18542l313374l957348q76795J622581J384958N58077
5399A568278J027999J482575M30578p28944J87006K544682L453152J367802k237152
5390I095976m515463l721887m84960K559335K785062Q6799k778342l036983r25858
5381i36321Q54570O44941j86462O62159K974657L817746J207040k830006m002983
5372B205341p17851L730945M709512J408651k581055l649976j817810L98153J402222
$$ plain form
5363 5088132 6597976 7829677 8203422 7377757 6184798 5988059 7014816 8323948 9478592
5354 9478592 10879358 11974555 10817740 6747309 2190232 -73484 -551709 -1686353
5346 -1686353 -3393167 -2912969 355482 2971169 2189246 149946 809138 4298798 7241473
5337 7241473 7875073 7754147 8202490 8078194 6316136 4501703 5081630 8059160 11014378
5328 11014378 11935138 10807003 8594228 5802452 2513358 -624095 -2109413 -790374
5320 -790374 2586498 5560710 6207472 4966946 3819666 4020982 5225847 6428787 6939445
5311 6939445 6658868 6195978 6463775 7277342 6681811 2946875 -2691981 -6587746 -6543809
5302 -6543809 -4258514 -3306078 -5221979 -8134470 -9027247 -6963450 -3950276 -2520110 -2699019
$$ packed form
5363E088132J509844J231701L73745q25665j192959j96739J026757J309132J154644
5354I478592J400766J095197j156815m070431m557077k263716m78225j134644
5346a686353j706814M80198L268451K615687p81923k039300O59192L489660K942675
5337G241473O33600j20926M48343j24296j762058j814433N79927K977530K955218
5328A1014378R20760j128135k212775k791776l289094l137453j485318J319039
5320g90374L376872K974212O46762j240526j147280K01316J204865J202940N10658
5311F939445k80577m62890K67797Q13567n95531l734936n638856l895765M3937
5302f543809K285295R52436j915901k912491q92777K063797L013174J430166j78909
$$ plain form
5293 -2699019 -2160552 506813 4004895 6577473 8563725 11093419 13421912 13813567 12536498
5284 12536498 11559293 11311337 10221765 7913120 6431706 7340478 9554618 11032931 10845736
5275 10845736 8765036 4869197 701234 -1237304 -623098 -80833 -1277261 -2222457 -423478
5266 -423478 3144225 5655253 6531613 7212340 7950130 7831854 7408096 8206520 9692304
5257 9692304 9822327 9030536 10415470 14688246 17860299 16096281 10822542 6606814 5293051
5248 5293051 4823686 3319300 1653332 1426971 2363426 2796868 1632461 -1088645 -4644880
5239 -4644880 -7623598 -8258013 -6226113 -3833317 -3768389 -5417911 -5164587 -1276798 3251907
5230 3251907 4552442 3238464 3251891 5764653 7444780 5784050 3179966 3442952 6228169
$$ packed form
5293b699019N38467K667365L498082K572578J986252K529694K328493L91655j277069
5284A2536498r77205k47956j089572k308645j481414R08772K214140J478313j87195
5275A0845736k080700l895839m167963j938538O14206N42265j196428r45196J798979
5266d23478L567703K511028Q76360O80727P37790j18276m23758P98424J485784
5257I692304J30023p91791J384934M272776L172053j764018n273739m215728j313763
5248E293051m69365j504386j665968k26361R36455M33442j164407k721106l556235
5239d644880k978718o34415K031900K392796O4928j649522K53324L887789M528705
5230C251907J300535j313978J3427K512762J680127j660730k604084K62986K785217
$$ plain form
5221 6228169 7832443 6659694 4886824 4497844 4410541 2764076 109531 -1448876 -1323412
5212 -1323412 -876770 -1002385 -903873 228115 1623450 2105193 2098227 2977340 4522149 4741211
5202 4741211 2892809 1058354 1364567 2900459 3150140 1596270 -75927 -681560 -220473
5193 -220473 1557866 4532028 6333171 4352709 224626 -1055926 2230072 6074607
5185 6074607 6737659 5776925 6368975 7760198 7169173 5055781 4240931 4803502 3994391
5176 3994391 1158488 -858405 279810 3706498 6952225 7926437 5523129 835497
5168 835497 -2479700 -1826479 574638 522761 -1960571 -2983540 -1390337 -487412 -1857281
5159 -1857281 -2081281 1497121 5492543 4915011 649912 -1652596 609388 4016042 4394934
$$ packed form
5221F228169J604274j172749j772870l88980q7303j646465k654545j558407J25464
5212a323412M46642j25615R8512J131988J395335M81743o966Q79113J544809K19062
5202D741211j848402j834455L06213J535892K49681j553870j672197o05633M61087
5193b20473J778339K974162J801143j980462m128083j280552L285998L844535
5185F074607O63052r60734N92050J391223n91025k113392q14850N62571q09111
5176C994391k835903k016893J138215L426688L245727R74212k403308m687632
5168H35497l315197O53221K401117n1877k483332j022969J593203R02925j369869
5159a857281k24000L578402L995422n77532m265099k302508K261984L406654L78892
$$ plain form
5150 4394934 2230230 1503675 4542860 9376747 12185142 11703855 10299769 10257772 10352074
5141 10352074 8038443 4279333 3124728 5914757 9036421 9108831 7647937 8160161 10815985
5132 10815985 13056951 14108472 15527134 17566894 18040421 15330640 10353611 4998225
5124 4998225 431902 -2561646 -3347207 -2402848 -1258387 -693044 39196 1599703 3218869
5115 3218869 3794724 3576898 3769883 4776737 5717226 5683458 4718570 3304405 1605746
5106 1605746 -52887 -431484 1586515 4878800 6415962 4845423 2681991 3285098 6356537
5097 6356537 8545954 8312780 7613966 8094772 8230240 6001310 2503037 631371 1170036
5088 1170036 2274428 2300475 1177372 -801923 -3564322 -6246889 -7136754 -5346978 -1780949
$$ packed form
5150D394934k164704p26555L039185M833887K808395m81287j404086m1997R4302
5141A0352074k313631l759110j154605K790029L121664P2410j460894N12224K655824
5132A0815985K240966J051521J418662K039760M73527k709781m977029n355386
5124D998225m566323k993548p85561R44359J144461N65343P32240J560507J619166
5115C218869N75855k17826J92985J006854R40489l3768r64888j414165j698659
5106A605746j658633l78597K017999L292285J537162j570539k163432O03107L071439
5097F356537K189417k33174o98814M80806J35468k228930l498273j871666N38665
5088A170036J104392K6047j123103j979295k762399k682567q89865J789776L566029
$$ plain form
5079 -1780949 1888381 4489097 5454453 4534795 1914714 -1735391 -5508859 -8312116 -8917421
5070 -8917421 -6785620 -3047588 77141 1404794 1950373 3372003 5461414 6041497 3753199
5061 3753199 261702 -1227428 489606 3511165 5394638 5732178 5660963 5947649 6604785
5052 6604785 7658175 9105106 10455940 11212847 11394668 10896853 9159040 6432056 4365737
5043 4365737 4042344 4482830 4658141 5709255 8941667 12622875 13510868 11112893 7705910
5034 7705910 4572223 1455457 -284157 2137771 8354048 13775030 14861579 12894384
5026 12894384 10938158 9711669 8423594 7356850 7314523 8065469 9168389 10906850 12984422
5017 12984422 13954534 13307094 12338893 11721387 10363430 8125332 7202772 8847119 10970962
$$ packed form
5079a780949L669330K600716R65356r19658k620081l650105l773468k803257o05305
5070h917421K131801L738032L124729J327653N45579J421630K089411N80083k288298
5061C753199l491497j489130J717034L021559J883473L37540p1215K86686O57136
5052F604785J053390J446931J350834P56907J81821m97815j737813k726984k066319
5043D365737l23393M40486J75311J051114L232412L681208Q87993k397975l406983
5034G705910l133687l116766j739614K421928O216277N420982J086549j967195
5026A2894384j956226j226489j288075j066744m2327P50946J102920J738461K077572
5017A2984422R70112o47440r68201o17506j357957k238098r22560J644347K123843
$$ plain form
5008 10970962 11195575 10234878 10079938 10862132 11733761 12716893 13296423 11479549 7057063
4999 7057063 3624397 4241169 7033815 8334705 8127668 8607871 9246654 7910536 5924158
4990 5924158 7149971 11848153 15796405 16251939 14922655 13943874 12496844 9186026 5114814
4981 5114814 2689122 2917451 5105809 7946047 10055789 10470449 9197604 6821478 3914362
4972 3914362 1489361 929304 2149475 3026000 2267621 1480708 2422995 3831909 3630029
4963 3630029 2853834 4162381 7328045 9615842 10224515 10925164 12317860 12875896 12180860
4954 12180860 11954198 13014828 13905359 13555886 13075920 13808882 15248543 15805890 14647649
4945 14647649 12429789 10843700 11048773 11985999 11380308 9134232 7801141 8500957 8997082
$$ packed form
5008A0970962K24613r60697j54940P82194Q71629R83132N79530j816874m422486
4999G057063l432666O16772K792646J300890k07037M80203O38783j336118j986378
4990E924158J225813M698182L948252M55534j329284r78781j447030l310818m071212
4981E114814k425692K28329K188358K840238K109742M14660j272845k376126k907116
4972C914362k425001n60057J220171Q76525p58379p86913R42287J408914k01880
4963C630029p76195J308547L165664K287797O08673P00649J392696N58036o95036
4954A2180860k26662J060630Q90531l49473m79966P32962J439661N57347j158241
4945A4647649k217860j586089K05073R37226o05691k246076j333091O99816M96125
$$ plain form
4936 8997082 7878409 7702197 10902982 15277634 17317091 17720055 19318980 21355900 20481369
4927 20481369 16429147 12397484 10521356 10752892 13150393 17409101 21224107 22779489
4919 22779489 23447421 24645411 24463473 21457187 18775097 19554861 21290640 20294386 18370542
4910 18370542 18759100 19196795 16551136 14679512 18819698 25263762 26410121 23485784
4902 23485784 23517260 25813040 23477943 17263619 14998515 17168223 16477960 12711115 13911693
4893 13911693 20722843 24124746 21839585 22086464 27271107 29604705 27537406 29930696
4885 29930696 38238046 42133104 39419324 41154794 49417822 51820096 47861621 55374306
4877 55374306 77043970 89915799 88353072 102617522 139832822 139180305 40254814 -117374764
$$ packed form
4936H997082j118673j76212L200785M374652K039457M02964J598925K036920q74531
4927B0481369m052222m031663j876128K31536K397501M258708L815006J555382
4919B2779489O67932J197990j81938l006286k682090P79764J735779r96254j923844
4910A8370542L88558M37695k645659j871624M140186O444064J146359k924337
4902B3485784L1476K295780k335097o214324k265104K169708o90263l766845J200578
4893A3911693O811150L401903k285161K46879N184643K333598k067299K393290
4885B9930696Q307350L895058k713780J735470Q263028K402274l958475P512685
4877E5374306K1669664J2871829j562727J4264450L7215300o52517r8925491j57629578
$$ plain form
4869 -117374764 -221057940 -215773280 -156221104 -117404561 -106743905 -91668827 -67515625
4862 -67515625 -54732986 -54528290 -49537453 -37802094 -32652666 -34872812 -32909146 -26785818
4854 -26785818 -27175003 -33076524 -32666160 -25257705 -22080098 -25213891 -24670110 -17720781 -13763274
4845 -13763274 -17297343 -21251315 -20322413 -17710732 -15822757 -12407062 -8521737 -9125020
4837 -9125020 -13403535 -14965220 -13304810 -14452056 -18694491 -18882834 -13303238 -8988738
4829 -8988738 -8928403 -6991534 1716 5488230 3906427 -780342 -3037293 -4134576 -6587036
4820 -6587036 -7604024 -4731853 -2101333 -4491649 -9781925 -13144778 -14557095 -16456257
4812 -16456257 -17597306 -15081983 -10054719 -6258884 -4636309 -3518263 -2499902 -2314958
$$ packed form
4869a17374764j03683176N284660N9552176L8816543J0660656J5075078K4153202
4862f7515625J2782639K04696M990837J1735359N149428k220146J963666O123328
4854b6785818l89185n901521M10364P408455L177607l133793N43781O949329L957507
4845a3763274l534069l953972R28902K611681J887975L415695L885325o03283
4837i125020m278515j561685J660410j147246m242435j88343N579596M314500
4829h988738O0335J936869O993250N486514j581803m686769k256951j097283k452460
4820f587036j016988K872171K630520k390316n290276l362853j412317j899162
4812a6456257j141049K515323N027264L795835J622575J118046J018361J84944
$$ plain form
4804 -2314958 -2210838 -792055 1465763 2995285 3272712 2274232 -613335 -5196713 -9448625
4795 -9448625 -11550799 -11668580 -10694914 -9035593 -7511043 -7253751 -7708347 -7004519 -5145893
4786 -5145893 -4188459 -4376993 -3231870 163204 3228637 4158008 5041802 8260598 12199091
4777 12199091 13125034 9661833 3452814 -2900972 -6916755 -7252932 -5535682 -5409858 -8052671
4768 -8052671 -10370885 -9262083 -5774878 -3233614 -3000358 -4028451 -5089029 -5443859 -4431165
4759 -4431165 -2177855 -22221 918887 783155 -73561 -1831728 -4246549 -6382214 -7921206
4750 -7921206 -9190063 -9527161 -7697815 -4533639 -2845340 -3779856 -5506931 -6436112 -7201282
4741 -7201282 -8208205 -7938827 -5665265 -3692706 -4727626 -8380582 -11846759 -12788219 -10594261
$$ packed form
4804b314958J04120J418783K257818J529522K77427r98480k887567m583378m251912
4795i448625k102174j17781R73666J659321J524550K57292m54596P03828J858626
4786e145893R57434j88534J145123L395074L065433R29371Q83794L218796L938493
4777A2199091R25943l463201o209019o353786m015783l36177J717250J25824k642813
4768h052671k318214J108802L487205K541264K33256j028093j060578l54830J012694
4759d431165K253310K155634R41108j35732q56716j758167k414821k135665j538992
4750g921206j268857l37098J829346L164176J688299r34516j727075r29181p65170
4741g201282j006923K69378K273562J972559j034920l652956l466177r41460K193958
$$ plain form
4732 -10594261 -6567917 -3805768 -4788343 -8014809 -9254643 -7107626 -4574810 -3863015
4724 -3863015 -2999154 114293 3405168 3479244 485434 -2923851 -5628694 -8005601 -9428825
4715 -9428825 -8901253 -7165229 -5586848 -3992374 -1925522 -627502 -1151682 -1899900 -919974
4706 -919974 501893 -423646 -3480822 -5643573 -5242914 -3239100 -958933 658564 139888
4697 139888 -3212965 -7281403 -9148771 -8996558 -9347365 -10775665 -11402885 -10605503 -9937956
4688 -9937956 -9867921 -8819099 -6476403 -5053580 -5782837 -6688126 -5608093 -3342462 -1877718
4679 -1877718 -1166455 187953 2082185 2910657 2185246 1441465 2129198 3493291 3063926
4670 3063926 -790502 -6766034 -11207964 -11284762 -7750152 -4190624 -3389581 -4691883 -5006599
$$ packed form
4732a0594261M026344K762149r82575l226466j239834K147017K532816P11795
4724c863015Q63861L113447L290875P4076k993810l409285k704843k376907j423224
4715i428825N27572J736024J578381J594474K066852J298020n24180p48218R79926
4706i19974J421867r25539l057176k162751M00659K003814K280167J617497n18676
4697A39888l352853m068438j867368J52213l50807j428300o27220P97382O67547
4688i937956P0035J048822K342696J422823p29257r05289J080033K265631J464744
4679a877718P11263J354408J894232Q28472p25411p43781O87733J364093m29365
4670C063926l854428n975532m441930p6798L534610L559528Q01043j302302l14716
$$ plain form
4661 -5006599 -2239577 2217053 4459879 2028392 -3030001 -5850367 -3794925 1246773
4653 1246773 6075501 10050444 14201583 17805765 18433799 15581738 12144836 11255203 12719791
4644 12719791 13469464 11005734 5807170 627971 -2115622 -2281891 -1669144 -2154231 -4259254
4635 -4259254 -6883569 -7780086 -5119573 -63420 2786720 -216198 -6687296 -9998633
4627 -9998633 -7012977 -1578093 919665 -257877 -2414656 -3967901 -4657059 -3253665
4619 -3253665 1218165 6814319 10388637 11311305 10691845 8216860 3545659 -40337 1875061
4610 1875061 8178434 12513937 11589568 9074303 9228748 10632046 9397525 5702612 3335217
4601 3335217 4113848 6078687 6835222 6163337 5233197 4917844 5038314 4519803 2754456
$$ packed form
4661e006599K767022M456630K242826k431487n058393k820366K055442N041698
4653A246773M828728L974943M151139L604182O28034k852061l436902q89633J464588
4644A2719791P49673k463730n198564n179199k743593j66269O12747m85087k105023
4635d259254k624315q96517K660513N056153K850140l002918o471098l311337
4627i998633K985656N434884K497758j177542k156779j553245o89158J403394
4619c253665M471830N596154L574318R22668o19460k474985m671201l585996J915398
4610A875061O303373M335503r24369k515265J54445J403298j234521l694913k367395
4601C335217P78631J964839P56535o71885r30140l15353J20470n18511j765347
$$ plain form
4592 2754456 1206632 2324699 5950016 8392309 6610042 2097855 -1016406 -753396
4584 -753396 1452808 3331856 3830857 3185957 2582857 3359812 5282630 6277835 5139360
4575 5139360 3479311 3320950 3835518 2703535 -16128 -1981121 -2301147 -2404473 -2818710
4566 -2818710 -1920044 947761 3494879 3308124 1029833 -806822 -747488 1153404 4317604
4557 4317604 7278727 7782322 5600544 4293610 7381631 12964333 15112260 11288829
4549 11288829 5585079 3129874 3873184 4322906 3439442 3282143 4304963 3809794 367963
4540 367963 -3092015 -2821476 861541 4596162 6792656 8669283 10626363 10489055 6618790
4531 6618790 849823 -3350368 -4574679 -3792658 -1863271 1257653 4841763 6836287
$$ packed form
4592B754456j547824J118067L625317K442293j782267m512187l114261K63010
4584g53396K206204J879048M99001o44900o03100P76955J922818R95205j138475
4575E139360j660049j58361N14568j131983k719663j964993l20026j03326m14237
4566b818710Q98666K867805K547118j86755k278291j836655N9334J900892L164200
4557D317604K961123N03595k181778j306934L088021N582702K147927l823431
4549A1288829n703750k455205P43310M49722q83464j57299J022820m95169l441831
4540C67963l459978K70539L683017L734621K196494J876627J957080j37308l870265
4531F618790n768967m200191j224311P82021J929387L120924L584110J994524
$$ plain form
4523 6836287 5881238 2839795 -470680 -3231808 -5410801 -6319883 -4771064 -820286 3601868
4514 3601868 6312646 6792932 6253646 6058957 6286375 5819140 3942514 1804348 1678874
4505 1678874 4263518 7276749 7673166 4956099 1251910 -1609043 -3591749 -4977045
4497 -4977045 -5263368 -4430279 -3721550 -3843029 -3497013 -1069380 3090047 7276872 10291322
4488 10291322 11342941 9418765 4848713 660803 -69685 1921494 3003352 1308737
4480 1308737 -1668895 -3977701 -5117481 -4757474 -2412543 470234 621842 -3114410 -7677489
4471 -7677489 -9245282 -7559025 -5532108 -5721818 -8241835 -10953996 -10833841 -6597113 -978336
4462 -978336 1132452 -2023617 -7055484 -9615925 -8826327 -6406305 -3639490 -1192391 -164883
$$ packed form
4523F836287r55049l041443l310475k761128k178993r09082J548819L950778M422154
4514C601868K710778M80286n39286j94689K27418m67235j876626k138166j25474
4505A678874K584644L013231L96417k717067l704189k860953j982706j385296
4497d977045k86323Q33089P08729j21479L46016K427633M159427M186825L014450
4488A0291322J051619j924176m570052m187910p30488J991179J081858j694615
4480A308737k977632k308806j139780L60007K344931K882777J51608l736252m563079
4471g677489j567793J686257K026917j89710k520017k712161J20155M236728N618777
4462i78336K110788l156069n031867k560441P89598K420022K766815K447099J027508
$$ plain form
4453 -164883 -945339 -2032195 -1885741 -933293 -123906 1088810 3374118 5520890 5999766
4444 5999766 5380609 5063425 4809163 3800100 2914074 3391944 4275667 3771921 2186090
4435 2186090 849030 -717230 -3440053 -5532754 -4385810 -1208215 54892 -1445066
4427 -1445066 -2555072 -1598145 -834806 -2209346 -4268634 -5117507 -5306422 -5678283 -5015259
4418 -5015259 -2192941 1326445 3390237 4032045 4565689 5215900 5467108 5560140 5904940
4409 5904940 5956069 5182173 4320600 4362123 5066388 5626422 6078231 7078003 8935015 11497170
4399 11497170 14121888 15308296 13648733 9895246 6808925 6051979 6360732 5666420 3883097
4390 3883097 2631311 3179356 5533251 8642036 10711134 10239079 7571095 4709568 3013066
$$ packed form
4453a64883p80456j086856J46454R52448Q09387J212716K285308K146772M78876
4444E999766o19157l17184k54262j009063q86026M77870Q83723n03746j585831
4435B186090j337060j566260k722823k092701J146944L177595J263107j499958
4427a445066j110006R56927P63339j374540k059288q48873j88915l71861O63024
4418e015259K822318L519386K063792O41808N33644O50211K51208R3032L44800
4409E904940N1129p73896q61573M1523P04265N60034M51809R99772J857012K562155
4399A1497170K624718J186408j659563l753487l086321p56946L08753o94312j783323
4390C883097j251786N48045K353895L108785K069098m72055k667984k861527j696502
$$ plain form
4381 3013066 1820930 -251481 -3448789 -6559671 -7731500 -5780953 -1737715 1351164
4373 1351164 1628367 914662 2116215 4828291 6193803 5785922 6175367 8042810 8336431
4364 8336431 4901361 -63726 -3033094 -3086174 -1193521 1576891 3161674 892692 -4353021
4355 -4353021 -6969004 -3017104 3896810 6552447 2861159 -2467145 -4290284 -2031976
4347 -2031976 1455789 3290388 2467489 212874 -1292408 -1400589 -1481222 -2076627 -1308284
4338 -1308284 2089590 5857833 6798526 5054826 3262115 2464253 1609942 344660 -590600
4329 -590600 -1369315 -2688775 -3562786 -2314486 192902 1184949 217094 -65412 1762374
4320 1762374 3577497 3158532 1704184 1848008 3449655 3550713 438237 -3773636 -5257701
$$ packed form
4381C013066j192136k072411l197308l110882j171829J950547M043238L088879
4373A351164K77203p13705J201553K712076J365512m07881L89445J867443K93621
4364H336431l435070m965087k969368n3080J892653K770412J584783k268982n245713
4355d353021k615983L951900O913914K655637l691288n328304j823139K258308
4347b031976L487765J834599q22899k254615j505282j08181q0633n95405P68343
4338a308284L397874L768243R40693j743700j792711p97862q54311j265282r35260
4329e90600p78715j319460q74011J248300K507388R92047r67855k82506J827786
4320A762374J815123m18965j454348J43824J601647J01058l112476m211873j484065
$$ plain form
4311 -5257701 -2644535 1579017 3951211 3682017 2769006 3105588 4877340 7601694 10763150
4302 10763150 12901623 12131549 8678685 5187477 3469044 2814670 2542294 3655314 6130353
4293 6130353 7141258 4637362 624259 -1949034 -3596745 -6366615 -9361336 -10086210
4285 -10086210 -9040760 -8740234 -8743490 -6116874 -1085939 2207392 1764337 679012 2267875
4276 2267875 5349691 6379620 4037212 -22557 -3215666 -3552930 -837227 2564886
4268 2564886 3707144 2559183 1829516 2849624 3875511 3329199 2350636 2740502 4373127
4259 4373127 6158680 7827904 9221457 9398374 8116585 6882402 6857971 6865055 5267477
4250 5267477 3005539 2763923 5236545 7895171 7914994 5278805 2384382 1134295 1136593
$$ packed form
4311e257701K613166M223552K372194k69194r13011L36582J771752K724354L161456
4302A0763150K138473p70074l452864l491208j718433o54374k72376J113020K475039
4293F130353J010905k503896m013103k573293j647711k769870k994721p24874
4285a0086210J045450L00526l256K626616N030935L293331m43055j085325J588863
4276B267875L081816J029929k342408m059769l193109l37264K715703L402113
4268B564886J142258j147961p29667J020108J025887n46312r78563L89866J632625
4259D373127J785553J669224J393553J76917j281789j234183k4431P084j597578
4250E267477k261938k41616K472622K658626J9823k636189k894423j250087K298
$$ plain form
4241 1136593 812179 -368771 -1360796 -955588 1110342 4314199 7464315 8645209 6677157
4232 6677157 3179002 1460380 2508863 3946480 4057138 4489191 7003440 9850181 10293002
4223 10293002 9174383 9744774 12762420 15820115 17135545 17173381 16695902 15817235 14925778
4214 14925778 14269281 12876041 9986306 6907566 5166928 3763564 990459 -1934372
4206 -1934372 -2240437 -39436 1870908 2281947 2373398 2493302 1581808 -76087 -760128
4197 -760128 -219379 230870 471068 1526117 3041584 3861526 4596437 6244373 6945873
4188 6945873 4079118 -763209 -3084551 -1777992 -14023 192105 81252 602933 924202
4179 924202 843814 931738 346647 -1766007 -3447921 -2576720 -930245 -850234 54579 4799585
$$ packed form
4241A136593l24414j180950r92025M05208K065930L203857L150116J180894j968052
4232F677157l498155j718622J048483J437617J10658M32053K514249K846741M42821
4223A0293002j118619N70391L017646L057695J315430L7836m77479q78667q91457
4214A4925778o56497j393240k889735l078740j740638j403364k773105k924831
4206a934372l06065K201001J910344M11039R1451J19904r11494j657895o84041
4197g60128N40749M50249K40198J055049J515467Q19942P34911J647936P01500
4188F945873k866755m842327k321342J306559J763969K06128j10853N21681L21269
4179I24202q0388Q7924n85091k112654j681914Q71201J646475Q0011R04813M745006
$$ plain form
4169 4799585 9817991 9373607 5510623 5080586 8034004 8227297 5261354 4863939 7374045
4160 7374045 7505006 6327179 10494597 17864990 18396434 12259848 10877864 15726994 14931836
4151 14931836 7693519 10077542 25362274 34248684 33745378 58100451 127529387 195281074
4143 195281074 189697200 106624464 18838403 -13548193 -4064304 2243797 -5781827 -9294029
4135 -9294029 -2510248 1736858 -888865 -1709242 1164819 20419 -6074926 -9434475
4127 -9434475 -8501464 -9786765 -14478692 -16005989 -12088716 -7993312 -6494702 -4584609
4119 -4584609 -1482656 -713657 -2549633 -2588586 385507 2382520 1533176 683832 1266890
4110 1266890 976178 -927585 -1896529 -1122757 -730517 -646325 2142968 7574427 11059524
$$ packed form
4169D799585N018406m44384l862984m30037K953418J93293k965943l97415K510106
4160G374045J30961j177827M167418P370393N31444o136586j381984M849130p95158
4151A4931836p238317K384023J5284732Q886410n03306K4355073O9428936O7751687
4143A95281074n583874q3072736q7786061l2386596R483889O308101q025624l512202
4135i294029O783781M247106k625723q20377K874061j144400o095345l359549
4127i434475R33011j285301m691927j527297L917273M095404J498610J910093
4119d584609L101953P68999j835976l8953K974093J997013q49344q49344N83058
4110A266890k90712j903763r68944P73772L92240Q4192K789293N431459L485097
$$ plain form
4101 11059524 10056717 7394466 6072308 5187196 3174379 999009 -312790 -1897900
4093 -1897900 -4474800 -6427790 -6581461 -6361312 -7260701 -8370849 -8187316 -6943324 -5561599
4084 -5561599 -3936257 -1681210 683198 2369933 3206490 3379739 3241042 3349171 3548675
4075 3548675 2386553 -981082 -4678901 -5727146 -3605689 -585085 1142000 1041125
4067 1041125 -403684 -2010034 -2190694 -849364 -232145 -1921692 -4116607 -4329662 -3468023
4058 -3468023 -4035514 -5278140 -3980524 71178 3344016 3848835 3621204 4983653 7555639
4049 7555639 10125517 12519388 14225175 13736604 10710351 6714459 2859015 -1127392
4041 -1127392 -4684481 -5919035 -4592594 -3188250 -3498318 -4288676 -3870606 -2930877 -3044683
$$ packed form
4101A1059524j002807k662251j322158q85112k012817k175370j311799j585110
4093a897900k576900j952990j53671K20149q99389j110148J83533J243992J381725
4084e561599J625342K255047K364408J686735Q36557J73249j38697J08129J99504
4075C548675j162122l367635l697819j048245K121457L020604J727085j00875
4067A041125j444809j606350j80660J341330O17219j689547k194915k13055Q61639
4058c468023n67491j242626J297616M051702L272838N04819k27631J362449K571986
4049G555639K569878K393871J705787m88571l026253l995892l855444l986407
4041a127392l557089j234554J326441J404344l10068p90358M18070R39729j13806
$$ plain form
4032 -3044683 -4045968 -4616994 -4241834 -3225823 -2066684 -1958742 -4366929 -8668493 -11614547
4023 -11614547 -10702290 -7004609 -3307397 -657059 1651353 3721070 4649687 4150987 2984994
4014 2984994 1749221 404585 -927497 -1701060 -1822271 -2169574 -3680647 -5929289 -7058702
4005 -7058702 -5647141 -2505123 173503 1438324 2074503 2184197 292887 -3801512 -7312244
3996 -7312244 -7844611 -6863984 -6996004 -7296871 -4920844 -858108 404146 -2288648 -4429868
3987 -4429868 -2154148 2646829 5890546 7070680 8559289 11153996 13287934 13598309
3979 13598309 11870779 8283856 3849536 874137 936662 2800130 3895886 3298429 1774458
3970 1774458 -225710 -2667377 -4480921 -4072697 -1511709 1294258 2918071 3760035 4800011
$$ packed form
4032c044683j001285n71026L75160J016011J159139J07942k408187m301564k946054
4023a1614547R12257L697681L697212K650338K308412K069717R28617m98700j165993
4014B984994j235773j344636j332082p73563j21211l47303j511073k248642j129413
4005g058702J411561L142018K678626J264821O36179J09694j891310m094399l510732
3996g312244n32367R80627j32020l00867K376027M062736J262254k692794k141220
3987d429868K275720M800977L243717J180134J488609K594707K133938L10375
3979A3598309j727530l586923m434320k975399O2525J863468J095756n97457j523971
3970A774458k000168k441667j813544M08224K560988K805967J623813Q41964J039976
$$ plain form
3961 4800011 6058970 6911661 7384562 8360184 10152452 11224804 9419827 5152240 2190449
3952 2190449 3494034 6919011 7494031 4048522 783212 1349965 4269064 6031854 6063149
3943 6063149 5855829 5196660 2715039 -684453 -2371427 -1992219 -1848235 -2734284 -2317804
3934 -2317804 992229 4879639 5774319 3387602 726427 154690 1126204 1849833 1701362
3925 1701362 1171026 255491 -1681934 -4061383 -4301300 -438066 5537208 8710725 6635998
3916 6635998 2518733 1575078 4881483 8576859 9117951 7414474 6769407 8013003 8417125
3907 8417125 5499670 529824 -2780305 -2656715 -1099556 -924740 -2093658 -2237827 -326768
3898 -326768 1886345 2459181 1802864 1634417 2353430 2669272 1457403 -993559 -3433459
$$ packed form
3961D800011J258959Q52691M72901R75622J792268J072352j804977m267587k961791
3952B190449J303585L424977N75020l445509l265310N66753K919099J762790L1295
3943F063149k07320o59169k481621l399492j686974L79208J43984q86049M16480
3934b317804L310033L887410Q94680k386717k661175n71737R71514P23629j48471
3925A701362n30336r15535j937425k379449k39917L863234N975274L173517k074727
3916F635998m117265r43655L306405L695376N41092j703477o45067J243596M04122
3907H417125k917455m969846l310129J23590J557159J74816j168918j44169J911059
3898c26768K213113N72836o56317j68447P19013L15842j211869k450962k439900
$$ plain form
3889 -3433459 -4604740 -3882876 -1664448 839731 2639559 3791466 4916966 6062829
3881 6062829 6426869 5240480 2746793 245166 -975110 -933999 -978556 -2151421 -3864897
3872 -3864897 -4802069 -4773147 -4708858 -4943318 -4652203 -3188930 -962689 1221653 2682387
3863 2682387 2581469 394177 -2943996 -5575195 -6834209 -7539602 -7788694 -6247484 -2691989
3854 -2691989 428896 650429 -1324034 -2702418 -2068808 -179531 1984878 4066751 5391190
3845 5391190 4967389 2844783 328467 -1443776 -2247180 -2033886 -559672 1811121 3757915
3836 3757915 4175212 3497101 3408528 5076652 7725990 9245569 8476238 6583993 5610973
3827 5610973 6004020 6505812 6266896 5727729 5230559 4201999 2278968 -6137 -2208033
$$ packed form
3889c433459j171281P21864K218428K504179J799828J151907J125500J145863
3881F062829L64040j186389k493687k501627j220276M1111m4557j172865j713476
3872c864897r37172K8922O4289k34460K91115J463273K226241K184342J460734
3863B682387j00918k187292l338173k631199j259014p05393k49092J541210L555495
3854b691989L120885K21533j974463j378384O33610J889277K164409K081873J324439
3845E391190m23801k122606k516316j772243q03404K13294J474214K370793J946794
3836C757915M17297o78111q8573J668124K649338J519579p69331j892245r73020
3827E610973L93047N01792k38916n39167m97170j028560j923031k285105k201896
$$ plain form
3818 -2208033 -4268848 -5235129 -3410180 961066 4602818 4406999 886445 -2791379 -4316627
3809 -4316627 -3678595 -2243425 -1745564 -3140741 -5076676 -4630588 -1090921 2223794 1786240
3800 1786240 -1556880 -3870066 -3093301 -491433 2109803 3960499 4431503 2915795 116550
3791 116550 -2336249 -3745892 -4367039 -3929390 -2028088 307682 1527379 1879477 2668947
3782 2668947 3430767 2448974 282899 -41308 2745651 6094053 6813269 4310507 -135343
3773 -135343 -5108338 -8941820 -9945207 -8176666 -5551046 -3339157 -1267365 283059
3765 283059 -406975 -3561916 -6635834 -7499587 -6947219 -6504831 -6002168 -5277435 -5919938
3756 -5919938 -8583688 -10442941 -8462699 -3944422 -638874 666699 2120554 3828045
$$ packed form
3818b208033k060815r66281J824949M371246L641752j95819l520554l677824j525248
3809d316627O38032J435170M97861j395177j935935M46088L539667L314715m37554
3800A786240l343120k313186P76765K601868K601236J850696M71004j515708k799245
3791A16550k452799j409643o21147M37649J901302K335770J219697L52098P89470
3782B668947P61820r81793k166075l24207K786959L348402P19216k502762m445850
3773a35343m972995l833482j003387J768541K625620K211889K071792J550424
3765B83059o90034l154941l073918q63753N52368M42388N02663P24733o42503
3756e919938k663750j859253J980242M518277L305548J305573J453855J707491
$$ plain form
3748 3828045 2950248 -1341807 -5518483 -6059153 -3637625 -1087544 707169 2623534 4364733
3739 4364733 4262490 1917679 -749046 -1488798 134289 2702415 4285574 3729213 1352580
3730 1352580 -1197608 -2075953 -650162 2043732 4283736 5193306 5328985 5736426 6616981
3721 6616981 7220724 6845674 5320821 2607247 -1036754 -4171188 -4713156 -2346759 526551
3712 526551 1437211 700893 280155 550274 80303 -1603569 -3107281 -3356023 -2795673
3703 -2795673 -1841014 -85975 1930534 2095472 -510595 -3653011 -4609701 -3730816 -3311341
3694 -3311341 -3729789 -3158009 -983972 1015659 1560684 1706958 2659836 3595332 3217263
3685 3217263 2115393 1748264 1912383 1138008 -731274 -2256650 -2827715 -3518576 -4822681
$$ packed form
3748C828045q77797m292055m176676n40670K421528K550081J794713J916365J741199
3739D364733j02243k344811k666725p39752J623087K568126J583159n56361k376633
3730A352580k550188q78345J425791K693894K240004R09570J35679M07441Q80555
3721F616981O03743l75050j524853k713574l644001l134434n41968K366397K873310
3712E26551R10660p36318m20738K70119m69971j683872j503712k48742N60350
3703b795673R54659J755039K016509J64938k606067l142416r56690Q78885M19475
3694c311341m18448N71780K174037J999631N45025J46274R52878R35496l78069
3685C217263j101870l67129J64119p74375j869282j525376n71065o90861j304105
$$ plain form
3676 -4822681 -5124757 -2780133 1103747 3433591 2636023 303035 -969400 -579674 -116444
3667 -116444 -891867 -2077360 -1668410 1008118 4233101 5395464 3337697 -632253 -3604573
3658 -3604573 -3104604 808694 5088012 6140743 3392919 -157696 -1510014 -916217 -590822
3649 -590822 -1078224 -638719 1873490 5205226 7202051 6874883 4578913 1318227 -1557986
3640 -1557986 -2905661 -2619464 -1387912 349788 2263964 3152046 1664328 -1639059 -4395595
3631 -4395595 -5031721 -3879440 -1581616 1580982 4209279 4077988 1289399 -1034823 -897849
3622 -897849 -118901 -810849 -1465039 336523 2893963 1932897 -3011925 -7242895 -6656263
3613 -6656263 -2184259 2406735 4904927 5660922 5826742 5918406 5658124 4884012 4733362
$$ packed form
3676d822681l02076K344624L883880K329844p97568k332988j272435L89726M63230
3667a16444p75423j185493M08950K676528L224983J162363k057767l969950k972320
3658c604573M99969L913298M279318J052731k747824l550615j352318N93797L25395
3649e90822m87402M39505K512209L331736J996825l27168k295970l260686k876213
3640a557986j347675K86197J231552J737700J914176Q88082j487718l303387k756536
3631d395595o36126J152281K297824L162598K628297j31291k788589k324222J36974
3622h97849P78948o91948o54190J801562K557440r61066m944822m230970N86632
3613f656263M472004M590994K498192P55995J65820R1664k60282p74112j50650
$$ plain form
3604 4733362 6885287 10542686 11647321 7383309 538102 -3339165 -2642798 -649105
3596 -649105 -34850 23799 698760 1020971 57565 -1303547 -2393074 -3998693 -5846323
3587 -5846323 -5442050 -1687828 2407606 3064055 359131 -2575831 -3707080 -3445653 -2974478
3578 -2974478 -3185870 -4467678 -5952110 -5792823 -3423660 -432846 1868039 4091667 6639892
3569 6639892 7946050 6860862 4968354 4203898 3876594 2686789 1974498 3575052 5567761
3560 5567761 4086168 -634833 -3679708 -1753114 2870193 5688166 4714994 787774
3552 787774 -4422335 -9012323 -11098453 -10219068 -7831419 -5519219 -3445062 -1149848 1087616
3543 1087616 2477546 2699012 2080925 1136516 73938 -1469894 -3790528 -5692826 -4644933
$$ packed form
3604D733362K151925L657399J104635m264012o845207l877267O96367J993693
3596f49105O14255N8649O74961L22211r63406j361112j089527j605619j847630
3587e846323M04273L754222M095434O56449k704924k934962j131249K61427M71175
3578b974478k11392j281808j484432J59287K369163K990814K300885K223628K548225
3569F639892J306158j085188j892508p64456l27304j189805p12291J600554J992709
3560E567761j481593m721001l044875J926594M623307K817973r73172l927220
3552G87774n210109m589988k086130Q79385K387649K312200K074157K295214K237464
3543A087616J389930K21466o18087r44409j062578j543832k320634j902298J047893
$$ plain form
3534 -4644933 289394 6305746 9353809 8533450 6349015 4911340 4011349 3051159 2429178
3525 2429178 2079006 745823 -1820039 -3481294 -2220779 809403 2330394 814593
3517 814593 -1833199 -2606785 -748366 1574264 1923717 682820 836948 4357704 9679944
3508 9679944 13579003 14578577 13200486 9922741 5141585 838666 -317271 1746631
3500 1746631 4095692 4509877 3928777 4325941 5835516 7166324 7536630 7025938 6090015
3491 6090015 5736245 7076297 9651948 11227069 10276594 7701385 5138620 2856415 716173
3482 716173 12735 2235471 6186927 8243898 6230051 2185466 575994 3715991 9051243
3473 9051243 11299774 7800139 1469071 -2424249 -2083309 -269128 351950 572836 2240744
$$ packed form
3534d644933M934327O016352L048063q20359k184435j437675q99991r60190o21981
3525B429178l50172j333183k565862j661255J260515L030182J520991j515801
3517H14593k647792p73586J858419K322630L49453j240897J54128L520756N322240
3508I679944L899059R99574j378091l277745m781156m302919j155937K063902
3500A746631K349061M14185n81100L97164J509575J330808L70306n10692r35923
3491F090015l53770J340052K575651J575121r50475k575209k562765k282205k140242
3482G16173p03438K222736L951456K056971k013847m044585j609472L139997N335252
3473I051243K248531l499635o331068l893320L40940J814181O21078K20886J667908
$$ plain form
3464 2240744 4752897 6211128 6739301 7992447 9709408 9344659 5775271 1510669 152501
3455 152501 2601979 6494948 8716333 7963555 5397401 3286984 2831207 3207471 2935453
3446 2935453 1852798 1115827 1419730 2023682 1668782 -122414 -2680689 -4471694 -3774024
3437 -3774024 -71424 4712511 7101436 5101342 381790 -3026111 -2363983 1550689
3429 1550689 5420707 6551702 4922938 2655896 1824348 2792126 4379026 5286610 5200022
3420 5200022 4636626 4096766 3711208 3602117 3938155 4222772 3108278 -185957 -4436839
3411 -4436839 -7353424 -7927795 -6769588 -4177435 292178 5608688 8691338 7905171 5722173
3402 5722173 5597682 7093655 6818982 3995869 2078421 3975930 8188122 11140320 11496217
$$ packed form
3464B240744K512153J458231N28173J253146J716961l64749l569388m264602j358168
3455A52501K449478L892969K221385p52778k566154k110417m55777L76264k72018
3446B935453j082655p36971L03903O03952l54900j791196k558275j791005O97670
3437c774024L702600M783935K388925k000094m719552l407901O62128L914672
3429A550689L870018J130995j628764k267042q31548R67778J586900R07584q6588
3420E200022n63396n39860l85558j09091L36038K84617j114494l294235m250882
3411d436839k916585n74371J158207K592153M469613N316510L082650p86167k182998
3402E722173j24491J495973k74673k823113j917448J897509M212192K952198L55897
$$ plain form
3393 11496217 10559750 9824140 9866797 10823732 12346715 13396066 13128242 11692031 9553669
3384 9553669 6796163 3890084 2284134 3014803 5106684 6378998 5760375 4256975 3893612
3375 3893612 6028474 10134337 13787578 14489549 12038562 8610340 6247441 5101680
3367 5101680 4472365 4376258 5206369 6719170 8364244 10074761 11894096 13236495 13245974
3358 13245974 11727334 9457759 7823098 7912588 9252128 9831642 8552216 7118451 7724085
3349 7724085 9341006 8920377 6361435 5062861 6571638 8129442 7426888 6368326 7174852
3340 7174852 7740002 4808314 -182353 -2743655 -1871700 -719796 -1002470 -959954 457858
3331 457858 1278623 -94107 -2140491 -2612539 -1488660 -20536 1364685 2745620 3695125
$$ packed form
3393A1496217r36467p35610M2657R56935J522983J049351k67824j436211k138362
3384I553669k757506k906079j605950P30669K091881J272314o18623j503400l63363
3375C893612K134862M105863L653241P01971k450987l428222k362899j145761
3367E101680o29315r6107Q30111J512801J645074J710517J819335J342399R479
3358A3245974j518640k269575j634661Q9490J339540N79514j279426j433765O05634
3349G724085J616921m20629k558942j298574J508777J557804p02554j058562Q06526
3340G174852N65150k931688m990667k561302Q71955J151904k82674M2516J417812
3331D57858Q20765j372730k046384m72048J123879J468124J385221J380935R49505
$$ plain form
3322 3695125 3928622 4032336 4634087 5597365 6478907 6906022 6309698 4368845 1930141
3313 1930141 498288 795236 2665689 5765246 8937739 9808863 7218235 3566235 2216466
3304 2216466 2791657 1941935 -1039546 -2679064 -485907 3307502 4830358 3151902 284830
3295 284830 -1339363 -61333 4183347 8720518 9823677 6996245 3562215 1797168
3287 1797168 222327 -2403827 -3572273 -713545 3940203 5986884 5002833 4284508 5232538
3278 5232538 5962013 5578142 5906355 7785991 8823364 6683565 2530635 -557169 -1147382
3269 -1147382 95769 2285989 4850319 6690297 6565247 4820811 3738325 5131240
3261 5131240 7634519 7505554 3066695 -2433061 -4196706 -2086488 -1085448 -4479979
$$ packed form
3322C695125K33497J03714O01751R63278Q81542M27115n96324j940853k438704
3313A930141j431853K96948J870453L099557L172493Q71124k590628l652000j349769
3304B216466N75191q49722k981481j639518K193157L793409J522856j678456k867072
3295B84830j624193J278030M244680M537171J103159k827432l434030j765047
3287A797168j574841k626154j168446K858728M653748K046681r84051p18325R48030
3278E232538P29475l83871L28213J879636J037373k139799m152930l087804n90213
3269a147382J243151K190220K564330J839978j25050j744436j082486J392915
3261E131240K503279j28965m438859n499756j763645K110218J001040l394531
$$ plain form
3253 -4479979 -8966170 -8861526 -3578319 2085817 4480265 4686680 5083272 5351687 3720851
3244 3720851 454855 -2037879 -2231215 -1110534 -428517 -162609 1401260 4842969 7781537
3235 7781537 7286702 4058527 2261258 4232538 7246557 7317550 4653713 2896124 3944354
3226 3944354 6351055 8453356 10073277 10835161 9804145 7745739 7060239 8146452 8256570
3217 8256570 5609288 2434585 1892522 3794008 5690212 6734971 7801209 8663992 7986323
3208 7986323 6083624 5070339 5666266 6011819 4528436 2142294 559803 -128608 -703430
3199 -703430 -807872 607408 3301921 5820639 7518366 9002270 10256950 9924858 7472015
3190 7472015 4818711 4158242 4700175 3545881 58137 -2643123 -1695122 1593086 3656263
$$ packed form
3253d479979m486191J04644N283207N664136K394448K06415L96592K68415j630836
3244C720851l265996k492734j93336J120681O82017K65908J563869L441709K938568
3235G781537m94835l228175j797269J971280L014019P0993k663837j757589J048230
3226C944354K406701K102301J619921P61884j031016k058406o85500J086213J10118
3217H256570k647282l174703n42063J901486J896204J044759J066238Q62783o77669
3208G986323j902699j013285N95927L45553j483383k386142j582491o88411n74822
3199g03430j04442J415280K694513K518718J697727J483904J254680l32092k452843
3190G472015k653304o60469N41933j154294l487744k701260R48001L288208K063177
$$ plain form
3181 3656263 3519549 3406471 4622750 5407508 4012573 1899378 1798642 3426202 3325853
3172 3325853 -706889 -6614407 -10308677 -10031753 -7601541 -5760752 -5287807 -4927386 -3480503
3163 -3480503 -1304490 262196 524296 109606 3262 229568 -26609 -844446 -722306
3154 -722306 1841720 6051202 9307517 10548584 11822572 15241626 19365191 20611786
3146 20611786 17947208 13886186 10596583 7652321 4784708 4111036 7155366 11410851
3138 11410851 12779272 10670404 8014558 6677099 5677213 4009115 2365939 1317083
3130 1317083 223988 -1017708 -1297970 -497745 -435530 -2327243 -4999705 -6858569 -7827529
3121 -7827529 -7870362 -5551191 -323019 5031602 6746041 4430393 1079976 -958357 -2090098
$$ packed form
3181C656263j36714j13078J216279P84758j394935k113195j00736J627560j00349
3172C325853m032742n907518l694270K76924K430212J840789M72945L60421J446883
3163c480503K176013J566686K62100m14690j06344K26306k56177q17837J22140
3154g22306K564026M209482L256315J241067J273988L419054M123565J246595
3146B0611786k664578m061022l289603k944262k867613o73672L044330M255485
3138A1410851J368421k108868k655846j337459r99886j668098j643176j048856
3130A317083j093095j241696k80262Q00225O2215j891713k672462j858864r68960
3121g827529m2833K319171N228172N354621J714439k315648l350417k038333j131741
$$ plain form
3112 -2090098 -3605058 -5558514 -6906192 -6500188 -3788911 337279 3393318 3278313 664655
3103 664655 -1582440 -1463302 644310 3385181 5909962 7614727 7739339 6072759 3412975
3094 3412975 792828 -1283903 -2649054 -3229850 -3325574 -3466829 -3609150 -2992523 -1179371
3085 -1179371 1150211 2718402 2711712 1291057 -586590 -1861514 -2278137 -2533996 -3178609
3076 -3178609 -3705264 -3359775 -2449394 -1888080 -1666855 -925943 453803 1580529 2108822
3067 2108822 2784520 3910585 4479768 3677004 2341517 2017116 3153648 5002962 6683556
3058 6683556 7543071 7019308 5109119 2808422 1402945 1384162 2338172 3454470 3761780
3049 3761780 2482448 -188924 -3025297 -4902860 -5497618 -4663982 -2278979 545350 1448507
$$ packed form
3112b090098j514960j953456j347678M06004K711277M126190L056039j15005k613658
3103F64655k247095J19138K107612K740871K524781J704765J24612j666580k659784
3094C412975k620147k076731j365151n80796r5724j41255j42321O16627J813152
3085a179371K329582J568191o690j420655j877647j274924m16623k55859o44613
3076c178609n26655L45489R10381N61314K21225P40912J379746J126726N28293
3067B108822O75698J126065N69183q02764j335487l24401J136532J849314J680594
3058F683556Q59515n23763j910189k300697j405477j8783R54010J116298L07310
3049C761780j279332k671372k836373j877563n94758Q33636K385003K824329R03157
$$ plain form
3040 1448507 -421868 -2493066 -1494085 2180951 4703790 3523997 102811 -2410729
3032 -2410729 -2495690 -560562 2417490 5337109 7063429 7186168 6158851 4236916 1327212
3023 1327212 -1527782 -1982475 1007908 5436275 8388639 8991798 7898449 5098181 424914
3014 424914 -4360374 -6474414 -5350393 -2967519 -674073 2177443 5814357 8572829
3006 8572829 9228187 8981144 9393227 9671165 7918212 4296911 1089465 -76046 416802
2997 416802 1228732 1021223 -1283518 -5484959 -9212883 -9518534 -5803942 -372523 3786592
2988 3786592 4827605 2381285 -1980805 -4707252 -3073876 1102884 2594095 -1050131
2980 -1050131 -6120234 -7266728 -4056450 -836449 -688357 -1900661 -852825 3425651
$$ packed form
3040A448507j870375k071198R98981L675036K522839j179793l421186k513540
3032b410729q4961J935128K978052K919619J726320J22739j027317j921935k909704
3023A327212k854994m54693K990383M428367K952364O03159j093349k800268m673267
3014D24914m785288k114040J124021K382874K293446K851516L636914K758472
3006H572829O55358k47043M12083K77938j752953l621301l207446j165511M92848
2997D16802Q11930k07509k304741m201441l727924l05651L714592N431419M159115
2988C786592J041013k446320m362090k726447J633376M176760J491211l644226
2980a050131n070103j146494L210278L220001J48092j212304J047836M278476
$$ plain form
2972 3425651 8511004 11321912 10670237 7680601 4607341 3251913 3987604 5888901 7571399
2963 7571399 7957765 6682405 4178602 1380730 -701705 -1032991 1332516 6100201 10572868
2954 10572868 11166728 7313414 2931794 2446538 5701048 8421771 7713594 5308212 4657730
2945 4657730 6314198 7622199 6457418 3897855 2820936 4459372 6910268 7183340
2937 7183340 4453352 784365 -1407499 -1817379 -1711174 -1895740 -2385850 -3417841 -5139563
2928 -5139563 -6384409 -5488683 -2697766 -140981 1142570 2402072 4451258 5612620
2920 5612620 4128013 1275020 -119586 344267 375195 -1349477 -3412528 -4111848 -3881082
2911 -3881082 -4195237 -5208275 -5630455 -4499416 -2350218 -838522 -1407406 -3870478 -6231130
$$ packed form
2972C425651N085353K810908o51675k989636l073260j355428P35691J901297J682498
2963G571399L86366j275360k503803k797872k082435l31286K365507M767685M472667
2954A0572868N93860l853314m381620m85256L254510K720723p08177k405382o50482
2945D657730J656468J308001j164781k559563j076919J638436K450896K73072
2937G183340k729988l668987k191864m09880J06205j84566m90110j031991j721722
2928e139563j244846Q95726K790917K556785J283551J259502K049186J161362
2920E612620j484607k852993j394606M63853L0928j724672k063051o99320K30766
2911c881082l14155j013038m22180J131039K149198J511696n68884k463072k360652
$$ plain form
2902 -6231130 -6544100 -5024239 -3561879 -3206866 -3281965 -3127306 -3168105 -3489705 -2847615 -433129
2892 -433129 2425676 3819939 3768324 3618442 3571918 2659551 946115 -237511 -474759
2883 -474759 -709661 -991621 136571 2892356 4883286 4249628 2599274 2548304 3473624
2874 3473624 2603107 64442 -458646 2817036 6596189 6962039 4877248 4266669 5704658
2865 5704658 5555694 1848483 -2295724 -2968478 -932101 -183756 -2172895 -4238606 -3807984
2856 -3807984 -1569257 467799 2015937 4005017 6301177 7786017 8208316 8230052 7720551
2847 7720551 5766366 2855805 1427709 3085899 6259683 7961019 7338821 6093420
2839 6093420 5526547 4775556 2559420 -581817 -2858990 -3349904 -2436855 -575225 2016566
$$ packed form
2902f231130l12970J519861J462360L55013p5099J54659m0799l21600O42090K414486
2892d33129K858805J394263n1615j49882m6524r12367j713436j183626k37248
2883d74759k34902k81960J128192K755785J990930o33658j650354n0970R25320
2874C473624q70517k538665n23088L275682L779153L65850k084791o10579J437989
2865E704658j48964l707211m144207o72754K036377P48345j989139k065711M30622
2856c807984K238727K037056J548138J989080K296160J484840M22299K1736n09501
2847G720551j954185k910561j428096J658190L173784J701336o22198j245401
2839F093420n66873p50991k216136l141237k277173m90914R13049J861630K591791
$$ plain form
2830 2016566 4393362 5085987 4048438 3358592 4849141 7615107 9093518 8352881 6956059
2821 6956059 6439783 6403619 5812921 4943214 4746297 4903730 3892947 1002760 -2691700
2812 -2691700 -5427480 -6021914 -4120387 -291794 3742616 5900076 5440642 3481183 1514901
2803 1514901 20546 -1131243 -1745651 -1586621 -1067340 -793507 -761399 -901615 -2092867
2794 -2092867 -5336541 -9657391 -12097438 -10773401 -7311101 -5141159 -5509255 -6256186 -4840719
2785 -4840719 -1509604 1435746 2833239 3682243 4902678 5654347 4915273 3633250 3664775
2776 3664775 4852998 4836813 2154020 -1794922 -4445681 -4529967 -2182520 1977297 6502358
2767 6502358 8869540 7461527 3755741 1100488 1093285 2250811 2393926 1212052 130346
$$ packed form
2830B016566K376796O92625j037549o89846J490549K765966J478411p40637j396822
2821F956059n16276l6164n90698q69707j96917J57433j010783k890187l694460
2812b691700k735780n94434J901527L828593M034410K157460m59434j959459j966282
2803A514901j494355j151789o14408J59030N19281K73833L2108j40216j191252
2794b092867l243674m320850k440047J324037L462300K169942l68096p46931J415467
2785d840719L331115K945350J397493Q49004J220435P51669p39074j282023L1525
2776C664775J188223j6185k682793l948942k650759q4286K347447M159817M525061
2767F502358K367182j408013l705786k655253p203J157526J43115j181874j081706
$$ plain form
2758 130346 615207 2997349 6106071 7718636 6303926 2832749 64216 -395766 589113
2749 589113 1730715 3295033 5856210 8231247 8517829 6813948 5014875 3812845 1908568
2740 1908568 -1096837 -3128042 -2654636 -1723542 -3438300 -6977267 -8133684 -5577373 -3656086
2731 -3656086 -6713651 -12537000 -14583581 -10217076 -3572277 323409 1268896 2101440 3634000
2722 3634000 4026883 2157103 -895393 -3536753 -4846061 -4072224 -834300 3706023 7248839
2713 7248839 8442822 7715279 6078889 4280564 3036522 2633528 2146090 548802 -1211505
2704 -1211505 -1013029 1120612 2477258 1412720 -250678 -37494 1660745 2832461 3371824
2695 3371824 4991361 8037522 10639831 11272734 10393253 9089788 7605834 5872664 4337492
$$ packed form
2758A30346M84861K382142L108722J612565j414710l471177k768533m59982R84879
2749E89113J141602J564318K561177K375037K86582j703881j799073j202030j904277
2740A908568l005405k031205M73406R31094j714758l538967j156417K556311J921287
2731c656086l057565n823349k046581M366505O644799L895686R45487Q32544J532560
2722C634000L92883j869780l052496k641360j309308P73837L237924M540323L542816
2713G248839J193983p27543j636390j798325j244042m02994m87438j597288j760307
2704a211505J98476K133641J356646j064538j663398K13184J698239J171716N39363
2695C371824J619537L046161K602309O32903q79481j303465j483954j733170j535172
$$ plain form
2686 4337492 3427771 2886995 2329616 2001301 2400306 3362785 3978852 3491072 2208669
2677 2208669 1435005 2175240 3763981 4217175 2347872 -824274 -3156821 -3378494 -1525253
2668 -1525253 1775492 5278864 6870317 5044294 1106811 -1386888 -289229 2765112
2660 2765112 4453634 3659781 2296573 2543277 4469492 6702055 8309366 9035999 8327676
2651 8327676 5635260 1936865 -401752 -128091 1535621 3045582 4971932 8569624
2643 8569624 12546727 13570804 10421308 5694895 2591916 1732115 2134501 3532354 6019728
2634 6019728 8581456 9833412 9754546 9305734 8783222 7782336 6351709 5004802 3921662
2625 3921662 3083584 2732878 2867260 2938135 2841019 3268622 4205174 4338417 3131052 1960115
$$ packed form
2686D337492r09721n40776n57379l28315L99005R62479O16067m87780j282403
2677B208669p73664P40235J588741M53194j869303l172146k332547k21673J853241
2668a525253L300745L503372J591453j826023l937483k493699J097659L054341
2660B765112J688522p93853j363208K46704J926215K232563J607311P26633p08323
2651H327676k692416l698395k338617K73661J663712J509961J926350L597692
2643H569624L977103J024077l149496m726413l102979q59801M02386J397853K487374
2634F019728K561728J251956p8866m48812n22512j000886j430627j346907j083140
2625C921662q38078l50706J34382P0875r7116M27603R36552J33243j207365j170937
$$ plain form
2615 1960115 1643911 611698 -2201208 -4354896 -2925874 579883 1951696 538817
2607 538817 -86044 1831486 3471199 2201635 -337093 -1141760 -262629 186243 -246488
2598 -246488 9905 1981556 4893053 7027888 7094060 5550140 4818278 6750679 9741943
2589 9741943 10380913 8234894 6358053 6402135 6465024 5234844 4695490 6108370 6534059
2580 6534059 2965857 -2358920 -4674648 -3188083 -995816 353432 2072468 4391811
2572 4391811 5847042 6650256 8803125 11897182 12442045 8899385 4284368 1943863 1433667
2563 1433667 725666 231874 1880450 5274090 7310664 5674891 1251128 -3044373 -4962567
2554 -4962567 -4366101 -2462070 64800 3578668 7784013 10602644 10312897 8195225 6959707
$$ packed form
2615A960115l16204j032213k812906k153688J429022L505757J371813j412879
2607E38817o24861J917530J639713j269564k538728q04667Q79131M48872m32731
2598b46488K56393J971651K911497K134835O6172j543920p31862J932401K991264
2589I741943O38970k146019j876841M4082O2889j230180n39354J412880M25689
2580F534059l568202n324777k315728J486565K192267J349248J719036K319343
2572D391811J455231Q03214K152869L094057N44863l542660m615017k340505n10196
2563A433667p08001m93792J648576L393640K036574j635773m423763m295501j918194
2554d962567N96466J904031K526870L513868M205345K818631k89747k117672j235518
$$ plain form
2545 6959707 6600349 4197283 -1524903 -7751007 -10889559 -10370644 -7668100 -3391248 2484312
2536 2484312 8498714 12087769 12096932 9543147 5987325 2374559 -533730 -1799915 -955952
2527 -955952 1322223 3441488 3995563 3100946 2608172 4236321 7317863 9248702 8490753
2518 8490753 6221127 4637626 4699378 6067759 7985640 9201855 8161771 4722372 1124188
2509 1124188 -29358 1535342 4050627 6101510 7404674 7574489 5845507 2537576
2501 2537576 -412898 -1271126 -393853 327201 -258315 -1330668 -1292996 77154 1197603
2492 1197603 749601 -277073 479653 3721898 7403048 9113282 8630751 7415123 6463879
2483 6463879 5740148 5095589 4386134 2817412 -387414 -4263006 -6282175 -5171576 -2772963
$$ packed form
2545F959707l59358k403066n722186o226104l138552N18915K702544M276852N875560
2536B484312O014402L589055R163k553785l555822l612766k908289j266185Q43963
2527i55952K278175K119265N54075q94617m92774J628149L081542J930839p57949
2518H490753k269626j583501O1752J368381J917881J216215j040084l439399l598184
2509A124188j153546J564700K515285K050883J303164J69815j728982l307931
2501B537576k950474q58228Q77273P21054n85516j072353L7672J370150J120449
2492A197603m48002j026674P56726L242245L681150J710234m82531j215628r51244
2483F463879p23731o44559p09455j568722l204826l875592k019169J110599K398613
$$ plain form
2474 -2772963 -1879487 -2459456 -1524527 2614393 7319881 8496875 5956861 3708709 4306250
2465 4306250 5171326 2383568 -3480688 -7974509 -8689522 -7631923 -7181244 -6351252 -2656927
2456 -2656927 3867518 10128488 12831692 11178224 7568513 5985616 8366472 12102448
2448 12102448 12686190 9344679 6000745 5723353 6754568 5961107 3861544 3274602 4410788
2439 4410788 4598285 2473580 -482964 -2620042 -3729113 -3786876 -2533580 -726377 418471
2430 418471 1474583 4239505 8322848 10650025 9423096 6518736 4698088 4225874 3586810
2421 3586810 1936544 -587035 -3556387 -5802414 -5642720 -3197509 -1303119 -2317809
2413 -2317809 -4885212 -5681767 -3707984 -965869 659281 1118624 805833 -464406 -2351722
$$ packed form
2474b772963Q93476n79969R34929M138920M705488J176994k540014k248152N97541
2465D306250Q65076k787758n864256m493821p15013J057599M50679Q29992L694325
2456b656927O524445O260970K703204j653468l609711j582897K380856L735976
2448A2102448N83742l341511l343934k77392J031215p93461k099563n86942J136186
2439D410788J87497k124705k956544k137078j109071n7763J253296J807203J144848
2430D18471J056112K764922M083343K327177j226929k904360j820648m72214o39064
2421C586810j650266k523579k969352k246027J59694K445211J894390j014690
2413b317809k567403p96555J973783K742115J625150M59343l12791j270239j887316
$$ plain form
2404 -2351722 -3342375 -2205153 581023 3386972 4899583 4907348 4441924 5310388 8428076
2395 8428076 12090445 12940968 9652583 5040801 3359986 5622948 8675199 9105653 6997569
2386 6997569 5076579 4956457 5555624 5224211 4066273 3333626 3373861 3349405 2699689 1728430
2376 1728430 704685 -467428 -1312515 -607001 2041613 5066585 6260591 5021158 2745117
2367 2745117 1256586 1361810 2671846 4166908 4872511 4403989 3059379 1471954 383194
2358 383194 560249 2196427 4202839 4946975 4206414 3575484 4224078 5122878 4578350
2349 4578350 2801881 1514833 1454230 2028188 3372010 6560942 10942566 13304481 11483889
2340 11483889 7562288 5361512 5345220 4389316 902402 -2231600 -1257034 3483076 8084405
$$ packed form
2404b351722r90653J137222K786176K805949J512611P765m65424Q68464L117688
2395H428076L662369Q50523l288385m611782j680815K262962L052251M30454k108084
2386F997569j920990j20122N99167l31413j157938p32647M0235k4456o49716r71259
2376A728430j023745j172113q45087P05514K648614L024972J194006j239433k276041
2367B745117j488531J05224J310036J495062P05603m68522j344610j587425j088760
2358C83194J77055J636178K006412P44136p40561o30930O48594Q98800n44528
2349D578350j776469j287048o0603N73958J343822L188932M381624K361915j820592
2340A1483889l921601k200776j6292r55904l486914l134002R74566M740110M601329
$$ plain form
2331 8084405 9829384 9340131 8055413 5837491 2272059 -1177209 -2178413 -368003
2323 -368003 2303446 4125713 5211883 6160577 6456132 5270779 3225773 2152768 3014211
2314 3014211 4803172 5738771 5120431 3815012 3221360 3940210 5293193 6024227 5533136
2305 5533136 4403866 3662030 3683768 4043038 4241421 4185844 3942603 3397938 2328860 678520
2295 678520 -1200595 -2426371 -2023567 -61922 1781122 1669476 -124737 -1285311 -321932
2286 -321932 1531349 2198950 1659204 1442154 1712480 925516 -1191805 -2416377 -1128630
2277 -1128630 925388 796366 -1730696 -4394541 -6079153 -7793441 -9848746 -10463398 -8308862
2268 -8308862 -4789787 -2509305 -2573051 -4403345 -6983436 -9046311 -9150701 -7101098 -4636401
$$ packed form
2331H084405J744979m89253j284718k217922l565432l449268j001204J810410
2323c68003K671449J822267J086170R48694K95555j185353k045006j073005Q61443
2314C014211J788961R35599o18340j305419n93652P18850J352983P31034m91091
2305E533136j129270p41836K1738L59270J98383n5577k43241n44665j069078j650340
2295F78520j879115j225776M02804J961645J843044j11646j794213j160574R63379
2286c21932J853281O67601n39746k17050K70326p86964k117321j224572J287747
2277a128630K054018j29022k527062k663845j684612j714288k055305o14652K154536
2268h308862L519075K280482o3746j830294k580091k062875j04390K049603K464697
$$ plain form
2259 -4636401 -3443588 -3210696 -2845164 -2510973 -2667241 -2092904 633624 3984446 4525203
2250 4525203 1610519 -1404744 -1577192 233932 1650389 2278243 3002140 3450205 2614008
2241 2614008 1231470 1167346 2496798 3296824 2687818 2201528 3246064 4641421 4012726
2232 4012726 1013400 -2128188 -3305275 -2743683 -1988030 -1397635 200658 3257418 6153145
2223 6153145 7069770 6358642 5625603 4989033 3215691 683872 -159304 1553639 3084253
2214 3084253 1677755 -1179529 -1382475 2531215 7898187 11423469 12020333 10217793 7155195
2205 7155195 4879343 5503704 8742208 11686871 12246056 11567812 11789085 12658250 12260173
2196 12260173 10467841 9554730 11010364 13355477 14040309 12656492 11295236 11943279 14199717
$$ packed form
2259d636401J192813K32892L65532L34191j56268N74337K726528L350822N40757
2250D525203k914684l015263j72448J811124J416457O27854P23897M48065q36197
2241B614008j382538o4124J329452Q00026o09006m86290J044536J395357o28695
2232D012726k999326l141588j177087N61592P55653N90395J598293L056760K895727
2223F153145R16625p11128p33039o36570j773342k531819q43176J712943J530614
2214C084253j406498k857284k02946L913690N366972L525282N96864j802540l062598
2205G155195k275852O24361L238504K944663N59185o78244K21273Q69165l98077
2196A2260173j792332r13111J455634K345113O84832j383817j361256O48043K256438
$$ plain form
2187 14199717 15656000 14216746 9969326 4961870 1300505 -481057 -1201620 -1452184
2179 -1452184 -754453 1355763 3812859 4584561 3216999 2056869 3936235 8867978 14044436
2170 14044436 17014548 17588003 16411812 13390088 8680704 4000740 1282138 513841
2162 513841 252528 -208471 -586689 -1047858 -2175550 -3592747 -4279862 -4320924 -4651635 -5036169
2152 -5036169 -4386765 -3525022 -5162941 -9800586 -13793241 -13500661 -9855464 -6606315 -5088745
2143 -5088745 -3242688 522926 4977861 8035823 9150891 8960106 7880581 5949372
2135 5949372 3360595 649664 -1270050 -1409940 120301 1469331 840235 -980139 -1280725
2126 -1280725 969732 3589574 4060883 2669951 1529289 1319941 619205 -1533975 -3778626
$$ packed form
2187A4199717J456283j439254m247420n007456l661365j781562p20563k50564
2179a452184O97731K110216K457096P71702j367562j160130J879366M931743N176458
2170A4044436K970112N73455j176191l021724m709384m679964k718602p68297
2162E13841k61313m60999l78218m61169j127692j417197o87115m1062l30711l84534
2152e036169O49404Q61743j637919m637645l992655K92580L645197L249149J517570
2143e088745J846057L765614M454935L057962J115068j90785j079525j931209
2135E949372k588777k710931j919714j39890J530241J349030o29096j820374l00586
2126a280725K250457K619842M71309j390932j140662k09348p00736k153180k244651
$$ plain form
2117 -3778626 -3887512 -1574159 943033 1382451 -65822 -1265774 -1040427 -426198 -456495
2108 -456495 -33846 2311179 5271697 5754990 3318195 1203072 1789502 3210823 2430950
2099 2430950 -53287 -1241076 -444071 -33708 -1227647 -2070243 -799553 1083241 906507
2090 906507 -1491277 -4067504 -5651235 -6763579 -7699300 -7670011 -6185832 -3938711 -1861848
2081 -1861848 -343915 236528 -695218 -2816727 -4397315 -3856636 -1574479 580451 1400442
2072 1400442 1423082 1932545 3407789 4992716 5160185 3085385 -77544 -1469606 944336
2063 944336 5761570 8966497 8186527 5528600 5098944 7992442 11137309 11409918 9416127
2054 9416127 8068069 8413336 8594260 6887608 4181389 2763855 3667182 5985932 8117300
$$ packed form
2117c778626j08886K313353K517192M39418j448273j199952K25347O14229l0297
2108d56495M22649K345025K960518M83293k436795k115123N86430J421321p79873
2099B430950k484237j187789P97005M10363j193939q42596J270690J882794j76734
2090I06507k397784k576227j583731j112344r35721K9289J484179K247121K076863
2081a861848J517933N80443r31746k121509j580588N40679K282157K154930Q19991
2072A400442K2640N09463J475244J584927J67469k074800l162929j392062K413942
2063I44336M817234L204927p79970k657927m29656K893498L144867K72609j993791
2054I416127j348058L45267J80924j706652k706219j417534R03327K318750K131368
$$ plain form
2045 8117300 8872622 7927851 6128876 5081904 5538844 6311404 5656413 3654989 2177278
2036 2177278 2310383 2958491 2610709 1531146 1164430 1862404 2353762 1534295 -107765
2027 -107765 -1226492 -1270257 -929802 -983029 -956518 711498 4780150 9572346 12015965
2018 12015965 10802215 7881866 6094504 5871246 5352503 3442782 1308328 510587 858606
2009 858606 808200 -736020 -3494657 -5951806 -6083295 -2995340 1533916 4231021 3901251
2000 3901251 2717582 2883555 3393146 1964137 -850351 -2042904 -492794 1664171 2533954
1991 2533954 2890823 4034863 5424366 6002755 6119391 6394801 6181191 5036071 4332761
1982 4332761 5176811 5849275 3919043 243491 -1903617 -1486019 -626646 -699998 -578158
$$ packed form
2045H117300P55322r44771j798975j046972M56940P72560o54991k001424j477711
2036B177278J33105O48108l47782j079563l66716O97974M91358q19467j642060
2027a07765j118727m3765L40455n3227K6511J668016M068652M792196K443619
2018A2015965j213750k920349j787362k23258n18743j909721k134454p97741L48019
2009H58606n0406j544220k758637k457149j31489L087955M529256K697105l29770
2000C901251j183669J65973N09591j429009k814488j192553J550110K156965Q69783
1991B533954L56869J144040J389503N78389J16636K75410k13610j145120p03310
1982D332761Q44050O72464j930232l675552k147108M17598Q59373p3352J21840
$$ plain form
1973 -578158 377585 639174 -548640 -1207307 243574 2026304 1618146 -343040 -1390655
1964 -1390655 -1177475 -1214752 -1454418 -236182 2365247 4026184 3570830 2472260 2255194
1955 2255194 2583291 2753774 2989674 3181277 2308307 424779 -577689 241758 915078
1946 915078 -680975 -3270819 -3553407 -641924 2901594 4497653 4276634 3972175 4477693
1937 4477693 5310204 5847807 6361591 7725217 10125383 12189915 11916051 8714374 4045516
1928 4045516 -171132 -3063837 -4481257 -4310453 -2977497 -1724517 -1326997 -1134828 -222232
1919 -222232 1347649 3330817 6146928 9371222 10587567 8121590 4438802 4122712 8057407
1910 8057407 12083278 12404102 10122239 8864206 9625021 10025527 7943747 4033745 657749
$$ packed form
1973e78158R55743K61589j187814o58667J450881J782730m08158j961186j047615
1964a390655K13180l7277k39666J218236K601429J660937m55354j098570k17066
1955B255194L28097J70483K35900J91603q72970j883528j002468Q19447O73320
1946I15078j596053k589844k82588K911483L543518J596059k21019l04459N05518
1937D477693Q32511N37603N13784J363626K400166K064532k73864l201677m668858
1928D045516m216648k892705j417420J70804J332956J252980L97520J92169R12596
1919b22232J569881J983168K816111L224294J216345k465977l682788l16090L934695
1910H057407M025871L20824k281863j258033P60815M00506k081780l910002l375996
$$ plain form
1901 657749 -447955 721965 2860342 4516856 4939249 3820247 844936 -3449534 -6606719
1892 -6606719 -5805463 -1230067 3541673 5555860 5641532 6391893 8365496 10071703 10734368
1883 10734368 10828804 10174599 7821754 4285144 1896175 1966710 3061820 3197727 2633393
1874 2633393 3140647 5090859 6644876 5934231 3154659 211626 -1151107 -520570 1442255
1865 1442255 3665725 4832696 3585143 -395566 -5371934 -8528266 -8493772 -6282629 -3424979
1856 -3424979 -303244 2796228 4334708 3116228 657222 -184585 938432 1468174 -45129
1847 -45129 -1656434 -1001567 1221882 2560228 2455041 2571493 3931052 5620717 6459380
1838 6459380 6379332 5765502 4686953 3366091 2480026 2319147 2191599 1222657 -546736
$$ packed form
1901F57749j105704J169920K138377J656514M22393j119002k975311m294470l157185
1892f606719Q01256M575396M771740K014187Q5672P50361J973603J706207O62665
1883A0734368R4436o54205k352845l536610k388969P0535J095110J35907n64334
1874B633393N07254J950212J554017p10645k779572k943033j362733O30537J962825
1865A442255K223470J166971j247553l980709m976368l156332L4494K211143K857650
1856c424979L121735L099472J538480j218480k459006q41807J123017N29742j513303
1847d5129j611305O54867K223449J338346j05187J16452J359559J689665Q38663
1838F459380q0048o13830j078549j320862q86065j60879j27548r68942j769393
$$ plain form
1829 -546736 -2198338 -2814916 -2070781 -204632 2236259 4555694 5952722 5715034 3744868
1820 3744868 869874 -1798738 -3806258 -5058704 -4697737 -1518366 3903591 8705456
1812 8705456 10414602 9228307 6632284 3076419 -1218339 -4338924 -4260529 -2147076 -1374097
1803 -1374097 -2854850 -3944296 -2777572 -1007990 -863840 -2053168 -3487615 -5674822
1795 -5674822 -8881989 -10913663 -9726661 -6860508 -5098589 -3833931 -428225 4347490
1787 4347490 6461641 4885706 3637723 5795508 8917656 8971436 6215657 4202112 4531039
1778 4531039 5494794 5132186 3160626 298591 -2238925 -2836668 -903366 1937683 3559078
1769 3559078 3916871 4526673 5869215 6955716 7098609 6406270 4794141 2316616 359937
$$ packed form
1829e46736j651602o16578P44135J866149K440891K319435J397028k37688j970166
1820C744868k874994k668612k007520j252446L60967L179371N421957M801865
1812H705456J709146j186295k596023l555865m294758l120585P8395K113453P72979
1803a374097j480753j089446J166724J769582J44150j189328j434447k187207
1795e674822l207167k031674J187002K866153J761919J264658L405706M775715
1787D347490K114151j575935j247983K157785L122148N3780k755779k013545L28927
1778D531039R63755l62608j971560k862035k537516n97743J933302K841049J621395
1769C559078L57793O09802J342542J086501J42893o92339j612129k477525j956679
$$ plain form
1760 359937 543567 2174085 2604220 624465 -2057094 -3188491 -2281409 6494 3134922
1751 3134922 6262766 7776982 6534726 3198834 -283520 -2175622 -1834723 34234
1743 34234 1694967 1775071 698405 75634 629544 1595462 2098075 1931710 978569 -661211
1733 -661211 -1719178 -611606 2121796 3790774 2810961 573944 -847717 -1449194 -2622845
1724 -2622845 -4966912 -7907513 -10348463 -10558000 -6744766 598979 7766904 10928799
1716 10928799 9889896 7717692 7126778 8165763 8837211 7111961 3073693 -214536
1708 -214536 797596 5734460 9775314 9017113 5029907 2339015 2705050 4104298 4409801
1699 4409801 3633667 2925291 3436019 5733747 8462591 8514607 4934021 1663617 3301423
$$ packed form
1760C59937J83630J630518M30135j979755k681559j131397R07082K287903L128428
1751C134922L127844J514216j242256l335892l482354j892102L40899J868957
1743C4234J660733Q0104j076666o22771N53910R65918N02613j66365r53141j639780
1733f61211j057967J107572K733402J668978r79813k237017j421661o01477j173651
1724b622845k344067k940601k440950k09537L813234P343745P167925L161895
1716A0928799j038903k172204n90914J038985O71448j725250m038268l288229
1708b14536J012132M936864M040854p58201l987206k690892L66035J399248L05503
1699D409801p76134p08376N10728K297728K728844N2016l580586l270404J637806
$$ plain form
1690 3301423 8622095 11765572 9875601 5887174 3207202 1588718 -276109 -1771581
1682 -1771581 -2162702 -2420195 -3039717 -2679435 -1020158 -81709 -283280 1633440 7401272
1673 7401272 12708569 11987583 5842424 -458897 -4288767 -6746483 -7534482 -4400632 1613325
1664 1613325 5525565 4873288 2709298 2224597 2383783 1437261 934944 2608290 4046725
1655 4046725 1664757 -3432840 -6401861 -4894937 -1047091 2407651 4705119 5572100
1647 5572100 4412265 1996934 520459 774155 1144176 492181 235483 2165904 5545252
1638 5545252 7926195 8185400 7518734 7780742 9677508 12315510 13976678 13611623 11837473
1629 11837473 10121440 9124062 8642323 8865465 10126945 11262404 10171887 6849850 3963114
$$ packed form
1690C301423N320672L143477j889971l988427k679972j618484j864827j495472
1682a771581l91121k57493o19522L60282J659277R38449k01571J916720N767832
1673G401272N307297p20986o145159o301321l829870k457716p87999L133850O013957
1664A613325L912240o52277k163990m84701J59186r46522n02317J673346J438435
1655D046725k381968n097597k969021J506924L847846L454742K297468Q66981
1647E572100j159835k415331j476475K53696L70021o51995k56698J930421L379348
1638E545252K380943K59205o66666K62008J896766K638002J661168l65055j774150
1629A1837473j716033r97378m81739K23142J261480J135459j090517l322037k886736
$$ plain form
1620 3963114 3187631 2948098 1609842 918403 3463520 7987602 10546246 10020145 9153779
1611 9153779 9773080 10295326 9095556 7305901 6537449 6339561 5894978 6019297 7226527
1602 7226527 7741412 6017679 3744124 3613458 5218979 6035727 5706271 6250442 8177555
1593 8177555 9434271 8677867 7001920 5770431 5010002 4582137 4771684 4984835 3873983
1584 3873983 1449683 -800349 -2272757 -3540699 -4047344 -2395805 332482 907693 -891850
1575 -891850 -952259 2987683 7267754 7796112 6577394 8312144 12518751 14220498 11831523
1566 11831523 9094710 8508510 7745391 4420741 236571 -2237670 -3643557 -5664365
1558 -5664365 -7169467 -5835939 -2341081 81650 -185285 -1770266 -2813228 -2740975 -1601443
$$ packed form
1620C963114p75483k39533j338256o91439K545117M524082K558644n26101q66366
1611I153779O19301N22246j199770j789655p68452j97888m44583J24319J207230
1602G226527N14885j723733k273555j30666J605521Q16748l29456N44171J927113
1593H177555J256716p56404j675947j231489p60429m27865J89547K13151j110852
1584C873983k424300k250032j472408j267942n06645J651539K728287N75211j799543
1575h91850o0409L939942M280071N28358j218718J734750M206607J701747k388975
1566A1831523k736813n86200p63119l324650m184170k474241j405887k020808
1558e664365j505102J333528L494858K422731k66935j584981j042962P2253J139532
$$ plain form
1549 -1601443 469247 2740995 4145669 4381416 3993923 3466346 3030980 3044953 3505527
1540 3505527 3435636 1915383 -307580 -1341857 -399763 1449584 2880377 3610554 3769017
1531 3769017 2999168 991607 -1573463 -3399578 -3879048 -3542562 -3060990 -2169862 -78061
1522 -78061 3043531 5681019 6682160 6825939 7707458 9325874 10070284 9152651 7559830
1513 7559830 6240123 5074589 4380051 5383148 7692446 8268937 5234681 1257805 364493
1504 364493 2322926 3353032 2017366 838078 1623610 2867180 3136239 3581355 4918059
1495 4918059 4961514 2065888 -1259709 -1369690 1446412 4049286 5324812 6564562 7772340
1486 7772340 7288681 5170087 3573951 3288771 2905392 1954559 1734581 2238228 1571513
$$ packed form
1549a601443K070690K271748J404674K35747l87493n27577m35366J3973M60574
1540C505527o9891j520253k222963j034277R42094J849347J430793P30177J58463
1531C769017p69849k007561k565070j826115m79470L36486M81572Q91128K091801
1522g8061L121592K637488J001141J43779Q81519J618416P44410r17633j592821
1513G559830j319707j165534o94538J003097K309298N76491l034256l976876q93312
1504C64493J958433J030106j335666j179288P85532J243570K69059M45116J336704
1495D918059M3455k895626l325597j09981K816102K602874J275526J239750J207778
1486G772340m83659k118594j596136k85180l83379r50833k19978N03647o66715
$$ [...]
##END NTUPLES=NMR SPECTRUM
##END=
