##TITLE=31P_DE-80H_X3
 64 sc D2O
 26.2.2025
##JCAMPDX= 6.0         $$ Bruker NMR JCAMP-DX V2.0
##DATA TYPE= NMR SPECTRUM
##DATA CLASS= NTUPLES
##ORIGIN= UXNMR, Bruker Analytische Messtechnik GmbH
##OWNER= root
$$ XWIN-NMR		Version 3.5
$$ Mon May 12 16:16:13 2025 Russian Standard Time (UT+4h)  Yarkov@DPX200
##.OBSERVE FREQUENCY= 81.013821
##.OBSERVE NUCLEUS= ^31P
##.ACQUISITION MODE= SIMULTANEOUS
##.ACQUISITION SCHEME= undefined
##.AVERAGES= 64
##.DIGITISER RES= 17
##SPECTROMETER/DATA SYSTEM= spect
##.PULSE SEQUENCE= zgpg30
##.SOLVENT NAME= DMSO
##.SHIFT REFERENCE= (INTERNAL, DMSO, 0, 198.062)
##AUDIT TRAIL= $$ (NUMBER, WHEN, WHO, WHERE, WHAT)
$$ ##TITLE= Audit trail, XWIN-NMR		Version 3.5
$$ ##JCAMPDX= 5.01
$$ ##ORIGIN= Bruker BioSpin GmbH
$$ ##OWNER= Yarkov
$$ C:/Bruker/XWIN-NMR/data/yarkov2/nmr/P31/2/pdata/1/auditp.txt
$$ ##AUDIT TRAIL=  $$ (NUMBER, WHEN, WHO, WHERE, WHAT)
(   1,<2025-05-12 16:15:27.37 +0400>,<Yarkov>,<DPX200>,
      <created by zg, POWCHK disabled, PULCHK disabled
       configuration hash MD5:
       00 E9 B6 7A A2 85 ED C7 34 08 36 98 17 FE 4E 26
       data hash MD5: 32K
       94 33 97 0C 8E 7C AA CE 6C 1C 58 DF 48 02 5D 2D>)
(   2,<2025-05-12 16:15:35.60 +0400>,<Yarkov>,<DPX200>,
      <Start of raw data processing
       efp BC_mod = 2 LB = 1.5 FT_mod = 6 PKNL = 1 PHC0 = 1806.83 PHC1 = 9.095428 SI = 64K 
       data hash MD5: 64K
       A9 59 95 7C 4C A1 D4 9A 3E 14 27 91 1B 0D C8 7F>)
$$ ##END=
$$ 
$$ hash MD5
$$ 0F E0 D7 F0 9B 7C B3 9D 47 43 DE 29 DB C1 9B A2
##$RELAX= 
##$RELAX= 
##$RELAX= 
##$RELAX= 
##$RELAX= 
##$RELAX= 
##$RELAX= 
##$RELAX= 
$$ Bruker specific parameters
$$ --------------------------
##$DU= <C:/Bruker/XWIN-NMR>
##$EXPNO= 2
##$NAME= <P31>
##$PROCNO= 1
##$TYPE= <nmr>
##$USER= <yarkov2>
##$AMP= (0..31)
100 100 100 100 100 100 100 100 100 100 100 100 100 100 100 100 100 100 
100 100 100 100 100 100 100 100 100 100 100 100 100 100 
##$AQSEQ= 0
##$AQ_mod= 1
##$AUNM= <au_zg>
##$AUTOPOS= <>
##$BF1= 81.014009
##$BF2= 200.13
##$BF3= 200.13
##$BF4= 200.13
##$BF5= 200.13
##$BF6= 200.13
##$BF7= 200.13
##$BF8= 200.13
##$BYTORDA= 1
##$CFDGTYP= 0
##$CFRGTYP= 5
##$CHEMSTR= <none>
##$CNST= (0..31)
1 1 145 1 1 1 1 1 1 1 1 1 1 1 1 1 1 1 1 1 1 1 1 1 1 1 1 1 1 1 1 1 
##$CPDPRG= <waltz16>
##$CPDPRG1= <>
##$CPDPRG2= <waltz16>
##$CPDPRG3= <>
##$CPDPRG4= <mlev>
##$CPDPRG5= <mlev>
##$CPDPRG6= <mlev>
##$CPDPRG7= <mlev>
##$CPDPRG8= <mlev>
##$CPDPRGB= <>
##$CPDPRGT= <>
##$D= (0..31)
0 1 0 0 0 0 0 0 0 0.06 0 0.03 2e-05 3e-06 0 0 0.0002 0 0 0 0 0 0 0 0 0 
0 0 0 0 0 0 
##$DATE= 1747052126
##$DBL= (0..7)
120 120 120 11 120 120 24 19 
##$DBP= (0..7)
150 150 150 150 150 150 150 150 
##$DBP07= 0
##$DBPNAM0= <>
##$DBPNAM1= <>
##$DBPNAM2= <>
##$DBPNAM3= <>
##$DBPNAM4= <>
##$DBPNAM5= <>
##$DBPNAM6= <>
##$DBPNAM7= <>
##$DBPOAL= (0..7)
0.5 0.5 0.5 0.5 0.5 0.5 0.5 0.5 
##$DBPOFFS= (0..7)
0 0 0 0 0 0 0 0 
##$DE= 6
##$DECBNUC= <off>
##$DECIM= 4
##$DECNUC= <off>
##$DECSTAT= 4
##$DIGMOD= 1
##$DIGTYP= 9
##$DL= (0..7)
0 0 52 120 120 21 21 25 
$$ [...]
##$SUBNAM3= <"">
##$SUBNAM4= <"">
##$SUBNAM5= <"">
##$SUBNAM6= <"">
##$SUBNAM7= <"">
##$SUBNAM8= <"">
##$SUBNAM9= <"">
##$SW= 400.765351723535
##$SWIBOX= (0..15)
0 1 3 0 0 0 0 0 0 0 0 0 0 0 0 0 
##$SW_h= 32467.5324675325
##$TD= 32768
##$TD0= 1
##$TE= 0
##$TE2= 300
##$TE3= 300
##$TEG= 300
##$TL= (0..7)
0 120 53 12 22 120 120 120 
##$TP= (0..7)
150 150 150 150 150 150 150 150 
##$TP07= 0
##$TPNAME0= <>
##$TPNAME1= <>
##$TPNAME2= <>
##$TPNAME3= <>
##$TPNAME4= <>
##$TPNAME5= <>
##$TPNAME6= <>
##$TPNAME7= <>
##$TPOAL= (0..7)
0.5 0.5 0.5 0.5 0.5 0.5 0.5 0.5 
##$TPOFFS= (0..7)
0 0 0 0 0 0 0 0 
##$TUNHIN= 0
##$TUNHOUT= 0
##$TUNXOUT= 0
##$USERA1= <user>
##$USERA2= <user>
##$USERA3= <user>
##$USERA4= <user>
##$USERA5= <user>
##$V9= 5
##$VALIST= <valist>
##$VCLIST= <CCCCCCCCCCCCCCC>
##$VD= 0
##$VDLIST= <DDDDDDDDDDDDDDD>
##$VPLIST= <PPPPPPPPPPPPPPP>
##$VTLIST= <TTTTTTTTTTTTTTT>
##$WBST= 1024
##$WBSW= 4
##$XGAIN= (0..3)
0 0 0 0 
##$XL= 0
##$YL= 0
##$YMAX_a= 13464
##$YMIN_a= -39086
##$ZGOPTNS= <>
##$ZL1= 120
##$ZL2= 120
##$ZL3= 120
##$ZL4= 120
##$ABSF1= 0
##$ABSF2= 0
##$ABSG= 0
##$ABSL= 0
##$ALPHA= 0
##$AQORDER= 0
##$ASSFAC= 0
##$ASSFACI= 0
##$ASSFACX= 0
##$ASSWID= 0
##$AUNMP= <proc_1d>
##$AZFE= 0.1
##$AZFW= 0.5
##$BCFW= 0
##$BC_mod= 2
##$BYTORDP= 0
##$COROFFS= 0
##$CY= -3
##$DATMOD= 1
##$DC= 0
##$DFILT= <>
##$DTYPP= 0
##$F1P= 0
##$F2P= 0
##$FCOR= 1
##$FTSIZE= 65536
##$FT_mod= 6
##$GAMMA= 0
##$GB= 0
##$INTBC= 1
##$INTSCL= 9.790993e-09
##$ISEN= 30
##$LB= 1.5
##$LEV0= 0
##$LPBIN= 0
##$MAXI= 10000
##$MC2= 0
##$MEAN= 0
##$ME_mod= 0
##$MI= 50
##$NCOEF= 0
##$NC_proc= -8
##$NLEV= 6
##$NOISF1= 182.463
##$NOISF2= 159.3651
##$NSP= 0
##$NTH_PI= 0
##$NZP= 0
##$OFFSET= 198.0616
##$PC= 4
##$PHC0= 1806.83
##$PHC1= 9.095428
##$PH_mod= 1
##$PKNL= yes
##$PPARMOD= 0
##$PSCAL= 0
##$PSIGN= 0
##$REVERSE= no
##$SF= 81.0140089999434
##$SI= 65536
##$SIGF1= 159.3651
##$SIGF2= -187.1042
##$SINO= 113.3802
##$SIOLD= 16384
##$SREGLST= <1H.CDCl3>
##$SSB= 0
##$STSI= 65536
##$STSR= 0
##$SW_p= 32467.5324675325
##$SYMM= 0
##$S_DEV= 0
##$TDeff= 32768
##$TDoff= 0
##$TI= <>
##$TILT= no
##$TM1= 0
##$TM2= 0
##$TOPLEV= 0
##$USERP1= <user>
##$USERP2= <user>
##$USERP3= <user>
##$USERP4= <user>
##$USERP5= <user>
##$WDW= 1
##$XDIM= 65536
##$YMAX_p= 326877718
##$YMIN_p= -170246290
$$ End of Bruker specific parameters
$$ ---------------------------------
##NTUPLES= NMR SPECTRUM
##VAR_NAME=  FREQUENCY,     SPECTRUM/REAL,   SPECTRUM/IMAG
##SYMBOL=    X,             R,               I
##VAR_TYPE=  INDEPENDENT,   DEPENDENT,       DEPENDENT
##VAR_FORM=  AFFN,          ASDF,            ASDF
##VAR_DIM=   65536,         65536,           65536
##UNITS=     HZ,            ARBITRARY UNITS, ARBITRARY UNITS
##FACTOR=    0.49542278885378, 1,            1
##FIRST=     16045.7642231865, 0,            0
##LAST=      -16421.768244346, 0,            0
##MIN=       -16421.768244346, -170246290,   0
##MAX=       16045.7642231865, 326877718,    0
$$ Real data points
##PAGE= N=1
##DATA TABLE= (X++(R..R)), XYDATA
$$ [...]
##PAGE= N=2
##DATA TABLE= (X++(I..I)), XYDATA
7416h706766J141104J471049K185201J207059j266850k464613r83969J117577
7408f300208J123521p77729j947471r19198O12981J05181k074291k656615J47294
7399a2686535L784211M469711K061100l74400j170954j473051k035421j678570
7391i103909J36421J842029K125910J530185O61857p35579j804556n42311K589316
7382c300637L970964J896824o39055q78255q50181l289022n779051l830591J689724
7373a1009280N293930M650317K733842J896119P31537j725075l135363j643325
7365b207298P19457R84321o57626j871665j472403M2516J526925J353620j465922
7356c048075m897693m923371q36810K811192J956804j406073k356077n3017J956149
$$ plain form
7416 -8706766 -7565662 -6094613 -3909412 -2702353 -3969203 -6433816 -7417785 -6300208
7408 -6300208 -5176687 -5954416 -7901887 -8821085 -8208104 -8102923 -10177214 -12833829 -12686535
7399 -12686535 -8902324 -4432613 -2371513 -2745913 -3916867 -5389918 -7425339 -9103909
7391 -9103909 -8967488 -7125459 -4999549 -3469364 -2807507 -3543086 -5347642 -5889953 -3300637
7382 -3300637 670327 2567151 1928096 1049841 199660 -3089362 -8868413 -12699004 -11009280
7373 -11009280 -5715350 -1065033 1668809 3564928 4296465 2571390 -563973 -2207298
7365 -2207298 -1487841 -503520 -1161146 -3032811 -4505214 -4462698 -2935773 -1582153 -3048075
7356 -3048075 -7945768 -12869139 -13705949 -10894757 -8937953 -10344026 -12700103 -12753120 -10796971
7347a0796971J635258Q13297J241203J735717O55824j229818k020132j269056
7339i234678P9262J148064J399904O01379l73696J50936K259528L401555J335300
7330G67554k577936m720820l482861m69628K252240L991999M291332K397823q82329
7321A567374k818008k001417m24871l81449q35670M66942K453661J868623j093267
7312a198082k215983L98178L019859J671018k116823l987831l030937j764729
7304i225330j153260L58754K864712L783221J734855j067533j651126L09134K854241
7295a192332L886529K264322j489205m737082m651108j520013J305568J493749
7287d639572R1012r92161j773258k905422l364015j667543J385151L274315K941329
$$ plain form
7347 -10796971 -9161713 -8348416 -7107213 -5371496 -4715672 -5945490 -7965622 -9234678
7339 -9234678 -9155416 -8007352 -6607448 -6006069 -6379765 -6228829 -3969301 -567746 767554
7330 767554 -1810382 -6531202 -10014063 -10483691 -8231451 -4239452 51880 2449703 1567374
7321 1567374 -1250634 -3252051 -3676922 -4058371 -4894041 -4427099 -1973438 -104815 -1198082
7312 -1198082 -3414065 -3015887 3972 1674990 -441833 -4429664 -7460601 -9225330
7304 -9225330 -10378590 -10019836 -7155124 -3371903 -1637048 -2704581 -4355707 -4046573 -1192332
7295 -1192332 2694197 4958519 3469314 -1267768 -5918876 -7438889 -6133321 -4639572
7287 -4639572 -4548560 -5540721 -7313979 -10219401 -13583416 -15250959 -13865808 -10591493 -7650164
7278g650164J836724J641524K144973J846516J03011j801053j954316k71968R80319
7269c124434o3932k228614k886514j773799j047132j380897o97259K039211M314612
7260f848758L422113M66952j344538j141255o91162j090598j572422j337194n05408
7251a0642270O82534J945877K452935J743026P47829L90414j10364j686124l009505
7242g485648k084416K18242J011918j65115p25416N04672J210713n36414k876204
7233a0927668k753169k76197J680281J399797N6667j68582J462189L508437L595832
7224b422413R82868j965262k077341N09155K178117N69549k345770l302196k122184
7215i995477j043954q68349k22041J592557L180965K945412J050478q93682j339371
$$ plain form
7278 -7650164 -5813440 -4171916 -2026943 -180427 -77416 -1878469 -3832785 -4104753 -3124434
7269 -3124434 -3188366 -5416980 -8303494 -10077293 -11124425 -12505322 -13202581 -11163370 -6848758
7260 -6848758 -3426645 -2959693 -4304231 -5445486 -6136648 -7227246 -8799668 -10136862 -10642270
7251 -10642270 -9959736 -8013859 -5560924 -3817898 -3070069 -2679655 -2790019 -4476143 -7485648
7242 -7485648 -9570064 -9351822 -8339904 -8505019 -9230435 -8725763 -7515050 -8051464 -10927668
7233 -10927668 -13680837 -13957034 -12276753 -10876956 -10820289 -10988871 -9526682 -6018245 -2422413
7224 -2422413 -1439545 -3404807 -5482148 -4972993 -2794876 -2225327 -4571097 -7873293 -9995477
7215 -9995477 -11039431 -11907780 -12129821 -10537264 -7356299 -4410887 -3360409 -4254091 -5593462
7206e593462l6824J534772J325372q90771k847659k542454r44353m95232j457593
7197a1948204j648387J59635K447514L107831J885746k2714j518050j938502r87858
7188a0462989O60268J467764P86326L9620J131039L775676N299508L434367j022925
7179E108654m678235m793195k038951K48488k96797k561819l484774j706008J056832
7170a3145805K227356J211625k31794o884K167856M387196M301464J465677k090364
7161B86327l814378k967706q55542Q17226J345753J090879O88335K06579q94430
7152d096957k592089l421799j987313N95268J531221K67342n45870O45111J477573
7143h127513l67598k611391j489488J873997K674056n4929j833960J39380K765985
$$ plain form
7206 -5593462 -5630286 -4095514 -2770142 -3660913 -6508572 -9051026 -9995379 -10490611 -11948204
7197 -11948204 -13596591 -13436956 -10989442 -7881611 -5995865 -6018579 -7536629 -9475131 -10462989
7188 -10462989 -9802721 -8334957 -7548631 -7509011 -6377972 -2602296 2697212 6131579 5108654
7179 5108654 430419 -4362776 -6401727 -6153239 -6450036 -9011855 -12496629 -14202637 -13145805
7170 -13145805 -10918449 -9706824 -9938618 -9945502 -7777646 -3390450 911014 2376691 286327
7161 286327 -3528051 -6495757 -7351299 -6534073 -5188320 -4097441 -3409106 -3202527 -4096957
7152 -4096957 -6689046 -10110845 -12098158 -11502890 -9971669 -9704327 -10250197 -9605086 -8127513
7143 -8127513 -8495111 -11106502 -12595990 -10721993 -8047937 -8102866 -9936826 -9797446 -7031461
7134g031461K334468J81383k53352Q30504O18416j217926k193888j187445J99372
7125g719929M35497j73040o30011m54661J93599M73701m05298j484099n17277
7116a0281518K503138M149269J934219j886903l361364k020216k22141J023112
7108h162404K202601K561380R70272j195336j671320j074460j277063j015093
7100h661423K140378N934556N212436K37240k662712n92835J582035o21584m296073
7091a727982m397126j456949P12384J391771J991778J650888q57086k946093j392210
7082g030625J730339J707516j121307j935904N01105K181795J114150N15664K574950
7073B37683L999795J098123m192452o815536m922348p58542L008173N006849M427690
$$ plain form
7134 -7031461 -4696993 -4515610 -4768962 -3938458 -3320042 -4537968 -6731856 -7919301 -7719929
7125 -7719929 -7284432 -7457472 -8087483 -8542144 -8348545 -7874844 -8280142 -9764241 -10281518
7116 -10281518 -7778380 -3629111 -1694892 -3581795 -6943159 -8963375 -9185516 -8162404
7108 -8162404 -5959803 -3398423 -2428151 -3623487 -5294807 -6369267 -7646330 -8661423
7100 -8661423 -6521045 -586489 4625947 4863187 2200475 1607640 3189675 2568091 -1727982
7091 -1727982 -6125108 -7582057 -6869673 -5477902 -3486124 -1835236 -2692322 -5638415 -7030625
7082 -7030625 -5300286 -3592770 -4714077 -6649981 -6148876 -3967081 -2852931 -2337267 237683
7073 237683 4237478 5335601 1143149 -5672387 -10594735 -11353277 -8345104 -3338255 1089435
7064A089435J446087j785340k683753j126659L72980l57808k649662l736897j956406
7055a1388023R89799J717183n15387k456799j116116K025835L267217K082649
7047e393642J241982J866821J881712Q9921j580670j374447l90295k54901o58912
7038d572431r89643j869940l014378k146274J340899M002354K748266l19847j041599
7029e862593L45818O8945k462574l382167o50435K490505K315952k11102j505814
7020h853465m50448J179478K040973K310225J886157K000k806818m104130k115095
7011a0911123J732513L835564K137639j613604l661572k181231J003255K765348
7003f893211K142290Q42232O92012J593639K203470J757492O19787n20756j325125
$$ plain form
7064 1089435 2535522 750182 -1933571 -3060230 -2687250 -3045058 -5694720 -9431617 -11388023
7055 -11388023 -10398224 -8681041 -9196428 -11653227 -12769343 -10743508 -7476291 -5393642
7047 -5393642 -4151660 -2284839 -403127 -313206 -1893876 -3268323 -3658618 -3913519 -4572431
7038 -4572431 -5562074 -7432014 -10446392 -12592666 -11251767 -7249413 -4501147 -4820994 -5862593
7029 -5862593 -5516775 -5447830 -7910404 -11292571 -11943006 -9452501 -7136549 -7347651 -8853465
7020 -8853465 -9303913 -8124435 -6083462 -3773237 -1887080 -1885080 -4691898 -8796028 -10911123
7011 -10911123 -9178610 -5343046 -3205407 -4819011 -8480583 -10661814 -9658559 -6893211
7003 -6893211 -4750921 -3908689 -3216677 -1623038 580432 2337924 2957711 2436955 1111830
6994A111830j725610j669575j194611o47577n59902j067490j520542j071277J87527
6985h157227J122835R67252L40826K22290L45928k83192j339894j098398Q66756
6976g012824K203169N66633k708506l737159j256633J338330N34920k255748k514557
6967a4842375J010775M416179L888380N48163j589294q95612P20845J103584J03058
6958e536297j291910k129787j617586K22567J708073R64879j290631k118892k36709
6949a1326293K142084K440886J133445M41156P85333N64609q71354j976133j209006
6940g875273Q04767K062562J535610J66146k74257R57206K778450L295107J736080
6931E186398o12647j577411l65129J336805Q76621k257189n091890m064839L43542
$$ plain form
6994 1111830 -613780 -2283355 -3477966 -4125543 -4685445 -5752935 -7273477 -8344754 -8157227
6985 -8157227 -7034392 -6067140 -5726314 -5504024 -5158096 -5441288 -6781182 -7879580 -7012824
6976 -7012824 -4809655 -4243022 -6951528 -10688687 -11945320 -10606990 -10072070 -12327818 -14842375
6967 -14842375 -13831600 -9415421 -5527041 -4978878 -6568172 -7463784 -6742939 -5639355 -5536297
6958 -5536297 -6828207 -8957994 -10575580 -10353013 -8644940 -7680061 -8970692 -11089584 -11326293
6949 -11326293 -9184209 -6743323 -5609878 -5168722 -4383389 -3818780 -4690134 -6666267 -7875273
6940 -7875273 -7070506 -5007944 -3472334 -3306188 -3580445 -2623239 155211 3450318 5186398
6931 5186398 4573751 2996340 2631211 3968016 4844637 2587448 -2504442 -6569281 -6225739
6922f225739L333949J497891k420357k720766J715685N782610M702460k34276
6914E431457l987806m010783k207200j573688k737367l763392k402358J367860
6906a3883277M702821M511650J082093k024984k240429o77173L67869Q41320K071708
6897e248402L750631M056103K428877K75583j126614j852311k303412k278964
6889b298509j409334K44623K086125L032199K146018j53116k167595k888740k972184
6880d380513k984598k111809o0455J216284q6979k401029k433963K62370K776616
6871a0204076K895037J347074k39751j265651j392336m3500K239937L552785K732829
6862c77652N27568j840903l797145m620481l377266o55804J205512Q35800m42503
$$ plain form
6922 -6225739 -2891790 -1393899 -3814256 -6535022 -4819337 963273 5665733 5431457
6914 5431457 1443651 -2567132 -4774332 -6348020 -9085387 -12848779 -15251137 -13883277
6906 -13883277 -9180456 -4668806 -3586713 -5611697 -7852126 -8529299 -8161430 -7320110 -5248402
6897 -5248402 -1497771 2558332 4987209 5262792 4136178 2283867 -19545 -2298509
6889 -2298509 -3707843 -3463220 -1377095 1655104 3801122 3648006 1480411 -1408329 -4380513
6880 -4380513 -7365111 -9476920 -9537375 -8321091 -8408070 -10809099 -13243062 -12980692 -10204076
6871 -10204076 -7309039 -5961965 -6201716 -7467367 -8859703 -8903203 -6663266 -3110481 -377652
6862 -377652 149916 -1690987 -5488132 -10108613 -13485879 -14141683 -12936171 -12100371 -12542874
6853a2542874o86509Q4687O11268O63519J179044K626100M301221N025113M052254
6844E313823J802204r0477l62466M2484r66593l380157m673491l528238j996892
6835g839803k286390l095279j573083J983904M075135K702931j21969j198540
6827g353094K12392K286559K910884J310914j610965l815770l691858j698148
6819a1449086L9819J38141o38500p25457K50243J484322K389260L017464L232486
6810b261308K408858L92486j686195k141918m30346K080492L302120K494611R52268
6801E111068L88986Q77390J002285R0719o86254k03441M33228q69619l780932
6792B363430n187667l195726J6104R73270m74025j454447o48568p121j180387
$$ plain form
6853 -12542874 -13229383 -13144696 -12533428 -11869909 -10690865 -8064765 -3763544 1261569 5313823
6844 5313823 7116027 7025550 6663084 6705568 5738975 2358818 -2314673 -5842911 -7839803
6835 -7839803 -10126193 -13221472 -14794555 -12810651 -8735516 -6032585 -6154554 -7353094
6827 -7353094 -7140702 -4854143 -1943259 -632345 -2243310 -6059080 -9750938 -11449086
6819 -11449086 -11409267 -11271126 -11909626 -12635083 -12384840 -10900518 -8511258 -5493794 -2261308
6810 -2261308 147550 540036 -1146159 -3288077 -3718423 -1637931 1664189 4158800 5111068
6801 5111068 5500054 6377444 7379729 7470448 6784194 6580753 7013981 6144362 2363430
6792 2363430 -2824237 -6019963 -6003859 -5030589 -5504614 -6959061 -7607629 -7614750 -8795137
6783h795137k540747j474960J696384L963050L332923Q93419o98327J29081K543473
6774i50841M060304K949323K11892j532544j336995q50094j433146k025370j094750
6765b002221P90369J951571J975970J451154M50025r52797j732226j358251j093759
6756e20165j856832k096882k78819J791689J206754j355640k598860j748890r66952
6747h424597p38936Q52159L455580L505542q3027l117661j728306K196270M004595
6738g8381K380611l65163k219297k861307k459643j614562j589787k604310k887047
6729a4298886j124994J380250K625693K538488K072347J394431P93187J423744
6721c195740K942479K523703r66811l856591k240619J869273L051930L94089j489422
$$ plain form
6783 -8795137 -11335884 -12810844 -11114460 -7151410 -3818487 -2925068 -3623395 -3494314 -950841
6774 -950841 3109463 6058786 6270678 4738134 3401139 2551045 1117899 -907471 -2002221
6765 -2002221 -1211852 739719 2715689 4166843 4616868 3664071 1931845 573594 -520165
6756 -520165 -2376997 -4473879 -4752698 -2961009 -1754255 -3109895 -5708755 -7457645 -8424597
6747 -8424597 -9163533 -8311374 -4855794 -1350252 -1433279 -4550940 -6279246 -4082976 -78381
6738 -78381 2302230 1937067 -282230 -3143537 -5603180 -7217742 -8807529 -11411839 -14298886
6729 -14298886 -15423880 -14043630 -11417937 -8879449 -6807102 -5412671 -4619484 -3195740
6721 -3195740 -253261 2270442 1303631 -2552960 -4793579 -2924306 127624 521713 -967709
6712i67709L21778L017407K652800n96628l706425m861536m231513k423932j77938
6703a0973696J252228R64196n21305j684983j247168J025146M048895N955751
6695a180936N624589L649445J323050o99112k008230j895484o30971j75204j705335
6686B301812l374371k761045o83449J14811n78528n55633L90935o7348k109769
6677g322585k408201O32411L612096K813092l99364j939736r72695j36284o85521
6668f806787q90091M48047J821151J489607R7395o40818o33413j158771k265347
6659h539027k003096R85460M849078N768634K180280l094739n692748m175285
6651i721443q91223J059147O02366j222466k583566k127377m5231J912138K300009
$$ plain form
6712 -967709 -645931 2371476 5024276 4427648 721223 -4140313 -8371826 -10795758 -10973696
6703 -10973696 -9721468 -8757272 -9278577 -10963560 -12210728 -11185582 -7136687 -1180936
6695 -1180936 4443653 8093098 9416148 8717036 6708806 4813322 4182351 4007147 2301812
6686 2301812 -1072559 -3833604 -4517053 -4402242 -4980770 -5536403 -5145468 -5212816 -7322585
6677 -7322585 -9730786 -9098375 -5486279 -2673187 -3072551 -5012287 -5984982 -6121266 -6806787
6668 -6806787 -7696878 -7248831 -5427680 -3938073 -3840678 -4481496 -5114909 -6273680 -8539027
6659 -8539027 -10542123 -9556663 -4707585 1061049 3241329 146590 -5546158 -9721443
6651 -9721443 -10612666 -9553519 -8951153 -10173619 -12757185 -14884562 -14929793 -13017655 -10717646
6642a0717646J703348J587860J856151J155723n05209j396798o83607N05321J207119
6633e287738J794106K074122M62264l148579n478189l335429J697210M454595
6625f767638K223216k247034m283803k459793O33805J977641J352531P52138J269873
6616g549064J653790M30554j510087j853184j32926J556277J501090N16859L62296
6607e024395J248695J976561J729453P62165j74133m39910m8435R9080o89739
6598e60658j462240n98672J491808K438115J401583M12035Q50453Q45907j511214
6589C307117m233881l886382r97778M94414q06636j926561n57990J440643J514548
6580e652506O30629J241336K716875K003705j494278m502260l974024o53572K324406
$$ plain form
6642 -10717646 -9014298 -7426438 -5570287 -4414564 -4919773 -6316571 -7000178 -6494857 -5287738
6633 -5287738 -3493632 -1419510 -957246 -4105825 -9584014 -12919443 -11222233 -6767638
6625 -6767638 -4544422 -6791456 -11075259 -13535052 -12901247 -10923606 -9571075 -8818937 -7549064
6616 -7549064 -5895274 -5464720 -6974807 -8827991 -8960917 -7404640 -5903550 -5386691 -5024395
6607 -5024395 -3775700 -1799139 -69686 692479 518346 78436 30001 129081 -560658
6598 -560658 -2022898 -2621570 -1129762 1308353 2709936 3121971 3972424 4818331 3307117
6589 3307117 -926764 -4813146 -5810924 -5316510 -6123146 -8049707 -8607697 -7167054 -5652506
6580 -5652506 -5021877 -3780541 -1063666 940039 -554239 -5056499 -9030523 -9684095 -7359689
6571g359689L004193J844374L60859m57426p48590j312211k251142k176971J61329
6562h935274L272781L649075K59372l220522k685752Q41924K513300L48218k293253
6553f250131j849987O15404J719906P85415j64618l36895j088866k830019l629664
6544a3029455j947359R25399K390573J691802N46289Q65208K424135L037862J212426
6535a883120j647024k630602j118758K76369n37700k071797j664868L97418J538717
6526i341365R13722J61149K91880L92117k48687r91646j273663j154135k19378
6517a1470006J834638L378261K294604k95716q17029J275736K128915n94704l686433
6508e951734l019665M01725K356375J634280Q02429J484114K159160Q53568k301466
$$ plain form
6571 -7359689 -4355496 -2511122 -2150263 -2607689 -3356279 -4668490 -6919632 -9096603 -8935274
6562 -8935274 -5662493 -2013418 -1754046 -4974568 -7660320 -6818396 -4305096 -3956878 -6250131
6553 -6250131 -8100118 -7484714 -5764808 -4979393 -5144011 -5480906 -6569772 -9399791 -13029455
6544 -13029455 -14976814 -14051415 -11660842 -9969040 -9422751 -8557543 -6133408 -3095546 -1883120
6535 -1883120 -3530144 -6160746 -7279504 -7003135 -7540835 -9612632 -11277500 -10880082 -9341365
6526 -9341365 -8427643 -8266494 -7974614 -7582497 -7831184 -8822830 -10096493 -11250628 -11470006
6517 -11470006 -9635368 -6257107 -3962503 -4258219 -5075248 -3799512 -1670597 -2265301 -5951734
6508 -5951734 -8971399 -8569674 -6213299 -4579019 -3776590 -2292476 -133316 720252 -1581214
6499a581214n407218o149344l258299J739168M931633M040016J263930J51228
6491d270100P05638L07444j311739j538912M09484J796117P38852o81593K58019
6482c586790K634964L295216J348752j005986j677869q26710J56055L33557l58938
6473C12251j338839j690196r44645K02374N12168k24203p58053P8042J764189
6464b086912K543274J361700j110442l320368m087032l011871n76703J684343
6456h604011K025929L87893j223997j180235k75829j60566o49520l52062P33890
6447i298508J464639J971360L220509M190580K579801r88951k727239j063661
6439f51470Q99453L30733j050374m66220R21589K04552j962899k322117m18387
$$ plain form
6499 -1581214 -6988432 -13137776 -16396075 -14656907 -9725274 -5685258 -4421328 -4270100
6491 -4270100 -3564462 -3257018 -4568757 -6107669 -5698185 -3902068 -3163216 -3844809 -3586790
6482 -3586790 -951826 2343390 3692142 2686156 1008287 181577 337632 671189 312251
6473 312251 -1026588 -2716784 -3661429 -3459055 -2946887 -3171090 -3929143 -3851101 -2086912
6464 -2086912 456362 1818062 707620 -2612748 -6699780 -9711651 -10288354 -8604011
6456 -8604011 -6578082 -6190189 -7414186 -8594421 -8870250 -9030816 -9680336 -10032398 -9298508
6447 -9298508 -7833869 -5862509 -2642000 1548580 4128381 3139430 412191 -651470
6439 -651470 247983 578716 -471658 -937878 -16289 188263 -1774636 -4096753 -4515140
6430d515140Q48360q1776j698189k508214k520457j315941J924698N562307N935459
6421A631107K243901j605327j812927P21067K417583J862090N50640r3309k95267
6412E619558o81190j021686o92410K08026O65906p4556j187290q86273J055261
6403C005346K343821R11015k119000l719194k701664n24252J183869J952109J532134
6394A864184j68353j916230j921718k89043J024697J024221N59456Q4222j137334
6385h75898k725670k505985K29036K674024J793977j500950l512287k500963l29438
6376i254154O17491L49408L34998Q35384O56871l90498l48182K120298M636626
6367d41758L323748j347163l816364n90667M348314M572236N1759l140728j627568
$$ plain form
6430 -4515140 -3666780 -3748556 -5446745 -7954959 -10475416 -11791357 -9866659 -4304352 1631107
6421 1631107 3875008 2269681 456754 1177821 3595404 5457494 6008134 5914825 5619558
6412 5619558 4938368 3916682 3224272 3432298 4098204 4023648 2836358 1950085 3005346
6403 3005346 5349167 6260182 4141182 421988 -2279676 -2803928 -1620059 332050 1864184
6394 1864184 1695831 -220399 -2142117 -2431160 -1406463 -382242 177214 261436 -875898
6385 -875898 -3601568 -6107553 -5878517 -3204493 -1410516 -2911466 -6423753 -8924716 -9254154
6376 -9254154 -8636663 -8287255 -7952257 -7116873 -6460002 -6850500 -7198682 -5078384 -441758
6367 -441758 2881990 1534827 -2281537 -2872204 1476110 6048346 6100105 2959377 1331809
6358A331809J192568R49949j764541l493211l021483j728940o38717L59441J213216
6349e599909J492469J011791k68301k082789l016472j355823K204910M296426
6341c317698K693721q36790k789925j834573P59932L278852M514264L530904L29895
6332F328582l410838n489953n148050l395932j724379q56623l42843Q03041K641205
6323a0595790L772754L077036J392370J40720r73847k892222m453095l451735
6315a3983809m37405J509933J266157Q62201J404011J154859p79295k046525n05025
6306a1554898K464047M207621M083506K640793R0221k315903k108847O46672K037220
6297A90432l89984l488713k949751L69558K237820J410996K86369L52889Q40826
$$ plain form
6358 1331809 2524377 3474326 1709785 -1783426 -4804909 -6533849 -7172566 -6813125 -5599909
6349 -5599909 -4107440 -3095649 -3363950 -5446739 -8463211 -9819034 -7614124 -3317698
6341 -3317698 -623977 -1460767 -4250692 -6085265 -5325333 -2046481 2467783 5998687 6328582
6332 6328582 2917744 -2572209 -7720259 -11116191 -12840570 -13697193 -14040036 -13236995 -10595790
6323 -10595790 -6823036 -3746000 -2353630 -2212910 -3186757 -6078979 -10532074 -13983809
6315 -13983809 -14421214 -12911281 -11645124 -10782923 -9378912 -8224053 -9003348 -11049873 -11554898
6306 -11554898 -9090851 -4883230 -799724 1841069 1931290 -384613 -2493460 -1846788 190432
6297 190432 -199552 -3688265 -6638016 -6268458 -4030638 -2619642 -2333273 -1980384 -1139558
6288a139558J290770J931636J846637n7834k551890l385949k583265j760650j103299
6279g513402K8731O51079k37265p36242J312232L714425K503256j320930k640802
6270d238918j18720J955106P87865j187941j630638k173698m018653m256154n53396
6261a5435147L944494M621380J841479o05478j430571j992571k040725K4368K943907
6252h128864L093110R100k246726p27119K314240K879160N95882j624762j985447
6243e821426j380385q43117K40476K439214M271986L453120j21629l812474m860758
6234f434993k861508L92422K629567K541857O21631r88262m63459J477939K445534
6225f39272J774087J329140K143666K389046L80033k286712k878317j425707n8409
$$ plain form
6288 -1139558 151212 2082848 3929485 3871651 1319761 -2066188 -4649453 -6410103 -7513402
6279 -7513402 -7484671 -6833592 -7070857 -7807099 -6494867 -2780442 -277186 -1598116 -4238918
6270 -4238918 -4357638 -2402532 -1614667 -2802608 -4433246 -6606944 -10625597 -14881751 -15435147
6261 -15435147 -11490653 -6869273 -5027794 -5633272 -7063843 -9056414 -11097139 -11072771 -8128864
6252 -8128864 -5035754 -5026654 -7273380 -8000499 -5686259 -2807099 -2211217 -3835979 -5821426
6243 -5821426 -7201811 -8044928 -7804452 -5365238 -1093252 2359868 2238239 -1574235 -6434993
6234 -6434993 -9296501 -8904079 -6274512 -3732655 -3111024 -4099286 -4562745 -3084806 -639272
6225 -639272 1134815 2463955 4607621 6996667 7376700 5089988 2211671 785964 727555
6216G27555M25565P55909Q90040K38097m99962l96637m36379j748932k666894
6207b711638j019090J413973Q88073k087698l151906j172641P6492j325857k207663
6198a1297955k87788J564007O05715o09416J183946L723683K776868l87596o49538
6189c378074K764601N042646L031088q47940k930148k797035k019599j380845
6181b515306r53151q75864p65407J02176J228842J054547o97305k377579k694447
6172h493494k115071j432168n46949N41849J044365O81376M70412J182312K026148
6163f641220J939165J310723J172424J256870L39769j472712k242599p39760J475507
6154c601833J764823p3525j481484p51281N96392K89597j144594j357801p0264
$$ plain form
6216 727555 1153120 1909029 2799069 3037166 2537204 2140567 1704188 -44744 -2711638
6207 -2711638 -3730728 -2316755 -1428682 -3516380 -6668286 -7840927 -7764435 -9090292 -11297955
6198 -11297955 -11585743 -10021736 -9416021 -10025437 -8841491 -5117808 -2340940 -2728536 -3378074
6189 -3378074 -613473 4429173 7460261 6612321 3682173 885138 -1134461 -2515306
6181 -2515306 -3468457 -4344321 -5109728 -5007552 -3778710 -2724163 -3421468 -5799047 -8493494
6172 -8493494 -10608565 -12040733 -12587682 -12045833 -11001468 -10320092 -9849680 -8667368 -6641220
6163 -6641220 -4702055 -3391332 -2218908 -962038 -622269 -2094981 -4337580 -5077340 -3601833
6154 -3601833 -1837010 -1910535 -3392019 -4143300 -3546908 -3257311 -4401905 -5759706 -5829970
6145e829970N21323n93112j703607j341058l63781K26743J228392L097042L913516
6136h44512J977518j019081k123823j449114j447640k366013j717563J175248
6128g814980L203223J646012j811826l260019j589112O83333J265092Q50840J353527
6119e473910K595908K226726r38636m693866n585595k827068J069587L393975
6111a0232879L615907K585062J070487j29355j21994Q74022J359683O50132J6496
6102c12439O02157J418380Q59694q40435k259092k957576l278434k789024r15720
6093a0472489J289428J977186J036888J41092K90584Q44091R70705O18564K3299
6084c280652m62157j63581J045661J966888J506768M43576J99387L68731n33272
$$ plain form
6145 -5829970 -5308647 -5901759 -7605366 -8946424 -9310205 -9083462 -7855070 -4758028 -844512
6136 -844512 1133006 113925 -2009898 -3459012 -4906652 -7272665 -8990228 -7814980
6128 -7814980 -4611757 -2965745 -4777571 -8037590 -9626702 -8943369 -7678277 -6827437 -5473910
6119 -5473910 -2878002 -651276 -1589912 -6283778 -11869373 -14696441 -13626854 -10232879
6111 -10232879 -6616972 -4031910 -2961423 -3090778 -3212772 -2338750 -979067 -328935 -312439
6102 -312439 289718 1708098 2567792 1727357 -531735 -3489311 -6767745 -9556769 -10472489
6093 -10472489 -9183061 -7205875 -6168987 -6027895 -5737311 -4893220 -3922515 -3303951 -3280652
6084 -3280652 -3742809 -3906390 -2860729 -893841 612927 1056503 1255890 1624621 1091349
6075A091349k108660k182741k11969J588952J304350k71476j164684p21534K84477
6066b391936Q95306N98474l85717j071990q52213o26172j528300k694045k085872
6057a0142465K89682J984080J464735o6673r21328j007700p51634K1913R03783
6048h225607O26006n11076k5580K875243M780349K280025k590544m461114j893410
6039g145708Q86269K55325k015770k116432R1946J489817P08611k66908K82208
6030g830642J247740J079119P79021K325302M930544N355646K311846j548238
6022H650338l074661k424557k006030k841135l708163l264264j402715J144293
6014h926894L146442L251946J493698n6094K62113J189749M94930j176552j122717
$$ plain form
6075 1091349 -1017311 -3200052 -3412021 -1823069 -518719 -790195 -1954879 -2676413 -2391936
6066 -2391936 -1496630 -898156 -1283873 -2355863 -3208076 -3834248 -5362548 -8056593 -10142465
6057 -10142465 -9852783 -7868703 -6403968 -6470641 -7391969 -8399669 -9151303 -9129390 -8225607
6048 -8225607 -7599601 -8110677 -8136257 -5261014 -480665 1799360 -791184 -5252298 -7145708
6039 -7145708 -6259439 -6004114 -8019884 -10136316 -10044370 -8554553 -7845942 -8112850 -7830642
6030 -7830642 -6582902 -5503783 -4724762 -2399460 2531084 7886730 10198576 8650338
6022 8650338 5575677 3151120 1145090 -1696045 -5404208 -8668472 -10071187 -8926894
6014 -8926894 -5780452 -2528506 -1034808 -1090902 -828789 360960 855890 -320662 -1443379
6005a443379P27954J134125j425821m020511l397217m37154J711533K008834J576806
5996c564830Q89157l37739j243330m92135J304807K058989J140102l7177l76362
5987f58518k32482o4433K94447P20398O97624M51328P82351J519435J560869P51246
5977E822265K46669N71721P39238j00605j401206k207209k241660j523309j81932
5968b76028Q20946K62830j278135j482495M94207K363615J689820q22178k745584
5959i73002l399373l676121l258585q28486K763721M274832K225085o84159r23655
5950d479743J270060K314220j40643m393626o564179m578981j35682L126678L398953
5941a0182943K300845K240774K922173K021570q78047l259783l315280k356252
$$ plain form
6005 -1443379 -715425 418700 -1007121 -5027632 -8424849 -8862003 -7150470 -5141636 -3564830
5996 -3564830 -2675673 -3013412 -4256742 -4748877 -3444070 -1385081 -244979 -282156 -658518
5987 -658518 -891000 -955433 -660986 59412 757036 1208364 1990715 3510150 5071019 5822265
5977 5822265 6068934 6640655 7379893 7279288 5878082 3670873 1429213 -94096 -276028
5968 -276028 544918 807748 -470387 -1952882 -1458675 904940 2594760 1772582 -973002
5959 -973002 -4372375 -8048496 -11307081 -12135567 -9371846 -5097014 -2871929 -3556088 -4479743
5950 -4479743 -3209683 -895463 -1036106 -5429732 -11993911 -16572892 -16708574 -13581896 -10182943
5941 -10182943 -7882098 -5641324 -2719151 -697581 -1575628 -4835411 -8150691 -10506943
5933a0506943k048258j359913J246637M039756L605119m8522k918330k046722
5925a0037176J262642L869860M136031K036883j646215m815805m771522j309530
5917a1274832K218904K651884P40765m60167J72684J123366J087997N12585K94032
5908b932782N15525P11953L82022p55309k161601k403899p00364J650710K442964
5899c250781J117678p82087j655995j400208q51798n76959n13884k50956O14476
5890g550514K050353L303398L223941J223436j741428l275235j617680J786609
5882b597120K982810J65541l488765l806704j438235m96972j742947j392948K145333
5873i670007M875950L252965l08740j641408j248129k025694l155061j612694
$$ plain form
5933 -10506943 -12555201 -13915114 -12668477 -8628721 -5023602 -5072124 -7990454 -10037176
5925 -10037176 -8774534 -4904674 -768643 1268240 -377975 -5193780 -9965302 -11274832
5917 -11274832 -9055928 -6404044 -5663279 -6123446 -5950762 -4827396 -3739399 -3226814 -2932782
5908 -2932782 -2417257 -1705304 -1323282 -2078591 -4240192 -6644091 -7344455 -5693745 -3250781
5899 -3250781 -2133103 -2915190 -4571185 -5971393 -6823191 -7400150 -7914034 -8164990 -7550514
5890 -7550514 -5500161 -2196763 1027178 2250614 509186 -2766049 -4383729 -2597120
5882 -2597120 385690 551231 -2937534 -6744238 -8182473 -8679445 -10422392 -11815340 -9670007
5873 -9670007 -4794057 -1541092 -1849832 -3491240 -4739369 -6765063 -9920124 -11532818
5865a1532818J600548K389886N43308K70985K986492M788307K855843l43194j609490
5856A949867j667290k352210k577685n42346K381551L309567J969948L94143m07037
5847B458508j000360j600064j782317j647547j568136j202110o1777J391456K168450
5838b843897J744315J71849j831732k639744j042330J733946L006691K070522
5830C69620O72609k81795j750520l397308k745593N33735K668118J007359j462153
5821d385928m06123K983249L515292l76909m564208n049558k450941K48982J663891
5812h822253K262780K455948K031522R84924L0297J17817J302077K264559J836890
5803D464561R57339J511584K886364J995049k022068n585995n283687k531706
$$ plain form
5865 -11532818 -9932270 -7542384 -6999076 -6728091 -3741599 1046708 3902551 3559357 1949867
5856 1949867 282577 -2069633 -4647318 -5189664 -2808113 501454 2471402 2865545 2458508
5847 2458508 1458148 -141916 -1924233 -3571780 -5139916 -6342026 -6403803 -5012347 -2843897
5838 -2843897 -1099582 -927733 -2759465 -5399209 -6441539 -4707593 -1700902 369620
5830 369620 1042229 760434 -990086 -4387394 -7132987 -6599252 -3931134 -2923775 -4385928
5821 -4385928 -4792051 -1808802 1706490 1329581 -3234627 -8284185 -10735126 -10486144 -8822253
5812 -8822253 -6559473 -4103525 -2072003 -1087079 -1056782 -938965 363112 2627671 4464561
5803 4464561 5421900 6933484 9819848 11814897 9792829 4206834 -1076853 -3608559
5795c608559r84331j152510q37623M03678Q63969J72629l89246r21902k667519
5786i121414m430702k962201J885650N620801M524429K35218k780627k411932
5778i440778L7306K261444K722681J210597q74326j574076o20062K99026Q1738
5769e896450l84666j51551J36039k00154j93994J134230K567634K092459l1785
5760i28238j529516j321277o37395o52681q26602m61181l20694j134500j484390
5751i296474O46580M206048N294820K252264j401200j234762K038658L499092
5743F005026P98247k906240l539684r85555J990869L364464K599183j70630l427318
5734C728362m256303j521652J884656K248022k77703k392405k322197j317697
$$ plain form
5795 -3608559 -4592890 -5745400 -6583023 -6179345 -5315376 -5142747 -5531993 -6453895 -9121414
5786 -9121414 -13552116 -16514317 -14628667 -9007866 -4483437 -4248219 -7028846 -9440778
5778 -9440778 -9403472 -7142028 -4419347 -3208750 -4083076 -5657152 -6277214 -5978188 -5896450
5769 -5896450 -6281116 -6432667 -6296628 -6496782 -6690776 -5556546 -2988912 -896453 -928238
5760 -928238 -2457754 -3779031 -4416426 -5069107 -5895709 -6356890 -6677584 -7812084 -9296474
5751 -9296474 -8649894 -4443846 850974 3103238 1702038 467276 2505934 6005026
5743 6005026 6803273 3897033 357349 -628206 1362663 4727127 7326310 7155680 3728362
5734 3728362 -527941 -2049593 -164937 2083085 1805382 -587023 -2909220 -4226917
5726d226917q29312o45195m4335J096336K488752L269843K063131j110193l637035
5717a574925l113758p49320L84534q0179J36833J543237J835949m6655j946918
5708c611202j837359n18382N09934J513776L054879L913062K482294p94046l859569
5699H53387n134527m273180j902044N26496J677809J848931K432301L463700L365313
5690B858186J824406Q94236J819988K585211O34454l095631n014901l353869R915
5681h38005K183980K198936R76131m45957j780751k874867l043904j709602L55537
5672d978502J377361P63058j927L87604R86908M07598l23344Q02914K830335K381585
5662D633590j080048l475665j427696K848786M350163J691012j757134k643234
$$ plain form
5726 -4226917 -5056229 -5701424 -5745759 -4649423 -2160671 1109172 3172303 2062110 -1574925
5717 -1574925 -4688683 -5438003 -5053469 -5133648 -4996815 -3453578 -1617629 -1664284 -3611202
5708 -3611202 -5448561 -5966943 -5457009 -3943233 -888354 3024708 5507002 4712956 853387
5699 853387 -4281140 -8554320 -10456364 -9929868 -8252059 -6403128 -3970827 -507127 2858186
5690 2858186 4682592 5576828 7396816 9982027 10616481 7520850 2505949 -847920 -838005
5681 -838005 1345975 3544911 4521042 4075085 2294334 -580533 -3624437 -5334039 -4978502
5672 -4978502 -3601141 -2838083 -2840010 -2452406 -1465498 -1057900 -1381244 -578330 2252005 4633590
5662 4633590 3553542 77877 -1349819 1498967 5849130 7540142 5783008 3139774
5654C139774j198061K87025N24036l65186k238372m947818p006227o032690j768446
5645a9605965K439250L081967J048639M30108K576114M240117K863350O08039
5637b318381O79269K269268K448763J112811K85215j33189j832371m018252m021597
5628e528464j863323k95491k55387j78871J46251o59115j626902P2362L757276
5619f431664N015000K289059q24104j478880j132566j285784o09990J102239J038370
5610b318320j419765k369951J00219J901326k38182k711564j097039K032392J639404
5601d481480r01664n33489K126302J657985k672811n533800m124154j604010p02422
5592a6769543J21896K190601L474292K394114O39575l4572k73167m94349O59945
$$ plain form
5654 3139774 1941713 2228738 2752774 2387588 149216 -4798602 -11804829 -17837519 -19605965
5645 -19605965 -17166715 -14084748 -13036109 -12606001 -10029887 -5789770 -2926420 -2318381
5637 -2318381 -1639112 630156 3078919 4191730 4476945 4343756 2511385 -1506867 -5528464
5628 -5528464 -7391787 -7687278 -7942665 -8121536 -7975285 -8634400 -10261302 -10188940 -6431664
5619 -6431664 -1416664 872395 48291 -1430589 -2563155 -3848939 -4458929 -3356690 -2318320
5610 -2318320 -3738085 -6108036 -6007817 -4106491 -4344673 -7056237 -8153276 -6120884 -4481480
5601 -4481480 -5383144 -5916633 -3790331 -2132346 -4805157 -10338957 -14463111 -16067121 -16769543
5592 -16769543 -16647647 -14457046 -10982754 -8588640 -7949065 -7983637 -8256804 -8751153 -8091208
5583h091208L158745M133455J926288j124009k157688j644845j598070k103490
5575g500822j904921q01870N75536K046689L164797K483961o16065m151279n175692
5566a1879666k941828M80370K455480K163184J018106Q38743J495989J152799
5558e216823o07395j461580J90059K065282J047669j696983k144102L20932J950062
5549e552879O79535p61246L76925K288857J516303j760027m194065l928183k255025
5540a3589805r86398k19124Q87479K255545K557009Q62388j577165k080237K34511
5531a1655797K898577L014552Q49133j100640j717071j799512j683767r01970
5523a2096495j0224j34814o47549P9100J485054J270399n78809j308397J75490
$$ plain form
5583 -8091208 -4932463 -799008 1127280 3271 -2154417 -3799262 -5397332 -7500822
5575 -7500822 -9405743 -10207613 -9632077 -7585388 -4420591 -1936630 -2552695 -6703974 -11879666
5566 -11879666 -14821494 -14341124 -11885644 -9722460 -8704354 -7865611 -6369622 -5216823
5558 -5216823 -5824218 -7285798 -7095739 -5030457 -3982788 -5679771 -7823873 -7502941 -5552879
5549 -5552879 -4873344 -5634590 -5257665 -2968808 -1452505 -3212532 -7406597 -11334780 -13589805
5540 -13589805 -14576203 -14795327 -13907848 -11652303 -9095294 -8232906 -9810071 -11890308 -11655797
5531 -11655797 -8757220 -5742668 -4893535 -5994175 -7711246 -9510758 -11194525 -12096495
5523 -12096495 -12106719 -12241533 -12889082 -12809982 -11324928 -10054529 -10633338 -11941735 -11766245
5514a1766245J460174N92664r11463q03660M93527J147881P76997K75956J89003
5505h545166O28181J518302J959339Q38775j156686j893112q55671J55263J22413
5496g228362K27432J122707J335386o7662j516058j353640k22084N76493J134634
5487e991154J786427J870889J201795P88868O70919o60489l081763l745909j343384
5478h503801J116869M71926j838022k119497K03818K528370L026456J900148r1104
5469c304837j711860j087458J858312L956686K509720o29994j526863K28082J379131
5460A670919l9042k480756l527633k403056L6437J981857J852357L87950M12120
5451b108847K713523L953902J257295k961712m108230j903424P709p2646n34488
$$ plain form
5514 -11766245 -10306071 -9713407 -10624870 -11428530 -10935003 -9787122 -9010125 -8734169 -8545166
5505 -8545166 -7916985 -6398683 -4439344 -3600569 -4757255 -6650367 -7506038 -7350775 -7228362
5496 -7228362 -7000930 -5878223 -4542837 -4610499 -6126557 -7480197 -7702281 -7125788 -5991154
5487 -5991154 -4204727 -2333838 -1132043 -343175 327744 -332745 -3414508 -7160417 -8503801
5478 -8503801 -7386932 -6915006 -8753028 -10872525 -10668707 -8140337 -5113881 -3213733 -3304837
5469 -3304837 -5016697 -6104155 -4245843 -289157 2220563 1590569 63706 291788 1670919
5460 1670919 1631877 -848879 -4376512 -6779568 -6743131 -4761274 -2908917 -2520967 -2108847
5451 -2108847 604676 4558578 5815873 2854161 -1254069 -3157493 -3149784 -3222430 -3756918
5442c756918n03807r81426j788810j441413m98458j086715k584107j962786P69021
5433a3835419J979301O30198L06548K756939M189157J504444j943436j381761
5425e794029J636851J717497j827807m261068k986939q05554n44961p53402J031634
5416a2587778L749949M340166K255739p2968p87262n63832q50917j677391j964002
5407h158296j209837L2433J142208K010065K418125J713528j43991j782136j758124
5398e736025n28306J13032l46245m40591Q23901K225216K162331J194334J174276
5389F41923K271712K562404Q89088j285214j703433j34237J543308J605384j247
5380F389688k070600l146687k320545j24511J287784R1500k656220l709252j645370
$$ plain form
5442 -3756918 -4260725 -5242151 -7030961 -8472374 -8970832 -10057547 -12641654 -14604440 -13835419
5433 -13835419 -11856118 -11225920 -10919372 -8162433 -3973276 -2468832 -4412268 -5794029
5425 -5794029 -4157178 -2439681 -4267488 -8528556 -11515495 -12321049 -12866010 -13619412 -12587778
5416 -12587778 -8837829 -4497663 -2241924 -2314892 -3102154 -3665986 -4516903 -6194294 -8158296
5407 -8158296 -9368133 -9335700 -8193492 -6183427 -3765302 -2051774 -2195765 -3977901 -5736025
5398 -5736025 -6264331 -6151299 -6497544 -6938135 -6114234 -3889018 -1726687 -532353 641923
5389 641923 2913635 5476039 6365127 5079913 3376480 3242243 4785551 6390935 6389688
5380 6389688 4319088 1172401 -1148144 -1272655 15129 106629 -2549591 -6258843 -7904213
5371g904213J170019J813042N86108k09242l3026j50377o05771q3284J170320
5362d246424J255223j1490o08340o4533n21057k589655l428070j176161J657921
5353i732586J988360P15445M48375J096159J220486J584826L283652M064038J123747
5344E792502l371020m335587j106386J911367K060339J082684L27526j528604
5336H32821m225203m231397j16765M208420M602420J958719l88837j502293k026521
5327h88636j306375J122976L090269K243184m02449k273716l080461l803822l430172
5318h729202m26504L289650L744216N75379j987051p31272K488511L552204J246259
5309C022190j631922j700159J167446L555173K454796p78228k010371j09048J436552
$$ plain form
5371 -7904213 -6734194 -4921152 -4335044 -4544286 -4577312 -4727689 -5333460 -5416744 -4246424
5362 -4246424 -2991201 -3002691 -3611031 -3675564 -4196621 -6786276 -10214346 -11390507 -9732586
5353 -9732586 -7744226 -7028781 -6580406 -5484247 -4263761 -2678935 604717 4668755 5792502
5344 5792502 2421482 -1914105 -3020491 -1109124 951215 2033899 2361425 832821
5336 832821 -3392382 -7623779 -7740544 -3532124 1070296 3029015 2640178 1137885 -888636
5327 -888636 -2195011 -1072035 2018234 4261418 3858969 1585253 -1495208 -5299030 -8729202
5318 -8729202 -9155706 -5866056 -2121840 -1546461 -3533512 -4264784 -1776273 1775931 3022190
5309 3022190 1390268 -309891 857555 4412728 6867524 6089296 4078925 3969877 5406429
5300E406429p970k165611j985331j000623k410973m666882l115574K208805N621220
5291b116510L724960k79399k093197j960653k173891k523047j642407l53959j08954
5282i527057J49515K027471L840864K526901j031851k439109j46186K099215P18449
5273a781788k569855l432700j030376J279708R34518o57232p18139Q61973J668912
5264e444979L46341j615680k045535p80614O85701J340637J225497M99409m98764
5255f287987m98718J470275L759306L127552p74003l875648k544213J404978K964572
5246a253886N89462k099024j638027P87529J646113J63141j021272P697J598315
5237a219952Q62530k002750l366206p93823L210072L904107N27643k486205j411262
$$ plain form
5300 5406429 5398459 3232848 1247517 246894 -2164079 -6830961 -9946535 -7737730 -2116510
5291 -2116510 1608450 1329051 -764146 -2724799 -4898690 -7421737 -9064144 -9418103 -9527057
5282 -9527057 -9377542 -7350071 -3509207 -982306 -2014157 -4453266 -4599452 -2500237 -1781788
5273 -1781788 -4351643 -7784343 -8814719 -7535011 -6600493 -7257725 -7975864 -7113891 -5444979
5264 -5444979 -5098638 -6714318 -8759853 -9540467 -8854766 -7514129 -6288632 -5789223 -6287987
5255 -6287987 -6786705 -5316430 -1557124 1570428 796425 -3079223 -5623436 -4218458 -1253886
5246 -1253886 -664424 -2763448 -4401475 -3613946 -1967833 -1804692 -2825964 -2818267 -1219952
5237 -1219952 -357422 -2360172 -5726378 -6520201 -3310129 593978 1121621 -1364584 -2775846
5228b775846J940250L208628J439546o92690j450245j593722j712396j297994
5220b934469q00624j426837k276460j006233J699371K033152q50695k538751J42521
5211g959025L979360M363987K224182J405028J661453j93370l385387l440849
5203a344621K69592K814919J024550k293559l483766l044800k870004k233691
5195a1161380K02670K991402L648406K113608Q7189j447434k093854j375013j72136
5186g206542p42834l190150m152575j453463K217860L172654K167087K541971
5178f645992M515094N168671L403761J217475P7111p51433j925817k775718k784240
5169e01088k238154j267201n0488L60046n66527j166790L71676K776304L068940
$$ plain form
5228 -2775846 -835596 2373032 3812578 3119888 1669643 75921 -1636475 -2934469
5220 -2934469 -3735093 -5161930 -7438390 -8444623 -6745252 -4712100 -5562795 -8101546 -7959025
5211 -7959025 -3979665 384322 2608504 4013532 5674985 5481615 2096228 -1344621
5203 -1344621 -1075029 1739890 2764440 470881 -3012885 -6057685 -8927689 -11161380
5195 -11161380 -10958710 -7967308 -4318902 -2205294 -2118105 -3565539 -5659393 -7034406 -7206542
5186 -7206542 -7949376 -11139526 -15292101 -16745564 -14527704 -11355050 -9187963 -6645992
5178 -6645992 -2130898 3037773 6441534 7659009 7736120 6984687 5058870 2283152 -501088
5169 -501088 -2739242 -4006443 -4056931 -3696885 -4263412 -5430202 -5058526 -2282222 786718
5160G86718Q96532j175890j573768j153697o85339J87740J025034M60145j217901
5151b450426j911862j015351m11623j154293j538879J32400K855190M506052M580947
5142C592155L887249K639799L02622l070415o109767o745362l928623O50754L389070
5133e392518K528770K43790m58020L62404Q45390R72157J769416J923406q05532
5124A989263m823890n530361j791604K223308L000801J881133J630935K237522
5116H17107K252413J409713k49258l163543o015392n446545n42033M752926O237890
5107E3278M315853J797587o61017l667250n602805l969733L13635L251578K553138
5098a615736k35722k321214k364175o61342J554098K797153K466999J287762J25520
$$ plain form
5160 786718 1683250 507360 -1066408 -2220105 -2905444 -2717704 -1692670 -1232525 -2450426
5151 -2450426 -4362288 -5377639 -5789262 -6943555 -8482434 -8350034 -5494844 -988792 3592155
5142 3592155 7479404 10119203 10421825 7351410 1241643 -5503719 -9432342 -8781588 -5392518
5133 -5392518 -2863748 -2619958 -3077978 -2715574 -1870184 -898027 871389 2794795 1989263
5124 1989263 -2834627 -8364988 -10156592 -7933284 -4932483 -3051350 -1420415 817107
5116 817107 3069520 4479233 4229975 1066432 -4948960 -10395505 -10937538 -6184612 53278
5107 53278 4369131 6166718 5505701 1838451 -3764354 -7734087 -7420452 -4168874 -1615736
5098 -1615736 -1851458 -4172672 -6536847 -7198189 -5644091 -2846938 -379939 907823 1033343
5089A033343q26591j179987j74420J595336J911280j64273k610859l216549k479729
5080f112449k002450j571842j0546K279278L864230M472812M541670L442234M35525
5071I338462l068634m342955k439851R36160L321956L154717L88371l123308m614572
5062d49654l156183p30716M20083K85667j63008q82463j653363r56121J614685
5053e671073L341673J603062j982004l564787k444061j285505j344742r18305
5045a2265742R39362K356977J633891r4621p10105Q9934J336569K778857M591268
5036F56390N729916M385965N17546l208796m060860k510708j576443k576331l223891
5027e867212j356016J131929Q38900j494514j520262K099882N364970M778548
$$ plain form
5089 1033343 206752 -973235 -1147655 447681 2358961 2194688 -416171 -3632720 -6112449
5080 -6112449 -8114899 -9686741 -9697287 -7418009 -3553779 919033 5460703 8902937 9338462
5071 9338462 6269828 1926873 -512978 423182 3745138 6899855 7288226 4164918 -449654
5062 -449654 -3605837 -4336553 -3916470 -3630803 -3793811 -4676274 -6329637 -7285758 -5671073
5053 -5671073 -2329400 -726338 -2708342 -6273129 -8717190 -10002695 -11347437 -12265742
5045 -12265742 -11326380 -8969403 -7335512 -7430133 -8140238 -8050304 -6713735 -3934878 656390
5036 656390 6386306 10772271 11289817 8081021 4020161 1509453 -66990 -2643321 -5867212
5027 -5867212 -7223228 -6091299 -5252399 -6746913 -8267175 -6167293 -802323 3976225
5019C976225K077566P28288O79518k18920j699770j600244K6436O17618j031036
5010C555681l017334k900022o16648J496455J139064j272332k583675o54336K445144
5001b408003L121837J595141J245414K632818K484885k42447k057101r68261j25271
4992E279012k132501m119199k638201L28296R59999k7941L52298J432447O50865
4983H5075p43531O28420L955242M904915K260873p51094j618227r50600O2689
4974G833762R23824P87401o97225k066343k190226k336402l422178l488540j211219
4965e867146P46264j64147j728778q75176Q06065N84683M84626L491458O599876
4956D077725M692685m75548k507529m74761O00881j135422k241882j201230o21847
$$ plain form
5019 3976225 6053791 6782079 7461597 7242677 5542907 3942663 3969099 4586717 3555681
5010 3555681 538347 -2361675 -2978323 -1481868 -342804 -1615136 -4198811 -4853147 -2408003
5001 -2408003 713834 2308975 3554389 6187207 8672092 8429645 6372544 5404283 5279012
4992 5279012 3146511 -972688 -3610889 -3282593 -2322594 -2350535 -1998237 -565790 85075
4983 85075 -658456 -30036 3925206 8830121 11090994 10339900 8721673 7771073 7833762
4974 7833762 8757586 9544987 8847762 6781419 4591193 2254791 -1167387 -4655927 -5867146
4965 -5867146 -5120882 -5285029 -7013807 -7888983 -7082918 -6498235 -6013609 -2522151 4077725
4956 4077725 8770410 8294862 5787333 5312572 5913453 4778031 2536149 1334919 713072
4947G13072j433452j363902J7437O77426P96128K140638L078741O88295k616897
4938B697486j697859K306725L179588p6059k087251p66747O7995j292797j976652
4929C54429j281506j830198k872927p81377K764875K051434k018238k215579K354595
4920c474492M178114M31398k460099p49819P96382q76125j585280O91667J248073
4911a800181j482682j791468K264217M117371O60135j655380J188631L412371
4903D913014O75873k068996r01524k77896k907785l361326Q79437L438930J456014
4894A845741J642084O370533P365884J697557q06441M401279P260253K371244
4886C2148134k00269M558565N254667k405775l281178Q290709J2558050j3177
$$ plain form
4947 713072 -720380 -2084282 -2066845 -1389419 -593291 1547347 4626088 5314383 2697486
4938 2697486 999627 3306352 6485940 6409881 4322630 3555883 3623878 2331081 354429
4929 354429 -927077 -2757275 -5630202 -6411579 -3646704 -1595270 -3613508 -5829087 -3474492
4920 -3474492 703622 1135020 -1325079 -2074898 -1278516 -2154641 -3739921 -3048254 -1800181
4911 -1800181 -3282863 -5074331 -2810114 1307257 1967392 312012 1500643 4913014
4903 4913014 5588887 3519891 2618367 2340471 -567314 -3928640 -3049203 389727 1845741
4894 1845741 3487825 9858358 17224242 18921799 18115358 22516637 29776890 32148134
4886 32148134 31947865 36506430 41761097 39355322 36074144 44364853 56922903 56909726
4878E6909726n362432J2265185K6184420J5735275J6432426O2377134J01423467
4871B85965201M6415844q5909110j68426681j24367892k4153583K1297879K376991
4864d6801351j2815228L153517J5698714N490244l504773L867374R453616J141405
4856b4316482n908358q96626L800853j090357m956914K17058M737025J108880
4848b7304921j873349K903683P069977K768787l279884k956740m20890k145516
4840b5238853n005723l870780r86204M02537K481738N966686N947094J025481
4832a9278024k302297k61785K023306L91526j389007o4585P66960j347508k116797
4823b3578211J038469L277734J157870r77889M39449J373071j541473l781857
$$ plain form
4878 56909726 51547294 63812479 89996899 105732174 122164600 184541734 285965201
4871 285965201 332381045 246471935 78045254 -46322638 -70476221 -49178342 -46801351
4864 -46801351 -59616579 -56463062 -40764348 -35274104 -38778877 -34911503 -25457887 -24316482
4856 -24316482 -30224840 -31121466 -27320613 -28410970 -33367884 -33150826 -28413801 -27304921
4848 -27304921 -29178270 -26274587 -19204610 -16435823 -19715707 -22672447 -23093337 -25238853
4840 -25238853 -30244576 -34115356 -35101560 -34699023 -32217285 -26250599 -20303505 -19278024
4832 -19278024 -21580321 -21842106 -19818800 -19427274 -20816281 -20880866 -20113906 -21461414 -23578211
4823 -23578211 -22539742 -19262008 -18104138 -19082027 -18642578 -17269507 -18810980 -22592837
4815b2592837j129191K247615J411846l41510J987772N487000M460409L74787
4807h094109j384578q13954j587964l149731j957802J441217L182040K453140
4799i911741J606094J349343N29654p91981j861603k873758l068785k64918M546393
4790a0741302O080607K111156k206344j786716Q64919O83104j560710j850804
4782h406090m80965o00302j684308p91291J344973J417694m35393j117392r8132
4773a0851206M41541j7943k84943m82902q83630M52228M311784O729268L903204
4764C317401j238332k926726j188250n35451j586596q75917J538866J514834j423104
4755c403275k592848P842K590364K325410J368273J596330Q08096k483704n069261
$$ plain form
4815 -22592837 -23722028 -21474413 -20062567 -20404077 -18416305 -12929305 -8468896 -8094109
4807 -8094109 -9478687 -10292641 -11880605 -15030336 -16988138 -15546921 -12364881 -9911741
4799 -9911741 -8305647 -6956304 -6426650 -7218631 -9080234 -11953992 -15022777 -15287695 -10741302
4790 -10741302 -4660695 -2549539 -4755883 -6542599 -5677680 -4994576 -6555286 -8406090
4782 -8406090 -8887055 -9487357 -11171665 -11962956 -10617983 -9200289 -9635682 -10753074 -10851206
4773 -10851206 -10409665 -10427608 -10712551 -11195453 -12079083 -11626855 -7315071 -585803 3317401
4764 3317401 2079069 -847657 -2035907 -2571358 -4157954 -5033871 -3495005 -1980171 -3403275
4755 -3403275 -5996123 -5988281 -3397917 -1072507 295766 1892096 2700192 216488 -4852773
4746d852773l674107j84175J358749M26358n41712l21964L77490R52343J254868
4737e204923R19721J7864n46157k86672L47503J119160K025439K071704L31130
4728G94769j586031j015728J291785J538087j248689l380559k354691q25875k007455
4719h794387m322857m075504j092044J865513L591288M748316M888677K809402
4711c81596n35408k681980l153819l565560m295201l751853j235779J804573L712770
4702a4083853L885744K136294j026010l464818l163665j188148n23309j617207
4694a9044972j779639K44884K087867J661187M63248P56865J766932J442496K58408
4685a2142724J13396N38216n25807k420186j837470J948162N020554L715503n37221
$$ plain form
4746 -4852773 -8526880 -8711055 -7352306 -6925948 -7467660 -7789624 -7412134 -6459791 -5204923
4737 -5204923 -4285202 -4267338 -4813495 -5100167 -4752664 -3633504 -1608065 463639 794769
4728 794769 -791262 -1806990 -515205 1022882 -225807 -3606366 -5961057 -6786932 -8794387
4719 -8794387 -13117244 -17192748 -18284792 -16419279 -12827991 -8079675 -3190998 -381596
4711 -381596 -917004 -3598984 -6752803 -10318363 -14613564 -18365417 -19601196 -17796623 -14083853
4702 -14083853 -10198109 -8061815 -9087825 -12552643 -15716308 -16904456 -17427765 -19044972
4694 -19044972 -20824611 -20579727 -18491860 -16830673 -16367425 -15610560 -13843628 -12401132 -12142724
4685 -12142724 -12029328 -11491112 -12016919 -14437105 -16274575 -14326413 -9305859 -5590356 -6127577
4676f127577l145307j845766J353458K941858J396325j589038k741351p73356
4668a0530754J618031Q03487k583640l905019r50791K702509K897533Q20700M50669
4659h677275J985656K008451l50002j773769j07102K387233K712751J169621j30467
4650g74903m44918k00411M52783R52643j69117l051959n061126l697931j29819
4641a2124758K187212J907198Q90382J024066J764782J371470n71101k614536
4633f165285l070641j703479K69099J602339J905440J039564j174270l680468
4625a0977701l942162r95007K063808J375428j953886k597677J582785O035120
4617i409292N452725P46552k602926j718669Q99366J396378q05086k784206j603300
$$ plain form
4676 -6127577 -9272884 -11118650 -9765192 -6823334 -5427009 -7016047 -9757398 -10530754
4668 -10530754 -8912723 -8109236 -10692876 -14597895 -15548686 -12846177 -9948644 -9127944 -8677275
4659 -8677275 -6691619 -4683168 -5033170 -6806939 -6914041 -4526808 -1814057 -644436 -774903
4650 -774903 -1219821 -1420232 -967449 -14806 -183923 -3235882 -8297008 -11994939 -12124758
4641 -12124758 -9937546 -8030348 -7139966 -6115900 -4351118 -2979648 -3550749 -6165285
4633 -6165285 -9235926 -10939405 -10670306 -9067967 -7162527 -6122963 -7297233 -10977701
4625 -10977701 -14919863 -15914870 -13851062 -12475634 -14429520 -17027197 -15444412 -9409292
4617 -9409292 -3956567 -3210015 -5812941 -7531610 -6632244 -5235866 -6040952 -8825158 -10428458
4608a0428458K194994M724515L153988n22509j933904k55297J114605J96118p47050
4599b502998L99163J814389R50689j231301k156870j567390p32136J67266J052441
4590c806747O00671j092641j007419K068799L926558N20778n073198o515475l416292
4581a3794966r27420j040594p08597J100331J174298j333433k168322J236159
4573a6462544N210725N334343K401546k02264j424153j720299o92456J171391
4565f383711J322385j066818k771951j062917J949565K649061J190298J81068
4557c993020K46250K14940r2631l42905j153149k245023j331441K035266L957787
4548b703926J296634k970114l753734j311140L3131q20358r59841N86798J381901
$$ plain form
4608 -10428458 -8233464 -3508949 -354961 -877470 -2811374 -3066671 -1952066 -1755948 -2502998
4599 -2502998 -2103835 -289446 661243 -570058 -2726928 -4294318 -5026454 -4859188 -3806747
4590 -3806747 -3206076 -4298717 -5306136 -3237337 689221 1209999 -3863199 -10378674 -13794966
4581 -13794966 -14722386 -15762980 -16471577 -15371246 -14196948 -15530381 -17698703 -16462544
4573 -16462544 -11251819 -5917476 -3515930 -3718194 -5142347 -6862646 -7555102 -6383711
4565 -6383711 -5061326 -6128144 -8900095 -9963012 -8013447 -5364386 -4174088 -3993020
4557 -3993020 -3746770 -3531830 -3624461 -3967366 -5120515 -7365538 -8696979 -6661713 -2703926
4548 -2703926 -1407292 -4377406 -8131140 -9442280 -9409149 -10229507 -11189348 -10602550 -9220649
4539i220649L86113n75648q33359j807572l026285j743445K045286M427939L170766
4530g176854O94163k48420o8354L18279J631576L294073K329624j626160l744396
4521d596469k62462N434338P088113L851607N7970j771432l031435m518162m381118
4512b129050j676388J365847K142300O55681j375350k700507k929200k080500
4504h727167o08831Q09531J764210J899721P83839j000994j470181L99086K520914
4495c629872J966066q54168k523728j346121O15075R57450J35773j28059K13785
4486d593799M8558n30541k96057J014033K202688K216281J117916m92501j919889
4477a233311k163098n08492K077089L122985J217675k045166l679283k697472
$$ plain form
4539 -9220649 -8834536 -9410184 -10243543 -12051115 -15077400 -16820845 -14775559 -10347620 -7176854
4530 -7176854 -6482691 -6731111 -6799465 -6481186 -4849610 -1555537 774087 -852073 -4596469
4521 -4596469 -4858931 575407 7663520 11515127 11573097 9801665 6770230 2252068 -2129050
4512 -2129050 -3805438 -2439591 -297291 358390 -1016960 -3717467 -6646667 -8727167
4504 -8727167 -9335998 -8526467 -6762257 -4862536 -4078697 -5079691 -6549872 -6150786 -3629872
4495 -3629872 -1663806 -2517974 -5041702 -6387823 -5772748 -4815298 -4679525 -4807584 -4593799
4486 -4593799 -4545241 -5075782 -5371839 -4357806 -2155118 61163 1179079 686578 -1233311
4477 -1233311 -3396409 -3904901 -1827812 1295173 2512848 467682 -3211601 -5909073
4469e909073q21647K27370P18243J458031J754110M08721j935719l211868k575869
4460i887701j066757L28893J523689K097192J240332m16349q58885M59122J639343
4451d941121J316101O96874J183957J877055J336766J37474n02419j091608k391778
4442b378699k945464j011578J898651K572482Q88265n6220J210719K536799J648912
4433D363867q96259l057426l483275j804261J124409K832601J313386k034052
4425a641010l734737k753637j138774k3690J652283L623785L281333N3234k597668
4416c278881k028289k92001l71085j308603m96307J394916J629594J89579n06266
4407e067343K3963p0524j142014j349250k19008K95023p66761j604848n83755
$$ plain form
4469 -5909073 -6730720 -6503350 -5785107 -4327076 -2572966 -2164245 -4099964 -7311832 -9887701
4460 -9887701 -10954458 -10625565 -9101876 -7004684 -5764352 -6180701 -7039586 -6580464 -4941121
4451 -4941121 -3625020 -2928146 -1744189 132866 1469632 1607106 1104687 13079 -2378699
4442 -2378699 -5324163 -6335741 -4437090 -1864608 -976343 -1032563 178156 2714955 4363867
4433 4363867 3467608 410182 -3073093 -4877354 -3752945 -920344 393042 -1641010
4425 -1641010 -5375747 -8129384 -9268158 -9291848 -7639565 -4015780 -734447 -681213 -3278881
4416 -3278881 -5307170 -5599171 -5970256 -7278859 -7775166 -6380250 -4750656 -4561077 -5067343
4407 -5067343 -5043380 -5113904 -6255918 -7605168 -7824176 -7529153 -8295914 -9900762 -10484517
4398a0484517J214098J801943J156399Q39423J583022K389184J765601o75244
4390d10091l670539n253150m504148k319134l09517O93800R51022J317207K577601
4381a0926949M379614M812636K440326j163762k850707k173687j663916k110143
4373i256588r98773K424967M285546J707625j838587j358147J768092K025847
4365a240018j240125k900699m05706K569045K400979N10724k45136M348O8396
4356d78192N39120J707555J512908j244283l890064l298124o28033N57930l06881
4347e528064n99559P45695J515203j82599k992548m118886k724462m73344P52153
4338a3606411Q24751R37676J631481J981881J128753j39325l29839O51942J509814
$$ plain form
4398 -10484517 -9270419 -7468476 -6312077 -5472654 -3889632 -1500448 265153 -410091
4390 -410091 -4080630 -9333780 -13837928 -16157062 -16466579 -15772779 -14821757 -13504550 -10926949
4381 -10926949 -6547335 -1734699 705627 -458135 -3308842 -5482529 -7146445 -9256588
4373 -9256588 -10255361 -7830394 -3544848 -1837223 -3675810 -5033957 -3265865 -1240018
4365 -1240018 -2480143 -5380842 -5786548 -3217503 -816524 -305800 -550936 -546588 -478192
4356 -478192 60928 1768483 3281391 2037108 -1852956 -5151080 -5779113 -5221183 -5528064
4347 -5528064 -6127623 -5381928 -3866725 -4049324 -7041872 -11160758 -13885220 -14358564 -13606411
4338 -13606411 -12781660 -11843984 -10212503 -8230622 -7101869 -7241194 -7571033 -6919091 -5409277
4329e409277J393425N40085n70781j346352q09883J109039K399782J111370j514642
4320c097234k317756o84247P28960J16542j214122j487868q60027o2720J020051
4311g858421K104794J960925N68164r5020J031571K084659Q29134k117502m119434
4302e611130l606039j251271R85172J342905r7522r69903P13594L469103M034320
4293i90771K179815R20326J323178N68641l125559o857620o836401l415091K53561
4284a5979921K619278M132737M788797M006925K201606M24871r05052j550440
4276b61199r10668O54514J323399J64848j319684j425045n56114J33216P87905
4267a408828J806609K178710P18148k005777m364720n347864m635381k352497
$$ plain form
4329 -5409277 -4015852 -3475767 -4046548 -5392900 -6202783 -5093744 -2693962 -1582592 -3097234
4320 -3097234 -5414990 -6099237 -5370277 -5253735 -6467857 -7955725 -8815752 -8878472 -7858421
4311 -7858421 -5753627 -3792702 -3224538 -3319558 -2287987 -203328 625806 -1491696 -5611130
4302 -5611130 -9217169 -10468440 -9483268 -8140363 -8237885 -9207788 -8494194 -5025091 -990771
4293 -990771 1189044 2109370 3432548 4001189 875630 -5981990 -12818391 -16233482 -15979921
4284 -15979921 -13360643 -9227906 -4439109 -432184 1769422 2194293 1289241 -261199
4276 -261199 -1171867 -517353 806046 970894 -348790 -1773835 -2329949 -2196733 -1408828
4267 -1408828 397781 2576491 3294639 1288862 -3075858 -8423722 -13059103 -15411600
4259a5411600L63670J997108K503485K919889K997518J649588p8085K37338J984347
4250h36742J630646j458063l372633j795605L66648J24714q56361N6523J695759
4241d445114J709741Q14942P08262N91612n31753q95279Q98890K483835J332841
4232B667977q68805j361723j082638k106828l050618j667391L35227p1555j737426
4223h943780j318456Q43896J595591M33437m53859n58179j247413k471749k910100
4214a5030612k349753r98989J649373M480763M235854O15828j660824K39272K422662
4205f396426R17460j440647m80679J530442L86466j903456r81573J410302Q05909
4196f152202j326867o24404J343989O8417k556254j087462L224272M453177K598478
$$ plain form
4259 -15411600 -15047930 -13050822 -10547337 -7627448 -4629930 -2980342 -3058427 -2821089 -836742
4250 -836742 793904 -664159 -4036792 -5832397 -5465749 -5341035 -6197396 -6140873 -4445114
4241 -4445114 -2735373 -1920431 -1212169 -620557 -1152310 -2047589 -1148699 1335136 2667977
4232 2667977 1799172 437449 -645189 -2752017 -5802635 -7470026 -7134799 -7206354 -8943780
4223 -8943780 -10262236 -9418340 -7822749 -7389312 -7843171 -8401350 -9648763 -12120512 -15030612
4214 -15030612 -17380365 -18379354 -16729981 -12249218 -8013364 -7397536 -9058360 -8819088 -6396426
4205 -6396426 -5478966 -6919613 -7400292 -5869850 -5483384 -7386840 -8368413 -6958111 -6152202
4196 -6152202 -7479069 -8103473 -6759484 -6691067 -9247321 -10334783 -7110511 -2657334 -58856
4187e8856K489408L531161P94020m406986n451772j848023M16933r6266Q53639
4178c776742L317862K731739l61784p17526J311266N67748k087285j126672J965930
4169A824536O05866l846488l968132l78834P2257j249044K004579N494100L67162
4160I26002o849958k519420P305413M638603n801767j728967J3712434J3894629
4152B3576969M431563K8293570Q7436881J08485339L6023401p4360698j16291044
4145I7595981o8484202q760047K619234j1496703q719950N159350M002463p323431
4137D592695p908744k41683k37046n507621l224420L267702J870269m078925k521581
4128a3989354M105986L905946k097098k608639K931570M439288j8835k144347
$$ plain form
4187 -58856 2430552 5961713 6755733 2348747 -3103025 -4951048 -4534115 -4630381 -3776742
4178 -3776742 -458880 2272859 1911075 1193549 2504815 3072563 985278 -141394 1824536
4169 1824536 2430402 -1416086 -5384218 -5763052 -5690795 -6939839 -4935260 558840 926002
4160 926002 -5923956 -8443376 -1137963 3500640 -2301127 -4030094 9682340 23576969
4152 23576969 28008532 56302102 143738983 252224322 288247723 213887025 97595981
4145 97595981 29111779 20351732 22970966 11474263 2754313 7913663 11916126 4592695
4137 4592695 -3316049 -3557732 -3794778 -9302399 -12526819 -9259117 -7388848 -11467773 -13989354
4128 -13989354 -9883368 -5977422 -8074520 -10683159 -7751589 -3312301 -3331136 -5475483
4120e475483P94826K673865R23330l20746M00906J11602j135820m92987O63985
4111a856522j368183m799760m631184j416082O0840o92654k16792J695197K407170
4102a0817970K325673L431566L921804J190152k000784j253435J722761J984554
4094E04321k95653j354768j396503l258924n483783m244385q03389K36468r75512
4085a7072128k60838K648217L766124J948161K105p81130j402280j350883L16866
4076a2185786J365244m33321k133861K75135M395296M667859J503266J18120J469516
4067i58532J711967L2597m16947O92429L84639j154095p24017R91201p5940l356208
4057b872906l557612J24720K075808m22622k894735j430538J415473J598589o43520
$$ plain form
4120 -5475483 -4680657 -2006792 -1083462 -1404208 -1003302 -891700 -2027520 -2520507 -1856522
4111 -1856522 -3224705 -8024465 -12655649 -14071731 -14010891 -14703545 -14920337 -13225140 -10817970
4102 -10817970 -8492297 -5060731 -1138927 51225 -1949559 -3202994 -1480233 504321
4094 504321 208668 -1146100 -2542603 -5801527 -11285310 -15529695 -16333084 -16096616 -17072128
4085 -17072128 -17332966 -14684749 -10918625 -8970464 -8968359 -9749489 -11151769 -12502652 -12185786
4076 -12185786 -10820542 -11253863 -13387724 -13112589 -8717293 -4049434 -2546168 -2428048 -958532
4067 -958532 753435 786032 369085 1061514 1446153 292058 -431959 559242 483302 -2872906
4057 -2872906 -6430518 -6305798 -4229990 -4652612 -7547347 -8977885 -7562412 -5963823 -6607343
4048f607343k817758l642686k383360J075053L946391K733696j115470k495266
4040a1306743m90394N91683p82900p84278K037729L065018n32692m170036k867379
4031a5239992R29488J849738J69578J98907K440222L001044J95425k900069k972225
4022a2327884m28181J892800K082254O43801n27049l57458L23771L47733J16777
4013h233436N91744J142291M67741q72398j207641n94843l54867l06041O05640
4004h761810J456796N58778q48245m5501K016145J425424k128002m060732j714861
3995a2102008J732171K279802L70869j194165j470887j056454r9172J116946J577879
3986h845019J213069J298953K086528K170497J074290M7058l95994r97974j303972
$$ plain form
4048 -6607343 -9425101 -13067787 -15451147 -14376094 -10429703 -7696007 -8811477 -11306743
4040 -11306743 -11797137 -11205454 -11988354 -12772632 -10734903 -7669885 -8202577 -12372613 -15239992
4031 -15239992 -14310504 -12460766 -12291188 -12092281 -9652059 -6651015 -6455590 -9355659 -12327884
4022 -12327884 -12756065 -10863265 -8781011 -8137210 -8664259 -9021717 -8697946 -8350213 -8233436
4013 -8233436 -7641692 -6499401 -6031660 -6904058 -8111699 -8706542 -9061409 -9367450 -8761810
4004 -8761810 -7305014 -6746236 -7594481 -7639982 -5623837 -4198413 -6326415 -10387147 -12102008
3995 -12102008 -10369837 -8090035 -7719166 -8913331 -10384218 -11440672 -11539844 -10422898 -8845019
3986 -8845019 -7631950 -6332997 -4246469 -2075972 -1001682 -954624 -1350618 -2348592 -3652564
3977c652564N8663J979637J519008r79625j599962O87783J760320r05494l585409
3968d717643k072756J450003J654240k050775n098318m135477l31569L154741
3960a2147554M344484L382091K099844K143742K624007J043876k585436m831409
3952c926355l548997j096523p48861k050585k229398n80049J132836J577909R62754
3943a0507269L7866k81067Q49134K908761L904755K721005M94905j228140k199290
3934c299340k388128j101871J381422K958285K102650l8728j210967p02125L92041
3925a906761N14317j077618l147762k895421N49242L671364K475299j626149l511181
3916f954670j857119m52095j290557j418546J377854M525963N068724L929482
$$ plain form
3977 -3652564 -3593901 -1614264 -95256 -1074881 -2674843 -1987060 -226740 -1132234 -4717643
3968 -4717643 -6790399 -5340396 -3686156 -5736931 -10835249 -14970726 -15302295 -12147554
3960 -12147554 -7803070 -4420979 -2321135 -177393 2446614 3490490 905054 -3926355
3952 -3926355 -7475352 -8571875 -9320736 -11371321 -13600719 -14180768 -13047932 -11470023 -10507269
3943 -10507269 -10469403 -10750470 -9901336 -6992575 -3087820 -366815 128090 -1100050 -3299340
3934 -3299340 -5687468 -6789339 -5407917 -2449632 -346982 -385710 -1596677 -2298802 -1906761
3925 -1906761 -1392444 -2470062 -5617824 -8513245 -7964003 -4292639 -1817340 -3443489 -6954670
3916 -6954670 -8811789 -9263884 -10554441 -11972987 -10595133 -6069170 -1000446 2929036
3908B929036K868234J174896j480090k772074j613497n52186j002658k98039K676697
3899A930319L555410p48109n584648m935266p95852N24148j134200m83964L264688
3890d407474M820405J629832k497700l902614l399649k550993r09894J132511
3882a0085576J395531k08244q50025M71879J295436M18643J51620J776392K702349
3873b931995P93106j817192k088360n25603N24390O99354R76505J169890Q26499
3864b373406J008469K437395L153390Q93511k920305m385312k256050N75775J168022
3855b698511J6905m55376O39025K015185K254584J164943o54560k312636k534810
3846b565251n43117K146128K286945j062350m217027l009339J303309L304752
$$ plain form
3908 2929036 5797270 6972166 5492076 2720002 1106505 554319 -448339 -746378 1930319
3899 1930319 5485729 4737620 -847028 -5782294 -6578146 -6053998 -7188198 -7672162 -4407474
3890 -4407474 412931 2042763 -454937 -4357551 -7757200 -10308193 -11218087 -10085576
3882 -10085576 -8690045 -8898289 -9748314 -9276435 -7980999 -7562356 -7410736 -5634344 -2931995
3873 -2931995 -2138889 -3956081 -6044441 -6570044 -6045654 -5346300 -4369795 -3199905 -2373406
3864 -2373406 -1364937 1072458 4225848 5119359 2199054 -2186258 -4442308 -3866533 -2698511
3855 -2698511 -2681606 -3136982 -2497957 -482772 1771812 2936755 2282195 -30441 -2565251
3846 -2565251 -3108368 -962240 1324705 262355 -3954672 -6964011 -5660702 -2355950
3838b355950Q21967k366078k402541l95561O78567R06313K000015L260539K690013
3829B837284P93775k31307k17441o22036j134880j37557J752658K048680N39452
3820E628628p6662J657262L779374L591691N17098l967389p318240p038221l130865
3811f357324O68146O19634k060608k645560N16576L753336L132089q42895m594791
3802g811397n321006k551798K006753N092783M173425K72864k769789k545208
3794i453373k78109J539675K013990J663783R14667j91776j489352k360390j685699
3785i326584J210986M774033N612359K357551j931536l234882j447470M45887
3777a539656Q78033N10657m21274k018133k428690M23250M579691N454908K303630
$$ plain form
3838 -2355950 -1533983 -3900061 -6302602 -6698163 -6019596 -5113283 -3113268 147271 2837284
3829 2837284 3631059 3399752 3182311 2560275 1425395 1287838 3040496 5089176 5628628
3820 5628628 5551966 7209228 10988602 14580293 15097391 11130002 3811762 -3226459 -6357324
3811 -6357324 -5689178 -5069544 -7130152 -9775712 -9259136 -5505800 -2373711 -3216606 -7811397
3802 -7811397 -13132403 -15684201 -13677448 -8584665 -4411240 -4138376 -6908165 -9453373
3794 -9453373 -9731482 -8191807 -6177817 -4514034 -3599367 -3791143 -5280495 -7640885 -9326584
3785 -9326584 -8115598 -3341565 2270794 4628345 2696809 -538073 -1985543 -1539656
3777 -1539656 -661623 -150966 -572240 -2590373 -5019063 -4595813 -16122 5438786 7742416
3768G742416n74680l36781O20510o03363k506473j971025N23274J584023m24298
3759D053603l728356n409248l870013j6963K975651K333112r71002k941851j392468
3750h967535J673640L299536L097238K285579J264911r4855j214808j536143j511054
3741a703491j671749j658530j020119L0117J127696J782727Q60738j995224m296179
3732h544014k764715J729240M191205J968214j542297j700183J252401L377675
3724b032474K570055K38283j470360j698884o04982J064827K246887K428993J896047
3715D638392Q30982o55419j386611M5236K620727L249361Q48938k120160l334162
3706D737284l305430k969716j534423R72676J845822m99285l125201k472485R3351
$$ plain form
3768 7742416 7167736 6830955 7451465 6848102 4341629 2370604 2893878 4477901 4053603
3759 4053603 325247 -5084001 -8954014 -8970977 -5995326 -3662214 -4633216 -7575067 -8967535
3750 -8967535 -7293895 -3994359 -897121 1388458 2653369 2558514 1343706 -192437 -1703491
3741 -1703491 -3375240 -5033770 -6053889 -6023772 -4896076 -3113349 -2252611 -4247835 -8544014
3732 -8544014 -11308729 -9579489 -5388284 -3420070 -4962367 -6662550 -5410149 -2032474
3724 -2032474 537581 775864 -694496 -2393380 -2998362 -1933535 313352 2742345 4638392
3715 4638392 5469374 4813955 3427344 3472580 6093307 9342668 10191606 8071446 4737284
3706 4737284 1431854 -1537862 -3072285 -2099609 -253787 -753072 -3878273 -6350758 -6257407
3697f257407N07097j380437j721019Q67291K979919J705415j194536k229164r19745
3688g642586M70825N64253K16051N55029J101866L78543j875265l647482k563957
3679a2442723J015375L812368L193516q509l054111m568132m917283m270841k261323
3670b3501663M58762K092554J794516Q55752J077851K492302L373535K450271
3662h906120N31482n29304k36444J25657k25219j39570J464138L243511K845896
3653a825973J38594k772028m306713m266725k478647Q94553L821551L946476J998046
3644d850866J016712J846021K270142J088204k29343p81860j617677k639249j866466
3635e764382M82455J100083q88304j582603J342903L948118J952494j977439k013587
$$ plain form
3697 -6257407 -5750310 -7130747 -8851766 -7984475 -5004556 -3299141 -4493677 -6722841 -7642586
3688 -7642586 -7171761 -6607508 -6391457 -5836428 -4734562 -4356019 -6231284 -9878766 -12442723
3679 -12442723 -11427348 -7614980 -4421464 -4429973 -7484084 -12052216 -16969499 -21240340 -23501663
3670 -23501663 -23042901 -20950347 -19155831 -18300079 -17222228 -14729926 -11356391 -8906120
3662 -8906120 -8374638 -8903942 -9140386 -9014729 -9239948 -9379518 -7915380 -4671869 -1825973
3653 -1825973 -1687379 -4459407 -8766120 -13032845 -15511492 -14616939 -10795388 -6848912 -4850866
3644 -4850866 -3834154 -1988133 282009 1370213 1140870 359010 -1258667 -3897916 -5764382
3635 -5764382 -5281927 -4181844 -5070148 -6652751 -5309848 -1361730 590764 -1386675 -3400262
3626c400262J930525M507493L132910O11648l97123o83201j397569j731434j092139
3617A480848o08151j152969k020196k368978k182582j468234k76240M56488r5669
3608h235683r41063m35137J054151J533584K56857j500949k231646j297962J004433
3599a0793415L021798K610984J29327j126942M41617J852636J95356k207614j329296
3590g205549J745361K440571J93099r20094R05678K838044K750051J998849J493630
3581F239640l35495l639807n362970l735132j137121k00275j26854Q79841K369658
3572e048515L088989L191116K964821J657772o24369k091075j895269j313035
3564f9565j154902p49968m97979j872396l468520j344318M279916P149041L340854
$$ plain form
3626 -3400262 -1469737 3037756 6170666 6782314 6385191 5701990 4304421 2572987 1480848
3617 1480848 872697 -280272 -2300468 -4669446 -6852028 -8320262 -8596502 -8140014 -8235683
3608 -8235683 -9176746 -9611883 -8557732 -7024148 -6767291 -8268240 -10499886 -11797848 -10793415
3599 -10793415 -7771617 -5160633 -5031306 -6158248 -5716631 -3863995 -3668639 -5876253 -7205549
3590 -7205549 -5460188 -3019617 -2826518 -3746612 -2840934 -2890 2747161 4746010 6239640
3581 6239640 5904145 2264338 -3098632 -6833764 -7970885 -8171160 -8298014 -7418173 -5048515
3572 -5048515 -1959526 1231590 4196411 5854183 5229814 3138739 1243470 -69565
3564 -69565 -1224467 -1974435 -2472414 -4344810 -7813330 -9157648 -4877732 2271309 5612163
3555E612163k630720m455079k957693k960699m298101k623766K128648M892490
3547g292757L406999R13412k06239j698528m299308m759020j338161K002238R27722
3538a2343642k679620l513316l10788L388432M836089M635604L956255K575688
3530E44702K68307k260097m277539n030878l142945J447551N055017L155893l212201
3521g452190p299017m912819J70551J880048J37896n90262Q39291J089138r43741
3512a7081105j612728J393164M885652M993753K684666J101649J95471j986485
3504e425963m489718m271794j229254J482096K146925K037124K043596J217710
3496f489278n54968j559818j082224n41981o20215J26434K317286L914266L256048
$$ plain form
3555 5612163 2981443 -1473636 -4431329 -7392028 -11690129 -14313895 -12185247 -7292757
3547 -7292757 -3885758 -2972346 -3178585 -4877113 -9176421 -13935441 -15273602 -13271364 -12343642
3538 -12343642 -15023262 -18536578 -18847366 -15458934 -10622845 -5987241 -2030986 544702
3530 544702 813009 -1447088 -5724627 -10755505 -13898450 -12450899 -7395882 -4239989 -7452190
3521 -7452190 -14751207 -19664026 -19493475 -17613427 -17475531 -18065793 -17226502 -16137364 -17081105
3512 -17081105 -18693833 -17300669 -12415017 -7421264 -4736598 -3634949 -3439478 -5425963
3504 -5425963 -9915681 -14187475 -15416729 -13934633 -11787708 -9750584 -7706988 -6489278
3496 -6489278 -7044246 -8604064 -9686288 -10228269 -10848484 -10722050 -8404764 -4490498 -1234450
3487a234450J808199J609292J658827l73368l642503m347532r90441K955553L148616
3478E92193j32130k511594j311923J273811J811848N56863L88115J747458J900067
3469D314708l10416k360667k287719j887692l226275m705774l748389j203574
3461a5415798L68878R44788J859789K173225M98978r86239P12968L552741K800833
3452c489837r33040j993532J144690L217590Q00562k388262k141363l94970q65801
3443g043963k341656j347633J391954K170336L40648j234421q51158N15115J624093
3434f776685J880528O18933j810715l085661j551149J044452J759083M26818p92861
3425h287257p62967m5490P60090J298530J113744P44275J685098L556480L428124
$$ plain form
3487 -1234450 573749 2183041 3841868 3468500 -174003 -4521535 -5511976 -2556423 592193
3478 592193 460063 -2051531 -3363454 -2089643 -277795 279068 667183 2414641 4314708
3469 4314708 4004292 1643625 -644094 -2531786 -5758061 -10463835 -14212224 -15415798
3461 -15415798 -15046920 -14102132 -12242343 -10069118 -9570140 -10556379 -9843411 -6290670 -3489837
3452 -3489837 -4422877 -6416409 -5271719 -2054129 -1253567 -3641829 -5783192 -6178162 -7043963
3443 -7043963 -9385619 -10733252 -9341298 -7170962 -6830314 -8064735 -8915893 -8400778 -6776685
3434 -6776685 -4896157 -4277224 -6087939 -9173600 -10724749 -9680297 -7921214 -7494396 -8287257
3425 -8287257 -9050224 -9095714 -8335624 -7037094 -5923350 -5179075 -3493977 62503 3490627
3416C490627K37559k472762j250308J945558K653385M37119j382716j293184p61671
3407A603607n10920K05180O96735p47809l150064l338563r09018Q39519n2231
3398e363564j551111j368163k63283J53539K86568J084968J672167P19431r80420
3389e609868j387795j51827J021776Q83181J66773J52231N86241J04974j263145
3380e497459j399137Q87795L236353K415532p33548k068199m10768N01594j897899
3371d965736m546699l444767J32300K008916J585299J596479K713396K994386
3363a926426K299947K675923L918647L027917p94917m276221m661293l122085
3355b858508k082257j817817j327115l87424P96702K272567L460868L134601J216040
$$ plain form
3416 3490627 3728186 1255424 5116 1950674 4604059 5041178 3658462 2365278 1603607
3407 1603607 1092687 1297867 1994602 1246793 -1903271 -5241834 -6150852 -5311333 -5363564
3398 -5363564 -6914675 -8282838 -8546121 -8392582 -8106014 -7021046 -5348879 -4629448 -5609868
3389 -5609868 -6997663 -7149490 -6127714 -5244533 -5077760 -4925529 -4339288 -4234314 -5497459
3380 -5497459 -6896596 -6008801 -2772448 -356916 -1090464 -3158663 -3569431 -3067837 -4965736
3371 -4965736 -9512435 -12957202 -12824902 -10815986 -9230687 -7634208 -4920812 -1926426
3363 -1926426 373521 3049444 6968091 9996008 9201091 4924870 263577 -2858508
3355 -2858508 -4940765 -6758582 -8085697 -8473121 -7676419 -5403852 -1942984 1191617 2407657
3346B407657q05757j859676k240545k235559j508908k65650O48117J145943J761360
3337b953018K017366Q55032j145893k024635j232522k19963Q709j9187K66824
3328d447287Q65251J940250K997957J829393k763889p421768p033233j662245
3320a5695571K947136K826667J51728j254780j025135o11542Q2323J479147K163876
3311h936151Q75070j042103j654948j353453j467711j540956l75202J423683K203500
3302a1868271J689060Q61171L66063M86494J416409K179982R38897j997113l371237
3293i298545j267372J652698J698463o75917k093039j381016l03586J56375R28674
3284a0583265K157870K358332R99954l64402m16522K37957M42753Q7676l66256
$$ plain form
3346 2407657 1601900 -257776 -2498321 -4733880 -6242788 -6508438 -5860321 -4714378 -2953018
3337 -2953018 -935652 -80620 -1226513 -3251148 -4483670 -4703633 -4694924 -4714111 -4447287
3328 -4447287 -3582036 -1641786 1356171 3185564 421675 -7000093 -14033326 -15695571
3320 -15695571 -12748435 -9921768 -9770040 -11024820 -12049955 -12661497 -12579174 -11100027 -8936151
3311 -8936151 -8061081 -9103184 -10758132 -12111585 -13579296 -15120252 -15495454 -14071771 -11868271
3302 -11868271 -10179211 -9318040 -8951977 -8465483 -7049074 -4869092 -3930195 -5927308 -9298545
3293 -9298545 -10565917 -8913219 -7214756 -7890673 -9983712 -11364728 -11668314 -11511939 -10583265
3284 -10583265 -8425395 -6067063 -5067109 -5431511 -5848033 -5610076 -5167323 -5079647 -5445903
3275e445903p68216j030603q36902k0924J301374K884876L947254L102476j1616
3266C121816l291025l945512j930239o1768k27619j081943n44701Q16303O67299
3257f477389j373743k852347j762424P98913K265184J855541Q69890L42113K3170
3248f311092l24017k43634L50774P83494P58523N95438N7540j292250k176858
3239g802082m65015L042911M473064K281558j39398K54657J408681K19219j749280
3230A524315j418219n65336k969218o544888n329663M44270L521084O31037k728737
3221a3435355j594859J134691J147748M00127K421824M681403K518260k261373
3213d987534l673143r38930J029147P5472o28199Q27460J753523O3743j835243
$$ plain form
3275 -5445903 -6214119 -7244722 -8081624 -8102548 -6801174 -3916298 30956 3133432 3121816
3266 3121816 -169209 -4114721 -6044960 -6106728 -6334347 -7416290 -7960991 -7144688 -6477389
3257 -6477389 -7851132 -10703479 -12465903 -11666990 -9401806 -7546265 -6676375 -6334262 -6311092
3248 -6311092 -6635109 -6878743 -6527969 -5744475 -4985952 -4390514 -4332974 -5625224 -7802082
3239 -7802082 -8267097 -5224186 -751122 1530436 1391038 1645695 3054376 3273595 1524315
3230 1524315 106096 -459240 -3428458 -9973346 -15303009 -14858739 -11337655 -10706618 -13435355
3221 -13435355 -15030214 -13895523 -12747775 -12347648 -9925824 -5244421 -2726161 -4987534
3213 -4987534 -8660677 -9599607 -8570460 -8494988 -9123187 -8295727 -6542204 -6478461 -8313704
3204h313704j000783J392534K000227p89k289064k444563k85840K218036K770938
3195e953008R91657j172272j776933r76092K0175R32890J949229K413590J805508
3186a765256J113803J362483J670405P51557o20167q55794l52767o26084j420881
3177g42701j333356p44433j288419k583680k363799j35260J885432J988260R01564
3168d416392L939m33423p02863r39620j230693j231307l8025K160558L182035
3159c645791J541508r10133j423495m82519o26590j922626k059844p30911j76952
3150a0437353r19553o75695J410695K950850K258741R63622Q03270O23970j158132
3141d179585l345140l638412k011441k49906P53587J373189J799121J880443J855929
$$ plain form
3204 -8313704 -9314487 -7921953 -5921726 -5922515 -8211579 -10656142 -10941982 -8723946 -5953008
3195 -5953008 -4961351 -6133623 -7910556 -8886648 -8866473 -7933583 -5984354 -3570764 -1765256
3186 -1765256 -651453 711030 2381435 3132992 2512825 1657031 1304264 678180 -742701
3177 -742701 -2076057 -2820490 -4108909 -6692589 -9056388 -9191648 -7306216 -5317956 -4416392
3168 -4416392 -4412453 -4845876 -5548739 -6488359 -7719052 -8950359 -8988384 -6827826 -3645791
3159 -3645791 -2104283 -3014416 -4437911 -4920430 -5547020 -7469646 -9529490 -10260401 -10437353
3150 -10437353 -11356906 -12032601 -10621906 -7671056 -5412315 -4448693 -3645423 -3021453 -4179585
3141 -4179585 -7524725 -11163137 -13174578 -13424484 -12670897 -11297708 -9498587 -7618144 -5762215
3132e762215J968092J775585P27325r80986k567056l132575j985259M62123K181010
3123g313956J432782o04220q13098J717828M179103L490890p1181l517962m355672
3114e855486k537141j14229O65843m09584j393073j044020p39711j814776k369418
3105a5611595K04945M140805M564293L99669l737672l888841j527757j12583p6479
3096a5645215K07485J003709J531458J907530K288206J594989o39359k599324
3088a0350521k497852j087293J85122J711171L861908M406488J178604l608124
3080f200497n233592k600755O48445J451581P07649M40855M24870n40384j833367
3071a2735195j629930L68606K524152L470766L422122L024221K055131J64708
$$ plain form
3132 -5762215 -3794123 -2018538 -1291213 -2272199 -4839255 -7971830 -9957089 -9494966 -7313956
3123 -7313956 -5881174 -6485394 -7298492 -5580664 -1401561 2089329 2018148 -1499814 -5855486
3114 -5855486 -8392627 -8506856 -7841013 -8250597 -9643670 -10687690 -11427401 -13242177 -15611595
3105 -15611595 -15406650 -11265845 -6701552 -6301883 -10039555 -13928396 -15456153 -15568736 -15645215
3096 -15645215 -15437730 -14434021 -12902563 -10995033 -8706827 -7111838 -7751197 -10350521
3088 -10350521 -12848373 -13935666 -13750544 -12039373 -8177465 -3770977 -2592373 -6200497
3080 -6200497 -11434089 -14034844 -13386399 -11934818 -11227169 -10786314 -10361444 -10901828 -12735195
3071 -12735195 -14365125 -13996519 -11472367 -8001601 -4579479 -1555258 499873 664581
3063F64581j702145k011170r83711p69450k306716l367391j469307K195170M038620
3054e711519K952182J312366Q83111N64533p33343j775358j469889j358351l109147
3045h445415n047851m016767j14089L065282L094601J421603P10438J204273J075742
3036g052183l59137j382095m01742J290765Q93472j703738l088154r42263K421249
3027a0323826L401627K378572K346468L190577J596677k792961n502579l448959
3019i154404N46655K027029P83324l37493j06343O82423J715866L009032L420248
3010B586337K068059L26377k3611K91353o38037k502686l152495j901628k75888
3001c222219L21197N727k77744K48405J263253Q93699k171303n482635m469140
$$ plain form
3063 664581 -1037564 -3048734 -4032445 -4801895 -7108611 -10476002 -11945309 -9750139 -5711519
3054 -5711519 -2759337 -1446971 -563860 673 -732670 -2508028 -3977917 -5336268 -8445415
3045 -8445415 -13493266 -17510033 -17624122 -14558840 -11464239 -10042636 -9332198 -8127925 -7052183
3036 -7052183 -7411320 -8793415 -9195157 -7904392 -7010920 -8714658 -11802812 -12745075 -10323826
3027 -10323826 -6922199 -4543627 -2197159 993418 2590095 -202866 -5705445 -9154404
3019 -9154404 -8607749 -6580720 -5797396 -6134889 -6241232 -5558809 -3842943 -833911 2586337
3010 2586337 4654396 4980773 4957162 5248515 4610478 2107792 -1044703 -2946331 -3222219
3001 -3222219 -2901022 -2895295 -3173039 -2924634 -1661381 -767682 -2938985 -8421620 -12890760
2992a2890760J148546N664527M628906P28705q61148K7297P7427r64461o11899
2983c052860P62161K54648j762525j550701J524900L378887J495265j446368j968497
2974b365090j95320J820270K928965K487298J50002k484223k856478j272213p92997
2965b579786k283780k954276j195044P10989N52388n52843r53600j223896j840792
2956a2320640j343694O59250J781727Q20349J85935J406926J717069j035705l417441
2947a1546224j245896L070262L594758k5476k254818l72682K070112J565049m93158
2938e638073j227002o57530l10000k68110J78255R41544J784707K756396K920178
2929D80365Q13940k685371m323094k742365m95575j40739p02074j23717J014710
$$ plain form
2992 -12890760 -11742214 -6077687 -1448781 -720076 -1581224 -1553927 -1476500 -2440961 -3052860
2983 -3052860 -2290699 -2036051 -3798576 -5349277 -3824377 -445490 1049775 -396593 -2365090
2974 -2365090 -2560410 -740140 2188825 4676123 4826125 2341902 -514576 -1786789 -2579786
2965 -2579786 -4863566 -7817842 -9012886 -8301897 -7749509 -8302352 -9255952 -10479848 -12320640
2956 -12320640 -13664334 -13005084 -11223357 -10403008 -10217073 -8810147 -7093078 -8128783 -11546224
2947 -11546224 -12792120 -9721858 -6127100 -6152576 -8407394 -8780076 -6709964 -5144915 -5638073
2938 -5638073 -6865075 -7522605 -7832605 -8100715 -7922460 -6980916 -5196209 -2439813 480365
2929 480365 1294305 -1391066 -5714160 -8456525 -8952100 -9092839 -9794913 -9918630 -8903920
2920h903920R73060L18557Q00257J778787J035121j146951j905229k83376J042578
2911f291116l47498l138337m050779j702178K357378N306104M957856J316311
2903a592259k801901l858664j359780J441486J512960m41976j571827p45941P77412
2894h640490J659595J581359M58578j537923l153502k947650j307261j18108j30737
2885a4136139q9809J051418K447266K656061J580178L33665j15216L82491J209712
2876d680373J343790K93517j121163j588904q87397J81947J166012J979580J798594
2867a514397k08703k775319l172938p83095J713715J711475l20294k188239k709221
2858a0247016j928350j42707J951125L343119L956569M468773M224596J445624
$$ plain form
2920 -8903920 -7930860 -7612303 -6812046 -5033259 -3998138 -5145089 -7050318 -7333694 -6291116
2911 -6291116 -6638614 -9776951 -13827730 -15529908 -13172530 -7866426 -2908570 -1592259
2903 -1592259 -4394160 -8252824 -9612604 -8171118 -6658158 -7100134 -8671961 -9417902 -8640490
2894 -8640490 -6980895 -5399536 -4940958 -6478881 -9632383 -12580033 -13887294 -14005402 -14136139
2885 -14136139 -14225948 -13174530 -10727264 -8071203 -6491025 -6157360 -6272576 -5890085 -4680373
2876 -4680373 -3336583 -3043066 -4164229 -5753133 -6640530 -6458583 -5292571 -3312991 -1514397
2867 -1514397 -1723100 -4498419 -7671357 -8454452 -6740737 -5029262 -5349556 -7537795 -10247016
2858 -10247016 -12175366 -12318073 -10366948 -7023829 -3067260 1401513 5626109 7071733
2850G071733l299542o256150m983341j533146Q51389J854780K508908K102614
2842a682755M604j563629m56306J252653J50899k697159l277342j215944L7402
2833i447577m26810L78333L336490M895956K763210l42818j101877j86664J22793
2824h964k29917l62518q91423k286484k951903j586618L45658Q46581L37125J96311
2814f592152J58693n45500j138274o94770p4375k56907l23122O40466J237776
2805g588165r4052j992129j863401L10366K303043K895597K511798J520089J75322
2796a821532o16982o35858j368153l411816m195399j194892L569744N530702L640798
2787e03388J171333M88776M25246n25836j610211j784107j797733k619578l386074
$$ plain form
2850 7071733 3772191 -2483959 -7467300 -9000446 -8149057 -6294277 -3785369 -1682755
2842 -1682755 -1678151 -3241780 -3698086 -2445433 -2294534 -4991693 -8269035 -9484979 -9447577
2833 -9447577 -9874387 -9496054 -6159564 -1263608 1499602 1156784 54907 -131757 -8964
2824 -8964 -238881 -601399 -1492822 -3779306 -6731209 -8317827 -7972169 -7125588 -6788463 -6592152
2814 -6592152 -6433459 -6978959 -8117233 -8812003 -8886378 -9143285 -9466407 -8825941 -7588165
2805 -7588165 -7682217 -9674346 -11537747 -11227381 -8924338 -6028741 -3516943 -1996854 -1821532
2796 -1821532 -2438514 -3074372 -4442525 -7854341 -12049740 -13244632 -9674888 -4144186 -503388
2787 -503388 667945 1156721 1581967 1056131 -554080 -2338187 -4135920 -6755498 -10141572
2778a0141572k442668M24950L684844N336930M222697R86621k031010k745664
2770b704872j343042K71635P04023l5108j195306j730713q20191Q03909J002371
2761e047294q05959k095827p03726J525911J390479m33484l68233K138008L567620
2752h32505J873971o49377j363627p98401m48137r7486N79166M19009r40772j509676
2742c767835o9214J288556L40207j491012j453946n242J96136j131464j636408
2733g730222m10812P35169L76049p21960j394880j515301j119274k6695J132218
2724a0675708J214739L44996j83132o1934k85943r59087o93415J121981L175808
2715g001695M069590L649239J962521j013320l663072l144746P36563M092028
$$ plain form
2778 -10141572 -12584240 -12159290 -8474446 -3137516 1085181 2071802 40792 -2704872
2770 -2704872 -4047914 -3776279 -3072256 -3107364 -4302670 -6033383 -6853574 -6049665 -5047294
2761 -5047294 -5853253 -7949080 -8652806 -7126895 -5736416 -6169900 -6538133 -4400125 -832505
2752 -832505 1041466 392089 -971538 -1769939 -2218076 -2315562 -1736396 -1317387 -2258159 -3767835
2742 -3767835 -3837049 -2548493 -2208286 -3699298 -5153244 -5158486 -4962350 -6093814 -7730222
2733 -7730222 -8141034 -7405865 -7029816 -7751776 -9146656 -10661957 -11781231 -11807926 -10675708
2724 -10675708 -9460969 -9115973 -9299105 -9361039 -9646982 -10606069 -11299484 -10177503 -7001695
2715 -7001695 -2932105 717134 2679655 1666335 -1996737 -5141483 -4404920 -312892
2707c12892L546822N76546j176431j285517k046779l597231l380097p88698J286526
2698g177751Q35048l39048K02262J849342K431585J471817k1453j360882j844335
2689c953415l20843K644356L758910Q78529l266555m166710j582434O27023K87684
2680e093455r38144j370061j617182j970935q70818K096348M255883L103056k67863
2671b673171k854482l332561k303859n16121J370697K445042K513871K345321
2663c005263J947953L14325j971832k195875N00412K886280J943422o42584j300517
2654a523679o9883L35063l39456J24937J647374J374680j321283l231465k077080
2645e080792L03617J156931N09910p7423k16233l97547p67698j591013l180402
$$ plain form
2707 -312892 3233930 3810476 2634045 1348528 -698251 -4295482 -7675579 -8464277 -7177751
2698 -7177751 -6342703 -6681751 -6479489 -4630147 -2198562 -726745 -748198 -2109080 -3953415
2689 -3953415 -4274258 -1629902 2129008 3007537 -259018 -4425728 -6008162 -5381139 -5093455
2680 -5093455 -6031599 -7401660 -9018842 -10989777 -11860595 -9764247 -5508364 -2405308 -2673171
2671 -2673171 -5527653 -8860214 -11164073 -11680194 -10309497 -7864455 -5350584 -3005263
2663 -3005263 -1057310 -742985 -2714817 -4910692 -4410280 -1524000 419422 -223162 -1523679
2654 -1523679 -1593562 -1258499 -1597955 -1473018 174356 1549036 227753 -3003712 -5080792
2645 -5080792 -4777175 -3620244 -3110334 -3187757 -3403990 -3801537 -4569235 -6160248 -9340650
2636i340650m235144k437929J781976M392911K737104o81694j816420o62151k67000
2627a0528997j463121k059133r91450J47110L45374R23584K748413M140789L321852
2618c415579J183336k58723q26147j520217j881394n10946J943326K902164J614181
2609g69999M43767J109634J839306M12613j704766j314780J139759J606381j645002
2600A116913n294235n560182k876877k12456R67717R59565J23502o01420P29350
2591a0648123M184073O138855L509215j282896l047866r38045R28225j9705j595246
2582b771513j103150P61567J877391J730919Q04176p22732k095238j906083k75688
2573c700351Q80694Q32418R53484J622202J108262q41253j487838M03035J602148
$$ plain form
2636 -9340650 -13575794 -16013723 -14231747 -9838836 -7101732 -7783426 -9599846 -10261997 -10528997
2627 -10528997 -11992118 -14051251 -15042701 -14895591 -14550217 -13626633 -10878220 -6737431 -3415579
2618 -3415579 -2232243 -2490966 -3317113 -4837330 -6718724 -7229670 -5286344 -2384180 -769999
2609 -769999 -326232 783402 2622708 3035321 1330555 15775 1155534 2761915 1116913
2600 1116913 -4177322 -9737504 -12614381 -12826837 -11859120 -10899555 -10776053 -11377473 -10648123
2591 -10648123 -6464050 -325195 3184020 1901124 -1146742 -2084787 -1156562 -1176267 -2771513
2582 -2771513 -3874663 -3113096 -1235705 495214 1299390 576658 -1518580 -3424663 -3700351
2573 -3700351 -2819657 -1987239 -1033755 588447 1696709 855456 -632382 -229347 1372801
2564A372801p69754l973155l188214J188928L966549K400288q21911k076575r78186
2555b879229O26594J192308K36827j413430j726879L54659K779312K424572p32202
2546H62532l627437m274615l535516k635819j595441o43893m92448l88376J364354
2537a4966659L899569L836308N73735j546290Q02557M284046L032426k698708
2529b783016o155023k854875L699778O652196L728791j459464m521465m297752
2521g990830k154235L50220K078532K004195m5811k469025l039994j405010N58802
2512a2113156J391546J893085L242412M368207L077354n06572l643901m391845
2504f682870l419908j904588K12587K626917L425452J556789q23439q96912O86321
$$ plain form
2564 1372801 603047 -3370108 -6558322 -5369394 -1402845 997443 175532 -1901043 -2879229
2555 -2879229 -2252635 -1060327 -823500 -2236930 -3963809 -3609150 -829838 1594734 862532
2546 862532 -2764905 -7039520 -10575036 -13210855 -14806296 -15450189 -15942637 -16331013 -14966659
2537 -14966659 -11067090 -7230782 -6657047 -8203337 -7400780 -3116734 -84308 -2783016
2529 -2783016 -8938039 -11792914 -8093136 -1440940 2287851 828387 -3693078 -7990830
2521 -7990830 -10145065 -9794845 -7716313 -5712118 -5757929 -8226954 -11266948 -12671958 -12113156
2512 -12113156 -10721610 -8828525 -5586113 -1217906 1859448 1352876 -2291025 -6682870
2504 -6682870 -10102778 -12007366 -11794779 -9167862 -5742410 -4185621 -5009060 -5905972 -5219651
2495e219651P94534j265847k560508r20741J870196K577215M90351k416196l932295
2486a0582942k959814K54673L758558M887721L204002J446233J886361K886877
2478D781669J390554k018803l627598k281268j183317k603509l817150j039270
2470a0398692M384532O988738M157652o80450k556683o86925J516881J045077
2462C770130j466060k989694j774355P26806J650769J26943j761232j620158L77669
2453b959182J918589J387038n26995j931949j782068p42995l32324j190272k203784
2444h363942j742884J95814J741753J270419q73465k907231l089048p47622K876570
2435a1639636M779343K982233m39211j310645R22065K239635L56491j360493O74588
$$ plain form
2495 -5219651 -4425117 -5690964 -8251472 -9172213 -7302017 -4724802 -4234451 -6650647 -10582942
2486 -10582942 -13542756 -13288083 -9529525 -4641804 -1437802 8431 1894792 4781669
2478 4781669 6172223 4153420 525822 -1755446 -2938763 -5542272 -9359422 -10398692
2470 -10398692 -6014160 974578 5132230 4451780 1895097 1208172 2725053 3770130
2462 3770130 2304070 -685624 -2459979 -1733173 -82404 44539 -1716693 -3336851 -2959182
2453 -2959182 -1040593 346445 -180550 -2112499 -3894567 -4637562 -4969886 -6160158 -8363942
2444 -8363942 -10106826 -9911012 -8169259 -6898840 -7772305 -10679536 -13768584 -14516206 -11639636
2435 -11639636 -6860293 -3878060 -4317271 -5627916 -4705851 -2466216 -2109725 -3470218 -2795630
2426b795630L904800L207886r27769l022866j033953J140336M22032j243975j379325
2417a728464j136933k135860k777307j090063J316297J454431n96115k263509
2409h957523k121466o07120J442559K806577K050018j38734n96820J920150L993502
2400b08857K122902j854537l502309k468806k242108l833440m199998j588572
2392a7775725J573211K581037K045042J857442K140116K059482J717055J490765
2384b311575J015511K56956J20576O31363J13825k122859l755767k276597J074320
2375g254247K620226J248622l77023j04005O49955l27019k043690j588416J170434
2366f005163K883464J387319j235978j717126R3828J910984K565875K441105J319874
$$ plain form
2426 -2795630 1109170 4317056 3389287 366421 -667532 472804 894836 -349139 -1728464
2417 -1728464 -2865397 -5001257 -7778564 -8868627 -7552330 -6097899 -6694014 -8957523
2409 -8957523 -11078989 -11686109 -10243550 -7436973 -5386955 -5525689 -6122509 -4202359 -208857
2400 -208857 1914045 59508 -3442801 -5911607 -8153715 -11987155 -16187153 -17775725
2392 -17775725 -16202514 -13621477 -11576435 -9718993 -7578877 -5519395 -3802340 -2311575
2384 -2311575 -1296064 -1039108 -918532 -287169 -173344 -2296203 -6051970 -8328567 -7254247
2375 -7254247 -4634021 -3385399 -3762422 -3866427 -3216472 -3543491 -5587181 -7175597 -6005163
2366 -6005163 -3121699 -1734380 -2970358 -4687484 -4593656 -2682672 -116797 2324308 3644182
2357C644182j274958l836954m017217k343381j763709k808238k526356M21129
2349a4505502L099415K994116K146371L433406N306928M145432L23643k156176
2341D787633j601466l65395l50910k39379J629272M131718M648627K211349j589059
2332A3262390m156925m065590k187375n16386K78426J057629J679496M43492k533756
$$ plain form
2357 3644182 2369224 -1467730 -5484947 -7828328 -9592037 -12400275 -14926631 -14505502
2349 -14505502 -11406087 -8411971 -6265600 -2832194 2474734 6620166 6943809 4787633
2341 4787633 3186167 2820772 2469862 2230483 3859755 7991473 12640100 14851449 13262390
2332 13262390 9105465 5039875 2852500 2336114 2614540 3672169 5351665 5795157 3261401
$$ [...]
##END NTUPLES=NMR SPECTRUM
##END=
