##TITLE=31P_DE-80H_X3
 64 sc D2O
 26.2.2025
##JCAMPDX= 6.0         $$ Bruker NMR JCAMP-DX V2.0
##DATA TYPE= NMR SPECTRUM
##DATA CLASS= NTUPLES
##ORIGIN= UXNMR, Bruker Analytische Messtechnik GmbH
##OWNER= root
$$ XWIN-NMR		Version 3.5
$$ Tue Apr  8 14:34:18 2025 Russian Standard Time (UT+4h)  Yarkov@DPX200
##.OBSERVE FREQUENCY= 81.013821
##.OBSERVE NUCLEUS= ^31P
##.ACQUISITION MODE= SIMULTANEOUS
##.ACQUISITION SCHEME= undefined
##.AVERAGES= 64
##.DIGITISER RES= 17
##SPECTROMETER/DATA SYSTEM= spect
##.PULSE SEQUENCE= zgpg30
##.SOLVENT NAME= CDCl3
##.SHIFT REFERENCE= (INTERNAL, CDCl3, 0, 198.062)
##AUDIT TRAIL= $$ (NUMBER, WHEN, WHO, WHERE, WHAT)
$$ ##TITLE= Audit trail, XWIN-NMR		Version 3.5
$$ ##JCAMPDX= 5.01
$$ ##ORIGIN= Bruker BioSpin GmbH
$$ ##OWNER= Yarkov
$$ C:/Bruker/XWIN-NMR/data/yarkov2/nmr/P31/2/pdata/1/auditp.txt
$$ ##AUDIT TRAIL=  $$ (NUMBER, WHEN, WHO, WHERE, WHAT)
(   1,<2025-04-08 14:33:12.34 +0400>,<Yarkov>,<DPX200>,
      <created by zg, POWCHK disabled, PULCHK disabled
       configuration hash MD5:
       00 E9 B6 7A A2 85 ED C7 34 08 36 98 17 FE 4E 26
       data hash MD5: 32K
       6E 9E FA E6 D4 39 D6 66 50 F4 25 A9 AE 7E C4 C0>)
(   2,<2025-04-08 14:33:18.28 +0400>,<Yarkov>,<DPX200>,
      <Start of raw data processing
       efp BC_mod = 2 LB = 1.5 FT_mod = 6 PKNL = 1 PHC0 = 1772.718 PHC1 = 28.09541 SI = 64K 
       data hash MD5: 64K
       B0 90 57 AB D4 1B 01 CE 26 73 74 BC B9 B2 A5 98>)
(   3,<2025-04-08 14:33:43.67 +0400>,<Yarkov>,<DPX200>,
      <pk PHC0 = 18.75494 PHC1 = -3.2 
       data hash MD5: 64K
       EF D6 CA BD C8 4F 19 75 F3 87 26 4D 11 D4 46 EE>)
(   4,<2025-04-08 14:33:51.89 +0400>,<Yarkov>,<DPX200>,
      <abs ABSG = 5 
       data hash MD5: 64K
       F9 21 EB AF 2C 45 5D EE 5C 23 30 B8 72 2C EB FD>)
$$ ##END=
$$ 
$$ hash MD5
$$ C7 20 B7 6B B3 E2 B5 CD 53 CA F6 28 09 41 94 5B
##$RELAX= 
##$RELAX= 
##$RELAX= 
##$RELAX= 
##$RELAX= 
##$RELAX= 
##$RELAX= 
##$RELAX= 
$$ Bruker specific parameters
$$ --------------------------
##$DU= <C:/Bruker/XWIN-NMR>
##$EXPNO= 2
##$NAME= <P31>
##$PROCNO= 1
##$TYPE= <nmr>
##$USER= <yarkov2>
##$AMP= (0..31)
100 100 100 100 100 100 100 100 100 100 100 100 100 100 100 100 100 100 
100 100 100 100 100 100 100 100 100 100 100 100 100 100 
##$AQSEQ= 0
##$AQ_mod= 1
##$AUNM= <au_zg>
##$AUTOPOS= <>
##$BF1= 81.014009
##$BF2= 200.13
##$BF3= 200.13
##$BF4= 200.13
##$BF5= 200.13
##$BF6= 200.13
##$BF7= 200.13
##$BF8= 200.13
##$BYTORDA= 1
##$CFDGTYP= 0
##$CFRGTYP= 5
##$CHEMSTR= <none>
##$CNST= (0..31)
1 1 145 1 1 1 1 1 1 1 1 1 1 1 1 1 1 1 1 1 1 1 1 1 1 1 1 1 1 1 1 1 
##$CPDPRG= <waltz16>
##$CPDPRG1= <>
##$CPDPRG2= <waltz16>
##$CPDPRG3= <>
##$CPDPRG4= <mlev>
##$CPDPRG5= <mlev>
##$CPDPRG6= <mlev>
##$CPDPRG7= <mlev>
##$CPDPRG8= <mlev>
##$CPDPRGB= <>
##$CPDPRGT= <>
##$D= (0..31)
0 1 0 0 0 0 0 0 0 0.06 0 0.03 2e-05 3e-06 0 0 0.0002 0 0 0 0 0 0 0 0 0 
0 0 0 0 0 0 
##$DATE= 1744108391
##$DBL= (0..7)
120 120 120 11 120 120 24 19 
##$DBP= (0..7)
150 150 150 150 150 150 150 150 
##$DBP07= 0
$$ [...]
##$SUBNAM3= <"">
##$SUBNAM4= <"">
##$SUBNAM5= <"">
##$SUBNAM6= <"">
##$SUBNAM7= <"">
##$SUBNAM8= <"">
##$SUBNAM9= <"">
##$SW= 400.765351723535
##$SWIBOX= (0..15)
0 1 3 0 0 0 0 0 0 0 0 0 0 0 0 0 
##$SW_h= 32467.5324675325
##$TD= 32768
##$TD0= 1
##$TE= 0
##$TE2= 300
##$TE3= 300
##$TEG= 300
##$TL= (0..7)
0 120 53 12 22 120 120 120 
##$TP= (0..7)
150 150 150 150 150 150 150 150 
##$TP07= 0
##$TPNAME0= <>
##$TPNAME1= <>
##$TPNAME2= <>
##$TPNAME3= <>
##$TPNAME4= <>
##$TPNAME5= <>
##$TPNAME6= <>
##$TPNAME7= <>
##$TPOAL= (0..7)
0.5 0.5 0.5 0.5 0.5 0.5 0.5 0.5 
##$TPOFFS= (0..7)
0 0 0 0 0 0 0 0 
##$TUNHIN= 0
##$TUNHOUT= 0
##$TUNXOUT= 0
##$USERA1= <user>
##$USERA2= <user>
##$USERA3= <user>
##$USERA4= <user>
##$USERA5= <user>
##$V9= 5
##$VALIST= <valist>
##$VCLIST= <CCCCCCCCCCCCCCC>
##$VD= 0
##$VDLIST= <DDDDDDDDDDDDDDD>
##$VPLIST= <PPPPPPPPPPPPPPP>
##$VTLIST= <TTTTTTTTTTTTTTT>
##$WBST= 1024
##$WBSW= 4
##$XGAIN= (0..3)
0 0 0 0 
##$XL= 0
##$YL= 0
##$YMAX_a= 7405
##$YMIN_a= -16755
##$ZGOPTNS= <>
##$ZL1= 120
##$ZL2= 120
##$ZL3= 120
##$ZL4= 120
##$ABSF1= 198.0616
##$ABSF2= -202.7028
##$ABSG= 5
##$ABSL= 3
##$ALPHA= 0
##$AQORDER= 0
##$ASSFAC= 0
##$ASSFACI= 0
##$ASSFACX= 0
##$ASSWID= 0
##$AUNMP= <proc_1d>
##$AZFE= 0.1
##$AZFW= 0.5
##$BCFW= 0
##$BC_mod= 2
##$BYTORDP= 0
##$COROFFS= 0
##$CY= -3
##$DATMOD= 1
##$DC= 0
##$DFILT= <>
##$DTYPP= 0
##$F1P= 0
##$F2P= 0
##$FCOR= 1
##$FTSIZE= 65536
##$FT_mod= 6
##$GAMMA= 0
##$GB= 0
##$INTBC= 1
##$INTSCL= 9.790993e-09
##$ISEN= 30
##$LB= 1.5
##$LEV0= 0
##$LPBIN= 0
##$MAXI= 10000
##$MC2= 0
##$MEAN= 0
##$ME_mod= 0
##$MI= 50
##$NCOEF= 0
##$NC_proc= -8
##$NLEV= 6
##$NOISF1= 182.463
##$NOISF2= 159.3651
##$NSP= 0
##$NTH_PI= 0
##$NZP= 0
##$OFFSET= 198.0616
##$PC= 4
##$PHC0= 1791.473
##$PHC1= 24.89541
##$PH_mod= 1
##$PKNL= yes
##$PPARMOD= 0
##$PSCAL= 0
##$PSIGN= 0
##$REVERSE= no
##$SF= 81.0140089999434
##$SI= 65536
##$SIGF1= 159.3651
##$SIGF2= -187.1042
##$SINO= 113.3802
##$SIOLD= 16384
##$SREGLST= <1H.CDCl3>
##$SSB= 0
##$STSI= 65536
##$STSR= 0
##$SW_p= 32467.5324675325
##$SYMM= 0
##$S_DEV= 0
##$TDeff= 32768
##$TDoff= 0
##$TI= <>
##$TILT= no
##$TM1= 0
##$TM2= 0
##$TOPLEV= 0
##$USERP1= <user>
##$USERP2= <user>
##$USERP3= <user>
##$USERP4= <user>
##$USERP5= <user>
##$WDW= 1
##$XDIM= 65536
##$YMAX_p= 163755919
##$YMIN_p= -340503871
$$ End of Bruker specific parameters
$$ ---------------------------------
##NTUPLES= NMR SPECTRUM
##VAR_NAME=  FREQUENCY,     SPECTRUM/REAL,   SPECTRUM/IMAG
##SYMBOL=    X,             R,               I
##VAR_TYPE=  INDEPENDENT,   DEPENDENT,       DEPENDENT
##VAR_FORM=  AFFN,          ASDF,            ASDF
##VAR_DIM=   65536,         65536,           65536
##UNITS=     HZ,            ARBITRARY UNITS, ARBITRARY UNITS
##FACTOR=    0.49542278885378, 1,            1
##FIRST=     16045.7642231865, 0,            0
##LAST=      -16421.768244346, 0,            0
##MIN=       -16421.768244346, -340503871,   0
##MAX=       16045.7642231865, 163755919,    0
$$ Real data points
##PAGE= N=1
##DATA TABLE= (X++(R..R)), XYDATA
$$ [...]
##PAGE= N=2
##DATA TABLE= (X++(I..I)), XYDATA
7486C140851J857864L24897P09445K836869K635611j607668n921726n911865k694850
7477d630572o77388j093865j005254J628768M755205M928209J582894k381795
7469C106202l750827k171306j19833K80813j77485N89413K208130J815756j497525
7460B83338m388569l229170J046296M157448L696366J070851j183369j844812
7452c91621r20874P50915J548181M68752j230809j378362J9286P92276p0588j094361
7442a507205q46270K01917J153591K040322K568544J487945j175604k917711j735331
7433g29802Q74084J854049N91159j058009j967992k616684k977800j970566M20173
7424g581388K337286K211567N36150j066797j522454p23046O14411J162740J44903
$$ y = [3140851, 4998715, 5323612, 6033057, 8869926, 11505537, 9897869, 3976143, -1935722, -4630572, -5307960, -6401825, -7407079, -5778311, -1023106, 3905103, 5487997, 3106202, -644625, -2815931, -2935764, -2654951, -2832436, -2243023, -34893, 1780863, 283338, -4105231, -7334401, -6288105, -2130657, 1565709, 2636560, 1453191, -391621, -1312495, -561580, 986601, 1455353, 224544, -1153818, -1134532, -342256, -412844, -1507205, -2353475, -2151558, -997967, 1042355, 3610899, 5098844, 3923240, 1005529, -729802, 144282, 1998331, 2589490, 1531481, -436511, -3053195, -6030995, -8001561, -7581388, -5244102, -3032535, -2496385, -3563182, -5085636, -5808682, -5194271, -4031531, -3886628]
7415c886628j378590j448991K68480K024728K331602J536990P39478N11922J136593
7406A835584K540700L318155J539136k349022n028021m134222j183377Q56031
7398b605036J425223J784525J878170N36482j631129k373758j214219k57855p50665
7389c208262j019605P85689L537690M442623K704364L17341o36577l10359m20685
7380F192219j867719l573863l851276k555530j078505j21989J198030L139793
7372b518840L663544Q73429l599574n873356m407250j292472J056657K221930
7364i875932K439021J465441j17945o14642M11303J219792O32708r9662L88459
7355d151457J206825R45600J96437K63422N67375m52666k531929l635210k482543
$$ y = [-3886628, -5265218, -6714209, -6445729, -4421001, -2089399, -552409, 187069, 698991, 1835584, 4376284, 7694439, 9233575, 6884553, 1856532, -2277690, -3461067, -2605036, -1179813, 604712, 2482882, 3019364, 1388235, -985523, -2199742, -2457597, -3208262, -4227867, -3442178, 95512, 4538135, 7242499, 7559840, 6923263, 6612904, 6192219, 4324500, 750637, -3100639, -5656169, -6734674, -6856663, -5658633, -2518840, 1144704, 2018133, -1581441, -7454797, -11862047, -13154519, -12097862, -9875932, -7436911, -5971470, -6089415, -6704057, -6292754, -5072962, -4440254, -4539916, -4151457, -2944632, -1999032, -1802595, -1539173, -971798, -1424464, -3956393, -7591603, -10074146]
7346a0074146L43429L198512M188261K317851q38864k001202k74120J264068o123
7337a882334k179915j914404K34848J108089L61026N18368K012755K428179J128512
7328A815124N19443J581223J952215P2318k179471k848093k740860k803120j698758
7319f329979J345041L806240K983076J06035j464667q31799K49470O69099Q26029
7310A358545Q11488R4516j103133j798393j488265l94455R36313J551219P53824
7301G21659m22870n5924J451519J182949j855789m610217m340012k558946j915648
7292a2403279j612590N51093L492854M222105K732581J523100J061394j24930
7284e57672j351939l10397K116927K153784q32871k948441j856757r3244l29894
$$ y = [-10074146, -9730717, -6532205, -2343944, -26093, -864957, -2866159, -3140279, -1876211, -1882334, -4062249, -5976653, -5741805, -4633716, -4272690, -3754322, -1741567, 686612, 1815124, 2334567, 3915790, 5868005, 5940323, 3760852, 912759, -1828101, -4631221, -6329979, -4984938, -1178698, 1804378, 1910413, 445746, -386053, -136583, 532516, 1358545, 2170033, 2264549, 1161416, -636977, -2125242, -2519697, -1583384, -32165, 721659, 298789, 242865, 1694384, 2877333, 1021544, -3588673, -7928685, -10487631, -12403279, -14015869, -13464776, -9971922, -5749817, -3017236, -1494136, -432742, -557672, -1909611, -2220008, -103081, 2050703, 1217832, -1730609, -3587366, -3680610, -4010504]
7275d010504j236912o70206L77191P4842o15156J83839J624924J428166m55069
7266c298885k109538k566202k124267p44795J609374L733288M265707L459928
7258B224610K347713J022323p02562j966376j922212j259965j099944j263967
7250b620380j060321o54046k00942J008498K906192L703493K477710J007050Q26135
7241G393389L62321k118437m483618l301456O22066L135713K681864J445986P46926
7232F484754m87411k122312k023763k24845J18654k109353l501557j294534K115215
7223c045152K767598Q26679m51807K25024J178726Q80674l97013j514109j364727
7214h94107L33950J956002J146844j635610k832037p76508J470418P46569j298678
$$ y = [-4010504, -5247416, -5917622, -5540431, -5465589, -6080745, -5896906, -4271982, -2843816, -3298885, -5408423, -7974625, -10098892, -10843687, -9234313, -5501025, -1235318, 2224610, 4572323, 5594646, 4892084, 2925708, 1003496, -256469, -1356413, -2620380, -3680701, -4334747, -4535689, -3527191, -620999, 3082494, 5560204, 6567254, 7393389, 7755710, 5637273, 1153655, -2147801, -1525735, 1609978, 4291842, 5737828, 6484754, 5997343, 3875031, 1851268, 1626423, 1745077, -364276, -3865833, -5160367, -3045152, -277554, 549125, 97318, 322342, 1501068, 2381742, 1984729, 470620, -894107, -560157, 1395845, 2542689, 907079, -1924958, -2701466, -1231048, -484479, -1783157]
7205a783157j271001K21211J00129j387288j156503R91002K018549J267139J488571
7196D88652L233876L115023l05521l341795k690700l55680J16882q68852p80901
7187a389016K52841K60909o68830q38973j03820M95492J031828J712043J101900
7178A854374j408325k939426q09665K386741J916469j512326k401007Q99817L504848
7169A491500J675686j682576k070279l742R47968q7192j189715j520654j826181
7160d265185k025352j234550K38874J159806J202525Q34806R4450r69252j576477
7151f540355j432169j468956j865282r64812J798517L662244J991056j329341
7143f149098k087351M04905K861576L085894K146956J280036l8269j921297k819718
$$ y = [-1783157, -3054158, -2832947, -2732818, -4120106, -5276609, -4285607, -2267058, -999919, 488652, 3722528, 6837551, 6532030, 3190235, 499535, 143855, 260737, -608115, -1389016, -1136175, -875266, -1544096, -2383069, -2486889, -1991397, -959569, 752474, 1854374, 446049, -2493377, -3303042, -916301, 1000168, -512158, -2913165, -2013348, 1491500, 3167186, 1484610, -585669, -589411, 358557, 271365, -918350, -2439004, -4265185, -6290537, -7525087, -7286213, -6126407, -4923882, -4089076, -3994626, -4963878, -6540355, -7972524, -9441480, -11306762, -12271574, -10473057, -6810813, -4819757, -6149098, -8236449, -7831544, -4969968, -1884074, 262882, 1542918, 1504649, -416648, -3236366]
7134c236366j901574o20529n28540j098038r03130K91919J609203K290359K268227
7125a828469K243391L133897M471036M003176O66926k735639k430205R08240K652498
7116A1084851O40739k119439k422706j405581j941977l899610m619246k812566
7108g495535J98473K326152K275755J68115k170793k556517j019079K64475L05414
7099g703540N88716J931908K490281Q38173j125368q15620J150305K277591K066176
7090A698622J865662J814215O63561j682849l664704l895869k038970J263750
7082c976582L891112L242772k77731k567707j071221J294069O13297j748266j627271
7073b227528P42633J289246n91871j073695Q71876J115806k410147n391081l561316
$$ y = [-3236366, -5137940, -5758469, -6287009, -7385047, -8288177, -7996258, -6387055, -4096696, -1828469, 414922, 3548819, 8019855, 12023031, 12689957, 9954318, 7524113, 8432353, 11084851, 11725590, 9606151, 7183445, 5777864, 3835887, -63723, -4682969, -7495535, -7297062, -4970910, -2695155, -2527040, -4697833, -7254350, -8273429, -8008954, -7703540, -7114824, -5182916, -2692635, -1854462, -2979830, -3795450, -2645145, -367554, 1698622, 3564284, 5378499, 6042060, 4359211, 694507, -3201362, -5240332, -3976582, -85470, 3157302, 2879571, 311864, -759357, 534712, 1148009, -600257, -2227528, -1484895, -195649, -787520, -1861215, -989339, 126467, -2283680, -7674761, -11236077]
7064a1236077P37570K584848J889102K222755M290330N156767L199330j01966
7056H742659l055976n070719n197259k629196R66789K456542J217106k53292k41618
7047c064964J14436l77822m61866J482723M243090M677476J652074k256545l424183
7038B584419j077192J918617K291802K1124j948381j576132n3099M00292k79205
7029B282245m92211J63904M04910m58854j476898j675246j312840r35422l42425
7020c842837O98051J528786J328273M01364m7725N54513J370939J157142j46965
7011C001541j222959r90370n9783N5636r26778j575016o13188J562648L558810
7002B790541M245143K973291j79084l526412m448481k328267J57923K17339j448185
$$ y = [-11236077, -10498507, -7913659, -6024557, -3801802, 488528, 5645295, 8844625, 8742659, 5686683, 615964, -4581295, -7210491, -6243702, -3787160, -2570054, -2823346, -3064964, -2950528, -3328350, -3790216, -2307493, 1935597, 6613073, 8265147, 6008602, 2584419, 1507227, 3425844, 5717646, 5738770, 3790389, 2214257, 2161158, 2561450, 2282245, 1790034, 1953938, 2358848, 1899994, 423096, -1252150, -2564990, -3500412, -3842837, -3144786, -1616000, -287727, 113637, 65912, 620425, 1991364, 3148506, 3001541, 1778582, 788212, 728429, 784065, -142713, -1717729, -2330917, -768269, 2790541, 7035684, 10008975, 9829891, 6303479, 1854998, -473269, -315346, -98007, -1546192]
6993a546192j983296n90052Q34832J015057P47851O10388l44260k420060l726058
6984g401790k381138Q61133L510489M003531K436927l38326l034068m022168k471335
6975h836745P49423L964102N982292O038419L636199l19074l170952k947943q30090
6966D265631K40365p88491k188219k100136o28813Q86225J398096O27022r04998
6957H06682j977391j713693p10916k61055n15173n91017m07311p93296j536741
6948g699911j206227L51284J246834M72056k47790Q26655K545957K838069K220319
6939A347246K677055L810214L140450K77001k180090k533631j993535j774993
6931B769717j062917L83850L28856k493533m949799k911191K639794O214979M731469
$$ y = [-1546192, -3529488, -4119540, -3284708, -2269651, -1521800, -911412, -1255672, -3675732, -7401790, -9782928, -8921795, -5411306, -1407775, 1029152, 690826, -2343242, -6365410, -8836745, -8087322, -4123220, 1859072, 7897491, 11533690, 11214616, 8043664, 5095721, 4265631, 4505996, 3717505, 1529286, -570850, -1199663, -313438, 1084658, 1711680, 806682, -1170709, -2884402, -3595318, -3856373, -4371546, -4962563, -5369874, -6163170, -7699911, -8906138, -8554854, -7308020, -6835964, -7083754, -6257099, -3711142, -873073, 1347246, 4024301, 7834515, 10974965, 11251966, 9071876, 6538245, 4544710, 2769717, 1706800, 2090650, 2419506, -74027, -5023826, -7935017, -5295223, 919756, 5651225]
6922E651225Q61556j335491j410936j498106k271136k228283l98023K046204L006057
6913B423067J400869j975007m813688m808966j704669K174948M079074L444482
6905B20110J823103N74373l02095j041271j228594q21812r20964k164564l031383
6896f893097j547572J340214K216386j04634k385898j283855J774286K675045
6888d209125P10266o91679M41233J771270Q90317o36316j230K206628L078847
6879C560211J867626L76140n37925j837692l599554m211944k986834j377782p42468
6870i490222o40731j34992P48156J567050K100517J847518K54130j994589l225630
6861h968793k809236j620850j86826J910785M202365M810249K895282J52366j267784
$$ y = [5651225, 6512781, 5177290, 3766354, 2268248, -2888, -2231171, -2629194, -582990, 2423067, 3823936, 1848929, -2964759, -7773725, -9478394, -7303446, -3224372, 220110, 2043213, 2617586, 2315491, 1274220, 45626, -776186, -1697150, -3861714, -6893097, -8440669, -7100455, -4884069, -4988703, -7374601, -8658456, -6884170, -4209125, -3498859, -4190538, -3749305, -1978035, -1087718, -1724034, -1725264, 481364, 3560211, 5427837, 5803977, 5266052, 3428360, -171194, -4383138, -7369972, -8747754, -9490222, -10130953, -10265945, -9517789, -7950739, -5850222, -4002704, -3748574, -5743163, -8968793, -11778029, -13398879, -13585705, -11674920, -7472555, -2662306, 232976, 385342, -882442]
6852h82442j108354l95599J11848j00064j343536k597854j915270O70905K275805
6843e284561R46519j209800q84506J598734K885154J523998l28858l73519R46513
6834a80326J743453J149709l91647k063027l049368k819228j726173p88448m85651
6825h610706l37167Q8868M94674N95847P92899J351595J399833j57511k552353
6816f934021l109134l44477L414534M114061J038435j874179r46549K475068M043161
6807A876899K138447q50680k494090k734861k068990k53286K043755K840841J664856
6798B162891P34332J733396L257343L118209J424280l77448j794378k747994k466355
6789E044276j013423k80939j164958j421745R16598L459294K150657k625694o053290
$$ y = [-882442, -1990796, -2386395, -2274547, -2374611, -3718147, -6316001, -8231271, -7560366, -5284561, -4338042, -5547842, -6432348, -4833614, -1948460, -424462, -753320, -1126839, -180326, 1563127, 2712836, 2321189, 258162, -2791206, -5610434, -7336607, -8125055, -8610706, -8947873, -8859005, -8364331, -7768484, -6975585, -5623990, -4224157, -4381668, -6934021, -10043155, -10387632, -6973098, -2859037, -1820602, -3694781, -4641330, -2166262, 1876899, 4015346, 3164666, 670576, -2064285, -4133275, -4386561, -2342806, 498035, 2162891, 2897223, 4630619, 7887962, 11006171, 12430451, 12053003, 10258625, 7510631, 5044276, 4030853, 3749914, 2584956, 1163211, 2079809, 5539103, 7689760, 5064066, -989224]
6780i89224n105901j749994N60100Q82683L96617J92130N86906J289195J504348
6771b433140Q01181q271J21788P61246M96270j070767k873925l491526j828673
6762i525817K137098N950981N674716N40200m787420n323730j964075N19005N15288
6753f263754O20206K006372K314388K09029j965627j894835m99979M07175R13118
6744d153907J518818J317474k52974j752816j738739q29491k15247K53062R66128
6735d887692J186103L89636m10818j65521O48633J199085J659556K185207J983532
6726C787721P59810k45766m6717M53365k4037r85527q40485R45962L279585M439938
6716A1523849L274256K52055k504203l258772k584620k005506j417430N1372J312268
$$ y = [-989224, -6095125, -7845119, -7285019, -6402336, -6005719, -5813589, -5226683, -3937488, -2433140, -1631959, -1640230, -1518442, -757196, -260926, -1331693, -4205618, -7697144, -9525817, -7388719, -1437738, 4236978, 4777178, -10242, -5333972, -7298047, -6779042, -6263754, -5643548, -3637176, -1322788, -1113759, -3079386, -4974221, -5474200, -5067025, -4153907, -2635089, -1317615, -1570589, -3323405, -5062144, -5891635, -6106882, -5853820, -4887692, -3701589, -3311953, -3722771, -3888292, -3239659, -2040574, -381018, 1804189, 3787721, 4547531, 4301765, 4255048, 4708413, 4684376, 3698849, 2858364, 3804326, 7083911, 11523849, 14798105, 15050160, 12545957, 9287185, 6702565, 4697059, 3279629, 3331001, 4643269]
6707D643269M22566j715273k086437k98869R58187P47901J154827K575505K131193
6698H532869j133186l678935k871699j096493j308841k121499j015425Q21324
6690c871885R83022M13042J160079J913210L27039k021114j663798R75201K289984
6681E04780J169927k02200n76885o66095m62558O62262J641673J032029j00251
6672C002682j59730o25528l396769n777657l372237K378294N157636K845690Q4203
6663A36584M25073J391748j60898k519396k283427K78634K208659J926740l2542
6654A371175k346579l253369j700719N34726L28862k033790k582045L36011L078628
6645f267100K037004j052547j976987N2823K298329K680991J416834l96057j645419
$$ y = [4643269, 5065835, 3350562, 1264125, 965256, 1923443, 2671344, 3826171, 6401676, 8532869, 7399683, 3720748, 849049, -247444, -1556285, -3677784, -4693209, -3871885, -2888863, -2475821, -1315742, 597468, 924507, -1096607, -2760405, -1785204, 504780, 1674707, 1472507, 895622, 229527, -233031, 429231, 2070904, 3102933, 3002682, 2842952, 2217424, -1179345, -6957002, -10329239, -7950945, -2793309, 52381, 136584, 561657, 1953405, 1792507, -726889, -3010316, -2731682, -523023, 1403717, 1371175, -975404, -4228773, -5929492, -5394766, -5065904, -7099694, -9681739, -9345728, -6267100, -4230096, -5282643, -7259630, -7206807, -4908478, -2227487, -810653, -1206710, -2852129]
6636b852129j596257r57648j323961k393494j675084J536465M152108L339755
6628a770245N22846j034376p38598j26394M64627J614162K372972J293377o17452
6619A980919r20104M66461J224343L93986n23504n86922r08501k182235k937856
6610c993413j697544O10237J893417J678242J253426J457323J676254J205325
6602D083267M91594L19068M00066k11257j467384k241356k107719j918492k008429
6593d660642j321522M97413J650049O57518r36904o60861R18193J012581q85566
6584c729741k160784j047288J127099K249115J747290J67809j426944j431138
6576d504582O02850K259616J029056j368705r73954J960532K941318O36228p78696
$$ y = [-2852129, -4448386, -5406034, -6729995, -9123489, -10798573, -9262108, -5110000, -1770245, -1247399, -2281775, -3020373, -3146767, -2682140, -1067978, 1304994, 2598371, 1980919, 1060815, 1527276, 2751619, 3145605, 2622101, 2035179, 1126678, -1055557, -3993413, -5690957, -5080720, -3187303, -1509061, -255635, 1201688, 2877942, 4083267, 4574861, 4893929, 5293995, 5082738, 3615354, 1373998, -733721, -2652213, -4660642, -5982164, -5484751, -3834702, -3177184, -4114088, -4774949, -3856756, -2844175, -3729741, -5890525, -6937813, -5810714, -3561599, -1814309, -1646500, -3073444, -4504582, -3901732, -1642116, -613060, -1981765, -2955719, -995187, 1946131, 2582359, 1803663]
6567A803663J039423K133614j015834m852406l996875J82284K040357O12067j6858
6558b070565J501291J788964p36065k880733k078962k88910j05025o17706M6674
6549e441037Q77162j09430j835020j352904J439282L225514J919463m29745p07660
6540b414375P92357R44973j566142m369881m811040l165157j017937J506539M400609
6531i700054N368344K434770j706178k127908J241014L309640J573622n97778
6523b04528m03020k72519k608866m448910k199122J740890K530459P02156O82018
6514d481442K833915K926421m45939l368500k623683J67669J793534J406643K1514
6505a769868j180670j199675j09218L13201q83600j404854J122869M451009M124255
$$ y = [1803663, 2843086, 4976700, 3960866, -891540, -4888415, -4706131, -2665774, -2053707, -2070565, -569274, 1219690, 483625, -2397108, -4476070, -4764980, -4870005, -5487711, -5441037, -4563875, -4673305, -6508325, -7861229, -6421947, -3196433, -1276970, -1706715, -2414375, -1622018, -677045, -2243187, -6613068, -11424108, -14589265, -15607202, -14100663, -9700054, -4331710, -1896940, -3603118, -5731026, -4490012, -1180372, 393250, -204528, -607548, -880067, -3488933, -7937843, -10136965, -8396075, -5865616, -5163460, -4481442, -1647527, 1278894, 832955, -2535545, -5159228, -4991559, -3198025, -1791382, -1769868, -2950538, -4150213, -4259431, -3946230, -4829830, -6234684, -5111815, -660806, 3463449]
6496C463449K38082k577151k152236j201769j877904k452768j110331Q98703J787199
6487d984726J557673K49363k683484n673230n337176j357946K360359L222588
6479a2646579K973120L262335K433062l12318j632518J020854M352540L601955
6471C052451j76398j752560N41998K984590K104693j344465m244538m355161j611712
6462d801102J883240L371563K352267J183006J561234K046725Q27922j067980
6454G356875j804336k057103l249232m072757k372291M89255R92860j087730k350212
6445h154671j129582M19288L70093k52502q0190L19350M55417J514463L788363
6436b749971M643344J674655l308666o009009m921614k607043j591089j199790
$$ y = [3463449, 3701531, 1124380, -1027856, -2229625, -4107529, -6560297, -7670628, -6771925, -4984726, -3427053, -3177690, -5861174, -11534404, -16871580, -18229526, -15869167, -12646579, -9673459, -6411124, -3978062, -4290380, -5922898, -4902044, -549504, 3052451, 2876053, 1123493, 1665491, 4650081, 6754774, 5410309, 1165771, -3189390, -4801102, -2917862, 453701, 2805968, 3988974, 5550208, 7596933, 8424855, 7356875, 5552539, 3495436, 246204, -3826553, -6198844, -5709589, -4716729, -5804459, -8154671, -9284253, -8864965, -8494872, -8747374, -8827564, -8508214, -8052797, -6538334, -2749971, 1893373, 3568028, 259362, -5749647, -10671261, -13278304, -14869393, -16069183]
6428a6069183N13488L269335M721313L698950J670607N68189M03419o2248j118286
6419b404416j760967j221665K04515J701828K452299J936788O53601N8622O77766
6410B298371R69613m23328k107582j772048p11M79835p22616j060356N27049J833597
6400B1824J234275J50173k2223l80452j721318k178016m26757J217602J17592
6391a987300k156733k019719O28387K434873J559097l33042q91896L51830K058295
6382c56208K151041m01784l595728l823969q74208R69289p78016k408534K53628
6373h864489M459220M128014o53601l644460j854623J003299J545552J431025
6365b450063K682836L354678J309335j420637j750396m34549l78966j885646k767859
$$ y = [-16069183, -15555695, -12286360, -7565047, -3866097, -2195490, -1627301, -1223882, -1286130, -2404416, -4165383, -5387048, -5182533, -3480705, -1028406, 908382, 1561983, 1620605, 2298371, 3267984, 2844656, 737074, -1034974, -1035685, -555850, -1278466, -2338822, -1811773, 21824, 1256099, 1406272, 1384049, 1003597, -717721, -2895737, -3322494, -2104892, -1987300, -4144033, -6163752, -5535365, -3100492, -1541395, -1874437, -2766333, -2414503, -356208, 1794833, 1393049, -2202679, -6026648, -6900856, -5931567, -6709583, -9118117, -8864489, -4405269, -277255, -930856, -4575316, -6429939, -5426640, -3881088, -2450063, 232773, 3587451, 4896786, 3476149, 1725753, 1291204, 912238, -973408, -3741267]
6356c741267k057650q73008k54259k12504l96875k55790P16149J838795J535844
6347c700565k02098j166595j4267J621186J640029N60057L21118J291339K285526
6338B635730K582844K285235J516645O17768J71451k54226j930787m261625m191435
6329h28400l57295L944142M559094J943731m5026J31903M77114k91874p60900
6320H772489R1529P77167k18538j932842k555115k155155k188983l055172l486816
6311e951436k194769N69084K993026L187349J145074r21025r85399K64542M79978
6302a413576q95135j902037j257368m31558j264724k880180k756163k77054K516949
6293a0560846L671603L291450K488742J732190R81232N30351P56126J375596J672879
$$ y = [-3741267, -5798917, -6671925, -6926184, -7138688, -7535563, -7791353, -7075204, -5236409, -3700565, -3902663, -5069258, -5083525, -3462339, -1822310, -1262253, -941135, 350204, 2635730, 5218574, 7503809, 9020454, 9638222, 9809673, 9555447, 7624660, 3363035, -828400, -1185695, 2758447, 7317541, 9261272, 9216246, 9348149, 9825263, 9533389, 8772489, 8864018, 9641185, 9422647, 7489805, 4934690, 2779535, 590552, -2464620, -5951436, -8146205, -7577121, -4584095, -1396746, -251672, -1172697, -2158096, -1893554, -1413576, -2308711, -4210748, -5468116, -5899674, -7164398, -10044578, -12800741, -13077795, -10560846, -6889243, -3597793, -1109051, 623139, 1604371, 2134722, 2890848, 4266444, 5939323]
6284E939323J289176K70482j401947l628597n575637n972233m360286j707785
6276a5147504M52121J293424J080097O29302N38588P31585P52086O60316J253237
6267g756748K757038L674515K171093j193093l448448k647993j76016J343036
6259e276616J375067J340153J899090K081126J025180q48905k568930l402369
6251d376204k897128j286838Q8431l052q72047n77863J272736K730711K122785
6242c798469K59957q33973m68852M01013P73038N46943J89128J58564M76453M76267
6232a819931n84387k229497k718218j105549J078354J322442o09572k063015q65188
6223i594561J531392J721258q48496k541516k10328M196341N886231L490285L50762
$$ y = [5939323, 7228499, 7498981, 6097034, 2468437, -3107200, -9079433, -13439719, -15147504, -14695383, -13401959, -12321862, -11692560, -11153972, -10422387, -9670301, -9009985, -7756748, -4999710, -1325195, 845898, -347195, -3795643, -6443636, -6619652, -5276616, -3901549, -2561396, -662306, 1418820, 2444000, 1595095, -973835, -4376204, -7273332, -8560170, -8471739, -8474791, -9346838, -9924701, -8651965, -5921254, -3798469, -3538512, -4372485, -4841337, -4440324, -3667286, -3120343, -2931215, -2772651, -2296198, -1819931, -2404318, -4633815, -7352033, -8457582, -7379228, -6056786, -6666358, -8729373, -9594561, -8063169, -6341911, -7190407, -9731923, -9942251, -5745910, 140321, 3630606, 3981368]
6214C981368o99284o60828j092054q08037J334721K993826J507070j141648q55704
6205D559430J851931K465095L7763j018710J572099L637051R90116l747541n009969
6196E337265k406700m01471j155449k255626j605930n35773r00725k019038k009233
6187g952680m19311J579441K441359J210284j506491l299103k175140O86340K011246
6178g424055O83793q88373m79978P86736N49963r51252j304372K97581J887821
6169f842136J765923R34328J382424L003892L643251J941924j073987l350592
6161A405027l732297k291106J81977K367554K963753J914641N75528k6276m22551
6152B936250j394224k264394j748803O999J554999K016934J660685R81646M11109
$$ y = [3981368, 3282084, 2621256, 1529202, 721165, 2055886, 5049712, 6556782, 5415134, 4559430, 6411361, 8876456, 8914219, 7895509, 9467608, 13104659, 14094775, 10347234, 5337265, 2930565, 2529094, 1373645, -881981, -2487911, -3023684, -3924409, -5943447, -7952680, -8371991, -6792550, -4351191, -3140907, -4647398, -7946501, -10121641, -9435301, -7424055, -6740262, -7628635, -8108613, -7321877, -6771914, -7723166, -9027538, -8729957, -6842136, -5076213, -4141885, -2759461, 244431, 3887682, 5829606, 4755619, 1405027, -2327270, -4618376, -4436399, -2068845, 894908, 2809549, 3385077, 3358801, 2936250, 1542026, -722368, -2471171, -2464172, -909173, 1107761, 2768446, 3750092, 4161201]
6143D161201M79567J015494Q32794l90251r57465J96156R97462p65447l007244
6134B562267j795562J998053L078285k69447l297381k136262M43830p256k622952
6125b046425l399725j694744k7530Q50497K118043L088862J764895r56136j712580
6116b014843L03700K309665K391596J675597J409187J107562N73120P88874J572156
6107A0116614R83364j530501l697157l578316k178664j418516j257811m92171
6099c053158Q50553J529813Q79406n29012j633570j738959j026642l53204r8160
6090e172933L92279J414772J782825N83146p06820N1686K186265K833980J060958
6081D426158j065330j817429j699147j385735l85147J119394J470662Q8772j115537
$$ y = [4161201, 4640768, 5656262, 6489056, 6098805, 5141340, 5337496, 6334958, 5569511, 2562267, 766705, 2764758, 5843043, 5573596, 2276215, 139953, 583783, 576527, -2046425, -5446150, -7140894, -7168424, -6317927, -4199884, -1111022, 653873, -302263, -2014843, -1711143, 598522, 2990118, 4665715, 6074902, 7182464, 7755584, 8544458, 10116614, 11099978, 9569477, 5872320, 2294004, 115340, -1303176, -2560987, -3053158, -2202605, -672792, 206614, -322398, -1955968, -3694927, -4721569, -5074773, -5172933, -4780654, -3365882, -1583057, -999911, -1706731, -1655045, 531220, 3365200, 4426158, 3360828, 1543399, -155748, -1541483, -1926630, -807236, 663426, 752198, -363339]
6072c63339m51335J037368J315996K63952o68971o15320K55314J499830K404446
6063D677941K003008J37514k067061l410388l655788l123906k200443j358890
6055h998013n59636J170302M008757N651037L752280m8897j568195l1846Q04923
6046D180712j297998l533259k724563j71184J119846J191250J691757J998359
6038B454920O16059j213061j268379n56037j666564l667772l049349K12877K059600
6029f077706P40711n30748Q44814K537831J358604j366790j942098j5062J418641
6020c031803J011974O57995J755368K831924K128312L71528p74887j521051k977169
6011D52191m095575k344356J997937M892399L683519J064988J133452K930816
$$ y = [-363339, -814674, 222694, 1538690, 1802642, 1133671, 518351, 773665, 2273495, 4677941, 6680949, 6818463, 4751402, 1341014, -2314774, -5438680, -7639123, -8998013, -9557649, -8387347, -4378590, 1272447, 5024727, 4975830, 3407635, 3375789, 4180712, 2882714, -650545, -3375108, -3546292, -2426446, -1235196, 456561, 2454920, 3070979, 1857918, 589539, 33502, -1633062, -5300834, -8350183, -8137306, -6077706, -5336995, -5867743, -5022929, -2485098, -1126494, -2493284, -4435382, -4450444, -3031803, -2019829, -1361834, 393534, 3225458, 5353770, 5725298, 4950411, 3429360, 452191, -3643384, -5987740, -3989803, 902596, 4586115, 5651103, 6784555, 9715371]
6003I715371J778368l027363o256742m232098l72467p3235k856967l693967p33802
5994i752902K533222K753156N74186j669446k906614k739900o50483K457996L856516
5985e544269J986278j272563k788345j787444o7022O49126L15917j11515R5368
5976h524469R09809J652947J547707M08642j170970k260958k212047j209520m03431
5967a1262290q75751k065875k034092J4088K417933L294391L018807K980108K873611
5958a639070J378765r26085j737302l38673J405534J822604J170575L3944j847255
5949f76963m036064m582170k314168J206882L342134L168687J722341M06333L6181
5940a726807N53605R01438N3757j334648j524960m06710J01701p84778j211534
$$ y = [9715371, 11493739, 8466376, 2209634, -2022464, -2394931, -2468166, -5325133, -9019100, -9752902, -7219680, -4466524, -3892338, -5561784, -8468398, -11208298, -11858781, -9400785, -5544269, -3557991, -4830554, -7618899, -9406343, -9473365, -8824239, -8508322, -8619837, -8524469, -7614660, -5961713, -4414006, -4005364, -5176334, -7437292, -9649339, -10858859, -11262290, -12138041, -14203916, -16238008, -16223920, -13805987, -10511596, -7492789, -4512681, -1639070, -260305, -1186390, -2923692, -3262365, -1856831, -34227, 1136348, 1170292, -676963, -4713027, -9295197, -11609365, -10402483, -7060349, -3891662, -2169321, -1762988, -1726807, -1173202, -271764, -218007, -1552655, -3077615, -3484325, -3382624, -4167402, -5378936]
5931e378936J17708J282483M1968k157469j994795O90701K786148K720130K167643
5922B75581K274386J423301j444548l906910l120904k88316Q43858n75710j463044
5913e982306L19528K661467K349246j69544j298245Q53293L965171M303834R44312
5904G946756l384874n152237l325204r6339J499455P31012l99844r8001P94322
5895a484954M32134q06653q08150N91478Q97731j089008k973160k212859Q2179
5886g371262J177839J057068J809774L433788L483098J157279j172790j386850
5878B187944j75745Q06544J171155R93692j88667k056031k776808j228284J147173
5869a19027K074618J144808k70670q36220j12272J254705J436009r64627m271306
$$ y = [-5378936, -5261228, -3978745, -3936777, -6094246, -8089041, -7398340, -4612192, -1892062, 275581, 2549967, 3973268, 2528720, -1378190, -4499094, -4787410, -3943552, -4519262, -5982306, -5662778, -3001311, -652065, -821609, -2119854, -1266561, 2698610, 7002444, 7946756, 4561882, -590355, -3915559, -4011898, -2512443, -1781431, -2181275, -2279276, -1484954, -1052820, -1859473, -2667623, -2076145, -1178414, -2267422, -5240582, -7453441, -7371262, -6193423, -5136355, -3326581, 107207, 3590305, 4747584, 3574794, 2187944, 2012199, 2818743, 3989898, 4983590, 4794923, 2738892, -37916, -1266200, -119027, 1955591, 3100399, 2829729, 1993509, 1881237, 3135942, 4571951, 3607324, -663982]
5860f63982m664380j249608J899120J018396j931964k206313O84535K678318J725997
5851b709881N64708J661232K998249J503944j702805k752949q08181P78819n13585
5842i80449k820600k774882k20744J956746J979302R17997R7667r09387k392079
5833e146429k583983k31L332402L736392Q44016j978013k427311j614980q77540
5824f715677M88001K540120K879656L29275j991455o25361K847707L956564J776686
5815E485516n28522j105323j384087k303977k391250q66325M76865J68705n60959
5806c009357J2337J347018J603427J05036k146545l293996j659973K425434N666581
5797A049962M745661N85570k512923k253859k89207J439809K908959L651210J998088
$$ y = [-663982, -5328362, -6577970, -4678850, -3660454, -5592418, -7798731, -7114196, -4435878, -2709881, -2145173, -483941, 2514308, 4018252, 2315447, -437502, -1245683, -466864, -980449, -3801049, -6575931, -6796675, -4839929, -2860627, -1942630, -1844963, -2754350, -5146429, -7730412, -7730643, -4398241, -661849, 182167, -1795846, -4223157, -5838137, -6715677, -6227676, -3687556, -807900, -478625, -2470080, -3095441, -247734, 3708830, 5485516, 4956994, 3851671, 2467584, 163607, -2227643, -3093968, -2617103, -2448398, -3009357, -2997020, -1650002, -46575, 58461, -2088084, -5382080, -7042053, -4616619, 1049962, 5795623, 6381193, 3868270, 1614411, 1325204, 2765013, 5673972, 9325182, 11323270]
5788A1323270j456604l215876k015583j029251k205317k372602J036512M114224
5780D178773J774809l585752m958930j205676J756077N49907j262146k04459J484140
5771a473257N11922j624512j449292P35654J828325J001648L16606J001440J912906
5762B761440J569127j63374k290593l411169k639236o71691P35728R59381J102475
5753b047912J798828J925156N53999j210371j644889o09560P38573J409452Q96975
5744A810251p36048k216657j864647Q1284J442091J237446R47335J529947J447177
5735C678179n44294k745313k940124j745353j102919r50430n3852J074560R37811
5726d391735p0454k90768K66598J94903n95563r26820n91134q7466J138665L436011
$$ y = [11323270, 9866666, 6650790, 4635207, 3605956, 1400639, -971963, 64549, 4178773, 5953582, 2367830, -2591100, -3796776, -2040699, -1490792, -2752938, -2957397, -1473257, -961335, -2585847, -4035139, -3299485, -1471160, -469512, -152906, 848534, 2761440, 4330567, 4167193, 1876600, -1534569, -4173805, -4845496, -4109768, -3150387, -2047912, -249084, 1676072, 2230071, 1019700, -625189, -1234749, -496176, 913276, 1810251, 1074203, -1142454, -3007101, -2925817, -1483726, -246280, 701055, 2231002, 3678179, 3133885, 388572, -2551552, -4296905, -5399824, -6350254, -6404106, -5329546, -4391735, -4462189, -4752957, -4486359, -4291456, -4887019, -5813839, -6404973, -6492439, -5353774, -1917763]
5716a917763M721627K778127o91212j865232n29541j59062k033303l478722k884242
5707f059323k031421j684377O31062N540055Q507409N592995k79227l064210j744487
5698E408476l51715q84032r01136J347485L513124K654925m56946k538217j951797
5689E840167r7465P49655j43389j667906k449067k391182k356699k493762j887034
5680f896682k94174R73778R46209P33632J841369L329532K533675j098449m449479
5671b380589m028558k05418K909705K073530j287208k817893p17660K030154J897424
5662b526513l02978r91217O32652J656723K45923j793825k298277j677469r97702
5653h052683J16190J621062J659286m82617k286783j661849n35253j506777k884696
$$ y = [-1917763, 2803864, 5581991, 4890779, 3025547, 2496006, 2336944, 303641, -3175081, -6059323, -8090744, -9775121, -9144059, -3604004, 4903405, 10496400, 10217173, 7152963, 5408476, 5056761, 4172729, 3271593, 4619078, 8132202, 10787127, 10330181, 7791964, 5840167, 5742702, 6492357, 6348968, 4681062, 2231995, -159187, -2515886, -5009648, -6896682, -7190856, -6217078, -5270869, -4537237, -2695868, 633664, 3167339, 2068890, -2380589, -6409147, -6614565, -3704860, -1631330, -2918538, -5736431, -6454091, -4423937, -2526513, -2829491, -3820708, -3188056, -1531333, -1285410, -3079235, -5377512, -7054981, -8052683, -7936493, -6315431, -4656145, -5138762, -7425545, -9087394, -9622647, -11129424, -14014120]
5644a4014120j199015K461797L284842K9172k955412k151760N50431J558286P15686
5635a1720093L96239J617071L362323M433095M080652J829143j640811m125137
5627a767518l864488j546657O10699J374874J295009J370252J760193J880414
5619A112778J377869P01571M14763R1376j203017l029952l455861j715386L17024
5610e388835O58149r6347l33126k77568r60308j516774m52045J066744M58272
5601f841838j791872k244624L99487L498830M539603L895393K549331L28252k102909
5592B229653k639359j086348k80154j734337k938038j484551Q25855J140873M98427
5583e467979J816556M378716M441353J077587k348684l100037k262045j954397
$$ y = [-14014120, -15213135, -12751338, -9466496, -9437324, -12392736, -14544496, -13994065, -12435779, -11720093, -11323854, -9706783, -6344460, -1911365, 2169287, 3998430, 2357619, -1767518, -5632006, -7178663, -6567964, -5193090, -3898081, -2527829, -767636, 1112778, 2490647, 3192218, 3606981, 3698357, 2495340, -534612, -3990473, -5705859, -5388835, -4730686, -4827033, -5160159, -5437727, -6398035, -7914809, -8366854, -7300110, -6841838, -8633710, -10878334, -10478847, -6980017, -2440414, 1454979, 4004310, 4332562, 2229653, -409706, -1496054, -1776208, -3510545, -6448583, -7933134, -7107279, -5966406, -5467979, -3651423, 727293, 5168646, 6246233, 3897549, 797512, -1464533, -3418930]
5575c418930k032653j251489O8975M77394j84440l60863J092762L267336M149354
5566A807446K900149O16566j235859k317935k730461j848511O23017K956591K802452
5557C573455M38112j358431j081315r9259P2156j76940j41908r5335J92974J714391
5547C037900L501338K488974j662531m443572k305233J811155K516656l35010
5539D609677k386427k011052j708762k227519p55782L186832M918495J098069
5531D723531m277834m581814L38964L943516J808612l085459n214754l776109
5523a0121347k420058k937512k539190J451780O597094P701806L584273j272450
5515D4396k505232r05997j80985j607884l153244k940188j317432M04424J514282
$$ y = [-3418930, -5451583, -6703072, -6634097, -6156703, -6341143, -6702006, -5609244, -2341908, 1807446, 4707595, 5324161, 4088302, 1770367, -960094, -2808605, -2185588, 771003, 3573455, 4011567, 2653136, 1571821, 1472562, 1544718, 1367778, 1225870, 1130535, 1323509, 3037900, 6539238, 9028212, 7365681, 2922109, 616876, 2428031, 4944687, 4609677, 2223250, 212198, -1496564, -3724083, -4479865, -1293033, 3625462, 4723531, 445697, -4136117, -3797153, 146363, 1954975, -1130484, -6345238, -10121347, -12541405, -15478917, -18018107, -16566327, -9969233, -2267427, 1316846, 44396, -2460836, -3366833, -3547818, -5155702, -8308946, -11249134, -12566566, -12162142, -10647860]
5506a0647860J979073K116722K341724K598117K309575J339380K73603o84872
5498A625462j844308k418153p12138K699403M127375J418801k342326k725046
5490a70930j96200R89227n74673j801881l83040K037906L064052K718263J884037
5481G566761L08150j941224l100483j794479P85495K270289J666203l71653k510350
5472B878709l199844j706062M30716N58245j593104l336741k862283j490336p53127
5463a1073827L26660K788156M694592L631549R95903L80610J996365K154113r96973
5454D897148m328832l997982o23145J925210J642460J35022l13985N03287J174753
5445A013936N69447j159228k692149k512608n34570J277778J031692k87482K92196
$$ y = [-10647860, -8668787, -6552065, -4210341, -1612224, 697351, 2036731, 2310334, 1625462, -218846, -2636999, -3349137, -649734, 3477641, 4896442, 2554116, -170930, -367130, 622097, 47424, -1754457, -2137497, -99591, 2964461, 5682724, 7566761, 7874911, 5933687, 2833204, 1038725, 1824220, 4094509, 5760712, 5389059, 2878709, -321135, -2027197, -1596481, -1038236, -2631340, -5968081, -8830364, -10320700, -11073827, -10747167, -7959011, -3264419, 367130, 1363033, 1743643, 3740008, 5894121, 4897148, 568316, -3429666, -4052811, -2127601, -485141, -350119, -664104, -160817, 1013936, 1583383, 424155, -2267994, -4780602, -5315172, -4037394, -3005702, -3293184, -3000988]
5436c000988L424237N848429M536403Q68870j401745j220569o77871r68871r17420
5427F490475J29982P68815j21337j758331l095820l960405l835778j952980N31823
5418f803556J156210L3542J04249K172080L248804J862916R98486K575215K980165
5409H328111j370422p128243p977954l533646J039969K912225L623959M039437
5401f6564K905593N38778j165682k547993n036682o405901l025124K786079M181270
5392g836226M4326k822616k82689L023631J953652r85381r43644R14067M46386
5383f488494j665239j452400J182807K802543K733290L454000M998080M091360
5375I655947l87397n050513o167974l501707N09993L139962K863205N61216q86177
$$ y = [-3000988, 423249, 6271678, 10808081, 11676951, 10275206, 9054637, 8376766, 7407895, 6490475, 6620457, 7389272, 7267935, 5509604, 2413784, -1546621, -5382399, -7335379, -6803556, -5647346, -5613804, -5509555, -3337475, -88671, 1774245, 2772731, 5347946, 8328111, 6957689, -170554, -8148508, -11682154, -10642185, -7729960, -4106001, -66564, 2839029, 3377807, 2212125, -335868, -5372550, -11778451, -14803575, -12017496, -7836226, -7791900, -10614516, -10897205, -7873574, -5919922, -6905303, -7848947, -6934880, -6488494, -8153733, -9606133, -8423326, -5620783, -2887493, 566507, 5564587, 9655947, 9268550, 4218037, -1949937, -5451644, -4941651, -1801689, 1061516, 1622732, 736555]
5366G36555l7087P80605j229077m567600m914547j271805K309066J981618j116926
5357g329198k676751o71166K364639K678396K43625r91422J337516L939776K183145
5348A078560k438840l464934J153330N553858M226204o09304l444758l462654
5340a408538l427243l498145j610235J363858K140495M54647o40289j773L00563
5331f326660p28336j444822j030310q37832j253447n41898J857217L687662K966504
5322c651922N76786j356138j895741j341092n07809m69073j487569k098558q98705
5313a3129821R93104J301936J71354l8697J446541K759534K499823J471866P56100
5304a768260L17440J94875Q98635J810716J222920j012694k589744j646685O82758
$$ y = [736555, 699468, 1480073, 250996, -4316604, -9231151, -10502956, -8193890, -6212272, -7329198, -10005949, -10677115, -8312476, -5634080, -5390455, -6381877, -5044361, -1104585, 1078560, -1360280, -4825214, -3671884, 1881974, 6108178, 5498874, 2054116, -1408538, -4835781, -8333926, -9944161, -8580303, -6439808, -5985161, -6625450, -6627223, -6326660, -7054996, -8499818, -9530128, -10367960, -11621407, -12163305, -10306088, -6618426, -3651922, -3075136, -4431274, -6327015, -7668107, -8175916, -8644989, -10132558, -12231116, -13129821, -12136717, -10834781, -10663427, -10702124, -9255583, -6496049, -3996226, -2524360, -1768260, -1450820, -1255945, -357310, 1453406, 2676326, 1663632, -926112, -2572797, -1890039]
5295a890039J698289M21824j313072r32864J819244M111783L143583j34237k264705
5286D659806k485030l666409o653968p409524l055154K511401L676298J484806
5278a0937774J481111M405364N225199J824311j429928p24667J745934K126964
5270C716514O05614l52687l92931p50243j421073j561216j290487j071761n62931
5261c081201L37152N82202n34530k139771k999732k803010j630462M09615K465649
5252i394088L342108L035324K440868J535500k95265k143519j998211M25492L217979
5243A66188M684034M339294K043355j360703l151371j553978R30529M17412k470982
5234D043778l532531j771064p32291k315044l894720l169507j564794q19330j02546
$$ y = [-1890039, -191750, 230074, -1082998, -2015862, -196618, 3915165, 7058748, 6924511, 4659806, 2174776, -1491633, -8145601, -15555125, -18610279, -16098878, -12422580, -10937774, -9456663, -5051299, 173900, 1998211, 568283, -156384, 1589550, 3716514, 4322128, 3969441, 3576510, 2826267, 1405194, -156022, -1446509, -2518270, -3081201, -2744049, -2161847, -2696377, -4836148, -7835880, -10638890, -12269352, -11859737, -9394088, -6051980, -3016656, -575788, 959712, 664447, -1479072, -3477283, -3051791, 166188, 4850222, 9189516, 11232871, 9872168, 6720797, 5166819, 6097348, 6514760, 4043778, 511247, -1259817, -1992108, -4307152, -8201872, -11371379, -12936173, -13755503, -13858049]
5225a3858049J260494J743639N64011m66980j8815Q40726J346952K294148L188141
5216c105733K042533l33158j51768L152350N039767K693088q78282k378764k902448
5207C177585l596770j968680K745232N394652J907640l369442l488125R30526
5199A732618L613822K351518K83871r13230k470487l734179k263878R78053K081035
5190A659143L78493p88846J9994N51611l48659r23292n19512r12969k300644k213454
5180e398135m0966J298731J27323j142216j89336J295208N83923j468920j698423
5171f632811O18380K855556K750775J150051M02813R74356R23213q75152k344469
5162a77288q98721K164781K835131K46509k028318j742327j232690k606684l514833
$$ y = [-13858049, -12597555, -10853916, -10289905, -10756885, -10775700, -9934974, -8588022, -6293874, -3105733, -1063200, -1396358, -1548126, 1604224, 6643991, 9337079, 8458797, 6080033, 3177585, -419185, -2387865, 357367, 5752019, 7659659, 4290217, 802092, 1732618, 5346440, 7697958, 7981829, 7068599, 4598112, 863933, -1399945, -421892, 1659143, 2037636, 1248790, 1268784, 1820395, 1471736, 548444, 28932, -884037, -3184681, -5398135, -5439101, -4140370, -4013047, -5155263, -5344599, -4049391, -3465468, -4934388, -6632811, -6014431, -3158875, -408100, 741951, 1144764, 2119120, 3042333, 2167181, -177288, -1076009, 1088772, 3923903, 4170412, 2142094, 399767, -832923, -3439607, -6954440]
5153f954440j290527J894216K291416N65695L05O27333o7347j848241j948947
5144f730537K4369J760551K286764K286051J201806j636748l817137k478403M26864
5135f676420M45235k158213k806572l22193J454250O49145K70268K303586M038529
5126b802385K749690j77799k157076k743841k095756J83983K685799K435782l63030
5117b284633j541411P73234K871490J245281j896992k364851m07207M83140n39599
5108c661548q19554J135163L123384K107801j708249m448961k620589K267820
5100d624733M633528J822920j806611p95264L256267M001984P6829l016044j556736
5091A992140J377135J686286R7047p78431j100547k036127k538239j393695o2001
$$ y = [-6954440, -8244967, -6350751, -4059335, -3493640, -3493335, -2866002, -2933349, -4781590, -6730537, -6706168, -4945617, -2658853, -372802, 829004, -807744, -4624881, -7103284, -6676420, -6231185, -8389398, -11195970, -11518163, -10063913, -9414768, -9144500, -6840914, -2802385, -52695, -230494, -2387570, -5131411, -7227167, -7043184, -4357385, -1921603, -2284633, -3826044, -3052810, -181320, 1063961, -833031, -3197882, -3605089, -3121949, -3661548, -4481102, -3345939, -222555, 1885246, 176997, -4271964, -6892553, -4624733, 8795, 1831715, 25104, -770160, 2486107, 6488091, 6564920, 3548876, 1992140, 3369275, 5055561, 5152608, 4374177, 3273630, 1237503, -1300736, -2694431, -2756432]
5082b756432k69466p65796N45029K830254L396473J460782j187511k414538j428885
5073e90090N87408J003918j349789l758440k759739L58941R90489j407394k127745
5064i052441R61842L551311J883896j113736q82542J417949J504815p38590j670832
5055d138328j98944J040087M30041o12336n99221K1270K47332p7637n02677m83803
5045d874216J05415N24167J88565J90730J888263L892052L249515J55224j852468
5036C467247j379183j086650k586274l536095k138706m51153k83353K62228K684851
5027e047088M242158K241405j030046j898551j001194j037548j446181m4872K066827
5018b955090K036969K52130o49399m75801r04268j452240m38303R82844J82551
$$ y = [-2756432, -3025898, -3791694, -3246665, -416411, 2980062, 4440844, 3253333, 838795, -590090, -2682, 1001236, -348553, -4106993, -6866732, -6507791, -5517302, -6924696, -9052441, -8090599, -4539288, -2655392, -3769128, -4651670, -3233721, -1728906, -2467496, -4138328, -4337272, -3297185, -2867144, -3479480, -4078701, -4057431, -3810099, -3887736, -4390413, -4874216, -4768801, -4244634, -4056069, -3865339, -1977076, 1914976, 5164491, 5319715, 3467247, 2088064, 1001414, -1584860, -5120955, -7259661, -7710814, -7994167, -7731939, -5047088, -804930, 1436475, 406429, -1492122, -2493316, -3530864, -4977045, -5021917, -2955090, -918121, -665991, -1315390, -1791191, -2695459, -4147699, -4586002, -3603158, -3420607]
5009c420607k100823k556962p18740M44007n79222k008496k094066j068276M36321
5000a3666864K070886K767040J630490j57356o11554J11586J81775q68177j590297
4991a0132471p59912J469426L880595M609226K619739l18574j214492k62985o02406
4982g11854k512076k149395J543925L544908L24121l766529k828432J496718L054993
4973b003621N98536j780211j780807p18219M75922J708860J304747j802097m588166
4964h585056l552688m95688K72072j036240q32031J027272J386104O960j15445
4955a1924740J565206K458588J759733J231783J293830Q06516K27451P48893J310325
4946e22415N84394J65436J387517J554975j461856l958406j979887J027289m24587
$$ y = [-3420607, -5521430, -8078392, -8797132, -8353125, -8932347, -10940843, -13034909, -14103185, -13666864, -11595978, -8828938, -7198448, -7355804, -7967358, -7855772, -7673997, -8542174, -10132471, -10892383, -9422957, -5542362, -933136, 1686603, 1368029, 153537, -109448, -711854, -3223930, -5373325, -3829400, -284492, 39629, -3726900, -6555332, -5058614, -2003621, -1405085, -3185296, -4966103, -5684322, -5208400, -3499540, -2194793, -3996890, -8585056, -12137744, -12633432, -12361360, -13397600, -14229631, -13202359, -11816255, -11809295, -11924740, -10359534, -7900946, -6141213, -4909430, -3615600, -2809084, -2581633, -1832740, -522415, 61979, 227415, 1614932, 3169907, 1708051, -2250355, -4230242, -3202953, -3627540]
4937c627540l792850k473753K256326K915167j359591l622827j257548N08181
4929a0454435j171902k318612m09702J304161O47214K40415J632510K373719J224930
4920f931702K10978O8334m35520l91757J547900K097406k349966p466017o078062
4911a9728406m66032P76308k495399k135277L015586M852819Q47034j910812m40167
4902a7684346n65674m142100m711265m51200J462955j649199k961573M25144K165865
4893b8111393k29919o40202K343061J772177l062847m003555o88522k330286q156273
4884d3107759o529028R73036j133676j1604912j0124064L603920K794327j7616702
4876h2744858k5574146j2101518k0240308o8017427q6517813m925633J25811717
$$ y = [-3627540, -7420390, -9894143, -7637817, -4722650, -6082241, -9705068, -10962616, -10454435, -11626337, -13944949, -14354651, -13050490, -12403276, -12162861, -10530351, -8156632, -6931702, -6720724, -6652390, -7087910, -7479667, -5931767, -3834361, -6184327, -13650344, -19728406, -20194438, -19418130, -21913529, -24048806, -21033220, -16180401, -15333367, -17244179, -17684346, -18250020, -22392120, -27103385, -27554585, -26091630, -27740829, -30702402, -30277258, -28111393, -28341312, -28981514, -26638453, -24866276, -27929123, -31932678, -32621200, -34951486, -43107759, -49636787, -48663751, -49797427, -61402339, -71526403, -67922483, -65128156, -82744858, -108319004, -120420522, -140660830, -208678257, -295196070, -300121703, -174309986]
4869a74309986J75273089J01747210J351806k9327851o038475L964449j0342425
4862F2317817j3986212j347945J486971q939826j0373526O52794M731561k384285
4854C2157349m504844K351477M193796k670190o017878k527264k591002p769406
4846A2622038p162025N54960L590187q72528j967012L383241M543954j988400
4838A2704415n044814J178753O985058M626637K41863M60075J259212j556000
4830B0855199l377767o30576J470497j087030l333250j009553J261184j102701
4822A3046003m043362k496294R21214J749291J341261K211687K163000o87403
4814A4205397k865485j379546Q04358M22307l29313J210303K735568J668732K86208
$$ y = [-174309986, 963103, 102710313, 104062119, 74734268, 68695793, 72660242, 62317817, 48331605, 46983660, 48470631, 39530805, 29157279, 29810073, 34541634, 32157349, 27652505, 30003982, 34197778, 31527588, 25509710, 22982446, 20391444, 12622038, 5460013, 6014973, 9605160, 8732632, 6765620, 10148861, 14692815, 12704415, 7659601, 8838354, 15823412, 20450049, 20691912, 21151987, 22411199, 20855199, 17477432, 16846856, 18317353, 17230323, 13897073, 12887520, 14148704, 13046003, 9002641, 6506347, 7427561, 9176852, 10518113, 12729800, 14892800, 14205397, 11339912, 9960366, 10764724, 11187031, 10857718, 12068021, 14803589, 16472321, 16758529]
4805A6758529J128935J930429o8582l017493l997641l508905k730448q93986J192819
4796F793657K89835k960682k802958K217116N020080P38379m572892k969713K908614
4787D661436M469832N80335k143768o06832J348667O93565o47829n45596j27560
4778G682250q77268k022015k196938j350850l47688r2704p39235q97438R02150
4769F0264L158980K474402r71396k490249K97608L494379K969262O40600N64018
4760A0197868J981546J226910j648255l233895k506644j581239j437298j024717
4752A974276k05795k3206m02164m92280n23017p87891k60579J116766Q98072j881956
4742e87774l640749j160986K824698L653138K119646K324920L855203K593215
$$ y = [16758529, 17887464, 19817893, 19749311, 16731818, 12734177, 9225272, 6494824, 5600838, 6793657, 7083492, 4122810, 1319852, 3536968, 8557048, 9295427, 4722535, 1752822, 4661436, 9131268, 9711603, 7567835, 6961003, 8309670, 9003235, 8355406, 7809810, 7682250, 6804982, 4782967, 2586029, 1235179, 887491, 794787, 55552, -841886, 60264, 3219244, 5693646, 4722250, 2232001, 2529609, 6023988, 8993250, 9633850, 10197868, 12179414, 13406324, 11758069, 8524174, 6017530, 4436291, 2998993, 1974276, 1768481, 1745275, 1343111, 850831, 327814, -460077, -720656, 396110, 1294182, -587774, -4228523, -5389509, -2564811, 1088327, 3207973, 5532893, 9388096, 11981311]
4734A1981311j172494k334270L71151J843245j025169m284688l373374J40523
4726B146235J902442J207137L59210K30140o317l68539k08085K45290N11584Q36656
4716F855753J072484K25379j429371j744634M4942J440248R9728k622805l773139
4707A68585k852181j418685o8878J492032K358953J332715m07676l06200J724064
4698B022729K962238J878453J12304m49829m10728j202514k313406k032579j61923
4689D04745J720433K405634K047951J150124r0087j297420j963474k195269k397696
4680b15059k162223p81268R86406J371370L52538l0249Q10542M64366k512390
4671a715967n202975l897537L04956K930245K518491J836253K687324L514299
$$ y = [11981311, 10808817, 8474547, 8845698, 10688943, 9663774, 5379086, 2005712, 2146235, 4048677, 5255814, 5615024, 5845164, 5838847, 5470308, 5262223, 5507513, 6019097, 6855753, 7928237, 8153616, 6724245, 4979611, 5024553, 6464801, 6564529, 3941724, 168585, -2683596, -4102281, -4171159, -2679127, -320174, 1012541, 604865, 298665, 2022729, 4984967, 6863420, 6975724, 6525895, 6115167, 4912653, 2599247, 566668, 404745, 2125178, 4530812, 6578763, 7728887, 7638800, 6341380, 4377906, 2182637, -215059, -2377282, -3158550, -2172144, -800774, -448236, -478485, 332057, 796423, -1715967, -6918942, -10816479, -10511523, -7581278, -5062787, -3226534, -539210, 2975089]
4663B975089L051131K443573K132646L52181l028667m618915k348155P23006P00513
4654B382402j439844j952076j53047J608494K358590K913211K740862M58233k634730
4645F282095l287520j053521R46450O88900k93885k4818J029924J411631R08475
4636F607731J12955p23998j439177j714793j634830j509483j123320k81740K66612
4627a440043n8656j83849J055007K347520J307945j665792l514818k791189j210260
4618f154135l43264N44788K198019L378172K859834J581642J073588J154497Q76404
4609G169545N40365Q93895J148679r6067k099837k295788j26888J275820r19589
4600E490135m577872m660592l66571K958761J173532k388424j921330J724664
$$ y = [2975089, 6026220, 8469793, 10602439, 10954620, 7925953, 3307038, 958883, 1681889, 2382402, 942558, -1009518, -1162565, 445929, 2804519, 5717730, 8458592, 8916825, 6282095, 2994575, 1941054, 2887504, 3576404, 3282519, 3257701, 4287625, 5699256, 6607731, 6720686, 5996688, 4557511, 2842718, 1207888, -301595, -1424915, -1706655, -1440043, -1498699, -1682548, -627541, 1719979, 3027924, 1362132, -2152686, -4943875, -6154135, -6497399, -5952611, -3754592, -376420, 2483414, 4065056, 5138644, 6293141, 7169545, 7709910, 8603805, 9752484, 9656417, 7556580, 5260792, 5133904, 6409724, 5490135, 912263, -3748329, -4114900, -1156139, 17393, -2371031, -4292361, -2567697]
4592b567697K559264m37836j570412J517199L197090o54243m969662l253200K063661
4583d115836M023248K041654P68003Q97721n49996k423154o70055K977480K381986
4574E331051k237554l795824k99436J704936j329293l816619j013901K905688
4566b550952K524895J41470O54651K987459L141432J470744P25547M88285p55459
4557H828072j464399l20268k8124k434147l735718n05803L345585K303828j437219
4548D551807j668562J486888K602269N57641o73413k357l83086k054831j831386
4539B584970L54953Q54766j063081k224461j792835k213627l218229j414919K885412
4530e247051M862357K929184J156373K002625K638204Q42207j214820j683117
$$ y = [-2567697, -8433, -446269, -2016681, -499482, 2697608, 2043365, -2926297, -6179497, -4115836, -92588, 1949066, 2717069, 3614790, 3064794, 641640, -28415, 2949065, 5331051, 3093497, -702327, -1001763, 703173, -626120, -4442739, -5456640, -2550952, -26057, 115413, 770064, 3757523, 6898955, 8369699, 9095246, 9583531, 8828072, 7363673, 7043405, 7015281, 4581134, 845416, 339613, 3685198, 5989026, 4551807, 2883245, 4370133, 6972402, 7530043, 6856630, 6854273, 6471187, 4416356, 2584970, 2939923, 3794689, 2731608, 507147, -1285688, -3499315, -6717544, -8132463, -5247051, -384694, 2544490, 3700863, 5703488, 8341692, 9183899, 7969079, 6285962]
4522F285962k031433k677542j155253K380189L387387K26053k141053J43015L380432
4513G797757K300926j787365l939549l218124k182044j392424L59524K061452
4505A53J549477l32688o74984R60226K199085J540753k07614j561327j514741
4496A958340p5718J006706k43825k685386k818973j93772J409264J42483o91880
4487b192761J362538K993011N50479l299206l656586j325982q37908k373911j882716
4478a0663042J327548L224833J959384P15048K064842L908117L155331K13581
4470E905642k293393l075696k792520k542301k702417k384817j56221L574759
4462f466964N771747M215327P90859r27638m41251j6598m57186l87840M56688
$$ y = [6285962, 4254529, 1576987, 421734, 2801923, 6189310, 6415363, 4274310, 4417325, 7797757, 10098683, 8311318, 4371769, 1153645, -1028399, -2420823, -2061299, 153, 1549630, 1216942, 541958, 1502184, 3701269, 5242022, 5034408, 3473081, 1958340, 1882622, 2889328, 2645503, -39883, -2858856, -3052628, -1643364, -1500881, -2192761, -830223, 2162788, 2713267, -585939, -4242525, -5568507, -6406415, -8780326, -10663042, -9335494, -6110661, -4151277, -3436229, -1371387, 2536730, 5692061, 5905642, 3612249, 536553, -2255967, -4798268, -7500685, -9885502, -10041723, -6466964, -695217, 3520110, 4310969, 3383331, 2942080, 2925482, 2468296, 2080456, 2537144]
4453B537144M93652o98943j411411n18029J056763K056604K126665J178395m92414
4444F328426j444477n08488J059394R17901r42735k251299j837241p89303k68375
4435B63803k96711p21866j381827j430851l98631M91961M4962o22175J81373J649829
4425b220133J940451J721559K859092M241132K887709p52874k724516j473252
4417F479168Q8416m20624j535971j302643n90585q99335j401042l60303K109001
4408B166082M192874M093816J155212l133736n412962l951768j426855j318624
4400c635961k267195j43406M449359N960736K337451j650752j804973j40902l2277
4391C072080n31274L89077J068998n73925k230800p07054K153415K172363k52349
$$ y = [2537144, 3030796, 2331853, 920442, 402413, 1459176, 3515780, 5642445, 6820840, 6328426, 4883949, 4375461, 5434855, 6352756, 5410021, 3158722, 1321481, 532178, 263803, -32908, -754774, -2136601, -3567452, -3966083, -3474122, -3429160, -4051335, -3869962, -2220133, -279682, 1441877, 4300969, 8542101, 11429810, 10676936, 7952420, 6479168, 6567584, 6146960, 4610989, 3308346, 2717761, 1818426, 417384, 57081, 2166082, 6358956, 10452772, 11607984, 8474248, 3061286, -890482, -2317337, -3635961, -5903156, -6046562, -1597203, 4363533, 6700984, 5050232, 3245259, 3104357, 3072080, 2540806, 2929883, 3998881, 3424956, 1194156, 487102, 2640517, 4812880, 4560531]
4382D560531j111450L65661R88179m70651j490797n13878P73800Q13291L35967
4373D250653K33478K55571M96027J341063J551686n13757l315452l191313J02752
4364A210708K388070R78169j793777k778142k355599k058780r98730J849690M058305
4355D99914K505136j330468k815971p40684J353073R44656j06935N00336J555058
4346B364115Q31406q83591j316809p93442j522275l359888l566497j142957J488181
4337g901757K043978J160736M75367J95244L3685N61937J917163K795923K388182
4328C670458J767545J768212J264147n21183j854337j044838M56504J71053j575096
4319D102465k684120k779737k661275j662735R49086L113143K419840N24007Q25499
$$ y = [4560531, 3449081, 3814742, 4802921, 4332270, 2841473, 2327595, 3101395, 3914686, 4250653, 4484131, 4739702, 5235729, 6576792, 8128478, 7614721, 4299269, 1107956, 1210708, 3598778, 4576947, 2783170, 5028, -2350571, -4409351, -5408081, -3558391, 499914, 3005050, 1674582, -1141389, -1882073, -529000, 415656, 308721, 809057, 2364115, 3195521, 2311930, 995121, 201679, -1320596, -4680484, -8246981, -9389938, -7901757, -5857779, -4697043, -4221676, -4026432, -3992747, -3430810, -1513647, 1282276, 3670458, 5438003, 7206215, 8470362, 7949179, 6094842, 5050004, 5506508, 5677561, 4102465, 1418345, -1361392, -4022667, -5685402, -4736316, -1623173, 796667, 1320674, 2146173]
4310B146173K416883J319915k254856l445955o33464J780939O11916j359303q47073
4301b64825N58451K51385l05308J207946K882561J485097j667571k377609M4611
4292A814738K199681J857923K27335q76704j147472r68012p28838j020484j940798
4283e82631k510650j914486o04427O52825J589416J644732K37373j407160j102156
4274c997164O74968R44844p34386j006114J510444L219028J385512r12635L04293
4265A388790L387414M020283J993402J58276j104932l143755m463924k442197
4257b06643J226186K111224k01113j890469j279605m80183n49989n2157R20518
4248d02231K12010j798916j783289P93654J973046n44760l515121k998361J11160
$$ y = [2146173, 4563056, 5882971, 3628115, 182160, -451304, 1329635, 1941551, 582248, -264825, 293626, 545011, 239703, 1447649, 4330210, 5815307, 4147736, 1770127, 1814738, 4014419, 5872342, 6099677, 5222973, 4075501, 3107489, 2378651, 1358167, -582631, -3093281, -5007767, -5612194, -4959369, -3369953, -1725221, -1487848, -2895008, -3997164, -3322196, -2377352, -3111738, -4117852, -2607408, 611620, 1997132, 1084497, 1388790, 4776204, 8796487, 10789889, 10948165, 9843233, 6699478, 2235554, -206643, 1019543, 3130767, 2929654, 1039185, -240420, -720603, -1270592, -1322749, -402231, -190221, -1989137, -3772426, -2978772, -1005726, -1550486, -5065607, -8063968, -7952808]
4239g952808K151940J871714Q51100L91635L86717M61910N65585Q62250J778959
4230A369002L416189M571029L485806J03546l341212m461305k958659p31022r2081
4221A361293j475418k752878j817271J95210K38414j767656k305998K60679K889516
4212e174109K693260J260502J257571J932233J544765J293777K741157L954134
4204A1503290K550049J50498o84702j340130l865013n464976k432152K280274
4196B697138K196921k693469n808999l940063q60411j58858n92184j84554L26372
4187i018107R7055P2106O70833Q91232N71729O24941R13618O01639o0072q00763
4177e435789k337781l647583j513189L605988N643033J757557k007286j78524
$$ y = [-7952808, -5800868, -3929154, -3078054, -2686419, -2299702, -1837792, -1272207, -409957, 1369002, 4785191, 9356220, 12842026, 12945572, 9604360, 5143055, 2184396, 1453374, 1361293, -114125, -2867003, -4684274, -4489064, -4250650, -6018306, -8324304, -8063625, -5174109, -2480849, -1220347, 37224, 1969457, 3514222, 4807999, 7549156, 11503290, 14053339, 14203837, 13519135, 12179005, 8313992, 2849016, 416864, 2697138, 4894059, 2200590, -3608409, -7548472, -8408883, -8567741, -9159925, -9344479, -9018107, -8921052, -8848946, -8178113, -7286881, -6715152, -6090211, -5176593, -4574954, -4635026, -5435789, -7773570, -11421153, -12934342, -9328354, -3685321, -1927764, -3935050, -4113574]
4169d113574K798954P65895k595193o84803K907244L58706n534596n775832j236067
4160a3109266j72852k311778o18513L158458J301434l090194l41352N710577K271751
4151g201735p548851p345678L077210O225586r02544j669373O050407K947222
4143f367756j2585512j4732327J455729K568357k1998895k3365747L4463744R8394152
4135E7831745Q5001860J180635o0034529m6468761m984653L953813j1719871j3047595
4127A1712644r4502J241436p975391n976284O435041Q716628j177802n372296
4119G509474P92301L729457j131412l075736J443268K786640k278880m454483
4111E320629M75458M382143J650658k470007k597953p37639M01429J556799J779659
$$ y = [-4113574, -1314620, -548725, -3143918, -3828721, -921477, -562771, -6097367, -11873199, -13109266, -13282118, -15593896, -16212409, -13053951, -11752517, -14842711, -15184063, -9473486, -7201735, -14750586, -22096264, -19019054, -12793468, -13696012, -15365385, -9314978, -6367756, -18953268, -33685595, -32229866, -29661509, -51660404, -75026151, -40562407, 57831745, 142833605, 144014240, 83979711, 37510950, 32526297, 36480110, 24760239, 11712644, 11618142, 12859578, 4884187, -1092097, 5342944, 14059572, 12881770, 7509474, 8301775, 12031232, 10899820, 7824084, 9267352, 12053992, 9775112, 5320629, 5796087, 10178230, 11828888, 9358881, 6760928, 6023289, 6424718, 7981517, 9761176]
4102I761176j667454o281228n746521M1694M363158M041962K563075K163770Q67318
4093A0106950j494120j889039q8207N92504n91121j151945r83291k258362l846934
4084a603565k444047Q49086J739232K75682K64245J491353N3492l349333l309319
4075f033174R80546L810501K035171q57540j568308j222341q06806J134583L875302
4066A347934L611704k24455l198721k771828j674388k111510j993945L04615K404544
4057d306050K119768Q89996L06852o95381k578720l102865j192455O70392M75013
4048g413450k02986N29175J681341J729501J206680Q72463J45065p80560j63071
4039b395842K090160L327628K103220M59146M49885J077319N62995p97589j873502
$$ y = [9761176, 8093722, 1812494, -3934027, -3892333, 470825, 4512787, 7075862, 9239632, 10106950, 8612830, 6723791, 6635584, 7228088, 6636967, 5485022, 4501731, 2243369, -1603565, -4047612, -3198526, -1459294, -1183612, -919367, 571986, 625478, -2723855, -6033174, -5052628, -1242127, 793044, -64496, -1632804, -2855145, -3661951, -2527368, 1347934, 4959638, 4735183, 1536462, -1235366, -2909754, -5021264, -7015209, -6710594, -4306050, -2186282, -1296286, -989434, -1684815, -4263535, -7366400, -8558855, -7888463, -7413450, -7616436, -7087261, -5405920, -3676419, -2469739, -1597276, -1452211, -2232771, -2395842, -305682, 3021946, 5125166, 5584312, 6034197, 7111516, 7674511, 6876922, 5003420]
4030E003420k582591k930240k219834o24629L43245K4301n22248m62418o519R71538
4020c005975K717247L780326K194399j087246k737781j566789K19140O44775Q9627
4011A247723m83353o19793L50915K231178K521533n30543m028387l644186k47165
4002c202078J396226K75675M0742J951862K946737J884435J488885K177708L62979
3993I323171m291688o250272k525054K043186K234605j24398q72554n83999j561687
3984b608690k219463l28359J753735R68027n29656P01966K565298J047223j798334
3975d48253o69120L544633M562598Q98021j949434o38627J293578J24495k299193
3966D418698k603793j364628j160922k075588k155757n49153J981425M276538
$$ y = [5003420, 2420829, -509411, -2729245, -3353874, -3010629, -2986328, -3508576, -3970994, -3977513, -3005975, -288728, 3491598, 5685997, 4598751, 1860970, 294181, 513321, 1158096, 1247723, 764370, 144577, 495492, 2726670, 5248203, 4717660, 689273, -2954913, -3202078, -1805852, -1530177, -1489435, 462427, 3409164, 5293599, 6782484, 8960192, 9323171, 5031483, -1218789, -3743843, -1700657, 533948, 409550, -463004, -1047003, -2608690, -4828153, -5156512, -3402777, -2434750, -2964406, -2262440, 302858, 1350081, -448253, -1117373, 2427260, 6989858, 7887879, 5938445, 5299818, 6593396, 6717891, 4418698, 1814905, 450277, -710645, -2786233, -4941990, -5491143, -3509718, 766820]
3958G66820N142367L964312J892424Q07526N18756r64454l677465m675194k123475
3949A651617J736372L446936K467934O22239j136765l110668m642864l934527
3941b899726o84261K623777L208845J239508m50513P1867J590358J708738J48482
3932F557075j294943j637938j660166j748683r16849J000706K110350J065441
3924C474993n41607k95868J532015K544433J646540K6132r62615j170840j027539
3915E225644r65214j336368j763166j064536Q87701K022326O01442j684805j483001
3906D40023J325320K998861J104841j897475j968393R75660K969354J221501k458309
3897D711383m180735k696844k97296N96087J66354j3887M37709P14849O97786
$$ y = [766820, 5909187, 9873499, 11765923, 12573449, 13092205, 12127751, 8450286, 3775092, 1651617, 3387989, 6834925, 9302859, 9925098, 8788333, 5677665, 1034801, -2899726, -3583987, -960210, 2248635, 3488143, 3037630, 3109497, 4699855, 6408593, 6557075, 5262132, 3624194, 1964028, 215345, -701504, 299202, 2409552, 3474993, 2933386, 2637518, 4169533, 6713966, 8360506, 8386638, 7424023, 6253183, 5225644, 4260430, 2924062, 1160896, 96360, 984061, 3006387, 3607829, 1923024, 440023, 1765343, 4764204, 5869045, 3971570, 2003177, 2978837, 5948191, 7169692, 4711383, 530648, -2166196, -2463492, -1867405, -1701051, -1714938, -1277229, -562380, 135406]
3888A35406J168664K177608K652673J927421N25694p54651j474436j296730l62245
3879D699404J42828p55712k095475k198528j445240j663983k726346k402659j32895
3870h578606J926605K572823L164365M050403K770481j599492n256403m261006
3862e210830k89759J844073J063838O02029K254174L863618L029257K72387k399400
3853E029387l817132l688170k144917j41889R59654Q33791L86999M08686Q85226
3844a288365J494703J815516J278440j20048j357251j535969j058494q05773q08735
3835b385976o68076m82255l24506K64973J147306J105517j10772n35959J367294
3826f22454L850600L816355J065369j419760j221125J145500L345539L261020
$$ y = [135406, 1304070, 3481678, 6134351, 8061772, 8587466, 7832815, 6358379, 5061649, 4699404, 4842232, 4086520, 1991045, -207483, -1652723, -3316706, -6043052, -8445711, -8578606, -6652001, -4079178, -914813, 3135590, 5906071, 4306579, -949824, -5210830, -5500589, -3656516, -2592678, -1990649, 263525, 4127143, 7156400, 7428787, 5029387, 1212255, -2475915, -4620832, -4762721, -3803067, -2969276, -2582277, -2173591, -1288365, 206338, 2021854, 3300294, 3180246, 1822995, 287026, -771468, -1577241, -2385976, -3054052, -3536307, -3860813, -3595840, -2448534, -1343017, -1453789, -1989748, -622454, 3228146, 7044501, 8109870, 6690110, 5468985, 6614485, 9960024, 13221044]
3818A3221044L39642l636811n525158l826923k61146K521034L653326L429857
3810I914865J716676j132158l259510l352149k481910j959606j006469J059433
3802e00828K188349K93434k875070l950636k823648j706627o32877J748345L691598
3793d567960J786162k774195m419606j023790L119935L939582K767283K415990
3785A243401K206485L52010j725161j249201J401338L192540K452038P9300k219860
3776E732890k995201j514594J073433K220026J135578J7465N92989J280541q5195
3767G457932k338579k418329J80040K827787L208982J343659j412631l532253
3759E316608l795523k298819q02740p74286j516253j410540j87975J450170L376047
$$ y = [13221044, 13560686, 9923875, 4398717, 571794, 310648, 2831682, 6485008, 9914865, 11631541, 10499383, 7239873, 3887724, 1405814, -553792, -1560261, -500828, 1687521, 1980955, -894115, -4844751, -7668399, -9375026, -10007903, -8259558, -4567960, -2781798, -5555993, -9975599, -10999389, -7879454, -3939872, -1172589, 1243401, 3449886, 3801896, 2076735, 827534, 2228872, 5421412, 7873450, 7952750, 5732890, 2737689, 1223095, 2296528, 4516554, 5652132, 5669597, 6262586, 7543127, 7457932, 5119353, 2701024, 2881064, 5708851, 8917833, 10261492, 8848861, 5316608, 1521085, -777734, -1580474, -2354760, -3871013, -5281553, -5469528, -4019358, -643311]
3750f43311N257030N262570K162992j694803k439877o4297J158140j253929m254361
3741C490154l633307j804K334470J440629k23470J36792K150872L577547L032386
3732A2304269M26172l467382o564965o300425k660916R58667J867278J680054
3724a757248L338149N799269N214591J169042k110233j671495N57789J502998
3716A2042862R03577l43669k457895m842572m922904j957338O49324J20687j189275
3707a997203J70295K692806K485880P1851n53690J199891J829528r6918k080281
3698C722159k464646k347792k048242l92320J548789R15399j377639o31816L976070
3689H99962O787585L743478j474948l071145j030652P15236Q41633Q40284Q38679
$$ y = [-643311, 4613719, 9876289, 12039281, 10344478, 7904601, 7840304, 8998444, 7744515, 3490154, -143153, -144957, 2189513, 3630142, 3406672, 3543464, 5694336, 9271883, 12304269, 12730441, 9263059, 2698094, -3602331, -6263247, -5304580, -3437302, -1757248, 1580901, 7380170, 12594761, 13763803, 11653570, 9982075, 10539864, 12042862, 12946439, 12602770, 10144875, 5302303, 379399, -1577939, -928615, -807928, -1997203, -1826908, 865898, 3351778, 3423629, 2869939, 4069830, 5899358, 5802440, 3722159, 1257513, -1090279, -3138521, -3530841, -1982052, -1066653, -2444292, -3076108, 899962, 7687547, 11431025, 9956077, 6884932, 5854280, 6569516, 7411149, 8251433, 9090112]
3680I090112l64022k199876k932830k560627k172098j472503J92923J492308P55886
3671a70727r48157j240483j21870N18772K94482L78563P64988L40637n61641l83238
3661a128674Q70202J448624N99792n55771r54872n86722L22111J335348J240045
3652B590083o63360k802438k729409l74419J753604J782802M53663l06913M12650
3643A16263J917107K696090J862484K76526l47657J12627j47098j924454l342936
3634A218952k598283q27576k04309m09346N26121K514978L170366J380023j056281
3625C714645j881963r05280M66852J100412J026730R82045J226027Q69496r28747
3616E670217l080684l337792j492790n7056o64767j660912r06836P31387Q68020
$$ y = [9090112, 8726090, 6526214, 3593384, 1032757, -1139341, -2611844, -2418921, -926613, -170727, -1118884, -2359367, -2481237, -1962465, -1667983, -1289420, -524432, -183795, -745436, -1128674, -258472, 1190152, 1789944, 1234173, 279301, -307421, 14690, 1350038, 2590083, 1926723, -875715, -3605124, -3979543, -2225939, -443137, 10526, -296387, 116263, 2033370, 4729460, 6591944, 6868470, 6520813, 6633440, 6486342, 4561888, 1218952, -1379331, -2206907, -2411216, -2820562, -2294441, 220537, 3390903, 4770926, 3714645, 1832682, 927402, 1394254, 2494666, 3521396, 4503441, 5729468, 6598964, 5670217, 2589533, -748259, -2241049, -2298105, -2962872, -4623784, -5530620, -4799233, -3931213]
3607c931213o00506j438482k51981K072151L670472L182011P30362j483164q22830
3598A126820K341204M400972L065259K44520j185654j152827q11858J38019J631100
3589I797555J317780j789868l983343j636368K323940J852947k985776n644412
3581g47545k398643L103464N889820N534757L990690J767053r74265k657143k468127
3572A1040061k120273l085858l943938k686607j17621J177299K54977j452186
3564i34146k094590r64752J152172K418182J531147o86116k162314k071052j236253
3555e047722k65727R76174K048880K034192J164424N46172K73722j90493m6868
3546A492754J789512L720443K729430q18012k942794j732464L0224m41389j783003
$$ y = [-3931213, -4531719, -5970201, -6222182, -4150031, -479559, 2702452, 3432814, 1949650, 1126820, 3468024, 7868996, 10934255, 11178775, 9993121, 8840294, 8028436, 8166455, 9797555, 11115335, 9325467, 5342124, 3705756, 6029696, 7882643, 4896867, -747545, -3146188, -42724, 5847096, 11381853, 15372543, 17139596, 16165331, 13508188, 11040061, 8919788, 5833930, 1889992, -796615, -914236, 263063, 518040, -934146, -3028736, -3993488, -2841316, -423134, 1108013, 421897, -1740417, -3811469, -5047722, -5313449, -4337275, -2288395, -254203, 910221, 1456393, 1730115, 1539622, 1492754, 3282266, 7002709, 9732139, 8914127, 5971333, 4238869, 4269093, 3827704, 2044701]
3537B044701j315076N78562J555092R46202j56327j018331j354993o50076O91686
3528A321440Q86292o62774j801554o42842J313619J384126j98056r57544k04919
3519D37788K63896o19990j683310j638824q58310k65789L11146J779324M131344
3510A857275N717042M561035P78307k733092l106757r91349J72817j363363l528123
3501A363792l471825j104786J448948K471416J545219p63651k715851k141625
3493c368363J005251L740068L286361N63701j059097K1224K163518K960756J807523
3484A1120942j25838j470019j795953j465997o31676J042254L067894L406777
3476A3148384P74464k610530k926315M8833K073322Q0830l554181m304280j296056
$$ y = [2044701, 729625, 1308187, 2863279, 3809481, 3653154, 2634823, 1279830, 629754, 1321440, 2207732, 1544958, -256596, -899438, 414181, 1798307, 1600251, 642707, 437788, 701684, 81694, -1601616, -3240440, -4098750, -4364539, -4053393, -2274069, 1857275, 7574317, 12135352, 12913659, 10180567, 7073810, 6082461, 6255278, 4891915, 1363792, -2108033, -3212819, -1763871, 707545, 2252764, 1489113, -1226738, -3368363, -2363112, 1376956, 4663317, 5227018, 4167921, 4189145, 6352663, 9313419, 11120942, 10995104, 9525085, 7729132, 6263135, 5631459, 6673713, 9741607, 13148384, 13922848, 11312318, 8386003, 8434836, 10508158, 10588988, 7034807, 2730527, 1434471]
3467A434471K376899L896026K981100P47779j373878j916827o38321N78278j85033
3458G900494k089020k661816j570894j096700k366656l262501j407023K189119
3450d364997M147545K824317j44945k349413l124402k940060j654484R92347L571043
3441c043049L647255R80584j513696j196455J045569K321195J471654l26752j790243
3432A596062k373899j478251R14954K877885K052986j077340l358899k861616
3424c708118q38422O65306J326224J863480K313119J957202L17353k044409l297014
3415a445279j673672J909652L768050J765827j525046k291211p45387P2684n35965
3406g00347q01897o63741j539165k140687L93966M532567M865084K64577l624767
$$ y = [1434471, 3811370, 7707396, 10688496, 11436275, 10062397, 8145570, 7507249, 8085527, 7900494, 5811474, 3149658, 1578764, 482064, -1884592, -5147093, -6554116, -4364997, -217452, 2606865, 2461920, 112507, -3011895, -5951955, -7606439, -6614092, -3043049, 604206, 1584790, 71094, -1125361, -79792, 2241403, 3713057, 3386305, 1596062, -777837, -2256088, -1341134, 1536751, 3589737, 2512397, -846502, -3708118, -4546540, -3881234, -2555010, -691530, 1621589, 3578791, 3896144, 1851735, -1445279, -3118951, -1209299, 2558751, 4324578, 2799532, 508321, -237066, -164382, -700347, -1502244, -2165985, -3705150, -5845837, -5451871, -919304, 3945780, 4210357, 585590]
3397E85590k482871R35559K085260J045173P5593j028234k946484l627943j429297
3388f787654J205570J234377k39177m88120J09041j77249m07918J017351K404931
3379b128848J148076j591495k652269j744644o90527M14619K234351L189535J671191
3370a50011m22447n78685j50728j341964j933466J324396N679701N169261j3448
3361G582609l370161j804119O87107K84876j448807j704238q76749n10546o23620
3352a783648j038233k062535k513207m95737K744629L412032P60082j614112j276706
3343c867435Q1587N48135Q62244J595640J266384n64002j622981m89280J127403
3334a062305J524539J468971J749078J291451l84697j712606j879782k170863
$$ y = [585590, -1897281, -961722, 1123538, 2168711, 2244304, 1216070, -1730414, -5358357, -6787654, -5582084, -4347707, -4586884, -5075004, -4965963, -5143212, -5551130, -4533779, -2128848, -980772, -2572267, -5224536, -6969180, -7659707, -7245088, -5010737, -1821202, -150011, -572458, -1151143, -1301871, -2643835, -4577301, -3252905, 2426796, 7596057, 7582609, 4212448, 2408329, 3095436, 3380312, 1931505, 227267, -649482, -1160028, -1783648, -2821881, -4884416, -7397623, -7893360, -5148731, -1736699, -976617, -2590729, -3867435, -3785848, -3237713, -2375469, -779829, 486555, -77447, -1700428, -2189708, -1062305, 462234, 1931205, 3680283, 4971734, 4587037, 2874431, 994649, -1176214]
3326a176214k782525j548860J933669M057713J877771k387585m240950k449204
3318f716185N51420K064445J018037j808542l709575j962036K658411O054850
3310a849175N710602L315746J444456K94868p44539j103554o89598j110928l043145
3301B224733m427385l348848q57368Q85095J385654J113156N5807j304674j552421
3292e826251m82100K78136J28896O10968K137388K316397l04230l147936k717731
3283g006463Q15849M169521M768880K527846p97615k868387k657576j541744j021978
3274c611667k2455K763708M816414K483258k469486m286745j818473J92356l04239
3265b257329M26736L756036M644838K08739m246628l406256m17430p72422k779886
$$ y = [-1176214, -3958739, -5507599, -3573930, 483783, 2361554, -26031, -4266981, -6716185, -6164765, -4100320, -3082283, -4890825, -8600400, -10562436, -7904025, -1849175, 3861427, 7177173, 8621629, 8916497, 8171958, 7068404, 6378806, 5267878, 2224733, -2202652, -5551500, -6408868, -5523773, -4138119, -3024963, -2969156, -4273830, -5826251, -6308351, -6030215, -5901319, -5290351, -3152963, -836566, -1140796, -4288732, -7006463, -6190614, -2021093, 2747787, 5275633, 4478018, 1609631, -1047945, -2589689, -3611667, -3634122, -870414, 3946000, 6429258, 3959772, -326973, -2145446, -1953090, -2257329, -1830593, 1925443, 6570281, 6779020, 2532392, -873864, -1291294, -2063716, -4843602]
3256d843602j426532K177874K942943P53833j91712P81235P28898m84011m16563
3247B2363L37088o80821j953416M6333L707615L818689O9046k526893j780732
3238A059272m95775k87989K75458Q94736n86213k765110j679472J769064K063265
3229B47236j840509m481435k935123r95144j511020j264212K559467O460365N678209
3220A917834R82606l386406n015754l624280J60639L622688L386129M72529j43527
3211a627542K782691M377425J655872j401120n24694K087475K173105K26866q20606
3202H929472r81200j509253j234108O51794J363643j040322l083419r33600K726012
3193D889019K484111j279160l407031k082284k79232J49041M26846R39558J69878
$$ y = [-4843602, -6270134, -4092260, -1149317, -395484, -587196, 194039, 922937, 438926, 22363, 359451, -321370, -2274786, -2228453, 1479162, 5297851, 5366897, 2840004, 1059272, 563497, 275508, 550966, 1445702, 859489, -1905621, -3585093, -1816029, 247236, -1593273, -6074708, -9009831, -10004975, -11515995, -12780207, -10220740, -3760375, 1917834, 2900440, -485966, -5501720, -9126000, -8965361, -5342673, -1956544, -1484015, -1627542, 1155149, 5532574, 7188446, 5787326, 5262632, 7350107, 9523212, 9750078, 8929472, 7948272, 6439019, 5204911, 5856705, 7220348, 6180026, 3096607, 2163007, 4889019, 7373130, 6093970, 2686939, 604655, 325423, 474464, 901310, 1840868, 2010746]
3184B010746j990723l676349m003198l467426j888630Q54401K880375K449804
3176f831000J036695Q67751Q89449q22814k281609j48566L933710M932364K096612
3167C672592l20086k35305j49402j492471j985099l30456J329424J609869K044754
3158D143820L004897J934134j812873m540178l514081r63888J97972R43182K869041
3149B262026L783001R81513l267860m084952q74072K086844J721664m44949j185074
3140I78141O01775L318879M350560K322965j279711l364710k911058k063070k502682
3131e48911k774845j156167Q79989Q81120l98944k92834J125733J148878q44791
3122a980772k143016r39090R95749J104883n61319j967637j632427L52636K616602
$$ y = [2010746, 20023, -3656326, -7659524, -11126950, -13015580, -12161179, -9280804, -6831000, -5794305, -4926554, -4037105, -4859919, -7141528, -7290094, -3356384, 1575980, 3672592, 3352506, 3117201, 2967799, 1475328, -509771, -840227, 489197, 2099066, 4143820, 7148717, 9082851, 7269978, 2729800, -784281, -1748169, -1550197, -607015, 2262026, 6045027, 7026540, 3758680, -326272, -1200344, 886500, 2608164, 2163215, 978141, 1579916, 4898795, 9249355, 11572320, 10292609, 6927899, 4016841, 1953771, -548911, -3323756, -4479923, -3599934, -2718814, -3117758, -3410592, -2284859, -1135981, -1980772, -4123788, -5062878, -4067129, -2962246, -3523565, -5491202, -7123629, -6770993, -4154391]
3113d154391L283905J688839m31823q78940j14501m56912j978707j866436J054497
3104c854469L833236L422017J059561J09758J022043J320961q5573j496635j406780
3095C924119l84804N47265J278139J645349R93500m32427j280576j165200j348653
3086C776712k339882k520571o80379J548325J783696N10802M06414K292854L853922
3077H631893K772482m32621l261876l808400k098306J40400P77513o91794k303564
3068b74273j899785j96070N0228j742424k641438k88723L446772M799126K967277
3059D220690N27047m11765j32638O09265J936693L290519K626340r36973m743884
3050F985294m991119j457972J883809J570948j293357k646817m37245L143435
$$ y = [-4154391, -870486, 818353, 386530, -492410, -606911, -1063823, -3042530, -4908966, -3854469, -21233, 3400784, 4460345, 4570103, 5592146, 6913107, 6827534, 5330899, 3924119, 3539315, 4086580, 5364719, 7010068, 8003568, 7571141, 6290565, 5125365, 3776712, 1436830, -1083741, -1764120, -215795, 1567901, 2078703, 2485117, 4777971, 8631893, 11404375, 10971754, 7709878, 3901478, 1803172, 1943572, 2721085, 2029291, -274273, -2174058, -2370128, -2319900, -4062324, -6703762, -6992485, -3545713, 1253413, 4220690, 4747737, 4335972, 4203334, 4812599, 6749292, 10039811, 12666151, 11729178, 6985294, 1994175, 536203, 2420012, 3990960, 2697603, 50786, -386459, 2756976]
3042B756976M331871J798329k313424m743269m024235j294945J243867K380466
3034A35636K377566J717928R9015k762091n765943o859393m987094r82139L404117
3025a3622398O438229O539729L197545j481472l706135j877252J493091L025401
3017F738K431730J563695Q85587m29449j562686n13045K023625K431660p35120
3008F102735m121793m004619j164158J019705J526225J838300K225779J225934
3000D648108j055105k117633n53076J823379K523844J410345m5100j057205j629715
2991C947842j514311p68907o31114j992125l324225k185091R48021K527496P03839
2982b288575j734638j149442J624723K454913k4326k583336k318621m13095P63557
$$ y = [2756976, 7088847, 8887176, 6573752, 1830483, -2193752, -3488697, -2244830, 135636, 2513202, 4231130, 4330145, 1568054, -4197889, -11057282, -16044376, -17026515, -13622398, -7184169, -644440, 2553105, 1071633, -2634502, -4511754, -3018663, 6738, 2438468, 4002163, 4887750, 4458301, 2895615, 2382570, 4406195, 6837855, 6102735, 1980942, -2023677, -3187835, -2168130, -641905, 1196395, 3422174, 4648108, 3593003, 1475370, 922294, 2745673, 5269517, 6679862, 6634762, 5577557, 3947842, 2433531, 1664624, 1033510, -958615, -4282840, -6467931, -5519910, -2992414, -2288575, -4023213, -5172655, -3547932, -1093019, -1117345, -3700681, -6019302, -6432397, -5668840]
2973e668840J682767L919483O018671M647899k42197m550505n080873l013579
2965b287174j297895p19840r3602J096736K008357J919114J193587P48145R89698
2956C557126J331944R87716L69526P50971J823902J147083k165045m778868l160856
2947a36501P24186J654816r66794k103284P80846L466814J821788j412672j076473
2938B752726K160621L164206M83370k054599j758555l34523O8728q8418j00956
2929D292600q77879k459216k568700r108K639224K258270k69330j354171J17595
2920A769285J466355L87077j732497j940982N4J238784j58144k377304k232824
2911c580196M40194K534347J909751M4379m42624O62715J597802J570105J477292
$$ y = [-5668840, -3986073, -66590, 5952081, 10599980, 10357783, 5807278, 726405, -2287174, -3585069, -4304909, -4398511, -3301775, -1293418, 625696, 1819283, 2567428, 3557126, 4889070, 5876786, 6246312, 6997283, 8821185, 9968268, 7803223, 3024355, -136501, 587685, 2242501, 1275707, -827577, -46731, 3420083, 5241871, 3829199, 2752726, 4913347, 8077553, 8560923, 6506324, 4747769, 4413246, 4481974, 4393556, 4292600, 3414721, 955505, -1613195, -1622303, 1016921, 3275191, 3005861, 1651690, 1769285, 3235640, 3622717, 1890220, -50762, -50708, 1188076, 1029932, -1347372, -3580196, -3140002, -605655, 1304096, 1348475, 905851, 1568566, 3166368, 4736473, 6213765]
2902F213765J936574K123763R22743j485943l416578l050882m72663J819819J559952
2893F150550j66493k54921J606968K001683r56901m067193l279129N00269K949924
2884D484757K414610J063763N23133j48763j701158k890069k468338r47608M56587
2875G86914J146886J010054L18861j13623J01835J43271n39535q19998J93716
2866B228381R21240m75745k491220j976711Q85038K600864J530629k23306n78498
2857B420672O6930Q40620J691060J795676r6911k632895k516877L23961J688398
2848C580634p49269l562644k574525J038682K825237J298045j053084j753806
2840i50730n51669J537908K981654K148070r44312l738309l627262q93115J954259
$$ y = [6213765, 8150339, 10274102, 11196845, 9710902, 6294324, 3243442, 2770779, 4590598, 6150550, 5984057, 5729136, 7336104, 9337787, 8380886, 4313693, 1034564, 1534833, 4484757, 6899367, 7963130, 8486263, 8337500, 6636342, 3746273, 1277935, 330327, 786914, 1933800, 2943854, 3262715, 3149092, 3250927, 3394198, 2854663, 2034665, 2228381, 3149621, 2673876, 182656, -1794055, -909017, 1691847, 3222476, 2999170, 2420672, 2487602, 3328222, 5019282, 6814958, 6718047, 4085152, 1568275, 1892236, 3580634, 2831365, -731279, -3305804, -2267122, 558115, 1856160, 803076, -950730, -1502399, 35509, 3017163, 5165233, 4220921, 482612, -3144650, -4037765, -2083506]
2831b083506K946412J812326m21525j883507j146609R21817J905677J115319K81531
2822C447935L08170j29559j562296k196342j199513n75418j510627j862492k4472
2813e304614J779858J387801Q09437K411353L922483K184416n80090p6540K167065
2804H701169Q55595l626834n006208j394205J393666n84828l158929j467980K039100
2795b249454K292875M0538l17379J403756J523596n91602j774684j068857j082329
2786a823540k475157k072594J531301M618192L484469M7034r34772J449562L603569
2777G428064K872061O36044n52301n85783j151958k631767l273246j612582J216209
2768B344741K407471P97736j459074j379592R05642K073922J20303k510313k053175
$$ y = [-2083506, 862906, 2675232, 2253707, 370200, -776409, 145408, 2051085, 3166404, 3447935, 3756105, 3626546, 2064250, -132092, -1331605, -1907023, -3417650, -5280142, -5304614, -3524756, -2136955, -1327518, 1083835, 5006318, 7190734, 6610644, 6534104, 8701169, 9556764, 5929930, 923722, -470483, 923183, 338355, -2820574, -4288554, -2249454, 43421, 83959, -233420, 1170336, 2693932, 2102330, 327646, -741211, -1823540, -4298697, -6371291, -4839990, -221798, 3262671, 3309705, 2374933, 3824495, 7428064, 10300125, 10936169, 10383868, 9798085, 8646127, 6014360, 2741114, 1128532, 2344741, 4752212, 5549948, 4090874, 2711282, 3616924, 5690846, 5811149, 3300836, 1247661]
2759A247661J070727K389804m52486m099972l777575M35707L914948L407092L64129
2750D500035j718854j340125K11430P51862o36627k507396k197916Q81987L653885
2741A598281K808772o20276k556210j694838r20954k091770k872982r21333J775914
2732e495396J902201J13834k82205J092026J246346r02444k321775k59370L558854
2723a347929M981364K659578l26060j81499K932057M752980K080062k696123m194601
2714H659829j192004J713709Q37272j454052j104225R96364R11148j493473k462612
2705E411956q25489K95546q74777j865690m71504J645449K174488J828054K172512
2696I490545K363381R56594q62868q08276Q31593J637331N57914j187481k218427
$$ y = [1247661, 2318388, 4708192, 4255706, 155734, -3621841, -3186134, 728814, 4135906, 4500035, 2781181, 1441056, 1652486, 2404348, 1767721, -739675, -2937591, -2055604, 1598281, 4407053, 3786777, 1230567, -464271, -1385225, -3476995, -6349977, -7271310, -5495396, -3593195, -3479361, -3761566, -2669540, -1423194, -2325638, -4647413, -4906783, -1347929, 3633435, 6293013, 5966953, 5785454, 8717511, 13470491, 15550553, 12854430, 8659829, 7467825, 9181534, 10018806, 8564754, 7460529, 8456893, 9368041, 7874568, 5411956, 4586467, 4882013, 4007236, 2141546, 1670042, 3315491, 5489979, 7318033, 9490545, 11853926, 12810520, 11947652, 11139376, 11970969, 13608300, 14166214, 12978733, 10760306]
2687A0760306k133490j002103N03608P91542j140255l935553n009796l466774
2679d632515q35658R38793J197940M19931n51081r90119p10701j53529J91663
2670e125276K62877K42290M25255J297164K817259L511189J695007j770735l502809
2661a47779j590720J706152K772751J133375o35200p85017j29163O9956o804L83820
2651B771371J059710J147245K70412r18816j188206J08268J855830J701274j219255
2642E587833m395089m221758m13557L262628L369519O98303j338048j248112o57311
2633F44408j091715j526945k31835K168313L145908J558345j012106k452678k319541
2624a117846j308150J22511J521537J856982N78617j186557j796031j202875p03300
$$ y = [10760306, 8626816, 7624713, 8128321, 8919863, 7779608, 3844055, -1165741, -4632515, -5468173, -4529380, -3331440, -2911509, -3462590, -4452709, -5163410, -5316939, -5125276, -4862399, -4620109, -4194854, -2897690, -80431, 3430758, 5125765, 3355030, -147779, -1738499, -32347, 2740404, 3873779, 3238579, 2453562, 2324399, 2394355, 2387551, 2771371, 3831081, 4978326, 5248738, 4329922, 3141716, 3249984, 5105814, 6807088, 5587833, 1192744, -3029014, -3442571, -179943, 3189576, 3887879, 2549831, 1301719, 644408, -447307, -1974252, -2206087, -37774, 3108134, 4666479, 3654373, 1201695, -1117846, -2425996, -2303485, -781948, 1075034, 1653651, 467094, -1328937, -2531812, -3235112]
2615c235112p77128n39532M96113J354665Q48048p97039j992880j273290J169700
2606d746455L269842L003279Q52187o62198m75359l87313j676310k302831n1846
2597c177004L040122K902321m32749k698232j741605j22510k17201o26616L51902
2588b721572J111519l35631k315727j762947J033484L155930L464986L179308
2580D809350K742653J286576q01954j677578r26207k94332q49886j466797j016560
2571A805265k79145m39634r43046l12989J379767K213723Q82003j365030k061967
2562H78947o56699P89039N56430l30773q6230N60771m80621k526209k188512J517294
2552a966563M961816M488220R84140j976412k588773j452370L78948J756700J398652
$$ y = [-3235112, -4012240, -4551772, -4055659, -2700994, -1852946, -2649985, -4642865, -5916155, -4746455, -1476613, 1526666, 2378853, 1716655, 1241296, 853983, -822327, -3125158, -3177004, -136882, 2765439, 2332690, -365542, -2107147, -2229657, -2446858, -3073474, -2721572, -1610053, -1945684, -4261411, -6024358, -4990874, -1834944, 1630042, 4809350, 7552003, 8838579, 8036625, 6359047, 5432840, 5138508, 4288622, 2821825, 1805265, 1526120, 1086486, 143440, -169549, 1210218, 3423941, 4305944, 2940914, 878947, 222248, 1011287, 1567717, 1236944, 1150714, 1711485, 1230864, -1295345, -3483857, -1966563, 2995253, 7483473, 8467613, 6491201, 3902428, 2450058, 2829006, 4585706, 5984358]
2543E984358l41912j121485K540O98375q06559k248784q31391J836115K196822
2534E368079O09144K85569J261406L95434k522562l758634j849075p5243q66822
2525a152704k061716j196059L60974N35028M58480J824548L012238J614786j025829
2516B369746j601124p758R20847K82745J15017J369044K180699J124324l92163
2507F361377m16609N76044N60939r90068k275411j437981R76177K354808J058741
2498F768017j340827j865366r3487J237955J97784j553025j378010M17493J348525
2489C739059N35173o11111j191767j861885k657858k078587M92836L072505L217297
2480B655662R58290j624448l001037l051627j883508M67839K813801K840388l28324
$$ y = [5984358, 5642446, 4520961, 4523501, 5221876, 4415317, 2166533, 1335142, 3171257, 5368079, 5977223, 6262792, 7524198, 7919632, 5397070, 1638436, -210639, -285882, -1152704, -3214420, -4410479, -4049505, -3514477, -3055997, -1231449, 1780789, 3395575, 2369746, 768622, 760864, 1681711, 1964456, 2079473, 3448517, 5629216, 6753540, 6361377, 5944768, 6520812, 7081751, 6091683, 3816272, 2378291, 3354468, 5709276, 6768017, 5427190, 3561824, 3468337, 4706292, 4904076, 3351051, 1973041, 2390534, 3739059, 4274232, 3663121, 2471354, 609469, -2048389, -4126976, -3634140, -561635, 2655662, 3613952, 1989504, -1011533, -4063160, -5946668, -5478829, -2665028, 175360, -152964]
2471a52964m150164m764310j525851J670161O85241l717869o387980l696830K277298
2462a9763268O267151N626056K446238L24783N15854J660316K068713J233813
2454C79656l64449j840221k293930j516662n02982n07656j346538j478633j72959
2445i644374J451184K291490K917462L948853L994493J562906j515093j575238
2437C431683J469578L291296J137120k270168l059268j783627j532189k461995
2429a777570k069707R547J432559J310810J187905J404702K02034k434592l498955
2420d233267j278875J897879L087211K399002J398869L33701q53685r77276M27556
2411B201115J373248J29191j867651k213271j131719l32576K11642J434551K385160
$$ y = [-152964, -4303128, -9067438, -10593289, -8923128, -8237887, -11955756, -18343736, -22040566, -19763268, -13496117, -7870061, -5423823, -5099040, -4583186, -2922870, -854157, 379656, 15207, -1825014, -4118944, -5635606, -6138588, -6646244, -7992782, -9471415, -9644374, -8193190, -5901700, -2984238, 964615, 4959108, 6522014, 5006921, 3431683, 4901261, 8192557, 9329677, 7059509, 4000241, 2216614, 684425, -1777570, -3847277, -3837730, -2405171, -1094361, 93544, 1498246, 1700280, -734312, -4233267, -5512142, -3614263, -527052, 1871950, 3270819, 3604520, 2750835, 1773559, 2201115, 3574363, 3703554, 1835903, -377368, -1509087, -1841663, -1630021, -195470, 2189690]
2402B189690J522254l2959L5295R99562N5279k389100k447992J085642M117579
2393E135250K865870r63467l154626k693865j552984n41509J167820K961468K605435
2384E829392k13939k685874k359408j32094J400601J237459K70041p06995j595528
2375A043655j947098j075102M27126Q14683l11744r58952M46351K223972J420392
2366B083283j660839l210614q92336K900101M066156J650738j797261l593519
2358d54291k999612p47337J700307K699499J791666M32774J93914O56259M04774
2349C677953n27533r76878r10514j211317j386228k7412K051490J887034j202198
2340A374397l707342k334823J503521L690604K568070M234j651460j484700L44610
$$ y = [2189690, 3711944, 3678985, 3714280, 4713842, 4769121, 2380021, -67971, 1017671, 5135250, 8001120, 7037653, 3883027, 1189162, -363822, -905331, 262489, 3223957, 5829392, 5615453, 2929579, 570171, 438077, 1838678, 3076137, 3346178, 2639183, 1043655, -903443, -1978545, -1551419, -736736, -1048480, -2007432, -1561081, 662891, 2083283, 422444, -2788170, -3680506, -780405, 3285751, 4936489, 3139228, -454291, -3453903, -4201240, -2500933, 198566, 1990232, 2423006, 2616920, 3273179, 3677953, 3150420, 2173542, 1263028, 51711, -1334517, -1361929, 689561, 2576595, 1374397, -2332945, -4667768, -3164247, 526357, 3094427, 3098661, 1447201, -37499, 307111]
2331C07111K553253K746548j37475l507137l681155r17513P88739m88172k019071
2322d354872j156099L14506p00068l232552l526316p82749J928226K537479K302375
2313f670070K494970K170062R35872Q86870L137064M749373K411448k193877m233176
2304C688536k449460m41879q69286j960594j184058P38381J714581J849682K453516
2295C539419K967674J747420o86096j872048j002338J7238l55526j136381p19475
2286B499887N27002Q60636m13796k290765l508015l660410k874151j219393J083158
2277h995847L198098L985709L015313J112947l18596n25074Q9059N02178P0160
2268B133947o80673j83993K514456N815627O331166K746597j930592l672504k436200
$$ y = [307111, 2860364, 5606912, 5469437, 1962300, -1718855, -2636368, -1847629, -2335801, -4354872, -5510971, -5196465, -5896533, -9129085, -12655401, -13438150, -11509924, -8972445, -6670070, -4175100, -2005038, -1069166, -182296, 2954768, 7704141, 10115589, 7921712, 3688536, 1239076, 797197, -72089, -2032683, -3216741, -2478360, -763779, 1085903, 3539419, 6507093, 8254513, 7568417, 5696369, 4694031, 4711269, 4355743, 3219362, 2499887, 3026889, 3887525, 3473729, 1182964, -2325051, -5985461, -8859612, -10079005, -8995847, -5797749, -1812040, 1203273, 2316220, 1997624, 1472550, 1561609, 2063787, 2133947, 1453274, 1269281, 3783737, 9599364, 15930530, 18677127, 16746535, 13074031, 10637831]
2259A0637831j680198k955311l748469j745509J374891K443230J288056L04060
2251E918581M69411J68363k054079n209551o582879m098821J521071O460092O825853
$$ y = [10637831, 8957633, 6002322, 2253853, 508344, 1883235, 4326465, 5614521, 5918581, 6387992, 6556355, 4502276, -707275, -7290154, -11388975, -9867904, -3407812, 3418041]
$$ [...]
##END NTUPLES=NMR SPECTRUM
##END=
