##TITLE=31P_DE-80H_X3
 64 sc D2O
 26.2.2025
##JCAMPDX= 6.0         $$ Bruker NMR JCAMP-DX V2.0
##DATA TYPE= NMR SPECTRUM
##DATA CLASS= NTUPLES
##ORIGIN= UXNMR, Bruker Analytische Messtechnik GmbH
##OWNER= root
$$ XWIN-NMR		Version 3.5
$$ Mon May 19 14:15:29 2025 Russian Standard Time (UT+4h)  Yarkov@DPX200
##.OBSERVE FREQUENCY= 81.013821
##.OBSERVE NUCLEUS= ^31P
##.ACQUISITION MODE= SIMULTANEOUS
##.ACQUISITION SCHEME= undefined
##.AVERAGES= 64
##.DIGITISER RES= 17
##SPECTROMETER/DATA SYSTEM= spect
##.PULSE SEQUENCE= zgpg30
##.SOLVENT NAME= CDCl3
##.SHIFT REFERENCE= (INTERNAL, CDCl3, 0, 198.062)
##AUDIT TRAIL= $$ (NUMBER, WHEN, WHO, WHERE, WHAT)
$$ ##TITLE= Audit trail, XWIN-NMR		Version 3.5
$$ ##JCAMPDX= 5.01
$$ ##ORIGIN= Bruker BioSpin GmbH
$$ ##OWNER= Yarkov
$$ C:/Bruker/XWIN-NMR/data/yarkov2/nmr/P31/2/pdata/1/auditp.txt
$$ ##AUDIT TRAIL=  $$ (NUMBER, WHEN, WHO, WHERE, WHAT)
(   1,<2025-05-19 14:14:37.03 +0400>,<Yarkov>,<DPX200>,
      <created by zg, POWCHK disabled, PULCHK disabled
       configuration hash MD5:
       00 E9 B6 7A A2 85 ED C7 34 08 36 98 17 FE 4E 26
       data hash MD5: 32K
       C9 B1 FA B4 55 D6 EC 6B 7C 12 2B 12 47 13 82 E4>)
(   2,<2025-05-19 14:14:41.54 +0400>,<Yarkov>,<DPX200>,
      <Start of raw data processing
       efp BC_mod = 2 LB = 1.5 FT_mod = 6 PKNL = 1 PHC0 = 1753.79 PHC1 = 76.9595 SI = 64K 
       data hash MD5: 64K
       61 03 09 A6 F9 13 EF 1C C3 16 FB C7 8C 5E 51 9E>)
$$ ##END=
$$ 
$$ hash MD5
$$ BE E7 18 56 83 4A DB B5 3A A1 72 13 40 F5 A4 51
##$RELAX= 
##$RELAX= 
##$RELAX= 
##$RELAX= 
##$RELAX= 
##$RELAX= 
##$RELAX= 
##$RELAX= 
$$ Bruker specific parameters
$$ --------------------------
##$DU= <C:/Bruker/XWIN-NMR>
##$EXPNO= 2
##$NAME= <P31>
##$PROCNO= 1
##$TYPE= <nmr>
##$USER= <yarkov2>
##$AMP= (0..31)
100 100 100 100 100 100 100 100 100 100 100 100 100 100 100 100 100 100 
100 100 100 100 100 100 100 100 100 100 100 100 100 100 
##$AQSEQ= 0
##$AQ_mod= 1
##$AUNM= <au_zg>
##$AUTOPOS= <>
##$BF1= 81.014009
##$BF2= 200.13
##$BF3= 200.13
##$BF4= 200.13
##$BF5= 200.13
##$BF6= 200.13
##$BF7= 200.13
##$BF8= 200.13
##$BYTORDA= 1
##$CFDGTYP= 0
##$CFRGTYP= 5
##$CHEMSTR= <none>
##$CNST= (0..31)
1 1 145 1 1 1 1 1 1 1 1 1 1 1 1 1 1 1 1 1 1 1 1 1 1 1 1 1 1 1 1 1 
##$CPDPRG= <waltz16>
##$CPDPRG1= <>
##$CPDPRG2= <waltz16>
##$CPDPRG3= <>
##$CPDPRG4= <mlev>
##$CPDPRG5= <mlev>
##$CPDPRG6= <mlev>
##$CPDPRG7= <mlev>
##$CPDPRG8= <mlev>
##$CPDPRGB= <>
##$CPDPRGT= <>
##$D= (0..31)
0 1 0 0 0 0 0 0 0 0.06 0 0.03 2e-05 3e-06 0 0 0.0002 0 0 0 0 0 0 0 0 0 
0 0 0 0 0 0 
##$DATE= 1747649676
##$DBL= (0..7)
120 120 120 11 120 120 24 19 
##$DBP= (0..7)
150 150 150 150 150 150 150 150 
##$DBP07= 0
##$DBPNAM0= <>
##$DBPNAM1= <>
##$DBPNAM2= <>
##$DBPNAM3= <>
##$DBPNAM4= <>
##$DBPNAM5= <>
##$DBPNAM6= <>
##$DBPNAM7= <>
##$DBPOAL= (0..7)
0.5 0.5 0.5 0.5 0.5 0.5 0.5 0.5 
##$DBPOFFS= (0..7)
0 0 0 0 0 0 0 0 
##$DE= 6
##$DECBNUC= <off>
##$DECIM= 4
##$DECNUC= <off>
##$DECSTAT= 4
##$DIGMOD= 1
##$DIGTYP= 9
##$DL= (0..7)
0 0 52 120 120 21 21 25 
$$ [...]
##$SUBNAM2= <"">
##$SUBNAM3= <"">
##$SUBNAM4= <"">
##$SUBNAM5= <"">
##$SUBNAM6= <"">
##$SUBNAM7= <"">
##$SUBNAM8= <"">
##$SUBNAM9= <"">
##$SW= 400.765351723535
##$SWIBOX= (0..15)
0 1 3 0 0 0 0 0 0 0 0 0 0 0 0 0 
##$SW_h= 32467.5324675325
##$TD= 32768
##$TD0= 1
##$TE= 0
##$TE2= 300
##$TE3= 300
##$TEG= 300
##$TL= (0..7)
0 120 53 12 22 120 120 120 
##$TP= (0..7)
150 150 150 150 150 150 150 150 
##$TP07= 0
##$TPNAME0= <>
##$TPNAME1= <>
##$TPNAME2= <>
##$TPNAME3= <>
##$TPNAME4= <>
##$TPNAME5= <>
##$TPNAME6= <>
##$TPNAME7= <>
##$TPOAL= (0..7)
0.5 0.5 0.5 0.5 0.5 0.5 0.5 0.5 
##$TPOFFS= (0..7)
0 0 0 0 0 0 0 0 
##$TUNHIN= 0
##$TUNHOUT= 0
##$TUNXOUT= 0
##$USERA1= <user>
##$USERA2= <user>
##$USERA3= <user>
##$USERA4= <user>
##$USERA5= <user>
##$V9= 5
##$VALIST= <valist>
##$VCLIST= <CCCCCCCCCCCCCCC>
##$VD= 0
##$VDLIST= <DDDDDDDDDDDDDDD>
##$VPLIST= <PPPPPPPPPPPPPPP>
##$VTLIST= <TTTTTTTTTTTTTTT>
##$WBST= 1024
##$WBSW= 4
##$XGAIN= (0..3)
0 0 0 0 
##$XL= 0
##$YL= 0
##$YMAX_a= 6300
##$YMIN_a= -20975
##$ZGOPTNS= <>
##$ZL1= 120
##$ZL2= 120
##$ZL3= 120
##$ZL4= 120
##$ABSF1= 0
##$ABSF2= 0
##$ABSG= 0
##$ABSL= 0
##$ALPHA= 0
##$AQORDER= 0
##$ASSFAC= 0
##$ASSFACI= 0
##$ASSFACX= 0
##$ASSWID= 0
##$AUNMP= <proc_1d>
##$AZFE= 0.1
##$AZFW= 0.5
##$BCFW= 0
##$BC_mod= 2
##$BYTORDP= 0
##$COROFFS= 0
##$CY= -3
##$DATMOD= 1
##$DC= 0
##$DFILT= <>
##$DTYPP= 0
##$F1P= 0
##$F2P= 0
##$FCOR= 1
##$FTSIZE= 65536
##$FT_mod= 6
##$GAMMA= 0
##$GB= 0
##$INTBC= 1
##$INTSCL= 9.790993e-09
##$ISEN= 30
##$LB= 1.5
##$LEV0= 0
##$LPBIN= 0
##$MAXI= 10000
##$MC2= 0
##$MEAN= 0
##$ME_mod= 0
##$MI= 50
##$NCOEF= 0
##$NC_proc= -8
##$NLEV= 6
##$NOISF1= 182.463
##$NOISF2= 159.3651
##$NSP= 0
##$NTH_PI= 0
##$NZP= 0
##$OFFSET= 198.0616
##$PC= 4
##$PHC0= 1753.79
##$PHC1= 76.9595
##$PH_mod= 1
##$PKNL= yes
##$PPARMOD= 0
##$PSCAL= 0
##$PSIGN= 0
##$REVERSE= no
##$SF= 81.0140089999434
##$SI= 65536
##$SIGF1= 159.3651
##$SIGF2= -187.1042
##$SINO= 113.3802
##$SIOLD= 16384
##$SREGLST= <1H.CDCl3>
##$SSB= 0
##$STSI= 65536
##$STSR= 0
##$SW_p= 32467.5324675325
##$SYMM= 0
##$S_DEV= 0
##$TDeff= 32768
##$TDoff= 0
##$TI= <>
##$TILT= no
##$TM1= 0
##$TM2= 0
##$TOPLEV= 0
##$USERP1= <user>
##$USERP2= <user>
##$USERP3= <user>
##$USERP4= <user>
##$USERP5= <user>
##$WDW= 1
##$XDIM= 65536
##$YMAX_p= 127419473
##$YMIN_p= -263763159
$$ End of Bruker specific parameters
$$ ---------------------------------
##NTUPLES= NMR SPECTRUM
##VAR_NAME=  FREQUENCY,     SPECTRUM/REAL,   SPECTRUM/IMAG
##SYMBOL=    X,             R,               I
##VAR_TYPE=  INDEPENDENT,   DEPENDENT,       DEPENDENT
##VAR_FORM=  AFFN,          ASDF,            ASDF
##VAR_DIM=   65536,         65536,           65536
##UNITS=     HZ,            ARBITRARY UNITS, ARBITRARY UNITS
##FACTOR=    0.49542278885378, 1,            1
##FIRST=     16045.7642231865, 0,            0
##LAST=      -16421.768244346, 0,            0
##MIN=       -16421.768244346, -263763159,   0
##MAX=       16045.7642231865, 127419473,    0
$$ Real data points
##PAGE= N=1
##DATA TABLE= (X++(R..R)), XYDATA
$$ [...]
7462d716724L537820J843210q22337l418824n033914m013809l05624K738860K158014
7453h033328j98779m21042J366405J522706r44781k852994k021328k90344j19182
7444a1992667j051634j048187O43801L047529M446595L455875O19337j243688
7436c123039k18252J640002R66150j594332k036998P90142L304709K645396M74709
7427B848487n17291p22754j711338k713651j938879P4147J088781L77701p70616
7418c985413j188262q59129l02126r2113m58318p27321j49450L93330p30525k710335
7408a0809662k398518J016662L991287L439367J193279P21247J348011l49803
7400a848130m083514n008956m01405N990357Q185207M804325j43704k399881j661819
$$ y = [-4716724, -1178904, 664306, -158031, -3576855, -8610769, -12624578, -12930202, -10191342, -8033328, -8232107, -8653149, -7286744, -5764038, -6708819, -9561813, -11583141, -11873485, -11992667, -13044301, -14092488, -13448687, -10401158, -5954563, -2498688, -1879351, -3123039, -3341291, -1701289, -735139, -2329471, -4366469, -3576327, -271618, 2373778, 2848487, 2331196, 1608442, -102896, -2816547, -4755426, -4681279, -3592498, -3214797, -3985413, -5173675, -6032804, -6334930, -6427043, -6885361, -7612682, -7762132, -7368802, -8099327, -10809662, -13208180, -12191518, -8200231, -4760864, -3567585, -2846338, -1498327, -1848130, -5931644, -10940600, -11342005, -5351648, 2833559, 7637884, 7494180, 5094299, 3432480]
7391C432480o15093j057276k067263j967485q13786K34641J184981K847422M311993
7382E490614L255440m26280l638560m047284k804209j775985n48644J487970K463345
7373e43593O81653j691161j224923J395404K288869L24820j618647j570045q75096
7364b832719q14484m03366Q56087J142481o75344k609882k339321n77060M72633
7355g780975N09406P67185J297942Q79683o72398j859238j268653R77990L417332
7346c731726M274262K779095J06338j471590q75833Q21090J911124J648506J69808
7337E631074j864612l033303j999935N09191J857757O59208j380887j837241n85849
7328b044597P49413J203509R30963K72138k11223K78916J340277J065747j111219
$$ y = [3432480, 2817387, 1760111, -307152, -2274637, -3088423, -2853782, -1668801, 1178621, 5490614, 8746054, 8319774, 4681214, 633930, -2170279, -3946264, -4494908, -3006938, -543593, 138060, -1553101, -2778024, -1382620, 906249, 1231069, -387578, -1957623, -2832719, -3647203, -4050569, -3194482, -2052001, -2727345, -5337227, -7676548, -8253608, -7780975, -7271569, -6504384, -5206442, -4326759, -4999157, -6858395, -8127048, -7149058, -3731726, 542536, 3321631, 3427969, 1956379, 1080546, 1901636, 3812760, 5461266, 5631074, 3766462, 733159, -1266776, -757585, 1100172, 1759380, 378493, -1458748, -2044597, -1295184, -91675, 839288, 1111426, 900203, 1179119, 2519396, 3585143, 2473924]
7319B473924k560320q32533K078860J909546j602556l927804k042988J602218
7311b901653L060579K101129J036179M54889o90756j755475o71694K082247K879882
7302E595327k50756m449883n563955l365879j031751k86933K46443J659589K459554
7293d988244J217081m53442l951J796660J542480j472466l331236o51405M234281
7284b110242N842628K584463j506549k400988p45356M27097L50448M96997J180300
7275D118798J062884k5572m40845M12512Q93847j693o75688M00038J759893J040924
7265H545098j057727j592096J10105J428345M50479j355601j543872L714J399414
7256F387859J140446q29391l348786m476226k873833L02293J998213P07001j721577
$$ y = [2473924, -86396, -918929, 1159931, 3069477, 1466921, -2460883, -4503871, -2901653, 158926, 2260055, 3296234, 3751123, 3060367, 1304892, 633198, 2715445, 5595327, 5344571, 894688, -4669267, -8035146, -9066897, -9353830, -9107387, -7447798, -4988244, -3771163, -4224605, -4228556, -2431896, -889416, -2361882, -5693118, -6344523, -2110242, 3732386, 6316849, 4810300, 2409312, 1663956, 2091053, 2441501, 2938498, 4118798, 5181682, 5156110, 4715265, 5127777, 6021624, 6019931, 5344243, 5744281, 7504174, 8545098, 7487371, 5895275, 6005380, 7433725, 7884204, 6528603, 4984731, 4988445, 6387859, 7528305, 6698914, 3350128, -1126098, -3999931, -3697638, -1699425, -992424, -2714001]
7247b714001k573917j369291M87816J776234J941314Q38702n89912o59457N61630
7238b300882N71139j891231m060430k606118J251880L108018J404322r76660j247095
7229f747057J94289J805068L103363L656894K447104j16410j526878k85550J762996
7220D293819J840554j29186j837404j738448m74464L69671j64045j770046l067246
7211b676795k737309r07499J007360J921646J756264N52355j697750l868256l860458
7202a0510442j095501K069294K646169M17063j852593j569955Q05998K243715
7194f846252O12356k515336l415279q65873K170257K566365J074925M31821J000479
7185e786537J149985Q98119J640770K579943J315575j559229k444431m14330J078836
$$ y = [-2714001, -5287918, -6657209, -6169393, -4393159, -2451845, -1613143, -2203055, -2862512, -2300882, -1729743, -3620974, -7681404, -10287522, -9035642, -5927624, -4523302, -5499962, -6747057, -6552768, -4747700, -1644337, 2012557, 4459661, 4343251, 2816373, 2530823, 4293819, 6134373, 6005187, 4167783, 2429335, 1954871, 2324542, 2160497, 390451, -2676795, -5414104, -6321603, -5314243, -3392597, -1636333, -1083978, -2781728, -6649984, -10510442, -11605943, -9536649, -6890480, -6473417, -8326010, -9895965, -9089967, -6846252, -6233896, -8749232, -12164511, -13030384, -10860127, -8293762, -7218837, -6787016, -5786537, -4636552, -3738433, -2097663, 482280, 1797855, 238626, -2205805, -2620135, -1541299]
7176a541299j08621j423229l71398J154234N99785m77791O67072K709417K196462
7167C404632p27528k638152k085512q32061k81436o0988R676m08482n56655P02891
7157c473615K613915L265341K255368N37175j485618l330570l207575m70106J891817
7148a403868P75075j948364j877139R83016K278592L87161j442114j025658m84625
7139c757924j608605k414596j096744K59304q67720l036549l154934j176051N56695
7130a6297124J187431J779640K813470L548838L303113J898814k61279j634389
7122c661486p02134J255546P85279k791999n551365m239105q83166O50185L88001
7113a4750244J047123K875181L711176L235289L020137K670865K07231l266388
$$ y = [-1541299, -1649920, -3073149, -3444547, -2290313, -1690528, -2168319, -1501247, 1208170, 3404632, 2677104, 38952, -2046560, -2878621, -3160057, -3221045, -3211369, -3619851, -4176506, -3473615, -859700, 2405641, 4661009, 5198184, 3712566, 381996, -2825579, -3295685, -1403868, -628793, -2577157, -4454296, -3471280, -1192688, -805527, -2247641, -3273299, -3757924, -5366529, -7781125, -8877869, -8618565, -9486285, -12522834, -15677768, -16853819, -16297124, -15109693, -13330053, -10516583, -6967745, -3664632, -1765818, -2027097, -3661486, -4363620, -3108074, -2322795, -5114794, -10666159, -14905264, -15788430, -15138245, -14750244, -13703121, -10827940, -7116764, -3881475, -861338, 1809527, 2016758, -1249630]
7105a249630l618851J32772L588210L043394M23582n42494n0780n56265j571575
7096d01637n16279J951128J919942j698482m957386m424174j708293j18815L94903
7087i559093J742489L132178K045736q54445j879908J11817K057514J801679J238799
7078a63234K290546L025056P64080l286960n678221n323648l530572j079016J485504
7069a1496465K129654l52365l179267k503545J055512L529710L642987L479438
7061c694341L425242J428134k000318l111157q56257J203614R18783P67946K495613
7052E77259L296614Q73743j969929j956096q05868j442935k080631M03678L605742
7043E01577K261884l095042o054786l321368J290595K914164J378524n57099j175096
$$ y = [-1249630, -4868481, -4735709, -1147499, 1895895, 2319477, 1776983, 1726203, 1169938, -401637, -917916, 1033212, 2953154, 1254672, -3702714, -8126888, -9835181, -9953996, -9559093, -7816604, -4684426, -2638690, -3493135, -5373043, -5261226, -3203712, -1402033, -163234, 2127312, 5152368, 5916448, 2629488, -3048733, -8372381, -11902953, -12981969, -11496465, -9366811, -9719176, -12898443, -15401988, -14346476, -10816766, -7173779, -3694341, -269099, 1159035, -841283, -3952440, -4808697, -3605083, -2686300, -1918354, 577259, 3873873, 4747616, 2777687, 821591, 15723, -1427212, -3507843, -3104165, 501577, 2763461, -331581, -6386367, -9707735, -8417140, -5502976, -4124452, -4681551, -5856647]
7034e856647l25303J386111K497584J713352j59072j028920n06867r4118l98943
7025b772823m53650J26269O92848J354583K693501L573178J980572j528525l952897
7016A713056l993551l356923l207276k232508M41634K949028L000300Q00933j607872
7007e493179k508898j303097J207900K794168J864352o0124l6313J848687K389058
6998G02554L35890j448871m02519J951390K721488J955964J832029K929544L529463
6989A4106932K027660j318715m519457n183660k800688P8474N30749q40644j011664
6980A068987L63653K89122k137316l418831j073931K035851J946008m96474j524952
6971b947883l34036O65015K75412m36989r67039j911551k774096k090707P6363
$$ y = [-5856647, -6181950, -4795839, -2298255, -584903, -743975, -1772895, -2279762, -2373880, -2772823, -3226473, -3100204, -2407356, -1052773, 1640728, 5213906, 7194478, 5665953, 1713056, -2280495, -5637418, -8844694, -11077202, -10635568, -7686540, -4686240, -3885307, -5493179, -8002077, -9305174, -8097274, -5303106, -3438754, -3498878, -3535191, -1686504, 702554, 1038444, -410427, -812946, 1138444, 3859932, 5815896, 7647925, 10577469, 14106932, 16134592, 14815877, 10296420, 5112760, 2312072, 2390546, 2921295, 2080651, 1068987, 1432640, 1721762, -415554, -3834385, -4908316, -2872465, -926457, -1422931, -2947883, -3281919, -2616904, -2341492, -2778481, -3745520, -5657071, -8431167, -10521874, -10445511]
6962a0445511K008271K668874K309530J187266l87360j342949j136876r10683
6954f049438j408491j148076Q10776K052008L55224j455262J010987N864297O116033
6945F148058j40376o127003n582006r23367J436106K08252q99791q9060P14756
6936e254431K67025k06214n4062m14538j400798j075321J308598L380988K775527
6927f73226N73363l24094O28176J074883o64271l197076l926823k259367M3429
6918h725006J248992J308644J064776Q62608N69822K47292p0197p95413j960287
6909f248769k249325k11409L299023N197594L497205k85521k938159l147790k253598
6900e340749j742330j295864J67481K314059L270693J898282m06799r75266R02543
$$ y = [-10445511, -8437240, -5768366, -3458836, -2271570, -2658930, -4001879, -5138755, -6049438, -7457929, -8606005, -7795229, -5743221, -5387997, -6843259, -5832272, 32025, 6148058, 6007682, -119321, -5701327, -6624694, -5188588, -4980336, -5880127, -5969187, -5254431, -4987406, -5193620, -5247682, -5662220, -7063018, -8138339, -6829741, -3448753, -673226, -99863, -423957, 204219, 1279102, 614831, -2582245, -6509068, -8768435, -8725006, -7476014, -6167370, -5102594, -4239986, -3670164, -3422872, -3493069, -4288482, -6248769, -8498094, -8709503, -5410480, -212886, 3284319, 2998798, 60639, -3087151, -5340749, -7083079, -8378943, -8211462, -5897403, -2626710, -728428, -1135227, -2110493, -1207950]
6891a207950K758248J743255j708002m113753l042115R3610J986351J311052l98301
6882b577605j247005r78361l04047M48318J171196J292609M18819o43263p09018
6873c128357q7553k96827j460291j491462Q97134L594081L452673P67701q81430
6864A365669L88076K169809J332487j612143l467629k621755m70297J013186J359272
6855e43325J102402O10573n074n33587o94594l29212M59365J202604J316756O25119
6845C211027o12971k077224l195185k902605q67090J130039Q46305j022894j308080
6836f798678Q57228K312376P05084j586100j144197J107547J807445Q23222P78250
6827a137823J691916P93151k006377l162270j323739K76109p15821j988223r89793
$$ y = [-1207950, 1550298, 3293553, 1585551, -2528202, -5570317, -5476707, -3490356, -2179304, -2577605, -3824610, -4802971, -5107018, -4658700, -3487504, -2194895, -1776076, -2419339, -3128357, -3215910, -3512737, -4973028, -6464490, -5567356, -1973275, 1479398, 2247099, 1365669, 1753745, 3923554, 5256041, 3643898, 176269, -2445486, -2915783, -1902597, -543325, 559077, 1169650, 1164576, 630989, -63605, -392817, 66548, 1269152, 2585908, 3211027, 2598056, 520832, -2674353, -5576958, -6444048, -5314009, -4467704, -5490598, -6798678, -5941450, -3629074, -2923990, -4510090, -5654287, -4546740, -2739295, -1916073, -1137823, 554093, 1347244, -659133, -3821403, -5145142, -4869033, -5584854, -7573077, -8562870]
6818h562870N10674j89493j659504p17387J987558K950100J445408J98990N74483
6809c462041Q04794l53773j381943o87109P53968R35917l15360j264612m81854
6800e452013J548342K910021K346229Q25284K94906Q35924O04248q14925j162445
6791A935571Q54606K863140K124749l38456j805895k374017l826256n195405l775996
6782i537959l45098J150471j87489p64286J263408K692695P16533k193145k189539
6773i394409Q2077J229695O80862O41629J640279J888274Q61629K25005P73131
6764a371828J084285l9643j737415k489239k027566j158249m45097M15016J970370
6755e799366L680785L730461J431182o24504P02405L889128L704015j037472m534043
$$ y = [-8562870, -8052196, -8241689, -9901193, -10618580, -8631022, -5680922, -4235514, -4036524, -3462041, -2657247, -3011020, -4392963, -5080072, -4326104, -3390187, -3705547, -4970159, -5452013, -3903671, -993650, 1352579, 2177863, 2472769, 3308693, 3912941, 3098016, 1935571, 2790177, 5653317, 7778066, 7439610, 5633715, 3259698, -566558, -5761963, -9537959, -9883057, -8732586, -8920075, -9684361, -8420953, -5728258, -5011725, -7204870, -9394409, -9312332, -8082637, -7401775, -6760146, -5119867, -3231593, -2369964, -2144959, -1371828, -287543, -327186, -2064601, -4553840, -6581406, -7739655, -8184752, -7769736, -5799366, -2118581, 1611880, 3043062, 2418558, 3120963, 7010091, 10714106, 9676634, 5142591]
6746E142591k015413K865421L345941m38215k651482j528926j136613l019566
6738E63738l153295L77773K945614N02938l781264m469217j659280P16336J317243
6729f639414J404028R12183n99277r96921J434513L562686J282427l159535l487384
6720f286694J019414M254436K612250l36559o33344K26215m04151j011610P06286
6711A46243K765866J986137k91568m17786J192676Q55760j769917k785130m37133
6702A245148J946633J104675j451951k135557m10710J157394P95334n79795j006546
6693F64625K76843K178891K781321J269273j018287k090772j864212k078421l327738
6684c208477l676427j409246J937503L050258J097606j234366j429365k66183
$$ y = [5142591, 3127178, 5992599, 9338540, 8900325, 6248843, 4719917, 3583304, 563738, -2589557, -2211784, 733830, 1236768, -2544496, -7013713, -8672993, -7956657, -6639414, -5235386, -4323203, -4922480, -5919401, -4484888, -922202, 360225, -2799310, -6286694, -5267280, -1012844, 1599406, 1262847, 629503, 855718, 451567, -560043, 146243, 2912109, 4898246, 4606678, 4188892, 5381568, 6237328, 4467411, 1682281, 1245148, 3191781, 4296456, 2844505, 708948, 298238, 1455632, 2250966, 1671171, 664625, 941468, 3120359, 5901680, 7170953, 6152666, 4061894, 2197682, 119261, -3208477, -6884904, -8294150, -6356647, -3306389, -2208783, -3443149, -4872514, -5138697]
6676e138697l582n89425J74430K670370M086112K402310j29369Q1057K529292
6667F082498L126007K30825k994945l431484k236592k110379k729126j822742
6659e885938O04173K176448J726196L40661q39481j469029j018873N43452J420803
6650b401588O6269j647542n15260K631124L325145J58049k769223j941043O20452
6641b473617J165309j51586q01154n78536r34849j290294p3268J491023P58420
6632b888552j439408j455306J157902K425127P2560k882700k733776j46019J844055
6623f046117K280458J959205Q35329j010465j364160J558540N231295N152350
6615H596435J144652k247392k367723j745179l015709m112290j818718K214431
$$ y = [-5138697, -5142279, -5731704, -5557274, -2886904, 1199208, 3601518, 3472149, 3553206, 6082498, 9208505, 9439330, 6444385, 3012901, 776309, -1334070, -4063196, -5885938, -5281765, -3105317, -1379121, -1038460, -1877941, -3346970, -4365843, -3822391, -2401588, -2335319, -3982861, -4498121, -1866997, 1458148, 1616197, -1153026, -3094069, -2473617, -1308308, -1459894, -2261048, -2839584, -3774433, -5064727, -5137995, -3646972, -2888552, -4327960, -5783266, -4625364, -2200237, -2127677, -5010377, -7744153, -7890172, -6046117, -3765659, -1806454, -971125, -1981590, -3345750, -1787210, 3444085, 8596435, 9741087, 7493695, 5125972, 3380793, 365084, -3747206, -5565924, -3351493]
6607c351493L166152P5968k888074k719074j315869j328196j713758l31147J498447
6598h907044Q24634j580289j753292J203830L182885J020258k641311k985132
6590a1635461M16704L534746L489316J463358M3235M9568O60420R75192O30975
6581c71947p0525j55372R40372K033728J187306j463378l184849j888455J056579
6572a916541K354773O07931k342324l582548j881072J424146L570170K650878
6564H85413n22150k925984k223584R56072L946870M764373L309875N22496k430727
6555F282654m166813l558177q12973K448357M502504M538380K557203p23471l636997
6546G430667m407407k999811j340767r28311j047512l40522P54337P13095l59270
$$ y = [-3351493, -185341, -109373, -2997447, -5716521, -7032390, -8360586, -10074344, -10405491, -8907044, -8082410, -9662699, -11415991, -10212161, -7029276, -6009018, -8650329, -11635461, -11218757, -7684011, -4194695, -2731337, -2688102, -2638534, -1978114, -1002922, -371947, -442472, -597844, 342528, 2376256, 3563562, 2100184, -1084665, -2973120, -1916541, 438232, 1046163, -1296161, -4878709, -6759781, -5335635, -1765465, 885413, 363263, -2562721, -4786305, -3830233, 116637, 4881010, 8190885, 8713381, 6282654, 2115841, -1442336, -2255309, 193048, 4695552, 9233932, 11791135, 11067664, 7430667, 3023260, 23449, -1317318, -2245629, -3293141, -3633663, -2879326, -2166231, -2525501]
6537b525501o31037N93993J768023J631092J115191J356286J267080q25684l773866
6528b4423m229288j103294K564818L270486J172527q25425j161629r74217j507679
6519b818124k030356j238117M54635J389568J006395L38027Q6746l98575j588049
6510d797850k479674k035927j010998p89339r27959K53500K643963L967964L015933
6501b160387J258974K46354o29037k228734l324139k266855K15776K085049K905116
6492c897883L438872L259384J493813n57907n96686Q18529O97066j580103l099392
6483b4307k149466q79693j391139k127107p25418J823899K797044J944682J161727
6474D30222J022787N51524j82068j17948K90155o18808k563635k987586p65112
$$ y = [-2525501, -3156538, -2562545, -794522, 836570, 1951761, 3308047, 4575127, 3749443, -24423, -4253711, -5357005, -2792187, 478299, 1650826, 825401, -336228, -1310445, -2818124, -4848480, -6086597, -5631962, -4242394, -3235999, -2897972, -2811226, -3209801, -4797850, -7277524, -9313451, -10324449, -11113788, -12041747, -11788247, -9144284, -5176320, -2160387, -901413, -655059, -1284096, -3512830, -6836969, -9103824, -8888048, -6802999, -3897883, -459011, 2800373, 4294186, 3736279, 3139593, 3958122, 4655188, 3075085, -24307, -2173773, -3053466, -4444605, -6571712, -7297130, -5473231, -2676187, -731505, 430222, 1453009, 2004533, 1822465, 1704517, 1994672, 1375864, -1187771, -4175357, -4940469]
6465d940469J674297J123507k530211o052908n985199j811158L448284N885844
6457i188013M478398J852909Q38151J240090J048393l19742j644222j975087j302994
6448d972117K15852J892455K044065j2058k082850j565448O41556J331032j32145
6439b639658j164610m66623J38584o25832j180854j49795J015240N37091p69253
6430e305710j193441q33746n12960J85432J537227K009703M67108j353676j183436
6421f183499J64449L15008n43438k25631J287273J692285N43602J25641J246775
6412a577535J478959o62202k618302j385440J704479K641555K69110k546769l105511
6403e801656j743087o3326J418619K605411K474658L44455k128328k183313M46840
$$ y = [-4940469, -3266172, -2142665, -4672876, -10725784, -16710983, -18522141, -15073857, -9188013, -4709615, -2856706, -2018555, -778465, 269928, -49814, -1694036, -3669123, -4972117, -4756265, -2863810, -819745, -831803, -2914653, -4480101, -3838545, -2507513, -2639658, -3804268, -4270891, -4132307, -4758139, -5938993, -6088788, -5073548, -4536457, -5305710, -6499151, -7332897, -7845857, -7660425, -6123198, -4113495, -3646387, -5000063, -6183499, -6019050, -5704042, -6247480, -6473111, -5185838, -3493553, -2949951, -2824310, -1577535, -98576, -760778, -3379080, -4764520, -3060041, -418486, -149376, -2696145, -5801656, -7544743, -7608069, -6189450, -3584039, -1109381, -764926, -2893254, -5076567, -4629727]
6394d629727K668365J619869j862977m436369m208801k218025l04058R13247J627328
6385a0831148J836118J557930J160747P35827r8647j109136j085674M63635K082430
6376e287918K103227J055059Q45037J758335J985695N19942j116979j084431K1816
6367G99783J24611j130064j812186o49293R83580J047042k05241p73398k8734
6358a643900N28984j2436l70236O38614J729191R16330j281596k548263k286702
6349d330014k099089k587836k151363P3332K236392K293951R29086K29900N72786
6340d832855O87599K38909M59293K017780L527186K793655o42474m348238m847158
6331d946303j442937K234056K095090j112752k695477o79199J439787L35882j875890
$$ y = [-4629727, -1961362, -341493, -2204470, -6640839, -10849640, -13067665, -13371723, -12458476, -10831148, -8995030, -7437100, -6276353, -5540526, -5639173, -6748309, -7833983, -7370348, -5287918, -3184691, -2129632, -1284595, 473740, 2459435, 2979377, 1862398, 777967, 799783, 924394, -205670, -2017856, -2667149, -1683569, -636527, -841768, -1615166, -1643900, -1114916, -1127352, -1497588, -858974, 870217, 1786547, 504951, -2043312, -4330014, -6429103, -9016939, -11168302, -11094970, -8858578, -6564627, -5635541, -5405641, -4832855, -4145256, -3906347, -3447054, -1429274, 2097912, 4891567, 4249093, -99145, -4946303, -6389240, -4155184, -2060094, -3172846, -5868323, -6547522, -5107735, -4771853, -6647743]
6322f647743j241350J436907J871919p18762k397176p39523J841553K420381J631886
6313b541908J327385J115247q4394j174536n34500P59144L38976j407810j650377
6304c852773L11797J550944k41954l120172l403687p51300J513340J180445Q7306
6295f726054J022848L274727L577996J138626j014482o41793L05845r58188l246028
6286c266503l087304m28829R16764r93715l360720k970191o30073Q73033J146173
6277a1801365J821355K993483K902529J092025n17171l08172R59235J531306R69073
6268c57702K56981K67120Q35944J150997O54336m11579j287425j566520j622477
6259b080325j997722k593476k761095k041016n53698J158520K408081K687131
$$ y = [-6647743, -7889093, -6452186, -4580267, -5299029, -7696205, -8435728, -6594175, -4173794, -2541908, -1214523, -99276, -183670, -1358206, -1892706, -1133562, -794586, -2202396, -3852773, -3540976, -1990032, -2231986, -5352158, -8755845, -9507145, -7993805, -6813360, -6726054, -5703206, -2428479, 1149517, 2288143, 1273661, 631868, 937713, -20475, -3266503, -6353807, -6782636, -5865872, -6859587, -10220307, -13190498, -13820571, -12947538, -11801365, -9980010, -6986527, -4083998, -2991973, -3509144, -3817316, -2858081, -1326775, -357702, -100721, 166399, 1002343, 2153340, 2807676, 2396097, 1108672, -457848, -2080325, -4078047, -6671523, -9432618, -11473634, -12027332, -10868812, -8460731, -5773600]
6251e773600K073804J257934R06166J010985J026223O47922L32285Q35187K028988
6242D345894K406489N20811k829390m792237l624609q51000Q09961Q34077O32879
6233b547125O21244j55945j450003j429869K66724J472219Q72879K67063J482891
6224e99922K916485J755626j465075l364363k439582o46814p9307m96505p64854
6215e184311o23536j21178R03827J789773J126822j017025k441694j663260j3705
6206g244287O06734O86272J755818L119306K621409N61694l6831J975131L560509
6197G605755J664419k155465l792777k363105j091933k316545m283335m019227
6189a0752213j332954J594038L129999L014107J401135r65339k271219j318329
$$ y = [-5773600, -3699796, -2441862, -1535696, -524711, 501512, 1149434, 1481719, 2316906, 4345894, 6752383, 7273194, 4443804, -348433, -3973042, -4824042, -4014081, -3180004, -2547125, -1925881, -2081826, -3531829, -4961698, -4694974, -3222755, -2349876, -2082813, -599922, 2316563, 4072189, 2607114, -757249, -3196831, -3843645, -3922952, -4419457, -5184311, -5807847, -5929025, -5025198, -3235425, -2108603, -3125628, -5567322, -7230582, -7244287, -6637553, -5951281, -4195463, -1076157, 1545252, 2106946, 2070115, 4045246, 7605755, 9270174, 7114709, 3321932, 958827, -133106, -2449651, -6732986, -10752213, -12085167, -10491129, -7361130, -4347023, -2945888, -3911227, -6182446, -7500775]
6181g500775M99252P22322p37691j566835n65112Q75054J336279J280144J303991
6172d353371N35192j446110k588136o11192L233434M880675K313865j901869l716064
6163c653576k180448O0035M19843o98013j167148m55091j29577q55545q30347
6154i489867J240839L178212J964779j346784k587019o03729J056560r7010j587978
6145h271997k97426K320205K796239J301205P68593J546698J151128q09460j608394
6136a103209j04488J197992K54705j400923j463582l47159P9656n98301j498429
6127d983738j998803j599645K47560K611409K932148K15360k918165l254519r96379
6118i744772J069301J343524L24516j309420l099312l650132j527047K366005
$$ y = [-7500775, -7001523, -6279201, -7016892, -8583727, -9148839, -8273785, -6937506, -5657362, -4353371, -3818179, -5264289, -7852425, -8463617, -5230183, -349508, 1964357, 62488, -3653576, -5834024, -5773989, -5354146, -6052159, -7219307, -7674398, -7803975, -8659520, -9489867, -8249028, -5070816, -3106037, -4452821, -7039840, -7643569, -6587009, -6684019, -8271997, -8569423, -6249218, -3452979, -2151774, -1383181, 163517, 1314645, 505185, -1103209, -1207697, -9705, 245000, -1155923, -2619505, -2966664, -2887008, -3485309, -4983738, -6982541, -8582186, -8334626, -5723217, -2791069, -2575709, -5493874, -8748393, -9744772, -8675471, -7331947, -7007431, -8316851, -11416163, -15066295, -16593342, -14227337]
6110a4227337N200016N418437L993872K331903O72505r53620j868037j720418
6102a152679j162936q43389o66605m77582l84232k4202J166464K396871J721789
6093E73499j242232m121718m480201k595207l82308J187803K051162J680991m2519
6084g370730j269046K1028K657466L213728Q58308j156794m9785K601541L317217
6075B822933J464599o00333j205680r18003o63520l71233J21517L19480k07777
6066G61983j268225k448510l273797l024650j411127N70380J523516J415287J327934
6057e827209J485886R77728k59891p22106O04403K585899L195090J683634j008846
6048B714588l204002l475006j694361M41205R13652k04565r16458j31257J084459
$$ y = [-14227337, -9027321, -3608884, 384988, 2716891, 3389396, 2435776, 567739, -1152679, -2315615, -3159004, -3825609, -4303191, -4687423, -4711625, -3545161, -1148290, 573499, -668733, -4790451, -9270652, -11865859, -12248167, -11060364, -9009202, -7328211, -7370730, -8639776, -8618748, -5961282, -2747554, -1889246, -3046040, -3095825, -494284, 2822933, 4287532, 3687199, 2481519, 1563516, 899996, 528763, 650280, 969760, 761983, -506242, -2954752, -6228549, -9253199, -10664326, -10093946, -8570430, -7155143, -5827209, -4341323, -3363595, -3623486, -4345592, -3741189, -1155290, 2039800, 3723434, 2714588, -489414, -3964420, -5658781, -5217576, -4303924, -4508489, -5424947, -5556204, -4471745]
6039d471745J463711J058478K27742r28953j286834P94970M213209M881086J043921
6030F995585l387305l728715q98915N97256l17185n56431J128479J968469J81131
6021A982369j745926r57702J332683J712569q02358m002155n266055l746083p81434
6012a2274092R60010l5723j856864r80019K933622O034230N156595J614469j305632
6003B46596k460918k478883j331709R59945K472817J224383j491067k249719j12386
5994e220941K173215K045296K89352n20032N26890J746175J001076j677902l763619
5985c400490k956387j88132J263353J29754r64156P56333M021517N008716K282218
5976E952726j669616l530204k229067P13867K456311R28131k822501m909281k795818
$$ y = [-4471745, -3008034, -1949556, -1721814, -2650767, -3937601, -3142631, 1070578, 5951664, 6995585, 3608280, -120435, -1019350, -422094, -739279, -1295710, -167231, 1801238, 1982369, 236443, -721259, 611424, 2323993, 1521635, -2480520, -7746575, -11492658, -12274092, -11314082, -11349805, -13206669, -14186688, -11253066, -5218836, -62241, 1552228, 246596, -2214322, -4693205, -6024914, -5064969, -2592152, -1367769, -2858836, -5108555, -5220941, -3047726, -1002430, -713078, -1233110, -706220, 1039955, 2041031, 363129, -3400490, -6356877, -6545009, -5281656, -5151902, -6116058, -5359725, -1338208, 3670508, 5952726, 4283110, 752906, -1476161, -762294, 1694017, 2622148, -200353, -5109634, -7905452]
5967g905452J454954L787929L061252J186126n75263k390223l332081j640214
5959f352972J806427L478334J902476l27506n57842N14321R57314O16543J74724
5950B211819n59992j486079j390379k29164o9108j620848k202046J17921K650051
5941b577825J859856p99759r63740J720022L194714J497748p55083j257689j276616
5932F41628k373800l393452k872341j654566r20319l5373J436907J893175L63117
5923f915024r74815K68079K785598L507527K255044J389531J510836P62337j487444
5914C101669l261717l005413j644604p42279m95028m20794l96930j34024R76082
5905f023038K600649L226784K042407J58408p53364l42436L53166Q3401j548459
$$ y = [-7905452, -6450498, -2662569, 398683, 1584809, 1009546, -1380677, -4712758, -6352972, -4546545, -1068211, 834265, 506759, -51083, 463238, 1420552, 2037095, 2211819, 1651827, 165748, -1224631, -1453795, -1522903, -3143751, -5345797, -5227876, -2577825, -717969, -1517728, -2481468, -761446, 2433268, 3931016, 3175933, 1918244, 641628, -1732172, -5125624, -7997965, -9652531, -10572850, -10608223, -9171316, -7278141, -6915024, -7889839, -7621760, -4836162, -1328635, 926409, 2315940, 3826776, 4589113, 3101669, -160048, -3165461, -4810065, -5552344, -6047372, -6468166, -6865096, -6999120, -6023038, -3422389, -195605, 1846802, 2005210, 1251846, 909410, 1262576, 1345977, -202482]
5896b02482l484006l760086j636332J009049J671482M18204n18360k74324l65879
5887g142734j617353k285695o22484K249300L573726K209163n03297k391901k134738
5878h666013n3323K074816K668525K077992J738039J747052J008010j88800j39065
5869B267233J059204R61003j205380k681874j349687P45602O19240r99113j248713
5860a832485J40514Q77725j8203j306384j933222j791117o74183J095059J742097
5851c700199K15484j581330j315548P5952J22013r15614r52229k31885n63316
5842h846672j060552Q04684L886896L976448N81988j716394k81722J827213J363503
5833E35392j49144P4470J217407Q81897o69055j453566r89193j5031J112896J644338
$$ y = [-202482, -3686488, -7446574, -9082906, -8073857, -6402375, -5984171, -6502531, -6776855, -7142734, -8760087, -11045782, -11668266, -9418966, -5845240, -3636077, -4139374, -6531275, -8666013, -8719336, -6644520, -3975995, -1898003, -159964, 1587088, 2595098, 2406298, 2267233, 3326437, 4287440, 3082060, 400186, -949501, -203899, 415341, -583772, -1832485, -1691971, -814246, -832449, -2138833, -4072055, -5863172, -6537355, -5442296, -3700199, -3484715, -5066045, -6381593, -6305641, -6183628, -7099242, -8051471, -8283356, -8846672, -9907224, -9102540, -5215644, -1239196, -657208, -2373602, -2655324, -828111, 535392, 386248, 460718, 1678125, 2560022, 1890967, 437401, -551792, -566823, 546073, 2190411]
5823B190411K23797k517355l560121j742884K53161L02432O0293J083386J208522
5814b498358j413292l720344j828275K358007L498683O41772k009792j695723
5806f667322n6342O57909M61518J78317K05998J102704K813920L418612J271735
5797C387049j924424k956912j655061p23255j328099j900762j363000o43552o32250
5788i740266r45821r11183n7705J799804L379672K402655o32392j481066J881021
5779d305281M917473K504759l013314n033337k299791O16188J358959J734261
5771c520083J916166j94781l095870k359037J293209J868675j732902l080229
5763h904852R41691M430458K411138r00515L400K334261Q38453k121867r14094
$$ y = [2190411, 2414208, -103147, -3663268, -5406152, -5152991, -4850559, -4790266, -3706880, -2498358, -3911650, -7631994, -9460269, -7102262, -3603579, -2961807, -4971599, -6667322, -6723664, -6065755, -5604237, -5425920, -5219922, -4117218, -1303298, 2115314, 3387049, 1462625, -1494287, -3149348, -3872603, -5200702, -7101464, -8464464, -9108016, -9740266, -10686087, -11597270, -11654975, -9855171, -6475499, -4072844, -4705236, -6186302, -4305281, 612192, 3116951, 103637, -4929700, -7229491, -6613303, -5254344, -3520083, -1603917, -1798698, -4894568, -7253605, -5960396, -4091721, -5824623, -8904852, -7963161, -3532703, -1121565, -2022080, -2018680, 315581, 1154034, -967833, -1881927]
5754a881927K551850J446375m175897o947005l608669R60186K224937J607567
5746g822583J750168K003800J023691n79622k114301l609921l622183k88295M284490
5737h974756N056296J184248k084923q32864K159336K234050l58295j927541j277452
5728d821901n67068j202961j883100q48357J714455L879221L917183K009288M7721
5719B244481o00941o17368j202970j952955j774454j033968p69353n36822N70348
5710e674002J479485N83525q77819k20958K010754K491882O04125n59018L04538
5701A42512M79497j549849k830966q85710J567578N76673k762779l853547j041411
5692a0158002K916365M932958M136828J085153k666091m583274l285883m87846
$$ y = [-1881927, 669923, 2116298, -2059599, -9006604, -12615273, -11655087, -9430150, -7822583, -6072415, -4068615, -3044924, -3624546, -5738847, -9348768, -12970951, -13259246, -8974756, -3918460, -2734212, -4819135, -5651999, -3492663, -1258613, -1616908, -3544449, -4821901, -5388969, -6591930, -8475030, -9323387, -7608932, -3729711, 187472, 2196760, 2244481, 1643540, 1026172, -176798, -2129753, -3904207, -4938175, -5707528, -6244350, -5674002, -4194517, -3610992, -4488811, -4709769, -2699015, -207133, 396992, -162026, 142512, 622009, -927840, -3758806, -4644516, -3076938, -2500265, -5263044, -9116591, -10158002, -7241637, -2308679, 1828149, 2913302, 247211, -4336063, -7621946, -8109792]
5684h109792J111563J210899J218125J310815Q14630O14183K043355L690092K624488
5675F528358q86438l146194k324335q24755r88131j464744q0900K093110K368735
5666A274706P12862m83680l00786k03758r89026j361230l57811Q67050R67198
5657A25525N96125J047999J658715N21079k296783m128362l053223n04169O89370
5648e343724P1701j74646J284229K733706J649729j619812l715356k104141J718459
5639e499855L649922J570213k194366l490263j036059K271367K779644R260l236316
5630e176453m067988k202224K61373J203555N72475J53243J150033K477597K342322
5621c286067J143521J108919K693268L347228J114748k321506m020797l768999
$$ y = [-8109792, -6998229, -5787330, -4569205, -3258390, -2443760, -1829577, 213778, 3903870, 6528358, 5641920, 2495726, 171391, -653364, -1641495, -3106239, -3187139, -1094029, 1274706, 1987568, 1503888, 1203102, 999344, 10318, -1350912, -1708723, -841673, 125525, 721650, 1769649, 3428364, 3949443, 1652660, -2475702, -5528925, -6033094, -5343724, -5272023, -5446669, -4162440, -1428734, 220995, -1398817, -5114173, -7218314, -5499855, -1849933, -279720, -2474086, -5964349, -7000408, -4729041, -1949397, -1940137, -5176453, -9244441, -11446665, -11185292, -9981737, -9409262, -9256019, -8105986, -5628389, -3286067, -2142546, -1033627, 1659641, 5006869, 6121617, 3800111, -220686, -3989685]
5613c989685l413978l306917k182612k05170Q00391N32940R42087K891569M428330
5604c503045L605475J189766o87520j100464n02564K70565K54916r62408k012042
5595c447321q45358J990723L077780N34285l048224l844405j575564Q22481J202954
5586e132649n9976j579236k321718j823973m99343N21405P31408P18325O31066
5577h814691l73952k030935k121089M41151L324167L794483K509047J777439J579081
5568H4701N05428n41447M85758K326144J407428k133177l684025r35107K483383
5559i14K427024o6881j399307j006801r42691j636980j547042k52181J041516
5550c384257J687862J887390J286175m08827j944765j982090j465308k020341
$$ y = [-3989685, -7403663, -10710580, -12893192, -13098362, -12297971, -11765031, -10822944, -7931375, -3503045, 102430, 1292196, 604676, -495788, -998352, -727787, -472871, -1435279, -3447321, -4292679, -2301956, 775824, 1310109, -1738115, -5582520, -7158084, -6335603, -5132649, -5192625, -6771861, -9093579, -10917552, -11416895, -10895490, -10164082, -9445757, -8814691, -9188643, -11219578, -13340667, -12899516, -9575349, -5780866, -3271819, -1494380, 84701, 590129, 48682, 534440, 2860584, 4268012, 2134835, -1549190, -2484297, -914, 2426110, 2359229, 959922, -46879, -989570, -2626550, -4173592, -4425773, -3384257, -1696395, 190995, 1477170, 1068343, -876422, -2858512, -4323820, -6344161]
5542f344161k601783q26585K497208L693619J750321J7631R12876K219445R50445
5533B269016j809244k775766j314681M64420J169096R41500j23603j606067j702329
5524d487658N07198K453174J070309j958896j804684K200478M954693K854286
5516E788900j171208k437160j053318l29120j027545j155583l04981l10811j697329
5507c698155k736590k344424j170654M40454K795116M683336L794245M23929j842624
5498C44633p65146J356309R84663j813723l924485l525549j734824k85821N29304
5489h834639J248687J815277J490397k6030j726178j969139m40908J043796P12301
5480f686436n23580j71460J955329K889715M87796l418627n269001l961917j260530
$$ y = [-6344161, -8945944, -9772529, -7275321, -3581702, -1831381, -1813750, -900874, 1318571, 2269016, 459772, -2315994, -3630675, -3166255, -1997159, -1055659, -1179262, -2785329, -4487658, -3980460, -1527286, -456977, -2415873, -4220557, -2020079, 2934614, 5788900, 4617692, 2180532, 1127214, 798094, -229451, -1385034, -1690015, -2000826, -3698155, -6434745, -8779169, -9949823, -9509369, -6714253, -2030917, 1763328, 2187257, 344633, -420513, 935796, 1920459, 106736, -3817749, -7343298, -9078122, -9363943, -8834639, -7585952, -5770675, -4280278, -4306308, -6032486, -8001625, -8442533, -7398737, -6686436, -7210016, -7381476, -5426147, -2536432, -2048636, -5467263, -10736264, -14698181, -15958711]
5471a5958711J021526K441317K991548K592896J782822J626390K456051L359690
5463B313529L151368J457935j066544l162259l782876k986653j883083j355259
5455g313842j124110m55207N86357J137632O58942l15016n40573P72108K887986
5446c705723L862975K533041p858j663161j722344r34217K71918J820405K388575
5437B843611J92189l879274o205101m788032j654656M78011J711211L183638L981407
5428d136996K633127K16529j048195j341992k275477l093892j473267J798558
5420h721605K768912J73536k075768m27628K919480L061659o04267l520079k095514
5411h521274J828469L675605J794844j118617j934525q20102j19043n16372l29462
$$ y = [-15958711, -14937185, -12495868, -9504320, -6911424, -5128602, -3502212, -1046161, 2313529, 5464897, 6922832, 5856288, 2694029, -1088847, -4075500, -5958583, -7313842, -8437952, -8893159, -8306802, -7169170, -6510228, -6825244, -7365817, -6593709, -3705723, 157252, 2690293, 2682435, 1019274, -703070, -1637287, -1365369, 455036, 2843611, 3035800, -843474, -7048575, -11836607, -13491263, -13013252, -11302041, -8118403, -4136996, -1503869, -1287340, -2335535, -3677527, -5953004, -9046896, -10520163, -8721605, -5952693, -5779157, -7854925, -8282553, -5363073, -2301414, -2905681, -6425760, -8521274, -6692805, -3017200, -1222356, -2340973, -4275498, -5095600, -5214643, -5731015, -6060477]
5402f060477J103424J600173o01601l360868k966291N93419L376378K814290P63250
5393b738303J88629R89410R48215m65846j390037n19838R20589Q39235q81118
5384b109064k097555j029830J526808L249537L099747J931174M38577j651203
5376C358191l662089l410642l68205K360431J691592j012361k007740p99619l01089
5367d151531j533912k019554l85819J116877N56448m20036K57573J302529M34711
5358d842714j402888j501121K8457M71407r13870j625239K07774L099368M322939
5349b155887L096164P65698r77805j266693k95091Q80179J165529M05080o33427
5340I83747j119504p75801q6558k17333j882783l665472k702730J581765N546309
$$ y = [-6060477, -4957053, -3356880, -3958481, -7319349, -10285640, -9692221, -6315843, -3501553, -2738303, -2549674, -1560264, -612049, -1077895, -2467932, -2987770, -2067181, -1227946, -2109064, -4206619, -5236449, -3709641, -460104, 2639643, 4570817, 5009394, 3358191, -303898, -3714540, -4082745, -1722314, -30722, -1043083, -3050823, -3850442, -4151531, -5685443, -7704997, -8090816, -6973939, -6417491, -6837527, -6579954, -5277425, -4842714, -6245602, -7746723, -7718266, -7246859, -8160729, -9785968, -9578194, -6478826, -2155887, 940277, 1705975, 728170, -538523, -833614, 46565, 1212094, 1617174, 983747, -135757, -911558, -998116, -1215449, -3098232, -6763704, -9466434, -7884669, -2338360]
5331b338360N157595J137678k047067k121202j132523j129817q73082J204422
5323b142356L245054K147983j594948m141598l235407m79098J507203J932349
5315b760818J299242J96127l47447Q54829L164333L928440J767556j248786k370589
5306D482887j868767j851328k347434j375775J066864J984821m69869l937002
5298d315603m570642j625506K090976L583321K327296J20613p51931N04825K512475
5289a24176L291141K482569J224010R1232j277470k485665k422230j588902j988045
5280b797536l470415k783053J590837N885651N278672K79757m100679m691544
5272d808310k673059l58096J243253J522556P5645j799702j884270j00575J325491
$$ y = [-2338360, 2819235, 3956913, 1909846, -211356, -1343879, -2473696, -3346778, -2142356, 1102698, 3250681, 1655733, -2485865, -5721272, -6200370, -4693167, -2760818, -1461576, -1265449, -1612896, -758067, 2406266, 6334706, 8102262, 6853476, 4482887, 2614120, 762792, -1584642, -2960417, -1893553, 91268, -378601, -4315603, -8886245, -10511751, -8420775, -4837454, -2510158, -2389545, -3141476, -2636651, -124176, 3166965, 5649534, 6873544, 6964776, 5687306, 3201641, 779411, -809491, -2797536, -6267951, -9051004, -7460167, -1574516, 3704156, 3983913, -116766, -4808310, -7481369, -7839465, -6596212, -5073656, -4998011, -6797713, -8681983, -8782558, -7457067]
5263g457067J285451J055836J484986J431574K05705p17567l2283J152625J123686
5254d67054K52935J52196J071241J743982J318565J51090j038554j809541j924336
5245e49476j329230k87426O59667Q90321J61504q76021j201941r34665j377116
5236d844383k700463k849591l39287K936156L711728J430825j728913m027642
5228h411570m891764l379228P91621M821784M911664J383351j351305o78975J369381
5219e435041J990591J145848n0522j451441k723697k634125j111008J68183M48310
5210i652902Q44555J720788J854410J136556R73111R73045j064319m390296m728637
5201a2333689p72332K916040K510347M10704N09681J809330J170358p84947j371695
$$ y = [-7457067, -6171616, -5115780, -3630794, -2199220, -1993515, -2711082, -2743365, -1590740, -467054, -214119, -61923, 1009318, 2753300, 4071865, 4222955, 3184401, 1374860, -549476, -1878706, -2166132, -1506465, -616144, -454640, -1330661, -2532602, -3467267, -4844383, -7544846, -10394437, -10733724, -7797568, -4085840, -2655015, -4383928, -8411570, -13303334, -16682562, -15890941, -11069157, -6157493, -4774142, -6125447, -6804422, -5435041, -3444450, -2298602, -2349124, -3800565, -6524262, -9158387, -10269395, -10101212, -9652902, -8808347, -7087559, -5233149, -4096593, -3123482, -2150437, -3214756, -7605052, -12333689, -13106021, -10189981, -7679634, -7268930, -6759249, -4949919, -3779561, -4564508, -5936203]
5192e936203r32237j303957j287840J250300M357667M299796J807810Q22267J703411
5183D781014J051723j770717l285801j824405j7373j30026r80687q41873J672
5174c016473P10621J036327M88180r11561j284999N00286J703654o09055l545952
5165d928972j525080M409950O680779K223286k809819k427454Q50974J278540
5157C752204j223506k596897j791638j092715j216755q86198k68179p06635j629716
5148g660035j244860J95017R13891P40137P20377M58378q45349j449221R23180
5139g248485M212782L508455j459591m490689j070988M944511O298967J925290
5131F620252k516222l048475j891503k365766l336272j918974Q03567J030389
$$ y = [-5936203, -6868440, -8172397, -9460237, -8209937, -3852270, 447526, 2255336, 3077603, 4781014, 5832737, 4062020, 776219, -1048186, -1065559, -1195585, -2176272, -3018145, -3016473, -2305852, -1269525, -781345, -1692906, -2977905, -2477619, -773965, -1383020, -4928972, -6454052, -2044102, 4636677, 6859963, 4050144, 1622690, 2473664, 3752204, 2528698, -68199, -1859837, -2952552, -4169307, -5055505, -5323684, -6030319, -7660035, -8904895, -8709878, -7795987, -7055850, -6335473, -5877095, -6722444, -8171665, -7248485, -3035703, 472752, -986839, -5477528, -6548516, -1604005, 4694962, 6620252, 4104030, 1055555, -835948, -3201714, -6537986, -8456960, -7653393, -6623004]
5123f623004j457689k565110k05269K712072L423089L495304M791670M786706
5115H357769N83709m528235m177767J553004N129294J629426m732295o719694
5107b904789l253325P47903J541268J63380m95311N29870J917613K108254J088670
5098A443533K86988P22789J710508K062595J942362K196500K327975R66097j630969
5089A2028378l379815l029391j485844k42865K6199q08583k419497l634937l446632
5080f392987k466370j970452j770010p21144J015781K164506K414457K279234
5072e446985J437917l94230j555193k36791K224531K929168J898586J491661J613126
5063C961790k99802m026816n711549l599182o22914L68343J94854M06378N13391
$$ y = [-6623004, -8080693, -10645803, -10851072, -8139000, -4715911, -1220607, 3571063, 8357769, 8941478, 4413243, 235476, 1788480, 6917774, 8547200, 3814905, -2904789, -6158114, -5410211, -3868943, -3705563, -4200874, -3671004, -1753391, 354863, 1443533, 1730521, 2453310, 4163818, 6226413, 8168775, 10365275, 12693250, 13659347, 12028378, 8648563, 5619172, 4133328, 3890463, 3916662, 3108079, 688582, -2946355, -6392987, -8859357, -10829809, -12599819, -13320963, -12305182, -10140676, -7726219, -5446985, -4009068, -4403298, -5958491, -6195282, -3970751, -1041583, 857003, 2348664, 3961790, 3661988, -364828, -6076377, -9675559, -10298473, -9930130, -9735276, -9328898, -8815507]
5054h815507J99094O95570J749728P72790k576362m520430k606475M26824J232688
5045a3442080Q91775J834484K867141J464796j216883j873159j99152J290702
5037h382376J547308J580993J502920K64390j817908k856589j768377P17164K969980
5028f242495L366879J436215j007656j489819l25644j69141j509507j882291o54750
5019h478209m88539k034956j760940J789318M174905J789206j807431j546531
5011h363177P78185P198l146470l302322K67879K480521R44423o91994O95780
5002a0329977L150039L635394K310314O93749r68608k443706k393396n08875J210096
4993e644970Q90559q64399k006724j310270P56425K344117J524684j499359l849126
$$ y = [-8815507, -8616413, -7920843, -6171115, -5398325, -7974687, -12495117, -15101592, -14674768, -13442080, -12550305, -10715821, -7848680, -6383884, -7600767, -9473926, -9673078, -8382376, -6835068, -5254075, -3751155, -3486765, -5304673, -8161262, -9929639, -9212475, -6242495, -2875616, -1439401, -2447057, -3936876, -4262520, -4431661, -5941168, -7823459, -8478209, -8966748, -11001704, -12762644, -10973326, -6798421, -5009215, -6816646, -8363177, -7584992, -7577794, -10724264, -14026586, -13758707, -11278186, -10333763, -11025757, -10329977, -7179938, -3544544, -1234230, -540481, -1509089, -3952795, -6346191, -6855066, -5644970, -4754411, -5618810, -7625534, -8935804, -8179379, -5835262, -4310578, -5809937, -9659063]
4984i659063k956743L63482L071795L438604K187556R64841Q67681J588847J227212
4975A094212j621057n014252n183985j761126J395239J801187J292196J621436
4967f376150J207438r86960k416778j269042M5617n01908n01820J943250L385011
4958e471342N53096l032310k151446J441496K026948p29202k246426j225169n24690
4949a1359045p57531L82084K676898L291999K023553J296927J360347N41051n93781
4940a137498l93311j20528j646668l046175k030275j230432l586218n312081j266094
4931a9769280N047197N683226R64030j405089P44218J827426m08256j471134O56274
4922h131388K109440J017801L32669Q54036m22259l260305l518796r88251J14412
$$ y = [-9659063, -12615806, -12252324, -9180529, -5741925, -3554369, -2589528, -1721847, -133000, 1094212, -526845, -5541097, -10725082, -12486208, -11090969, -9289782, -7997586, -6376150, -5168712, -6155672, -8572450, -9841492, -9795875, -10297783, -10799603, -8856353, -5471342, -4918246, -7950556, -10102002, -8660506, -6633558, -7362760, -9609186, -10834355, -11359045, -12116576, -11734492, -9057594, -5765595, -3742042, -2445115, -1084768, -543717, -1137498, -1530809, -1651337, -3298005, -6344180, -8374455, -9604887, -13191105, -18503186, -19769280, -14722083, -9038857, -8074827, -9479916, -8735698, -6908272, -7316528, -8787662, -8131388, -6021948, -5004147, -4671478, -3817442, -4239701, -7500006, -11018802, -12007053, -11892641]
4913a1892641o18962M22885K384605P56323k762885j688520K969063L157442j917748
4904i190438m042371q54077L87727k789670l279720J382440L374504j151902n048875
4895b1212382l458940j485701k625952k482644J19306o06111m363136k961787
4887c9077347K831438J765554o285000p086179J576900L161792p216942j1544262
4879f1874046k742965p19862j4632166k1799834j2490203j9203298n7661497p1801504
4871b62925375q37784J13447437J57591382R2116496L46356k9349825q009710
4864F2378977K932766r566697j3680511j349460L895441m461945p620258R3026
4856C2621339K953770m144167p370025j308928K512627j036082k438677K332866
$$ y = [-11892641, -12511603, -12088718, -9704113, -8947790, -11710675, -13399195, -10430132, -7272690, -9190438, -13232809, -14086886, -13699159, -16488829, -19768549, -18386109, -15011605, -16163507, -21212382, -24671322, -26157023, -28782975, -31265619, -31146313, -31752424, -36115560, -39077347, -36245909, -34480355, -40765355, -47851534, -46274634, -43112842, -50329784, -61874046, -64617011, -65336873, -79969039, -101768873, -114259076, -133462374, -191123871, -262925375, -263763159, -150315722, 7275660, 99392156, 99738512, 70388687, 62378977, 65311743, 55745046, 42064535, 40715075, 44610516, 40148571, 32528313, 32621339, 35575109, 31430942, 24060917, 22751989, 25264616, 24228534, 21789857, 24122723]
4848B4122723M250751p53461m551747k964080k537105n897702n838709J81274
4840F011944L822491M18328k913639j23970M117263M070223K132931J938722J141846
4831B0616139k474125n226351l846856j188555n78956m77881P55794P41569j767245
4822F553533l173486j003708J399300M96017j661706j488489L11983J106576J128537
4813C668557K033860L295826L300286J963659j6210k319500l808176k835843k95598
4804D986861M42388j795542m057626l422309n06486K314360L561130K623982r8952
4795D047806k167378j106620J716914K205047o85173l377002k821877j08122K090842
4786b05563K636568J448552j079811l032222k181750N97376J794072J40052j631068
$$ y = [24122723, 28373474, 27620013, 23068266, 20104186, 17567081, 11669379, 5830670, 6011944, 9834435, 10252763, 7339124, 7215154, 11332417, 15402640, 17535571, 19474293, 20616139, 18142014, 12915663, 9068807, 7880252, 7301296, 6823415, 7579209, 8320778, 6553533, 3380047, 2376339, 3775639, 4271656, 2609950, 1121461, 1433444, 2540020, 3668557, 5702417, 8998243, 12298529, 14262188, 14245978, 11926478, 8118302, 5282459, 4986861, 5429249, 3633707, -423919, -3846228, -4352714, -2038354, 1522776, 4146758, 4047806, 1880428, 773808, 2490722, 4695769, 4010596, 633594, -2188283, -2296405, -205563, 2431005, 3879557, 2799746, -232476, -2414226, -1816850, -22778, 117274, -1513794]
4777a513794q94632J562646L336692L185889J289119j099613j946185o17007M75577
4768C778692r27750k793958j455606K149167L410953J370327N4099J426481K270018
4759I282423L06538j523068j73499K167745J726094q04069j768291k43266J327839
4750A0298446J132815k76548j688200k516017k685469k481006k050147p26318
4742i92444J891892M121233L557707O58065j457355j361901p81897r94257r86678
4733C654365m82674j308091l656641m287067j205664K638885L431780J909500
4725F94393J325904J935584J339592p15902j784379r23503o1001n51519j169866
4716H9303n96308K65370j32309j438700j924158j004563L6699K7480l12168N95977
$$ y = [-1513794, -2408426, -845780, 2490912, 5676801, 6965920, 5866307, 3920122, 3303115, 3778692, 2850942, 56984, -1398622, 750545, 4161498, 5531825, 5585924, 7012405, 9282423, 9588961, 8065893, 7892394, 10060139, 11786233, 10982164, 9213873, 8970607, 10298446, 11431261, 11154713, 9466513, 6950496, 4265027, 1784021, -266126, -992444, 899448, 5020681, 8578388, 9236453, 7779098, 6417197, 5635300, 4641043, 3654365, 3171691, 1863600, -1793041, -6080108, -7285772, -4646887, -1215107, 694393, 2020297, 3955881, 5295473, 4579571, 2795192, 1871689, 1810688, 1259169, 89303, -507005, -241635, -373944, -1812644, -3736802, -4741365, -4704666, -4677186, -4989354, -4393377]
4706d393377K635101L675960K341721m4733j336650j370308j407184j665940j411142
4697b976552r90704j461455k194078j243972J410051L190877K264612k58718k141251
4688d401190k314776q28849J590780L194041K263201n75614k640467k426623r34294
4679g073791N88554K054060K973609J969455o97242k196141n33318K594590L969351
4670C649127K600006j39833k752681m271450l750504j072197K046101L330745
4662c60686K236108J07900j628297k543972k652361j752340J85604K260131K957322
4653a190591J796030K47546p2494J26975j034221k849142k143158J611460M312612
4644H05017K748189o80960j935189j426432k042768l233830k061308J029384K730858
$$ y = [-4393377, -1758276, 1917684, 4259405, 4214672, 2878022, 1507714, 100530, -1565410, -2976552, -3967256, -5428711, -7622789, -8866761, -7456710, -4265833, -2001221, -2259939, -4401190, -6715966, -7544815, -5954035, -2759994, -496793, -1072407, -3712874, -6139497, -7073791, -6485237, -4431177, -1457568, 511887, -185355, -2381496, -2914814, -320224, 3649127, 6249133, 6109300, 3356619, -914831, -4665335, -5737532, -3691431, -360686, 1875422, 1983322, 355025, -2188947, -4841308, -6593648, -6408044, -4147913, -1190591, 605439, 852985, 780491, 907466, -126755, -2975897, -5119055, -3507595, 805017, 3553206, 2872246, 937057, -489375, -2532143, -5765973, -7827281, -6797897, -4067039]
4635d067039K653446L221909L934569J611453k899309m381647j395080J085857
4627b35841l04123k221852q23525K000184K571798J383178Q95615Q12235l34959
4618C742710j657096j714321j392342j730892j508118p7828L12386j665577l305029
4609h996107k098494n7744N279n40184Q27509K582639J759938m30921m63465J640754
4599e770796K911296K519192J878146J017597p38485j732973p2627K331131K194453
4590D536934K14004m53316J76532l53660j639035j113827N55669L00035j264592
4581I58744l56326K816505L355465l21192l367252j883275J410815J928015k23175
4572D318324j707327j157661J94525J151523J255430K38731j334955k029268j414948
$$ y = [-4067039, -1413593, 1808316, 5742885, 7354338, 4455029, 73382, -1321698, -235841, -539964, -2761816, -3585341, -1585157, 986641, 2369819, 3265434, 4077669, 3742710, 2085614, 371293, -1021049, -2751941, -4260059, -4337887, -4025501, -5691078, -8996107, -11094601, -11152345, -11147066, -11687250, -10859741, -8277102, -6517164, -6948085, -7411550, -5770796, -2859500, -340308, 1537838, 2555435, 1816950, 83977, 11350, 2342481, 4536934, 4750938, 4297622, 4474154, 4120494, 2481459, 1367632, 1923301, 2223336, 958744, 602418, 3418923, 6774388, 6453196, 3085944, 1202669, 2613484, 4541499, 4318324, 2610997, 1453336, 1647861, 2799384, 4054814, 4293545, 2958590, 929322, -485626]
4563d85626p82750j076093j433374n63160J570435L807019M480989K355359j654351
4554F218448m287776l372611p52205L41165k36715m48420k26911r89708j704120
4545e458853J63928L544353M079517O08545k771312k633397m81557O62956M86735
4536a799085J75118m9106j40556N05907J285192L03495k400991m034061k932276
4527i086363q22018K00413M12766Q00357J232124J688824K687731L220442J224488
4518A558764k465774l913288j654963Q73463P26576j56050J190977L637648M138896
4509C936249K586444R37127n79342k805278m589244l848814r93629J534755K508821
4500a312911K367893J352442m13041j743676j529709m34988K86016O93213J212865
$$ y = [-485626, -1268376, -2344469, -3777843, -4341003, -2770568, 1036451, 5517440, 7872799, 6218448, 1930672, -1441939, -2194144, -1852979, -2089694, -2538114, -2765025, -3754733, -5458853, -5294925, -1750572, 2328945, 2937490, 166178, -2467219, -2948776, -2285820, -1799085, -1623967, -1673073, -1813629, -1307722, -22530, 280965, -2120026, -6154087, -9086363, -9908381, -9707968, -9295202, -8494845, -7262721, -5573897, -2886166, 334276, 1558764, -907010, -4820298, -6475261, -5601798, -4875222, -5031272, -3840295, -202647, 3936249, 6522693, 7459820, 6880478, 4075200, -514044, -4362858, -5356487, -3821732, -1312911, 1054982, 2407424, 1994383, 250707, -1279002, -1713990, -1427974, -734761, 478104]
4491D78104J113431j41845j314547j135896l49727j33334l973O49997O49885r45975
4481a133880k459028j818352K24856J631947K243830K674444J876689p39666k333868
4472A66972J02665M346684N133711J610700j711461j881347j017735j680718k895404
4463B174067k939832k653872l233325l258342q94448K502181L787050K281867
4455b234654K87308l09107Q4830K86859k073n09400j111876j588076j420699n42097
4445g058985J69707q4316o66771j42597J434982K013625L20324j808303j570547
4436g392881P77393K184649J254066J4312L40386J034689K36500j231566j248198
4427d030650J14647Q62886J89705q31965j262293j013667J51767K323984M123568
$$ y = [478104, 1591535, 1449690, 135143, -1000753, -1350480, -1483814, -1487787, -837790, -187905, -1133880, -3592908, -5411260, -5186404, -3554457, -1310627, 1363817, 3240506, 2500840, 166972, 269637, 4616321, 9750032, 11360732, 9649271, 7767924, 6750189, 5069471, 2174067, -765765, -3419637, -6652962, -9911304, -10805752, -8303571, -4516521, -2234654, -1947346, -2256453, -2171623, -1884764, -1886837, -2396237, -3508113, -5096189, -6516888, -7058985, -6889278, -6973594, -7640365, -7782962, -6347980, -4334355, -4014031, -5822334, -7392881, -6615488, -4430839, -3176773, -3162461, -2822075, -1787386, -1550886, -2782452, -4030650, -3916003, -3053117, -2863412, -3695377, -4957670, -5971337, -5819570, -3495586, 627982]
4418F27982L602358R00005j497401j718489o38550m68896j885727l145009k086223
4409f309950J046298L303530K414772J9730k38686K071808L286641R66345k438310
4400D122178l146712j102422R49706J657956J555540P23218r69931k073943j037809
4391F77781Q81652J024840n94821j464932p49873k99178j113026j706399q73906
4382d217862L72115O77657K05803k46977k80583N39666K328231L567099K144886
4373E090035j481096l980865k958218M09907L226567L847574K409891R5513j288412
4364E370896n27399J300286J647582k64918k386305k649543j367503p9698M40316
4355A483714Q1246j198456k660516k718182q64113J238230J729127Q17039o149
$$ y = [627982, 4230340, 5130345, 3632944, 1914455, 1275905, 807009, -1078718, -4223727, -6309950, -5263652, -1960122, 454650, 474380, 235694, 2307502, 5594143, 6560488, 4122178, 975466, -126956, 822750, 2480706, 4036246, 4759464, 3789533, 1715590, 677781, 1559433, 2584273, 1989452, 524520, -225353, -524531, -1637557, -3343956, -4217862, -3845747, -3168090, -2962287, -3209264, -3489847, -2950181, -621950, 2945149, 5090035, 3608939, -371926, -3330144, -2920237, 306330, 4153904, 6563795, 6659308, 5370896, 4843497, 6143783, 7791365, 7526447, 5140142, 2490599, 1123096, 1043398, 1483714, 1564960, 366504, -2294012, -5012194, -5876307, -4638077, -2908950, -2091911, -2098060]
4346b098060k27304n20030j134614j390424q84707k62314l13129p01603j65809
4337g697994J839882M114034M916670M024798K683053J521448j37502k460210
4329H804179m145770m245082l508935k809146j759066k46447M44473j33309n8221
4320g657324J952728L780473K942915P27908m7715J02734j205765k948151j754203
4311d106400J687142K452974j029325l965115k086883K379552M469717L080453
4303B882115P98781n37908j093767j241440r70984l75031N52675J580868J325375
4294B920684j242983l960061l147589Q13934L038860J058461j452145n52410J900150
4285f23099J830542k22401m65435J457375J878312q56302l826612l914391j770170
$$ y = [-2098060, -2325364, -2845394, -3980008, -5370432, -6255139, -6517453, -6830582, -7532185, -7697994, -5858112, -1744078, 3172592, 7197390, 9880443, 11401891, 11264389, 8804179, 4658409, 413327, -3095608, -5904754, -7663820, -7910267, -7465794, -7599103, -7657324, -5704596, -1924123, 1018792, 1746700, 1698985, 1801719, 595954, -2352197, -4106400, -2419258, 33716, -995609, -4960724, -7047607, -4668055, -198338, 2882115, 3680896, 3142988, 2049221, 807781, -163203, -538234, 14441, 1595309, 2920684, 1677701, -2282360, -5429949, -4616015, -1577155, -518694, -1970839, -2523249, -623099, 1207443, 985042, 519607, 1976982, 3855294, 2998992, -827620, -4742011, -6512181]
4276f512181j78722l59352j061116m85717J513913L048154K291819q6100j631811
4267c461113j245638K0738J336243K814260L408100J254644k556644l943050j641771
4258d014231L45012j107724l084625j338114K778451M570548L124398J473196
4250B746911J004338M18260m51353l13658L32652k32585j347700r21258L47550
4241A583157r1682j731224j572634L43930Q10581o52162q60010R78768J543268
4232C51992l68689j151651J183577K787438P0480m013923m384883j567989m4246
4223g137894p16913k79934K219254L178501K51119l268427k414197K718948O652077
4214A202534M956925o45217m675893m570786k991177l021605l535849j625188
$$ y = [-6512181, -6690903, -7050255, -8111371, -8597088, -7083175, -4035021, -1743202, -1829302, -3461113, -4706751, -4686013, -3349770, -535510, 2872590, 4127234, 1570590, -2372460, -4014231, -3669219, -4776943, -7861568, -9199682, -6421231, -1850683, 1273715, 2746911, 3751249, 4169509, 3718156, 3404498, 3737150, 3504565, 2156865, 1235607, 1583157, 1491475, -239749, -1812383, -1468453, -657872, -1310034, -2170044, -1191276, 351992, -16697, -1168348, 15229, 2802667, 2873147, -1140776, -5525659, -7093648, -7137894, -7854807, -8134741, -5915487, -2736986, -2485867, -5754294, -8168491, -5449543, 1202534, 6159459, 5514242, 838349, -3732437, -6723614, -9745219, -13281068, -14906256]
4206a4906256K057892L754902K022271n94537j583488j065438J33655J800984
4198h380015K798502J359634j748415l218810j702440M98295J465029K159684
4190f768536L233540K845431J69256j995787j091556J138820J361709o15459k509782
4181d232364k998071j941544P47337L827530M431818J832015n43734L23206K581335
4172D027528K588625K77623j767103k478755k214008o25394J891438K838712J284125
4163E822791L22518J949923K654727q42421m693155l184745J633060K944393J18942
4154F726033j383116k05337l77271k164295j057672K617735K959933k2178J065098
4145H158930O419566M591895r357210k1786813j7835876l094718M946360J941352
$$ y = [-14906256, -12848364, -9093462, -7071191, -7665728, -9249216, -10314654, -10180999, -8380015, -5581513, -4221879, -5970294, -9189104, -10891544, -10393249, -8928220, -6768536, -3534996, -689565, -520309, -2516096, -3607652, -2468832, -1107123, -1722582, -4232364, -7230435, -9171979, -8424642, -4597112, -165294, 1666721, 1122987, 1446193, 4027528, 6616153, 6893776, 5126673, 2647918, 433910, -191484, 1699954, 4538666, 5822791, 6145309, 8095232, 10749959, 9907538, 5214383, 2029638, 3662698, 6607091, 6726033, 5342917, 5137580, 4760309, 2596014, 1538342, 4156077, 7116010, 7093832, 8158930, 14578496, 19170391, 9813181, -11973632, -29809508, -32904226, -27957866, -26016514]
4137b6016514r51139K399766N164740K196842r25987J152476M178893K479504
4129a0321419j455638k338850q48359m45645l75924J703718L969947L475549J862764
4120d773857K194879K822836M42284k905063k303324J660038L336082P95196j836980
4111e67909j674377j048354k278330l364035j798440Q77765J508159N4241r60599
4102i251879l75169O57987R32576N14271M3505p1861J61672L79663K95512J85250
4092f528473M77946J030470J536250K272055L335747L588357J920943o22668j781460
4083E229167j188761o29860r56927r59867n1123K41565j040277k008379m08240
4074a772702K681009L771649J444097j743531k247512L84925K940248K063346
$$ y = [-26016514, -26967653, -24567887, -19403147, -17206305, -18132292, -16979816, -12800923, -10321419, -11777057, -14115907, -14964266, -15409911, -15785835, -14082117, -10112170, -6636621, -4773857, -2578978, 243858, 686142, -2218921, -4522245, -2862207, 473875, 1269071, -567909, -2242286, -3290640, -5568970, -8933005, -10731445, -9853680, -8345521, -8291280, -9251879, -9627048, -8969061, -8036485, -7522214, -7478709, -7550570, -7388898, -7009235, -6713723, -6528473, -6050527, -5020057, -3483807, -1211752, 2123995, 5712352, 7633295, 7010627, 5229167, 4040406, 3410546, 2453619, 1493752, 1442629, 1684194, 643917, -1364462, -1772702, 908307, 4679956, 6124053, 4380522, 2133010, 2517935, 5458183, 7521529]
4066G521529j752024m362146k846030P03059J920968J24042j141827N8595Q20495
4057A046661j943782o071083o533624k301351K297054L277071J517811O19304
4049h091939J960027L327194K069021j331219l380608j577168K176203L451591
4041a396898P85688k502677k952318j357232m98471k93851J569458M809855O012450
4032D176004L678567O62210l1766O32715r6433k354924l965876m064651l730571
4023e094725l215121j184600K438002M894047L478118q08955l980536l392311
4015f866081k87187K220795K750516K448167K628079K780114J433724j589546
4007E518581m525413n250466l167597L47318K988900L174155J248791p61809r40591
$$ y = [7521529, 5769505, 1407359, -1438671, -735612, 1185356, 1309398, 167571, 226166, 1046661, -897121, -6968204, -13501828, -15803179, -13506125, -10229054, -8711243, -8091939, -6131912, -2804718, -735697, -2066916, -5447524, -7024692, -4848489, -1396898, -611210, -3113887, -6066205, -7423437, -7921908, -8215759, -6646301, -1836446, 4176004, 7854571, 8516781, 8485015, 9117730, 9021297, 6666373, 2700497, -1364154, -5094725, -8309846, -9494446, -7056444, -2162397, 1315721, 506766, -3473770, -6866081, -7153268, -4932473, -2181957, 266210, 2894289, 5674403, 7108127, 5518581, 993168, -4257298, -7424895, -7077577, -4088677, -914522, 334269, -427540, -1368131]
3998a368131P40726K464402K364909K36782k336051l344790k092499O3781Q36301
3989b434570p34034l166987m019738k448082M4458J418189J235786P30079R79552
3980h395347J532456J179798j52743j015782k76679J305864K087178J664563J011055
3971a059637P40380M79546N6756R246M86004P84138M56106j84878r91508k049796
3961a273643k416071o41844K447211L487447Q18726k668793l078789n81511J537455
3952b369812J879795J972896K575735K204764J90942j503398j023046O84211J424436
3943F036523O64283n93399j867805l550900n436535o104480m201973j58598L579597
3934a1633287M523539K769442J078914J559981K941248K409214l46154k608761
$$ y = [-1368131, -627405, 1836997, 4201906, 4438688, 2102637, -1242153, -3334652, -3270871, -2434570, -3168604, -6335591, -10355329, -12803411, -12758953, -11340764, -10104978, -9374899, -8395347, -6862891, -5683093, -5835836, -6851618, -7128297, -5822433, -3735255, -2070692, -1059637, -319257, 160289, 217045, 226291, 712295, 1496433, 1952539, 1767661, 776153, -1273643, -3689714, -4331558, -1884347, 1603100, 2421826, -246967, -3325756, -3907267, -2369812, -490017, 1482879, 4058614, 6263378, 6454320, 4950922, 3927876, 4612087, 6036523, 6700806, 6107407, 4239602, 688702, -4747833, -10852313, -15054286, -15212884, -11633287, -7109748, -4340306, -3261392, -1701411, 1239837, 3649051, 3302897, 694136]
3926F94136k179577J71475K139826K383149J128838n28294j409190j152309n92461
3917F55593o36549j043181j146399j103052j116562k82206J895074L572285K577397
3908C372400n7851j302842p40114q68752k473816l110922j244159J412712L128138
3899a885206M433287N337655L702705r17948m810149m694486k399858j604694
3891b838694k115564j257879P16602J010694n98540j309950j14928Q42019L46232
3882e320008p6495M50502K88451j474906k662945j088636J850277K904225J329323
3873c800212m46340k34547J342759K026231Q81961o11550o55338K69606Q0911
3864a146519j563947k414589j097877N26026L62597l75210O29871K414259K077085
$$ y = [694136, -1485441, -1313966, 825860, 3209009, 4337847, 3809553, 2400363, 1248054, 655593, 19044, -1024137, -2170536, -3273588, -4390150, -4672356, -2777282, 795003, 3372400, 3314549, 2011707, 1271593, 402841, -2070975, -5181897, -6426056, -5013344, -1885206, 2548081, 7885736, 11588441, 10670493, 5860344, 1165858, -1234000, -2838694, -4954258, -6212137, -5495535, -4484841, -5083381, -6393331, -6508259, -5666240, -5320008, -5396503, -4946001, -4657550, -6132456, -8795401, -9884037, -8033760, -5129535, -3800212, -4246552, -4481099, -3138340, -1112109, -230148, -841698, -1497036, -1227430, -1146519, -2710466, -5125055, -6222932, -5696906, -5334309, -5709519, -5079648, -2665389, -588304]
3855e88304k3378m11824J651056K524765J1260k899519k669259n07966K74644
3846b638525j10423J004613L183470K803638r65083m006690k854366M76172J720546
3837a386648M53394j37191J194139J785850m96836l582448l894964j158851J662116
3828e561439K378693J320180m80345k338793k960539j055258K088539K969779
3820c639183L38460k625840k368928M51785K434956K079478O74465m21467r00479
3811c976753m10557J228522K714639K233417l8664j990857k180375r88848N97710
3802b811766J872613K286549J857905J439207J399877P86487q56408k021186j453971
3793B499307m86890p48509r50957Q80723L073660K100678j589615l645447k150667
$$ y = [-588304, -611682, -1023506, 627550, 3152315, 3163575, 264056, -2405203, -2913169, -2638525, -2748948, -1744335, 1439135, 4242773, 3277690, -729000, -3583366, -3107194, -1386648, -933254, -1070445, 123694, 1909544, 1412708, -2169740, -6064704, -7223555, -5561439, -3182746, -1862566, -2342911, -4681704, -7642243, -8697501, -6608962, -3639183, -3300723, -5926563, -8295491, -7843706, -5408750, -3329272, -2654807, -3076274, -3976753, -4387310, -3158788, -444149, 1789268, 1750604, -240253, -2420628, -3409476, -2811766, -939153, 1347396, 3205301, 4644508, 6044385, 6830872, 5974464, 3953278, 2499307, 2012417, 1263908, 312951, 1193674, 4267334, 6368012, 4778397, 1132950, -1017717]
3784a017717J20838O73593M68479O71841J77419j475987k165843o20797J174381
3775a993793J409949J334196K069436J602901j592133m418110k758242K080538
3767b265258M537683K143567j721456k790863r20170P57268l819k228965l158283
3758e650296j720076j5301l02131j263714J81078L422496M132900Q75334k169456
3749b509166j423132R36001J350323Q59010K271601M149143K885675p13932k272699
3740E532824p13345P46626M19527m903R3151j050363l232994l335831o47271J064520
3730a128059p62554l317893k717644M32326K677298K666995J600192L88238q65209
3721a026310j580869j250294o43862o99997q47028N9437J737774K751751K332706
$$ y = [-1017717, -896879, -223286, 245193, 917034, 1094453, -381534, -2547377, -3168174, -1993793, -583844, 750352, 2819788, 4422689, 2830556, -1587554, -4345796, -2265258, 2272425, 4415992, 2694536, -96327, -1016497, -259229, -263048, -2492013, -5650296, -7370372, -7385673, -7687804, -8951518, -8770440, -5347944, -1215044, -339710, -2509166, -3932298, -2996297, -1645974, -786964, 1484637, 5633780, 8519455, 7805523, 5532824, 4819479, 5566105, 5985632, 5980729, 6073880, 5023517, 1790523, -1545308, -2192579, -1128059, -1890613, -5208506, -7926150, -7493824, -4816526, -2149531, -549339, -161101, -1026310, -2607179, -3857473, -4501335, -5201332, -6048360, -5988923, -4251149, -1499398, 833308]
3712H33308R88939k14405m14066L03351N97795o62835k471236k642980r59308
3703d641437M42513L28726K1645R40083K453516L230225K827888R57434k600194
3694C960399o023684n903045j714146K299595K094134j101414l094344k344205
3686a1826710m71329J279366K767296L098635J497553l24555q826J335580L49279
3677b303711k895129m169614j275414K578001L623346K710629K837813L813944
3669D919865K857877m76231l354454l760328k750143j907662q78269J199309L336478
3660h13558L451316J015225k215046l987369l378599j103134J184723J933770
3652c912672Q20271q92824j516940n61357J129690K625010L430834K785058j15668
$$ y = [833308, 1822247, 1607842, 1193776, 1497127, 2094922, 1432087, -1039149, -3682129, -4641437, -4198924, -3870198, -3848553, -2908470, -454954, 2775271, 5603159, 6560593, 3960399, -2063285, -7966330, -9680476, -7380881, -5286747, -6388161, -9482505, -11826710, -12298039, -11018673, -8251377, -5152742, -3655189, -3979744, -3988570, -2652990, -2303711, -5198840, -9368454, -10643868, -8065867, -4442521, -1731892, 1105921, 4919865, 7777742, 7301511, 3947057, 186729, -2563414, -4471076, -5349345, -4150036, -813558, 2637758, 3652983, 1437937, -2549432, -5928031, -7031165, -5846442, -3912672, -3092401, -3985225, -5502165, -6063522, -4933832, -2308822, 1122012, 3907070, 3791402]
3643C791402m224391o232230l902648N65451K573998Q65208r05460N40208L293033
3634c635429K993950p55263l604769k292363J362169L462947K931867J543293
3626B006402N11905n31979j562923j546992l12424Q02746R33045P72931Q63906
3617A936617M45021p64117j303492l27903K23173j686046m228843l509567O77063
3608h538094M024164L455840P23541j096658j758924k305958j910684O85839M000699
3599b720235N075056L298912N71259j649960l051241k968543r62263J349066J637480
3590E79531M4212j291592j591883j750429j617165p6084K021040K263455O15618
3581h03297k81095M56591O37595o81448j220685K12856R86816r88339l145236
$$ y = [3791402, -432989, -6665219, -10567867, -10002416, -7428418, -6563210, -7468670, -6928462, -3635429, -641479, -1396742, -5001511, -7293874, -5931705, -2468758, 463109, 2006402, 2518307, 1986328, 423405, -1123587, -1436011, -633265, 299780, 1072711, 1936617, 2381638, 1617521, 314029, -13874, 209299, -1476747, -5705590, -9215157, -8538094, -4513930, -1058090, -334549, -1431207, -3190131, -5496089, -7406773, -6720934, -2720235, 2354821, 5653733, 6224992, 4575032, 1523791, -1444752, -2407015, -1057949, 579531, 623743, -667849, -2259732, -4010161, -5627326, -5703410, -3682370, -1418915, -803297, -1084392, -627801, 9794, -671654, -1892339, -1679483, -692667, -1681006, -4826242]
3572d826242j916152J597109L104902J034131k131062l553878k467839K56853
3564h902178K596586K349356j84005j687666j91806J761165J101805n53030M27081
3555c282692L098099K789920j385578m577863l076317P92406K607688J574712
3547a459625L9031m28163j64881m375m61538j431536j765641k93907K111830K960450
3537h98355J282671j126543k111818j219692Q68739K889454K716179p64720m733988
3528c098073m479920J43169L428567J217919l385102m674079k112005K91544M95939
3519a2172041M34k77941j222038k282231j120852K316914M771311M232707K624220
3510c129517K243430K302063J184668k79581n13804l40925j421497k773863k161586
$$ y = [-4826242, -6742394, -5145285, -2040383, -1006252, -3137314, -6691192, -9159031, -8902178, -6305592, -3956236, -4140241, -5827907, -6019713, -4258548, -3156743, -3709773, -3282692, -184593, 2605327, 1219749, -3358114, -6434431, -5642025, -3034337, -1459625, -1420594, -1848757, -2013638, -2018013, -2479551, -3911087, -5676728, -5970635, -3858805, -898355, 384316, -742227, -2854045, -4073737, -3204998, -315544, 2400635, 1635915, -3098073, -7577993, -7434824, -4006257, -2788338, -6173440, -10847519, -12959524, -12667980, -12172041, -12171607, -12449548, -13671586, -15953817, -17074669, -14757755, -9986444, -5753737, -3129517, -886087, 1415976, 2600644, 2321063, 1807259, 1466334, 44837, -2729026, -4890612]
3501d890612m16047p65945l387805m210441p79211L714683M745817K525629P01184
3492b762748N25736O5453j148023p55443J954901L750617J970811j204634j820352
3483E76318K12594J566283O03289j074395j837933j741195q84988R10744K249001
3474E79718J033799j741164k194026P45993K896279O35028l523623m583080k339224
3465h490300q85366j754182k107327k51795J416750P90925k26438R64289L226976
3456g316468L586477J848792K70685l04752q80288j407249o55106Q82950J063818
3447b911141k04901l39921J530319K455847P7556l259811l605793r61813J350461
3438e869197J834073J918716K218090J345889p66066j726614m52013O97107m40996
$$ y = [-4890612, -5306659, -6072604, -9460409, -13670850, -14450061, -10735378, -5989561, -3463932, -2762748, -2237012, -2171559, -3319582, -4075025, -2120124, 1630493, 3601304, 2396670, 576318, 788912, 2355195, 2958484, 1884089, 46156, -1695039, -2580027, -1669283, 579718, 1613517, -127647, -2321673, -1575680, 1320599, 1955627, -1567996, -6151076, -8490300, -9375666, -11129848, -13237175, -13488970, -12072220, -11281295, -11507733, -10543444, -7316468, -3729991, -1881199, -1610514, -1915266, -2795554, -4202803, -4857909, -3974959, -2911141, -3116042, -3455963, -1925644, 530203, 607759, -2652052, -6257845, -7219658, -5869197, -4035124, -2116408, 101682, 1447571, 681505, -1045109, -1497122, -800015, -1241011]
3429a241011k352019k369572q13209R4454J01834P12737J745901J242693r63028
3420c841220k382358j419664M87221J390330J584675K365542L409137L159288
3412D752951J331842m67654p95691j10283O658j008164j944377j456691L3558
3403C42149Q73354M46610k31487l32653j81315R5870J099221K274731J498996
3394E885476j624409l899857k494912O81144J558093j41760r80134N55136K193874
3385A732651K037803R77800N5383j196318k487637k052701J89079J681013J158165
3376B095238O60562J740861K620801J475488k29110m42454j46354j265386k995731
3367C513915l297552k358608j595421q36300M80276R70898n34300k034814j097345
$$ y = [-1241011, -3593030, -5962602, -6775811, -6681357, -6579523, -5866786, -4120885, -2878192, -3841220, -6223578, -7643242, -7156021, -5765691, -4181016, -1815474, 1593663, 4752951, 6084793, 5617139, 4821448, 4711165, 4717823, 3709659, 1765282, 308591, 342149, 1215503, 1662113, 1430626, 1097973, 916658, 1012528, 2111749, 4386480, 5885476, 4261067, 361210, -2133702, -1452558, 105535, -36225, -1016359, -461223, 1732651, 3770454, 4748254, 4803637, 3607319, 1119682, -933019, -743940, 937073, 2095238, 2755800, 4496661, 7117462, 8592950, 8363840, 7921386, 7775032, 6509646, 3513915, 216363, -2142245, -3737666, -4573966, -4093690, -3122792, -3657092, -5691906, -6789251]
3358f789251Q27006O32227j114335j324062l8188k16691j977613j922093J031612
3349a0891388L742440M041754L470666L175940J417965k409444n154788m307366
3341f914221j889618q60200l94090J780878M484481M353561J029477k231342k801901
3332c442975j013407J375228K752314J980784p25434l209017l246602j059656
3324f588765J073779J334016l30603k523763l056423n02303L545473N010485J824989
3315b13115l098232n097846l051157K98532K281185K474958J645227P31505P00145
3306c328798J616331K093511J132870j74560m52595n21013j797174l123553k091688
3297f646669P82654K323886J409327L33129P45510J330685Q26374M06669J136620
$$ y = [-6789251, -5962245, -5330018, -6444353, -7768415, -7806603, -8023294, -10000907, -11923000, -10891388, -7148948, -3107194, 363472, 3539412, 4957377, 2547933, -2606855, -6914221, -8803839, -9664039, -10058129, -8277251, -3792770, 560791, 1590268, -641074, -3442975, -4456382, -3081154, -328840, 1651944, 926510, -2282507, -5529109, -6588765, -5514986, -4180970, -4511573, -7035336, -10091759, -10594062, -7048589, -2038104, -213115, -3311347, -8409193, -11460350, -11161818, -8880633, -6405675, -4760448, -4028943, -3328798, -1712467, 381044, 1513914, 1339354, 886759, 365746, -1431428, -4554981, -6646669, -5864015, -3540129, -2130802, -1797673, -1052163, 278522, 1104896, 1511565, 2648185]
3288B648185J570053K37819j446409j336603j13219K7483q08209o20524P07802
3279H66378J032151l97393j704278j677450j717195k913814l299876m22100M315428
3270e918149O429937L762098p77588k733735j204100P13261Q2058k453089l794441
3261e893748k327512J42414P85447m95019r33798J060779L170365K128297j291973
3252c654748k746460l34021K449909J614737j542199k462661r9184J844203P40747
3243d189677j310185j186558O45220J482727N00908r31624j867272k263363j553560
3234a0673384P74603L276120L477518J064701j635165k700965k497858k111605
3226a1026035j579026m68323J017849K291688K863698K215554K80585j618008
$$ y = [2648185, 4218238, 4456057, 3009648, 1673045, 1559826, 1587309, 779100, 158576, 866378, 1898529, 1501136, -203142, -1880592, -3597787, -6511601, -9811477, -10233577, -5918149, 511788, 4273886, 3496298, 762563, -441537, 271724, 353782, -2099307, -5893748, -8221260, -8078846, -7293399, -7788418, -8722216, -7661437, -4491072, -2362775, -3654748, -6401208, -6735229, -4285320, -2670583, -4212782, -6675443, -6774627, -4930424, -4189677, -5499862, -6686420, -6041200, -4558473, -4057565, -4989189, -6856461, -9119824, -10673384, -9898781, -6622661, -3145143, -2080442, -3715607, -6416572, -8914430, -11026035, -12605061, -13073384, -12055535, -9763847, -6900149, -4684595, -4404010, -6022018]
3218f022018j685755j47022O19654n82939j721811l51568K567519L711835K028448
3209a583657K10513Q02642K496178J895014j642991m729743m070848o02676J776095
3200e449473J137341m10038k0437J994118K902348J466742n37831q98700K74115
3191D58185J083025L83116j083473j938110j854380j633083j777925j578936j21636
3182h063217K068046L251013K491973N93281j225238k481269k763248j320403
3174g449062J476280L406455K756235P12934k28524K87824M10713q60957k474253
3165a962355l194409k854344j586442L67464J808917J423222q0282n26156N07317
3156f097068J066295K12026k29985J218995K843678K110880l64216j466321K62849
$$ y = [-6022018, -7707773, -7854795, -7235141, -7818080, -9539891, -9891459, -7323940, -3612105, -1583657, -1373144, -570502, 1925676, 3820690, 2177699, -2552044, -6622892, -7225568, -5449473, -4312132, -4722170, -4742607, -2748489, 153859, 1620601, 1082770, 184070, 458185, 1541210, 1924326, 840853, -1097257, -2951637, -4584720, -6362645, -7941581, -8063217, -5995171, -2744158, -252185, 341096, -884142, -3365411, -6128659, -7449062, -5972782, -2566327, 189908, 902842, 674318, 962142, 1372855, 511898, -1962355, -5156764, -8011108, -9597550, -9230086, -7421169, -5997947, -6078229, -6604385, -6097068, -5030773, -4818747, -5048732, -3829737, -986059, 1124821, 760605, -705716, -442867]
3147d42867K952466L826723J964844j326197l824903m049770k377194n72973R9405
3138c750466Q397K35899J206684K522591L356434K694396J73533k884960m331027
3129g68519l558071j949712o83422L57751J027760L73021j193471j289938J057195
3120f627406L251518K540842Q8309q97265N0423O13496j45795o58440j17143j4621
3110a916082j400476k737275j873375J015447L508740L407551P35987k174616
3102a434099k615300j83690K636718L191637J392440j012081k851388l822756
3094d698519l383504j368397P62715J304488O95560O30417J142859Q02566l28969
3085d440784m69571P96596J639425Q91025m02430j168090j827034k504804j837622
$$ y = [-442867, 2509599, 6336322, 8301166, 6974969, 3150066, -899704, -3276898, -3849871, -3750466, -3742069, -3506170, -2299486, 223105, 3579539, 6273935, 6447468, 3562508, -768519, -4326590, -6276302, -6959724, -6601973, -5574213, -5201192, -6394663, -7684601, -6627406, -3375888, -835046, -746737, -1644002, -1593579, -980083, -1125878, -1784318, -1901461, -1916082, -3316558, -6053833, -7927208, -6911761, -3403021, 4530, 740517, -1434099, -4049399, -4233089, -1596371, 1595266, 2987706, 1975625, -875763, -4698519, -8082023, -9450420, -8687705, -7383217, -6687657, -6057240, -4914381, -4111815, -4440784, -4910355, -4113759, -2474334, -1583309, -1985739, -3153829, -4980863, -7485667, -9323289]
3076i323289Q39118L642569M095404J991806p87038k351566j848601L49554K435484
3067i56559K221037m38167l001185k935022m73107J866580J849067o57874l515771
3058f041001l830920q10245K800944L520934J347416o36193q46472q45502j770233
3049g111272k033322k48589K042572K764083K443073K546275K357246L52669k306420
3040H06315k666941k72462K018302J932158M29035l05474N6684J820j460549l409573
3030b870685m007860k454136L62585L043745M829185N245770L724386P36018j682294
3021F926714k254034k440974l920948n060551l064256P90442K027257l71136k371125
3012i738611j323546L30850L2915n17263P77196J987312O75672j164040j04746
$$ y = [-9323289, -8484171, -4841602, -746198, 1245608, 458570, -1892996, -3741597, -3392043, -956559, 1264478, 826311, -2174874, -5109896, -5583003, -3716423, -1867356, -2525230, -6041001, -9871921, -10682166, -7881222, -4360288, -3012872, -3649065, -4495537, -5341039, -7111272, -9144594, -9393183, -7350611, -4586528, -2143455, 402820, 2760066, 3112735, 806315, -1860626, -2133088, -114786, 1817372, 2246407, 1940933, 1997617, 1999437, 538888, -2870685, -6878545, -9332681, -8970096, -5926351, -1097166, 4148604, 7872990, 8609008, 6926714, 4672680, 2231706, -1689242, -6749793, -9814049, -9023607, -6996350, -7367486, -9738611, -11062157, -10731307, -10698392, -11215655, -10438459, -8451147, -7775475, -8939515, -9044261]
3003i044261K952124M290482K922816O40238j647564l520693k968259O91085L560638
2994b123394J852574j695114j567122J644667K372697m54016k025670m31048L35101
2985b091325j767316k766385J28808L210023K396058j84066m03702R57102M88612
2976c2191j445760j557434O29759K229334J544077k04344j386965j718143j722856
2967c664523j998758k497527j971074L90872K584754J732674j059269j351600
2959g834451J862523M149939K502285j84696n75534m18227k359335m133171k182162
2950i172829J720573K992302J477620O98043J238830N07727j510306j800933J85648
2941c663325J620954J394244J428028K194821J515030j029834k750550k353060
$$ y = [-9044261, -6092137, -1801655, 1121161, 1761399, 113835, -3406858, -6375117, -5684032, -2123394, -270820, -1965934, -3533056, -1888389, 484308, 30292, -1995378, -2426426, -2091325, -3858641, -6625026, -6496218, -3286195, -890137, -1074203, -1477905, -520803, -32191, -1477951, -3035385, -2405626, -176292, 1367785, 1163441, -223524, -1941667, -3664523, -5663281, -8160808, -10131882, -9741010, -7156256, -5423582, -6482851, -7834451, -5971928, -1821989, 680296, 495600, -79934, -498161, -2857496, -6990667, -9172829, -7452256, -4459954, -2982334, -2284291, -1045461, -537734, -2048040, -3848973, -3663325, -2042371, -648127, 779901, 2974722, 4489752, 3459918, 709368, -1643692]
2933a643692j921503k851283l412156k117489k83867N67043R52802J391629R39047
2924h379469m83687r73772K83113J292641M91174o38442k27752Q44627P49535
2915g042032o9121J91117J672871K839362K796566J992873J069151K23692o34911
2906C039568j789694l238360m013504k892166j03182K612678L776523L032276
2898D24139O07443k465220l887539k027131J472289L076140J642828o83056j869995
2889c710102j789136m89862K182322M453889L393042o82530l575548k833355j119567
2880d170847j714128l419688k921805j27835K155371K605390K248823J631100
2872c713619K36695j239697q59599J484819K972988J144095k642432m315238j779069
$$ y = [-1643692, -3565195, -6416478, -9828634, -11946123, -12229990, -11662947, -10710145, -9318516, -8379469, -8863156, -9836928, -9553815, -8261174, -7770000, -8408442, -8636194, -7791567, -7042032, -7111153, -6920036, -5247165, -2407803, 388763, 2381636, 3450787, 3674479, 3039568, 1249874, -1988486, -6001990, -8894156, -8997338, -6384660, -2608137, 424139, 1031582, -1433638, -5321177, -7348308, -5876019, -2799879, -1157051, -1840107, -3710102, -5499238, -5989100, -3806778, 647111, 4040153, 3357623, -217925, -3051280, -4170847, -5884975, -9304663, -12226468, -12354303, -10198932, -7593542, -5344719, -3713619, -3476924, -4716621, -5576220, -4091401, -1118413, 25682, -2616750, -6931988, -8711057]
2863h711057K361805L747773J694551j43056O77425J689922j35029k684975j612942
2854c115583K176644L253588K74052j781370J64245K417169J178244j004897o8573
2845C493519K301664J664316j635414l494726k918924k349891k110435j25799
2837e175690K787945K742004j028757m330763l920867j460995J02415P13978J677583
2828g893147K622470K350557J118457J30231l46825r70015j893951k221004r02431
2819h005658J745887L490450K215412j014347k570610r93125R46967N83967o75867
2810d276924l16495Q14712N85218O3829J505320L272292J862245j535046k021207
2801d6056R51459K122682j232817m710895l399695J062147L407734J751766j428954
$$ y = [-8711057, -6349252, -2601479, -906928, -1049984, -372559, 1317363, 1182334, -1502641, -3115583, -938939, 2314649, 2588701, 807331, 971576, 3388745, 4566989, 3562092, 3493519, 5795183, 7459499, 5824085, 2329359, -589565, -2939456, -5049891, -5175690, -2387745, 354259, -674498, -5005261, -8926128, -10387123, -10284708, -9570730, -7893147, -5270677, -2920120, -1801663, -1671432, -2018257, -2988272, -4882223, -7103227, -8005658, -6259771, -2769321, -553909, -1568256, -4138866, -5131991, -4185024, -3601057, -4276924, -4593419, -3778707, -3193489, -3129660, -1624340, 1647952, 3510197, 1975151, -46056, 905403, 3028085, 1795268, -2915627, -6315322, -5253175, -1845441, -93675, -1522629]
2792a522629l087643j777522J956950N094489M040059q64397m731621m067939
2784d960253j182041m16063k114961l103413j663377P48321K025317J518857Q9265
2775i058348n90570N02345K199380K343741J026112N40900J420573J306162q82158
2766a191863k735041k349583j429626j724764j414092J466409M511677L955861
2758i11022N33814j775489j757988j592266k090126j551341L94901J612258R46481
2749f190778j27821j43455O09077J523022K461449K650145J173813r26451j370659
2740c41658K688Q37752k05208j738170k153975j668615r81069M7742J231126J294665
2730c674722l98165k487304l050968j673560M96485K026392K211362J502148J022414
$$ y = [-1522629, -4610272, -6387794, -4430844, 663645, 4703704, 3839307, -892314, -4960253, -6142294, -6558357, -8673318, -11776731, -13440108, -12691787, -10666470, -9147613, -9058348, -9648918, -9146573, -6947193, -4603452, -3577340, -3036440, -1615867, -309705, -1191863, -3926904, -6276487, -7706113, -9430877, -10844969, -9378560, -4866883, -911022, -377208, -2152697, -3910685, -5502951, -7593077, -9144418, -8749517, -7137259, -6190778, -6318599, -6462054, -5852977, -4329955, -1868506, 781639, 1955452, 1029001, -341658, -338970, 498782, 293574, -1444596, -3598571, -5267186, -6248255, -6200513, -4969387, -3674722, -4072887, -6560191, -9611159, -11284719, -10788234, -8761842, -6550480, -5048332, -4025918]
2721d025918J114980Q13068m50298j490477j072630m4028J9176n10400j03595
2712e750122J090054J577150J280310J421017J854221J195921m09344j423012
2704H36195j879188l186986m707751l939537r06375J169400Q91975Q31498K767845
2695h122924M321246K990624N01853r1386P37410M90958p63098q94734K79591
2686e50460R25356N60925L51822L40170o31744k277472k950043k457153k066519
2677h755118j555349P19244M086638M985964J768194k331414l104629o06934J677464
2668c115940J789413J012519Q80400P88550n29171k569067l464272k466335q68143
2659h542046j47328l2132P78670K373687L268800K536261J183919O39407P12449
$$ y = [-4025918, -2910938, -2097870, -2548168, -4038645, -5111275, -5155303, -5136127, -5646527, -5750122, -4660068, -3082918, -1802608, -381591, 1472630, 2668551, 2259207, 836195, -1042993, -4229979, -8937730, -12877267, -13783642, -12614242, -11722267, -10890769, -8122924, -3801678, -811054, -309201, -400587, 336823, 827781, 64683, -830051, -550460, 374896, 935821, 1287643, 1627813, 996069, -1281403, -4231446, -6688599, -8755118, -10310467, -9591223, -5504585, -518621, 1249573, -1081841, -4186470, -4793404, -3115940, -1326527, -314008, 566392, 1354942, 825771, -1743296, -5207568, -7673903, -8542046, -8689374, -8721506, -7942836, -5569149, -2300349, 235912, 1419831, 2059238, 2771687]
2650B771687K17978q20767r81878L67678J878375J827874J84087j622591k470804
2641A351639k252807j075032J047445L171257L153927j54624m580036o101686
2633e439917l388560M52209J755315O53540j27067K72195J51720j164355j942903
2624h777823j151524m11240j199581k105848r81675J532138K930870K580129K244243
2615e340311K982334L582696K609139N32105r58918j013824m12788n54914j821315
2606c95796k925487k223234K21311K503655L058811K167791R70355P4945k51192
2597C201159K49210J029552P76063p22606j948913k004741k084602l079040l364596
2588g948514j203209J999141L483124L182434K968853K559428j21743m217833
$$ y = [2771687, 2989665, 2168898, 1187020, 1554698, 3433073, 5260947, 5445034, 3822443, 1351639, -901168, -1976200, -928755, 2242502, 5396429, 5241805, 661769, -5439917, -8828477, -8376268, -6620953, -5967413, -6094480, -5822285, -5670565, -6834920, -8777823, -9929347, -10340587, -11540168, -13646016, -14627691, -13095553, -10164683, -7584554, -5340311, -2357977, 1224719, 3833858, 4365963, 3407045, 2393221, 1980433, 1425519, -395796, -3321283, -5544517, -5323206, -2819551, 239260, 2407051, 3377406, 3452351, 3201159, 3450369, 4479921, 5255984, 4533378, 2584465, 579724, -1504878, -4583918, -7948514, -9151723, -7152582, -3669458, -487024, 2481829, 5041257, 4919514, 701681]
2580G01681n476740k091365K157675K795577L32378j349850n37282J007371J360947
2571a099608O06361k18452n53106m68834l88333o42951p93471L5190J521019J779217
2561b22968k72881k922041l386589j233472J182208J688849O41391j4923O68045
2552c872381J565064J061064n89440j233054L79075K651011L214980K173639J392195
2543F742153J076089k51245k168730k075547J93387R00955j918023m427421k341393
2534d269775K036174K866001j93884j371106K162253N828824M594989J66199k221841
2525I597834j333986l34982j188968k555061k976458k795904k396563j258830
2517e242918L28256Q32336m0145j94265J982362M778016M960054K030033r92660
$$ y = [701681, -4775059, -6866424, -4708749, -1913172, -1580794, -2930644, -3467926, -2460555, -1099608, -493247, -711699, -1264805, -1733639, -2121972, -2764923, -3558394, -3523204, -2002185, -222968, -495849, -3417890, -6804479, -8037951, -6855743, -5166894, -4525503, -4540426, -3872381, -2307317, -1246253, -1835693, -3068747, -2689672, -38661, 3176319, 5349958, 6742153, 7818242, 7566997, 5398267, 3322720, 3516107, 4417062, 2499039, -1928382, -4269775, -2233601, 632400, 438516, -932590, 1229663, 7058487, 11653476, 11819675, 9597834, 8263848, 7928866, 6739898, 4184837, 1208379, -1587525, -3984088, -5242918, -4914662, -4082326, -4122471, -4316736, -2334374, 2443642, 7403696, 9433729, 8441069]
2508H441069j412693k24301o05402l513673o107259n166660j214234K078492K458979
2499e265682J472244J561609K371835J720730n32065j913542r62003O94787R84565
2490A32478L86837N62216J134223J02256k635656m300991k602031J243405L808365
2481b168898L030474j85549l184188l636862j109221K443741M017877K257847
2473A465221j132641l072838k042534Q67299L292586L514156J621568n72793j194211
2464B745813l43875K05603k15530m5671J690653K960853J361819j708443k364865
2455D286357K56436K711026K191196p3296j685549k589876l582670l628336j506724
2446c621436J231948J867222M42097n06892J66762J085408J062531N71626J86539
$$ y = [8441069, 7028376, 6804075, 6198673, 2685000, -3422259, -8588919, -9803153, -7724661, -5265682, -3793438, -2231829, 140006, 1860736, 1328671, -584871, -1546874, -852087, 132478, 519315, 1081531, 2215754, 2318010, -317646, -4618637, -7220668, -5977263, -2168898, 861576, 676027, -2508161, -6145023, -7254244, -4810503, -792626, 1465221, 332580, -2740258, -4782792, -3915493, -622907, 2891249, 4512817, 3940024, 2745813, 2401938, 2607541, 2392011, 2346340, 4036993, 6997846, 8359665, 6651222, 4286357, 4542793, 7253819, 9445015, 9371719, 7686170, 5096294, 1513624, -2114712, -3621436, -2389488, -522266, -80169, -587061, -420299, 665109, 1727640, 2299266, 2485805]
2437B485805l43555r64623j041049o66133o83457j113329j118959o76443n61019
2428d682762n97737Q0053Q78999K19635j332041j025005J874287M328953L560634
2419C305016O66216j549059k310819k384889j696145O2588J685255J788255J079385
2410F45803J061827J238493o0105k539267l930366l005829p18882J416320K300636
2401c591370J121264j626475l325718j758378J583756K966282J308002o83600
2393d006237n74545R52377J946849J663693L17527j622727k899737k054593L61086
2384e916307J743259O47732j365883j981880q01738R93521K116036J568555p18232
2375c714937k834204k369652J07053J186288n40037k178063q85844J892008L053043
$$ y = [2485805, 2142250, 1177627, 136578, -529555, -1213012, -2326341, -3445300, -4121743, -4682762, -5280499, -5200446, -4321447, -4101812, -5433853, -6458858, -4584571, -255618, 3305016, 3971232, 2422173, 111354, -2273535, -3969680, -3907092, -2221837, -433582, 645803, 1707630, 2946123, 2886018, 346751, -3583615, -6589444, -7308326, -5892006, -3591370, -2470106, -4096581, -7422299, -9180677, -7596921, -4630639, -3322637, -4006237, -4580782, -3628405, -1681556, -17863, 299664, -1323063, -4222800, -6277393, -5916307, -4173048, -3525316, -4891199, -6873079, -7674817, -6681296, -4565260, -2996705, -3714937, -6549141, -8918793, -8811740, -7625452, -8165489, -10343552, -11229396, -9337388, -6284345]
2366f284345K587741K563935K924124J961914K77488L58274J925142J457043k309951
2357E461365n557416m219753M29435L438871K426645n9102l49034J902403L781817
2348G255231K841202j89007k621726l057450k392326j674443n41363J247668K153013
2339C020799N83204k329823l645118k298496j54285Q09703O43948K21635m57252
2330c605685j622359k383060j341429J503251M202965M578656K500200J63587
2322C996126l77283L15681J09501j304765j938129j034164o63437k051095k678117
2313e625682M9649L939827M471087J357879j192479p94813M33479K21768o06257
2304B254458o60044m38500n21266j96673L90273m27665k528733k976311m91291
$$ y = [-6284345, -3696604, -1132669, 1791455, 3753369, 4030857, 4389131, 6314273, 7771316, 5461365, -96051, -4315804, -3886369, -447498, 1979147, 1920045, 1571011, 3473414, 7255231, 10096433, 9907426, 7285700, 4228250, 1835924, 161481, -379882, 867786, 3020799, 3604003, 1274180, -2370938, -4669434, -4823719, -4014016, -3370068, -3148433, -3605685, -5228044, -7611104, -8952533, -7449282, -3246317, 1332339, 3832539, 3996126, 3618843, 3934524, 4044025, 2739260, 801131, -233033, -896470, -2947565, -5625682, -5576033, -1636206, 2834881, 4192760, 3000281, 2205468, 2638947, 2860715, 2254458, 1594414, 1155914, 634648, 437975, 828248, 400583, -2128150, -5104461, -5595752]
2295e595752J962688J644704K59216O44309J836416J100796j087900j993758j226929
2286b456210o32808n45279J87659J196099J190799Q51981J457464J459351j340373
2277A368683m705497l942918O32632L235409R47227k295399k160389J48589J339411
$$ y = [-5595752, -3633064, -1988360, -1729144, -1084835, 751581, 1852377, 764477, -1229281, -2456210, -3089018, -3634297, -3446638, -2250539, -1059740, -207759, 1249705, 2709056, 1368683, -3336814, -7279732, -6647100, -3411691, -2464464, -4759863, -6920252, -6771663, -5432252]
$$ [...]
##END NTUPLES=NMR SPECTRUM
##END=
