##TITLE=31P_DE-80H_X3
 64 sc D2O
 26.2.2025
##JCAMPDX= 6.0         $$ Bruker NMR JCAMP-DX V2.0
##DATA TYPE= NMR SPECTRUM
##DATA CLASS= NTUPLES
##ORIGIN= UXNMR, Bruker Analytische Messtechnik GmbH
##OWNER= root
$$ XWIN-NMR		Version 3.5
$$ Thu Apr  3 16:49:25 2025 Russian Standard Time (UT+4h)  Yarkov@DPX200
##.OBSERVE FREQUENCY= 81.013821
##.OBSERVE NUCLEUS= ^31P
##.ACQUISITION MODE= SIMULTANEOUS
##.ACQUISITION SCHEME= undefined
##.AVERAGES= 64
##.DIGITISER RES= 17
##SPECTROMETER/DATA SYSTEM= spect
##.PULSE SEQUENCE= zgpg30
##.SOLVENT NAME= CDCl3
##.SHIFT REFERENCE= (INTERNAL, CDCl3, 0, 198.062)
##AUDIT TRAIL= $$ (NUMBER, WHEN, WHO, WHERE, WHAT)
$$ ##TITLE= Audit trail, XWIN-NMR		Version 3.5
$$ ##JCAMPDX= 5.01
$$ ##ORIGIN= Bruker BioSpin GmbH
$$ ##OWNER= Yarkov
$$ C:/Bruker/XWIN-NMR/data/yarkov2/nmr/P31/2/pdata/1/auditp.txt
$$ ##AUDIT TRAIL=  $$ (NUMBER, WHEN, WHO, WHERE, WHAT)
(   1,<2025-04-03 16:48:20.00 +0400>,<Yarkov>,<DPX200>,
      <created by zg, POWCHK disabled, PULCHK disabled
       configuration hash MD5:
       00 E9 B6 7A A2 85 ED C7 34 08 36 98 17 FE 4E 26
       data hash MD5: 32K
       30 93 8B EE 1E 58 9B F5 49 5F 26 58 AF 0D 4E 0E>)
(   2,<2025-04-03 16:48:49.64 +0400>,<Yarkov>,<DPX200>,
      <Start of raw data processing
       efp BC_mod = 2 LB = 1.5 FT_mod = 6 PKNL = 1 PHC0 = 1789.316 PHC1 = 11.49541 SI = 64K 
       data hash MD5: 64K
       07 B3 FF C0 29 05 58 AA B0 CF 0B 34 4F 5F 4D 67>)
$$ ##END=
$$ 
$$ hash MD5
$$ 10 B0 11 28 A3 58 79 45 C4 B4 D5 A0 4F E7 20 2B
##$RELAX= 
##$RELAX= 
##$RELAX= 
##$RELAX= 
##$RELAX= 
##$RELAX= 
##$RELAX= 
##$RELAX= 
$$ Bruker specific parameters
$$ --------------------------
##$DU= <C:/Bruker/XWIN-NMR>
##$EXPNO= 2
##$NAME= <P31>
##$PROCNO= 1
##$TYPE= <nmr>
##$USER= <yarkov2>
##$AMP= (0..31)
100 100 100 100 100 100 100 100 100 100 100 100 100 100 100 100 100 100 
100 100 100 100 100 100 100 100 100 100 100 100 100 100 
##$AQSEQ= 0
##$AQ_mod= 1
##$AUNM= <au_zg>
##$AUTOPOS= <>
##$BF1= 81.014009
##$BF2= 200.13
##$BF3= 200.13
##$BF4= 200.13
##$BF5= 200.13
##$BF6= 200.13
##$BF7= 200.13
##$BF8= 200.13
##$BYTORDA= 1
##$CFDGTYP= 0
##$CFRGTYP= 5
##$CHEMSTR= <none>
##$CNST= (0..31)
1 1 145 1 1 1 1 1 1 1 1 1 1 1 1 1 1 1 1 1 1 1 1 1 1 1 1 1 1 1 1 1 
##$CPDPRG= <waltz16>
##$CPDPRG1= <>
##$CPDPRG2= <waltz16>
##$CPDPRG3= <>
##$CPDPRG4= <mlev>
##$CPDPRG5= <mlev>
##$CPDPRG6= <mlev>
##$CPDPRG7= <mlev>
##$CPDPRG8= <mlev>
##$CPDPRGB= <>
##$CPDPRGT= <>
##$D= (0..31)
0 1 0 0 0 0 0 0 0 0.06 0 0.03 2e-05 3e-06 0 0 0.0002 0 0 0 0 0 0 0 0 0 
0 0 0 0 0 0 
##$DATE= 1743684499
##$DBL= (0..7)
120 120 120 11 120 120 24 19 
##$DBP= (0..7)
150 150 150 150 150 150 150 150 
##$DBP07= 0
##$DBPNAM0= <>
##$DBPNAM1= <>
##$DBPNAM2= <>
##$DBPNAM3= <>
##$DBPNAM4= <>
##$DBPNAM5= <>
##$DBPNAM6= <>
##$DBPNAM7= <>
##$DBPOAL= (0..7)
0.5 0.5 0.5 0.5 0.5 0.5 0.5 0.5 
##$DBPOFFS= (0..7)
0 0 0 0 0 0 0 0 
##$DE= 6
##$DECBNUC= <off>
##$DECIM= 4
##$DECNUC= <off>
##$DECSTAT= 4
##$DIGMOD= 1
##$DIGTYP= 9
##$DL= (0..7)
0 0 52 120 120 21 21 25 
$$ [...]
##$SUBNAM3= <"">
##$SUBNAM4= <"">
##$SUBNAM5= <"">
##$SUBNAM6= <"">
##$SUBNAM7= <"">
##$SUBNAM8= <"">
##$SUBNAM9= <"">
##$SW= 400.765351723535
##$SWIBOX= (0..15)
0 1 3 0 0 0 0 0 0 0 0 0 0 0 0 0 
##$SW_h= 32467.5324675325
##$TD= 32768
##$TD0= 1
##$TE= 0
##$TE2= 300
##$TE3= 300
##$TEG= 300
##$TL= (0..7)
0 120 53 12 22 120 120 120 
##$TP= (0..7)
150 150 150 150 150 150 150 150 
##$TP07= 0
##$TPNAME0= <>
##$TPNAME1= <>
##$TPNAME2= <>
##$TPNAME3= <>
##$TPNAME4= <>
##$TPNAME5= <>
##$TPNAME6= <>
##$TPNAME7= <>
##$TPOAL= (0..7)
0.5 0.5 0.5 0.5 0.5 0.5 0.5 0.5 
##$TPOFFS= (0..7)
0 0 0 0 0 0 0 0 
##$TUNHIN= 0
##$TUNHOUT= 0
##$TUNXOUT= 0
##$USERA1= <user>
##$USERA2= <user>
##$USERA3= <user>
##$USERA4= <user>
##$USERA5= <user>
##$V9= 5
##$VALIST= <valist>
##$VCLIST= <CCCCCCCCCCCCCCC>
##$VD= 0
##$VDLIST= <DDDDDDDDDDDDDDD>
##$VPLIST= <PPPPPPPPPPPPPPP>
##$VTLIST= <TTTTTTTTTTTTTTT>
##$WBST= 1024
##$WBSW= 4
##$XGAIN= (0..3)
0 0 0 0 
##$XL= 0
##$YL= 0
##$YMAX_a= 27439
##$YMIN_a= -8516
##$ZGOPTNS= <>
##$ZL1= 120
##$ZL2= 120
##$ZL3= 120
##$ZL4= 120
##$ABSF1= 0
##$ABSF2= 0
##$ABSG= 0
##$ABSL= 0
##$ALPHA= 0
##$AQORDER= 0
##$ASSFAC= 0
##$ASSFACI= 0
##$ASSFACX= 0
##$ASSWID= 0
##$AUNMP= <proc_1d>
##$AZFE= 0.1
##$AZFW= 0.5
##$BCFW= 0
##$BC_mod= 2
##$BYTORDP= 0
##$COROFFS= 0
##$CY= -3
##$DATMOD= 1
##$DC= 0
##$DFILT= <>
##$DTYPP= 0
##$F1P= 0
##$F2P= 0
##$FCOR= 1
##$FTSIZE= 65536
##$FT_mod= 6
##$GAMMA= 0
##$GB= 0
##$INTBC= 1
##$INTSCL= 9.790993e-09
##$ISEN= 30
##$LB= 1.5
##$LEV0= 0
##$LPBIN= 0
##$MAXI= 10000
##$MC2= 0
##$MEAN= 0
##$ME_mod= 0
##$MI= 50
##$NCOEF= 0
##$NC_proc= -8
##$NLEV= 6
##$NOISF1= 182.463
##$NOISF2= 159.3651
##$NSP= 0
##$NTH_PI= 0
##$NZP= 0
##$OFFSET= 198.0616
##$PC= 4
##$PHC0= 1789.316
##$PHC1= 11.49541
##$PH_mod= 1
##$PKNL= yes
##$PPARMOD= 0
##$PSCAL= 0
##$PSIGN= 0
##$REVERSE= no
##$SF= 81.0140089999434
##$SI= 65536
##$SIGF1= 159.3651
##$SIGF2= -187.1042
##$SINO= 113.3802
##$SIOLD= 16384
##$SREGLST= <1H.CDCl3>
##$SSB= 0
##$STSI= 65536
##$STSR= 0
##$SW_p= 32467.5324675325
##$SYMM= 0
##$S_DEV= 0
##$TDeff= 32768
##$TDoff= 0
##$TI= <>
##$TILT= no
##$TM1= 0
##$TM2= 0
##$TOPLEV= 0
##$USERP1= <user>
##$USERP2= <user>
##$USERP3= <user>
##$USERP4= <user>
##$USERP5= <user>
##$WDW= 1
##$XDIM= 65536
##$YMAX_p= 204155193
##$YMIN_p= -213739798
$$ End of Bruker specific parameters
$$ ---------------------------------
##NTUPLES= NMR SPECTRUM
##VAR_NAME=  FREQUENCY,     SPECTRUM/REAL,   SPECTRUM/IMAG
##SYMBOL=    X,             R,               I
##VAR_TYPE=  INDEPENDENT,   DEPENDENT,       DEPENDENT
##VAR_FORM=  AFFN,          ASDF,            ASDF
##VAR_DIM=   65536,         65536,           65536
##UNITS=     HZ,            ARBITRARY UNITS, ARBITRARY UNITS
##FACTOR=    0.49542278885378, 1,            1
##FIRST=     16045.7642231865, 0,            0
##LAST=      -16421.768244346, 0,            0
##MIN=       -16421.768244346, -213739798,   0
##MAX=       16045.7642231865, 204155193,    0
$$ Real data points
##PAGE= N=1
##DATA TABLE= (X++(R..R)), XYDATA
$$ [...]
##PAGE= N=2
##DATA TABLE= (X++(I..I)), XYDATA
9475 -7882296 -9851529 -11711693 -12254047 -11859612 -11551744 -11573618 -11313950 -10205333 -8198831
9466 -8198831 -5635984 -3235918 -2087148 -3002002 -5706082 -8973918 -11450516 -11983770 -9783302
9457 -9783302 -5570651 -2430462 -3521602 -7893385 -10274553 -6897295 -482568 2870427
9449 2870427 1334473 -794513 595806 4000630 4861607 1605070 -3176131 -6534838
9441 -6534838 -7731142 -7213676 -5387897 -3051896 -1418476 -856737 -690499 -805568 -2213372
9432 -2213372 -5152316 -7741710 -7748646 -5076623 -1431544 1869543 4480809 5902059 5485062
9423 5485062 3832261 2694407 2741085 2550185 729892 -1838816 -3066533 -2539298 -2126570
9414 -2126570 -3626380 -6664769 -9132692 -9117359 -6334714 -2312006 641881 1226328 264747
9405 264747 -226541 843219 2775723 4204275 4385583 3259585 1045724 -1661106 -3840379
9396 -3840379 -4662428 -4081574 -2692085 -1285195 -543375 -570009 -557382 371362 1709271
9387 1709271 1815716 171654 -1488655 -1167167 956021 3044072 3950458 3848051 2992854
9378 2992854 1435797 69825 425084 2685555 4851704 4655375 1856090 -1759068 -4095182
9369 -4095182 -4057250 -1774751 1690630 4833807 6260887 5096333 1417777 -3225007 -6225746
9360 -6225746 -5949305 -3518802 -1777808 -2275038 -4003832 -5209411 -5442455 -5430393 -5824990
9351 -5824990 -6617428 -7070269 -5859973 -2279578 2067474 3847880 1402493 -3012345 -5443269
9342 -5443269 -4356040 -1681171 -198850 -921221 -2854336 -4297778 -4242018 -3131615 -2280762
9333 -2280762 -2180018 -1836225 -426990 1069595 1098410 15475 -153745 1396414 3090192
9324 3090192 3354376 2913683 3557597 5243948 5714287 3194836 -1249468 -4573571 -4924895
9315 -4924895 -3645229 -3753389 -6454514 -9779132 -11071089 -10056294 -8456717 -7134475
9307 -7134475 -5280448 -2709721 -1283042 -2889057 -6952316 -11133608 -13857591 -14874282
9299 -14874282 -13872038 -10457150 -6015968 -3894446 -6157449 -10659355 -12784877 -10330842
9291 -10330842 -5618722 -2347151 -1411926 -848419 801747 2675818 3337158 2847314 2153961
9282 2153961 1367509 -118404 -2212270 -4055832 -5327443 -6553555 -7987219 -9111345
9274 -9111345 -9465830 -9087686 -7901170 -5672053 -3031873 -1532349 -1842598 -2580983 -1849176
9265 -1849176 497360 2910312 4032156 3565044 1589195 -1729918 -5498722 -8162815
9257 -8162815 -8824955 -8046290 -6999345 -6278072 -5830380 -5479017 -4949470 -3799216 -2053908
9248 -2053908 -802983 -1438137 -4105562 -7395472 -9736388 -10605747 -10158612 -8391461 -5435513
9239 -5435513 -2319860 -453169 -158280 -416158 -280467 160805 548986 1112471 1974731
9230 1974731 2190999 566298 -2584836 -5381423 -6346790 -5919058 -5805447 -7192195 -9642116
9221 -9642116 -11386309 -10713020 -7523838 -3622230 -1151926 -705968 -1115856 -799800 1009038
9212 1009038 3842862 6096231 6013071 3561288 999168 407254 890572 -278083 -3669306
9203 -3669306 -6600382 -6622041 -4440792 -2383828 -1493566 -1524714 -2507123 -4466708 -6284118
9194 -6284118 -6654950 -6008266 -6037213 -7503294 -9790405 -12271416 -14570951 -15728700 -14949934
9185 -14949934 -13346548 -13077242 -14273926 -14653370 -12973438 -10989553 -10597514 -10649893 -8612641
9176 -8612641 -4498931 -960865 425699 931765 2201841 3683999 3591249 1369319 -2007350
9167 -2007350 -5590160 -8920416 -10995155 -10284939 -6718188 -2861891 -1841534 -4032341
9159 -4032341 -6783044 -7679270 -7098399 -6908446 -7580735 -7816018 -6670503 -4697226 -2772332
9150 -2772332 -962646 825439 1862095 1048403 -1871041 -5893056 -9280957 -10485894
9142 -10485894 -9338508 -7726487 -8182968 -10890144 -12724759 -10574916 -5489542 -2094385
9134 -2094385 -3292364 -6684658 -7388585 -3816659 779606 2589374 1535134 389657
9126 389657 794330 1817473 2113666 1585971 351738 -2225041 -6195806 -9840067 -11264155
9117 -11264155 -10493472 -8627606 -5732997 -1443409 2813359 4537681 3469089 2037311
9109 2037311 1766732 1337638 -560161 -2537603 -2695327 -2019743 -3052809 -5715818 -6995025
9100 -6995025 -5155149 -2258965 -1657998 -4322982 -8461720 -11671261 -12524106 -10847086 -7703728
9091 -7703728 -5095683 -4710764 -6298014 -7419535 -5480999 -552782 4085250 4969943 2046683
9082 2046683 -1556653 -3276162 -3294090 -2736438 -1757384 -864031 -2268463 -7308399 -13310562
9073 -13310562 -15846485 -14230629 -12229697 -12805516 -14685004 -15182294 -13980518 -12307634
9065 -12307634 -10161454 -6585993 -1894338 2239240 4597981 5130886 4337459 2981494
9057 2981494 1807901 609017 -1631905 -4761789 -6796657 -6513056 -5397045 -5277797 -5316533
9048 -5316533 -3679062 -1151501 -23631 370372 3505662 10076200 15607169 15561035 10750106
9039 10750106 5695214 3199052 2653132 2547150 2201373 1165365 -1095698 -4322063 -7194982
9030 -7194982 -8308510 -7145743 -4393597 -1598261 74155 1065344 2576658 4169246
9022 4169246 3584019 -149894 -4808560 -7479924 -7761329 -6986357 -5588676 -3288532 -967247
9013 -967247 1337 -103123 -40157 -70235 -1381650 -3305313 -3761338 -2660066 -2135517 -2907403
9003 -2907403 -3240298 -2350761 -1871031 -2582158 -2662888 -1061524 228936 -411676 -1296775
8994 -1296775 -836488 -1269487 -5145446 -9906382 -10437300 -6343876 -2338998 -1414025 -2063321
8985 -2063321 -3011129 -6022063 -11790232 -16768233 -17144486 -13644986 -9661429 -6526506 -3455827
8976 -3455827 -722146 225774 -583533 -1405061 -1293071 -1008220 -1307991 -1852043 -2010882
8967 -2010882 -1669066 -1126005 -916369 -1475323 -2344940 -2299933 -1036325 39954 -323014
8958 -323014 -1448044 -2025001 -2272066 -3262141 -4861136 -6195457 -7686103 -10433624 -13458182
8949 -13458182 -13732853 -9852345 -4181152 -399629 74092 -1509838 -3348948 -4555167
8941 -4555167 -5039783 -4999771 -4738338 -4651148 -5083415 -5900639 -6191227 -5020774 -2883209 -1684179
8931 -1684179 -2525142 -4136685 -4443633 -3022831 -797524 1986600 5571301 8532416 8010949
8922 8010949 3202602 -2684502 -5299054 -3574748 -438793 715086 -445599 -1447623
8914 -1447623 -521780 865933 -199695 -4069691 -7843599 -9188594 -9042512 -9211903 -9138396
8905 -9138396 -7363744 -4905517 -4214703 -5248945 -5661981 -4991826 -5408392 -7425111 -7986907
8896 -7986907 -4595325 873629 4220728 3225267 -1204131 -6238796 -8367531 -5793092
8888 -5793092 -1268886 -234165 -4057045 -7439381 -5209354 388068 2623736 -751809
8880 -751809 -5265769 -6262296 -4106785 -2085683 -2025835 -3416888 -5001860 -5792866 -5384714
8871 -5384714 -4099288 -2524980 -1115456 -788465 -2886582 -7007569 -9805838 -8282006
8863 -8282006 -4074779 -2116178 -4716645 -9145528 -11534584 -10974985 -8940599 -6780674
8855 -6780674 -5090699 -3989940 -2711958 -84399 3551914 6051920 6039967 4592108 3378550
8846 3378550 2385711 687194 -1661965 -3921191 -5974321 -7852334 -8621820 -7427090 -5414890
8837 -5414890 -4943696 -6543812 -8032730 -7400208 -5624831 -5484795 -7785586 -9986926 -9280942
8828 -9280942 -6320919 -4585127 -5951650 -8364564 -8773557 -7137558 -5964518 -6604544 -7905265
8819 -7905265 -8489989 -8477915 -8367225 -7694826 -5692344 -2406063 1443435 5004691 7305627
8810 7305627 7469569 5378446 1752149 -2370425 -5762252 -7225172 -6769964 -6028014 -6054345
8801 -6054345 -5322581 -1911378 2661188 4400392 2091629 -942887 -1338331 355685 1517216
8792 1517216 1186772 357029 96230 793080 1940521 1790205 -898223 -3853879 -2679110
8783 -2679110 3000541 7488787 5770579 54303 -3535220 -2879255 -829618 341145
8775 341145 1124141 1600931 328849 -2605272 -4781478 -5055249 -5324636 -7346150 -10046430
8766 -10046430 -11397061 -11060792 -9785358 -7766102 -5009425 -2144176 284551 2416453
8758 2416453 4246703 5279500 5660882 6453035 7988650 9012143 8253794 6012383 3587238
8749 3587238 1959095 1451514 1820854 2319840 2468940 2850693 4193048 5786810 6062032
8740 6062032 4657705 2613274 805587 -202119 674149 3649563 6082006 4778221
8732 4778221 620548 -2204611 -2280333 -2729316 -5547302 -8066254 -7632243 -6232386 -6887117
8723 -6887117 -8311285 -7453097 -5329472 -5552126 -8000796 -8839155 -6875851 -5228142 -5769387
8714 -5769387 -6305653 -4976163 -3592411 -4203884 -5447972 -5080092 -3799714 -3691131 -4569353
8705 -4569353 -4815834 -4790086 -6515246 -10291069 -14081423 -16308548 -17173073 -17014743 -15341112
8696 -15341112 -12111839 -8486853 -5526186 -3156962 -1048233 328301 152819 -1731725
8688 -1731725 -4649315 -7490660 -9109534 -8934067 -7483620 -5776685 -4053354 -1754874
8680 -1754874 1003151 2928986 3299997 3365118 4673962 6299656 5389901 1105975 -3362396
8671 -3362396 -4077849 -1063970 1721958 1070447 -2296388 -5635706 -7739711 -9341241 -10936440
8662 -10936440 -11912598 -11787660 -10880127 -9382040 -6925464 -3687516 -1051328 -379180 -1550757
8653 -1550757 -3187853 -3838479 -2643765 220451 2971320 3043134 -126039 -3610918 -3900598
8644 -3900598 -1225075 725220 -307608 -2520860 -3307858 -3083898 -3772325 -4842599 -3728235
8635 -3728235 -63565 3287108 4196329 3860271 4166752 4714371 4407045 4239002 5867791
8626 5867791 8289977 8694744 6565324 4352152 3530438 2362481 -1175335 -5935379 -8593656
8617 -8593656 -7292502 -3248689 673149 2278288 1526661 263758 65802 400496 -208742
8608 -208742 -1584183 -2253151 -2455537 -4355699 -8290388 -11284459 -11088466 -9501963 -9289682
8599 -9289682 -9674176 -8011431 -4771352 -3204346 -4131305 -4620120 -2691023 -198043 497491
8590 497491 147842 915585 2918105 4671856 5827431 7259494 8843764 9007463 6657547
8581 6657547 2411409 -2151760 -5575785 -6883788 -5779476 -2917978 285848 2370672
8573 2370672 2666046 1911387 1929096 3820608 6208127 6128548 2228482 -3561532 -7993426
8564 -7993426 -9458004 -8595659 -7011052 -6271705 -7232871 -8943045 -8636322 -4411840 1786913
8555 1786913 5181930 2986623 -2429002 -6023446 -5416231 -2825241 -1628005 -2189245 -2248798
8546 -2248798 -923251 -446177 -3094572 -7816747 -11465554 -12531695 -11741937 -9366365 -4468550
8537 -4468550 2315527 7354319 7157584 2156485 -3845345 -7389805 -7661904 -5938752 -4024127
8528 -4024127 -2928653 -2168730 -512490 2160342 4307831 4468333 2739747 46722 -2866099
8519 -2866099 -4891064 -4518311 -1912667 161295 -496663 -2186550 -1395514 2078127 4540989
8510 4540989 3281991 -298784 -3278656 -4760208 -5410451 -5246927 -3959746 -2611259 -2916676
8501 -2916676 -4744656 -5928857 -5117895 -3721249 -4150940 -6599090 -8507441 -7437261 -3806615
8492 -3806615 -182424 1774102 2687265 3731218 4779509 5129322 5078751 5425176 5868774
8483 5868774 5393884 4149117 3451556 3682396 3638843 2543754 1363998 1243691 1680822
8474 1680822 1340209 -5586 -1392519 -2071556 -2022594 -1366520 -273411 545601 130258
8465 130258 -1653983 -3831473 -5363945 -6165403 -6820819 -7487752 -7477129 -6178468 -4252992
8456 -4252992 -3404036 -4677649 -7302072 -9484209 -9964631 -8521117 -5723190 -2973257 -2011165
8447 -2011165 -3073798 -4001188 -2696863 -208565 508855 -1041626 -2053918 -697419 1143652
8438 1143652 1030582 -192222 -97897 1184032 1448183 620103 1450725 5221705 9100525
8429 9100525 9255596 5365847 808437 -901828 985383 4359536 6126116 4620832
8421 4620832 956057 -2155227 -3247560 -3444902 -4750026 -7621534 -10731126 -12538138
8413 -12538138 -12377389 -10346799 -7031982 -3509368 -1009485 -133844 -484134 -1241848 -2062321
8404 -2062321 -3189199 -4590753 -5281698 -4058857 -1020609 2258185 4458513 5797250
8396 5797250 6929237 7330970 6129757 4278553 4089835 5906207 6788345 3957711 -1308791
8387 -1308791 -4911133 -4879559 -3409570 -3439057 -4668842 -4304767 -1139655 2636930 4064127
8378 4064127 2794040 989133 269250 -170556 -2027362 -5150373 -7181917 -6114859 -2739609
8369 -2739609 21151 398996 6158 2065360 7199916 11810118 11629752 6587607 851025
8360 851025 -2105154 -2908430 -3958005 -5390524 -5427737 -4041991 -3731160 -5988319 -8951277
8351 -8951277 -9842473 -8472490 -6837724 -5999726 -5034819 -3049583 -792289 314132 -92162
8342 -92162 -1205277 -2255517 -3131246 -3807152 -3766546 -2500525 -462085 1064020 1314629
8333 1314629 829180 509982 412169 64843 -557113 -1298965 -2551915 -4423844 -5572563
8324 -5572563 -4675819 -3118483 -3973819 -7499620 -9986360 -8721053 -5969737 -5604515 -7419951
8315 -7419951 -7934954 -6036562 -4326857 -4669592 -5811237 -6436109 -7443823 -9484999 -10933578
8306 -10933578 -10528028 -9837440 -10539096 -10986749 -8465428 -3838954 -841658 -952717 -1760885
8297 -1760885 -661319 2236219 5246710 6916501 6266879 3441804 663821 337090 1564495
8288 1564495 940575 -2348741 -4977567 -4499511 -3000398 -3300123 -4083815 -2255867 1442106
8279 1442106 3042182 1140183 -1563156 -2753124 -3090236 -3465985 -2936101 -1041629 381655
8270 381655 -280771 -1904128 -2479688 -2025057 -1850701 -2130897 -1988420 -1136539 76513
8261 76513 1431728 2325848 1515259 -1177012 -3915144 -5102657 -5464660 -6273882 -6871419
8252 -6871419 -6078178 -4762629 -4324960 -3658039 -845882 2622825 3027015 97099 -2255327
8243 -2255327 -1945532 -1678039 -3986637 -6844043 -7087726 -5411778 -4464540 -3936206 -1430940
8234 -1430940 2626632 4752639 3298335 597430 -321501 1138029 3650877 5426443
8226 5426443 4798128 1480904 -2283449 -3757421 -3203881 -3332931 -5070555 -6425903 -6212576
8217 -6212576 -6006798 -6897208 -6959736 -4283130 -582288 818140 -499500 -1907004 -1389764
8208 -1389764 746021 3204555 4701937 4118786 1624416 -749946 -1542206 -2288082 -5341816
8199 -5341816 -9836305 -12499083 -12281013 -11061308 -9478557 -5788824 -318358 2712674
8191 2712674 720041 -2698247 -2365276 1167936 2953261 1316015 -365088 9887 -292872
8182 -292872 -3877654 -8123311 -8258382 -3824493 834703 1752256 -1340223 -6213108 -10198108
8173 -10198108 -11126586 -8567454 -4818669 -3122693 -4276483 -6099034 -6443375 -5351081
8165 -5351081 -3876651 -2362594 -798390 278377 354991 -184751 -551504 -482191 -278770
8156 -278770 -558360 -2224228 -5664687 -9456771 -11007627 -9362283 -6458926 -4779663 -4803193
8147 -4803193 -5710112 -7226465 -9136409 -10028686 -8611060 -5838438 -3778058 -2647811 -1082828
8138 -1082828 765987 948123 -796670 -1708204 334366 3552693 4376369 1707665 -2425596
8129 -2425596 -5521150 -6316960 -4619508 -1318872 1415745 1472062 -1160104 -4308713 -5645717
8120 -5645717 -4373509 -1343985 1636874 2847400 1865248 -252135 -2442214 -4775733
8112 -4775733 -7378092 -8997017 -8156507 -5567502 -3767906 -3979891 -4717876 -4161076 -2639544
8103 -2639544 -1775321 -2131322 -2960982 -3719379 -4458126 -4863356 -4279438 -3027956 -2516462
8094 -2516462 -3324834 -4101298 -3353102 -1711676 -1174881 -2340349 -3772791 -4227149 -3943509
8085 -3943509 -3158671 -1079542 2224388 4286233 2744612 -1143548 -3670467 -3382252 -2511029
8076 -2511029 -3294377 -4980263 -5510196 -4493458 -3264307 -3163134 -4694587 -7132733 -8134261
8067 -8134261 -5379120 138235 4036173 3344208 -28268 -2286612 -2643264 -2990643 -4035628
8058 -4035628 -4607073 -4263058 -3797940 -3226881 -1880562 -636430 -1381074 -3709506 -4715042
8049 -4715042 -2981161 -473330 674470 1068171 2225634 3670228 3755783 2332419 847426
8040 847426 253535 96297 -502991 -1743778 -2941438 -3212427 -2618869 -2310742 -2809960
8031 -2809960 -2806419 -1085181 917425 523636 -2380052 -5228879 -6540787 -7167734 -7410869
8022 -7410869 -6008816 -3197338 -1667107 -2535386 -3124657 -1133715 1412646 1161017 -1567208
8013 -1567208 -3701579 -3882688 -3165803 -2532248 -2473203 -3840172 -6247845 -6843806 -3814201
8004 -3814201 -24230 370617 -1821086 -1900562 1514307 4437606 3384527 -378212 -3562282
7995 -3562282 -4590996 -3422230 -776893 1055542 -374879 -3864897 -4977593 -1994167
7987 -1994167 1410833 1501434 -394175 -846546 10087 -808595 -4101176 -7449223 -8755522
7978 -8755522 -8158848 -6659010 -5109840 -4465667 -5018940 -5355349 -3691804 -215841 3204822
7969 3204822 5236729 5618927 4176643 1199596 -1485106 -1788895 142052 2282422 3524480
7960 3524480 4369056 4835314 3882292 1633695 120989 382075 299252 -2794701 -7962373
7951 -7962373 -10959077 -8922531 -3469679 1375428 3271506 2768574 1394081 110040
7943 110040 -448567 -27863 144043 -2088057 -6701545 -10287170 -10020954 -7902311 -8322579
7934 -8322579 -11689883 -13679469 -11500447 -7569124 -5240595 -3985503 -1532235 1606249
7926 1606249 3200334 3524433 4907664 7482596 8719419 7408189 5132267 3243355
7918 3243355 1152484 -1451949 -3217257 -3292244 -2885105 -3286730 -3971408 -3939208 -3403587
7909 -3403587 -2802615 -1644991 21172 256531 -2663745 -7391176 -10561872 -10542104 -8681034
7900 -8681034 -7011023 -6172793 -5659159 -4628467 -2097328 2276557 6820029 8443031 5958436
7891 5958436 2320988 2048216 6056548 10196166 9736856 4606179 -909396 -3346311 -3548819
7882 -3548819 -4600840 -7602202 -10704749 -11795025 -10745027 -8731416 -6376877 -3494687
7874 -3494687 -494460 948019 -508355 -3711922 -5543561 -4270531 -1518045 121369
7866 121369 467817 951582 1221481 -501306 -3260199 -2929487 2036285 7116013 6934846
7857 6934846 2211183 -1763712 -2445858 -2113879 -2847655 -3441456 -2546119 -1601576 -2513376
7848 -2513376 -4496342 -5368918 -4733088 -3998651 -3968095 -3930238 -2839197 -415038 2569378
7839 2569378 4421846 3515919 -40247 -3990234 -5788807 -4885055 -3118923 -3027803 -5448783
7830 -5448783 -8356088 -8616436 -5593262 -2199417 -1303941 -2210078 -2489438 -2202376 -3564386
7821 -3564386 -6826718 -9620504 -10726413 -11331218 -11736093 -10183566 -6546461 -4011063 -4823835
7812 -4823835 -7032845 -7946127 -8284133 -9860859 -11344817 -10094788 -7017529 -5760201 -7307829
7803 -7307829 -8806063 -8060842 -6192181 -5072489 -4645187 -3896663 -2783990 -2238063 -3255264
7794 -3255264 -6258023 -10363021 -13441425 -14094019 -13235678 -12454045 -11494054 -9140877 -5945404
7785 -5945404 -3836888 -3304086 -3268228 -3576577 -4966857 -6355064 -5173100 -1506130 768662
7776 768662 -1267162 -5524578 -7348056 -4757115 131604 3743976 3757951 208471 -4610821
7767 -4610821 -7717598 -7814136 -5914487 -3641496 -1934733 -1448106 -2506365 -4030495 -4156806
7758 -4156806 -2782355 -1885842 -2432095 -2898537 -2247216 -2277087 -4799715 -8016343 -8419355
7749 -8419355 -5592954 -2494817 -1165973 -711890 199545 1355684 2444280 4354686 7511405
7740 7511405 10237230 10402902 8128271 5546430 4159731 3524210 2475050 618601 -1656553
7731 -1656553 -3830738 -5340617 -5436944 -3621247 -262219 3571331 6871639 8995312 9493444
7722 9493444 8490963 7367113 7933947 10080250 11027767 8157488 2244971 -3300352 -6186676
7713 -6186676 -6896626 -6724401 -5941041 -4543618 -3279443 -2745628 -2352989 -1243839 299455
7704 299455 1118392 338454 -2170978 -5598961 -7917887 -7133012 -3976035 -2116449 -3913060
7695 -3913060 -6754505 -5885288 -872549 3103592 1413579 -4362851 -8543452 -8077372 -5280124
7686 -5280124 -4046039 -5344850 -7430422 -9047317 -10459151 -11434112 -10296793 -6255997
7678 -6255997 -1541214 487052 -852490 -3052261 -3678600 -2626563 -875827 1173179
7670 1173179 3008069 3099909 507982 -3062602 -4509080 -2937062 -862365 -1259590 -4141174
7661 -4141174 -6763784 -6898811 -5072158 -3359861 -2821073 -3145983 -4462227 -7676118 -12170337
7652 -12170337 -14842109 -13340194 -9418426 -6978167 -7201637 -7892121 -7459278 -6823001 -6842885
7643 -6842885 -6644275 -5642960 -4667679 -3675220 -1034018 3002265 4873444 2564126 -408998
7634 -408998 654895 4773540 6519216 3491382 -1151276 -3686685 -3823577 -2953702 -1525205
7625 -1525205 428844 2242889 3342481 3695710 3130073 1628968 203593 -399900 -1556748
7616 -1556748 -4881661 -8671507 -9253962 -6214240 -3031565 -1847285 -1283602 -766011 -2789136
7607 -2789136 -8060398 -11988525 -9920656 -3574301 1647148 3977153 5706677 7411450
7599 7411450 6576027 2496710 -1575134 -2718739 -1823642 -1276841 -1667480 -2518869 -4244038
7590 -4244038 -7212005 -9928739 -10083107 -7182929 -3026291 203294 1471406 811977 -1319090
7581 -1319090 -4221979 -6739906 -7435047 -5752974 -3230211 -2550664 -4462849 -6361658 -5181493
7572 -5181493 -1160322 2776210 4979649 6480485 8305386 9557872 9103430 7377140
7564 7377140 5158970 1961996 -2633255 -6925769 -8398535 -7089628 -5982914 -7446769
7556 -7446769 -10424367 -12006553 -11112933 -9547091 -9461494 -10849130 -12229109 -13111443 -14385097
7547 -14385097 -16008600 -15822453 -12073922 -6476485 -2971097 -3152371 -4469882 -3856367 -1927578
7538 -1927578 -2064376 -5688484 -10055395 -11317521 -8730274 -4812651 -1894293 11818
7530 11818 1541319 1739115 -851404 -5243487 -7973065 -6673937 -2612579 915500 1739001
7521 1739001 -100159 -3093218 -5213483 -5341513 -4776347 -6030006 -8940765 -9736321 -6032469
7512 -6032469 -1198653 -739764 -4994194 -8667469 -7715366 -3489776 537094 2802124 2975670
7503 2975670 396151 -4387574 -8459132 -9178898 -6763164 -2792787 2055246 7083294
7495 7083294 10399696 11000183 10466677 10290892 9133880 5410299 984664 -1071535 -1369814
7486 -1369814 -3121568 -6566493 -8479467 -7669712 -6939199 -8144260 -8948380 -6793543 -3295761
7477 -3295761 -1937918 -3214243 -4703213 -4755519 -3637447 -1787524 632535 2588790 2631120
7468 2631120 876175 -782095 -782268 605182 1964540 2233604 1488962 710060 718586 1201254
7458 1201254 1178325 510031 149382 643771 1371420 1727153 1965394 2177500 1602455 -16757
7448 -16757 -1367345 -1048558 534438 1728634 1374637 -853135 -4791031 -9243232 -12070224
7439 -12070224 -12305903 -11457186 -11274502 -11120371 -9336966 -6439633 -4703191 -4850200 -5489791
7430 -5489791 -5972384 -7326054 -9570943 -10382640 -7935451 -3608725 -348579 732259 798312
7421 798312 1063868 1503260 1552852 982671 -44995 -1107335 -1568885 -929931 634892
7412 634892 2173228 2610777 1812103 996883 1586795 3414994 4763632 4611906 3940897
7403 3940897 4009627 4403998 4188605 4094546 5562978 7880214 8396687 5992142 2566700
7394 2566700 535536 360495 1099736 1879423 2086014 1384842 268819 -425836 -879474
7385 -879474 -1927009 -3175536 -3177360 -1983719 -1780742 -4173207 -8247688 -11817549 -13015670
7376 -13015670 -10581892 -5068836 -337168 -789874 -5644316 -8899761 -6913716 -2952399
7368 -2952399 -1719227 -2662590 -2399777 -953240 -782029 -1311467 311657 3515924 4550716
7359 4550716 2816560 1910417 3176484 3125681 -542937 -4728227 -5733914 -4784924 -5338169
7350 -5338169 -7557600 -9071153 -9344844 -9609666 -9448663 -6970301 -2268870 2066642 4064934
7341 4064934 3851817 2049127 -1113674 -4711876 -6994108 -7074956 -5704413 -4020045 -2489695
7332 -2489695 -1340033 -1107865 -2211396 -4235250 -5906902 -6038001 -4880111 -4220406 -5184970
7323 -5184970 -6238936 -4980835 -1980277 -601872 -2203943 -3962640 -3119254 -1083641
7315 -1083641 -896347 -2468971 -3352800 -3078155 -3469936 -5057172 -6305664 -6525689 -6634528
7306 -6634528 -6651455 -5279892 -2749746 -1422553 -2421386 -3901839 -3874500 -2701416 -1516249
7297 -1516249 -127241 1938025 3840842 4447919 3850939 2771907 1679435 1411712 3102824
7288 3102824 6320300 8872717 9704714 10138943 10720074 9101965 3682704 -2418727 -4423359
7279 -4423359 -2300611 -782727 -2847947 -6359156 -8019840 -7752954 -7465370 -7587362 -6989369
7270 -6989369 -5320747 -3546517 -2425370 -1780420 -1315399 -1267042 -2003473 -3353881 -4581073
7261 -4581073 -5129278 -5388629 -6309118 -7992629 -9281123 -9350276 -9065964 -9879326 -11970058
7252 -11970058 -14441079 -16515965 -17214243 -14907810 -9347294 -3462711 -542200 118471
7244 118471 1759480 4295488 3703458 -1504267 -7104828 -8905696 -8206953 -8280651 -8530194
7235 -8530194 -6594402 -4208785 -5743657 -11288423 -16000775 -16852955 -15712747 -14825415 -13537168
7226 -13537168 -11191352 -9367619 -8893045 -7842926 -5037273 -2726607 -3101553 -4570080
7218 -4570080 -4365490 -2774172 -1843306 -1769433 -1712679 -2578314 -5543092 -8940601 -10127516
7209 -10127516 -9738573 -10551024 -12499070 -12528157 -9647304 -6531831 -5258364 -4655638 -3121848
7200 -3121848 -1313928 -562491 -775781 -1245713 -1779695 -2113895 -1978914 -2345302 -4468693
7191 -4468693 -7073821 -7030538 -3841588 -760957 -4750 357242 2633045 5192275 4750895
7182 4750895 1290496 -2193905 -3911009 -4650466 -5498444 -6488512 -7377737 -8015530 -8060539
7173 -8060539 -7503256 -6929318 -6293100 -4510261 -1461677 988366 1502162 1284375 1794738
7164 1794738 2197089 1466604 1272948 3567948 6544892 6724627 4516356 3686829 5113708
7155 5113708 5315614 2384102 -749586 -1262275 -1141420 -3688029 -7715265 -9018382 -6681092
7146 -6681092 -4382565 -5210030 -7974250 -9467317 -8171923 -4549762 540443 5803620
7138 5803620 8741663 7222007 2375011 -1752184 -2649021 -2267052 -3846314 -6778934 -7227056
7129 -7227056 -3880443 -26042 1433947 2163023 5203428 9813839 12537768 12070429 9918866
7120 9918866 7109668 3546492 197762 -1506031 -2491868 -4940635 -8207575 -9379514
7112 -9379514 -8285178 -7940421 -8973858 -7990189 -3596324 132265 -679858 -4103226 -6092344
7103 -6092344 -6669431 -8075864 -9201632 -7092886 -3014829 -1740069 -4447071 -7020946
7095 -7020946 -6524716 -5048095 -5164905 -5327124 -2769137 1442792 3554794 2359523 602931
7086 602931 1279868 4402331 7566547 8342474 5847632 1046428 -3872647 -6771759 -6796567
7077 -6796567 -4800580 -2765234 -2372772 -3431470 -3805506 -1711500 1858274 3934344 3082750
7068 3082750 1107020 545284 1337419 1161358 -1203699 -4144159 -5239660 -4069556 -2183891
7059 -2183891 -827684 154863 1108041 1537811 1135770 1027587 2801882 6440266 10081134
7050 10081134 11660703 10019629 4978174 -2184014 -8454070 -11028925 -9971792 -7587192
7042 -7587192 -5080758 -1813140 1731585 2958353 851380 -1583074 -988350 1776810
7034 1776810 3415723 3372945 4023884 5974768 6605885 4284813 1282646 791916 2781461
7025 2781461 4488250 3883888 1119049 -2626792 -6059820 -7808883 -7184658 -5438472 -5211432
7016 -5211432 -7698390 -10574454 -9828095 -4290476 2289702 4707970 1682382 -3230365
7008 -3230365 -5896477 -5296381 -2872984 -311755 947093 -88805 -2459360 -3287862 -1142888
6999 -1142888 1813189 2883857 2645816 3296464 4526889 4246819 2771316 2658681 4203511
6990 4203511 4785802 3602639 3354417 5488228 7194964 5720289 2831403 1778646 1911613
6981 1911613 116896 -3364671 -4549601 -1587667 2260720 2854199 59753 -3223544
6973 -3223544 -5324678 -7048929 -9129125 -10302275 -8722036 -4596249 -474325 1319754
6965 1319754 994887 464138 498994 -347161 -3649829 -8668627 -12599959 -13001996 -9654613
6956 -9654613 -4421301 217586 2617523 2472839 401357 -2447346 -4406581 -4021214 -1710599
6947 -1710599 101508 -80591 -355818 2177905 6681409 8641577 5547406 394341 -1937251
6938 -1937251 -226311 2742571 4013194 2762899 -270775 -3564350 -5237911 -4432304
6930 -4432304 -2357428 -836706 -58091 1049973 2621540 3529519 3126115 1837592 3704
6921 3704 -2401058 -4676539 -5460015 -4356030 -2421935 -790431 -15445 -874858 -3955524
6912 -3955524 -7579342 -8036738 -3732534 1947450 3981919 1596293 -1226804 -1281678 14522
6903 14522 -528793 -2940736 -4155767 -2561148 -327334 -457659 -2863867 -4583823 -3475654
6894 -3475654 -709030 545768 -1563139 -5745268 -8922218 -9227862 -7417799 -5336821
6886 -5336821 -3811206 -2782739 -2630002 -3669901 -4584187 -3447558 -822373 311281 -1286567
6877 -1286567 -3256382 -3467800 -3284301 -4508425 -5243010 -2404492 2788196 5843136 5335162
6868 5335162 4219902 4322164 3662860 773505 -2192143 -3062006 -3220488 -4763312 -6589656
6859 -6589656 -6411797 -4760486 -3794248 -3483570 -2228358 -417178 -63580 -1075772 -972399
6850 -972399 1224381 3338047 3034532 588152 -1997505 -3118921 -2371148 -629431 252341
6841 252341 -874406 -2647716 -2232177 1397687 6133926 8984855 8824675 6781214 4818284
6832 4818284 4191553 4539360 4192554 1858300 -1861055 -4872242 -5378031 -3197797 46509
6823 46509 1777926 464788 -2511133 -3814813 -1741055 1964191 4440755 4635864 3066602
6814 3066602 315336 -2636838 -3899527 -2483093 129584 1908499 2924629 4329086
6806 4329086 5669469 5369964 3267016 591895 -2003076 -4325276 -5278248 -4130407 -2750024
6797 -2750024 -3867007 -7045101 -8986224 -8173413 -6693056 -6794306 -7915591 -8043718 -6265251
6788 -6265251 -3233181 -537462 78591 -1606460 -3342820 -2812063 -824309 -130184 -1286538
6779 -1286538 -2195756 -1866743 -1925254 -3765906 -6610769 -9031284 -10159788 -9053540 -5479675
6770 -5479675 -1835160 -1430575 -4044373 -5948481 -5089583 -3170262 -1761471 -50870 1953244
6761 1953244 1819804 -1169848 -3555062 -2255104 1130593 3375927 4190869 4543204 3133062
6752 3133062 -1469241 -6954353 -9567494 -9256414 -8931029 -9434186 -8869863 -6584108 -4447579
6743 -4447579 -4050866 -5251923 -7340202 -9221506 -8970943 -5909992 -2757381 -2979625 -6212519
6734 -6212519 -8892683 -9076722 -7852281 -6272928 -4068053 -1730820 -939830 -2066072 -3450076
6725 -3450076 -3713426 -2964437 -1710735 -626432 -1168956 -4011238 -6966843 -6988322 -4131983
6716 -4131983 -932557 1821463 5403764 9210190 10347389 8216738 6040621 6271028
6708 6271028 7467711 7361793 6184925 5132081 4162910 3373048 4159194 6737695 8424365
6699 8424365 6659700 2366929 -1481293 -3219618 -2901003 -1051522 1261087 2584998
6691 2584998 2784460 3009778 2825751 -273986 -6676677 -12452650 -13892687 -12230874 -11112265
6682 -11112265 -11197670 -10412666 -8133094 -5717825 -3688444 -1668204 -671342 -2226937 -5279071
6673 -5279071 -6926362 -6366095 -5371249 -4833875 -3820910 -2432082 -2519065 -4555447 -6354286
6664 -6354286 -6016988 -3998430 -1347634 1806006 4885706 6227724 5300139 3811451 3265472
6655 3265472 3024503 2023915 698707 -177562 -922124 -1717858 -1577090 -202249 692826
6646 692826 -103524 -875060 566479 2976570 2904889 -385372 -3721038 -4143692 -2205273
6637 -2205273 -449547 -182871 -644294 -388626 1274060 3703978 5421011 5471963 4219921
6628 4219921 2460643 397331 -1758301 -3095456 -3336129 -4086228 -6771477 -9662099 -9326175
6619 -9326175 -5353540 -1220015 375375 610247 1574565 2538185 1403155 -1748666 -5070804
6610 -5070804 -7887600 -10637129 -12499332 -11888342 -9414017 -7738687 -7936417 -8438950 -8453628
6601 -8453628 -9814927 -13615996 -17017738 -15984790 -10455799 -4540593 -1673076 -1442397
6593 -1442397 -1464911 -647419 299667 512054 3005 -690015 -1129585 -1192000 -1108671 -1460515
6583 -1460515 -2792822 -4844354 -6329491 -6194069 -5317333 -6042637 -9137360 -11991621 -11338717
6574 -11338717 -7499156 -4108686 -3403402 -3911002 -3815370 -4286302 -7095427 -10309279 -9566340
6565 -9566340 -3944325 2137635 4143619 2625692 1417400 1867669 1365058 -2154304 -6498746
6556 -6498746 -7722493 -5327899 -2788406 -2670276 -3392326 -2153069 675374 2318430 1818125
6547 1818125 802353 181803 -1076430 -3294727 -5043303 -5964953 -7911956 -11479587 -13938016
6538 -13938016 -12881896 -9622997 -6329744 -2191036 4025468 9502826 9908017 5719370
6530 5719370 1710523 264927 -340886 -674005 1698069 6922727 10404676 8782901 4946416
6521 4946416 3698464 5077828 5560830 3853248 1611912 -420511 -3084167 -5772922
6513 -5772922 -6224895 -4075877 -2097478 -2879137 -5813573 -8067970 -7566650 -4779078 -2282287
6504 -2282287 -2338853 -4289481 -5127012 -3477823 -1634541 -2050642 -3290272 -2058995 1456543
6495 1456543 3332229 1343757 -2097606 -3583133 -3132774 -3335603 -5331812 -7410985 -7439773
6486 -7439773 -5601139 -4337941 -5678940 -8818259 -10848748 -10057201 -7615937 -5440963
6478 -5440963 -3596733 -1171092 1264047 1993855 648113 -1430455 -3188939 -4537344
6470 -4537344 -5157147 -4602523 -3807469 -4515196 -6634417 -7931671 -7038765 -5106739 -3723728
6461 -3723728 -2880004 -1976784 -1238903 -866676 -135388 1287676 2224184 1562900 42230
6452 42230 -912605 -1285947 -1862458 -2139169 -630307 2702092 5776837 6575069 5113657
6443 5113657 2954715 1462831 881339 652128 245603 -312516 -702835 -992395 -1700506
6434 -1700506 -3068876 -4650292 -5830106 -6418536 -6556456 -6372670 -5835391 -4618757 -2256569
6425 -2256569 1008854 3829315 5202371 6103430 8154031 10477259 9863525 5198206 11300
6416 11300 -1230195 1590728 4518626 4474993 1958198 -961451 -3152450 -4366711 -4491711
6407 -4491711 -4007886 -4182335 -5727322 -7713434 -8520663 -7576442 -5733290 -4241368 -3611122
6398 -3611122 -3122512 -1324805 2428610 6756404 9248676 9079664 7962954 7956741 8940949
6389 8940949 9079873 7410323 4984802 3364978 2803879 2344929 1261994 -141128 -1117747
6380 -1117747 -1439141 -1460575 -1315863 -552873 967518 2122112 1409868 -932360 -2652778
6371 -2652778 -2142205 -664028 -766691 -2917421 -5253683 -6635063 -7965764 -9696534 -10046681
6362 -10046681 -7569542 -4113658 -2751715 -3268290 -2394980 1145738 4492332 4649472 2291059
6353 2291059 -161373 -2247908 -4830955 -7021466 -6603065 -3368820 386236 2954601
6345 2954601 4649957 5706508 4977392 1921255 -1720993 -3679071 -3709070 -3280329 -3356794
6336 -3356794 -3437247 -2427312 56962 2796170 3286535 43213 -5055460 -8145628 -7919637
6327 -7919637 -7301742 -9268754 -12424466 -12792587 -9274544 -4990342 -3099168 -3403766 -3799121
6318 -3799121 -3346788 -2681730 -2371087 -2169603 -1687846 -1027148 -726811 -1290010 -2547092
6309 -2547092 -3473963 -3138884 -1904692 -1049316 -1043792 -1033493 -408973 45665 -657058 -2186673
6299 -2186673 -3710121 -5688843 -9283912 -13804496 -16350408 -14976452 -11192390 -8090842
6291 -8090842 -6647769 -5402811 -3599367 -2690978 -3842680 -5438060 -4710148 -1309731 2279855
6282 2279855 3788075 3180478 1466511 -944762 -3829569 -6220783 -7145870 -6874652 -6438282
6273 -6438282 -6127935 -5371820 -4034943 -2932136 -2746948 -2993684 -2440718 -428449 2328097
6264 2328097 4164561 3829370 1688726 -464880 -1015231 65378 1420005 1709847 795940
6255 795940 -71374 854576 4098465 7787394 8962786 6834634 4115382 4057327 6543864
6246 6543864 8417521 7629493 5557832 4707298 5507274 6431333 6329656 5367681 4157305
6237 4157305 3246535 3320193 4694233 6509516 7540559 8017431 9392288 11674563 12245707
6228 12245707 8642348 1964294 -3850758 -6070774 -5292047 -3529071 -1762750 -190806
6220 -190806 437129 -582862 -2234993 -2249361 233669 3352060 4445302 2706518 -580363
6211 -580363 -3811702 -6221098 -7593180 -7958129 -7942067 -8590300 -10109807 -11240106 -10761310
6202 -10761310 -9467089 -9514443 -11422398 -12832732 -11331843 -7887266 -6051359 -7691135
6194 -7691135 -10825586 -12162292 -10590600 -7363187 -3926793 -988151 732701 462704
6186 462704 -1437212 -3279339 -3810941 -3734400 -4759575 -7180290 -9064903 -8392264 -5741880
6177 -5741880 -3898408 -4276902 -4758937 -2540925 1305037 2268632 -1871344 -7689117 -10028806
6168 -10028806 -7943255 -4870664 -3802476 -4464011 -5059129 -4628835 -3205405 -1281422 223251
6159 223251 617796 439550 714446 1120743 344144 -1420104 -2039273 -452694 1290280
6150 1290280 328333 -3446554 -7339545 -8994070 -8524937 -7497971 -6586188 -4850137 -1507335
6141 -1507335 2058689 3157033 1033688 -2056590 -4038605 -5767231 -8713423 -11332462
6133 -11332462 -10774530 -7775867 -6430813 -8551572 -11491537 -12585169 -12439306 -12207987 -10992445
6124 -10992445 -8464345 -7046959 -8187985 -8817782 -5337202 427462 3336487 2246532
6116 2246532 1014273 2065540 3110415 1519866 -1549647 -3520194 -4423671 -6131509
6108 -6131509 -8829719 -10476620 -9572680 -7091465 -5411480 -5815125 -7227386 -7559663 -6246513
6099 -6246513 -4654096 -3598262 -1879018 1329934 3940673 3106858 -580237 -3487552
6091 -3487552 -3562444 -2162176 -946945 424759 2427888 3862863 3659298 2854898 2859900
6082 2859900 2729911 115372 -5225775 -10322956 -11826785 -9429806 -6185568 -5338599 -6821509
6073 -6821509 -7488114 -5317112 -2300050 -1591300 -2613756 -1622740 2513884 5884153 4462353
6064 4462353 -590113 -4719192 -5813178 -5807711 -6817032 -8086727 -7628220 -5383226 -3449673
6055 -3449673 -3525515 -5112415 -6485091 -6812391 -6679981 -6762022 -6954756 -7123604 -7667895 -8554040
6045 -8554040 -8668696 -7190731 -4877136 -2850957 -982307 1029436 1897897 221506 -2759351
6036 -2759351 -4300347 -4030439 -4157415 -5476062 -5958060 -4331328 -2410381 -2231655 -3068980
6027 -3068980 -3206479 -2858097 -3201064 -3890235 -3735473 -2942919 -2660643 -2982136 -3316442 -4181153
6017 -4181153 -6581596 -9647285 -10660090 -7897409 -2532507 2399168 4370739 3131217
6009 3131217 879812 272607 1653913 2922376 2636559 1993820 2658266 3949307 3864246
6000 3864246 2002882 -324435 -2282366 -3956905 -5060292 -5158704 -5030750 -5770317 -6398360
5991 -6398360 -4496518 96209 4130213 4659732 2500275 620090 134489 -377469 -1867315
5982 -1867315 -2935750 -1777199 910753 2142004 -158328 -4908749 -9118031 -10759254
5974 -10759254 -9936231 -7898965 -5948783 -5104286 -5671054 -6790529 -7119038 -6187608 -4628124
5965 -4628124 -3274887 -2814841 -3933937 -6555229 -9082458 -9796035 -8962895 -8084997 -7245933
5956 -7245933 -5247943 -2535546 -1498407 -2972002 -4731259 -4705801 -3577070 -2775984 -2030702
5947 -2030702 -679136 451732 381256 -403883 -1306031 -2713507 -4036143 -3081843 130993
5938 130993 1437471 -2165292 -7212160 -7829910 -3959577 -1187346 -2705868 -5885919 -7414302
5929 -7414302 -7526960 -7512438 -6623648 -3919461 -899600 14594 -1536831 -3829545 -5053918
5920 -5053918 -4495196 -2788144 -1616018 -2180253 -3743723 -4717357 -4861316 -4846546 -4175415
5911 -4175415 -1897785 664146 594383 -2588702 -5941484 -6925461 -6147335 -5606744 -6307860
5902 -6307860 -8240711 -10558669 -11182352 -8619037 -4870318 -3924875 -6480885 -8990769 -9067337
5893 -9067337 -8623125 -9823025 -11190981 -10512355 -8997667 -9340917 -11441308 -13192547 -14141389
5884 -14141389 -15221243 -15828061 -14333348 -11127199 -8352949 -6753659 -5273985 -3695182
5876 -3695182 -3174364 -3898726 -4362140 -3411258 -1311004 1382064 4202285 5747253 4097375
5867 4097375 -975742 -7341951 -12437579 -14887989 -14275345 -10839047 -5985656 -1950658
5859 -1950658 -163591 -378299 -1555166 -2922728 -4060285 -4750106 -5153100 -5694853 -6489591
5850 -6489591 -7037656 -6533309 -4497421 -1457608 944423 1137025 -834317 -3512790 -5823169
5841 -5823169 -7683602 -8735948 -8053873 -5927132 -4436146 -5000612 -6584697 -7635817 -8404618
5832 -8404618 -9517462 -9521334 -6452003 -1520372 1367205 329763 -2231555 -2903526 -1190524
5823 -1190524 865876 1807208 2149120 3011685 4457095 5517568 5451063 4479468 3193915
5814 3193915 1772032 353349 -355470 -28947 -15440 -1979712 -4967305 -5824274 -3548967
5805 -3548967 -1284617 -2296249 -5478465 -6894027 -4754213 -790938 2599154 4401519
5797 4401519 4495727 3215295 1563317 353473 -876732 -2851748 -4814923 -5248392 -3998795
5788 -3998795 -2230895 -711630 269159 -156724 -2548480 -5411955 -6342960 -4936991 -2770002
5779 -2770002 -706798 1584071 3432222 3027220 215428 -2662064 -3602464 -2865511 -1426909
5770 -1426909 500450 2445524 3143020 2428861 2179730 3867163 6212879 6622608 4247660
5761 4247660 612869 -2116257 -2663146 -1188020 801350 1545586 604046 -1063086 -2633467
5752 -2633467 -4153501 -5628893 -6596919 -7019752 -7486920 -8092480 -8195735 -7634806 -6932574
5743 -6932574 -5960685 -3931461 -1342999 -293551 -1791824 -4085355 -4820469 -3775045 -2414251
5734 -2414251 -1930778 -2974328 -6173050 -11223476 -15947981 -17779208 -16250192 -13211260
5726 -13211260 -10759408 -9555139 -8794106 -7170508 -4160685 -873566 650158 -647810
5718 -647810 -3803611 -6599795 -6927612 -3968822 650226 3115257 656741 -5015815 -9073129
5709 -9073129 -8841482 -6126961 -3906444 -2881289 -2355173 -2324523 -2927533 -3408488 -3387903
5700 -3387903 -3820776 -5033022 -5238676 -2974203 159045 1234128 -387487 -3022934 -5265478
5691 -5265478 -6636770 -6649466 -5546319 -5343887 -7778000 -11457683 -13115983 -11425238 -7756774
5682 -7756774 -3865120 -1058726 -880100 -3687823 -6743203 -6683955 -4058619 -2390643 -2478755
5673 -2478755 -1223776 2771171 6202580 5979290 4010191 3932607 5194673 4045279 -345830
5664 -345830 -4103125 -3351012 1603379 7329690 10792531 11164736 9368015 6701732 3775466
5655 3775466 716459 -1741419 -2333267 -902435 1166207 3015223 5556146 9316577
5647 9316577 12318045 12090029 9056045 5788526 3415755 1239162 -261477 833656
5639 833656 4097802 5506926 2027455 -4303771 -8907042 -9872141 -8513488 -6013346 -2413238
5630 -2413238 1284564 2946058 2117386 885348 867520 1114590 238421 -1024993 -1106893
5621 -1106893 -326669 -338338 -1340434 -1765934 -824517 314236 316557 -619557 -1401925 -1402023
5611 -1402023 -713337 109283 248604 -511964 -860846 860838 3947440 5189521 2640521
5602 2640521 -1581856 -3847200 -3646899 -3739831 -5767533 -7833093 -7273720 -4221473 -1082153
5593 -1082153 504508 701087 90567 -990115 -1684092 -947288 532112 127671 -3632733
5584 -3632733 -8535085 -10810636 -9530088 -7233120 -6135699 -5723590 -4954158 -4760225 -6357901
5575 -6357901 -8330655 -7981999 -5410890 -3771834 -4894703 -6786860 -6594761 -4286684 -1887791
5566 -1887791 -368068 866199 2016780 2285384 1332799 4420 -822250 -1376548 -2698741
5557 -2698741 -5584147 -9754634 -13652303 -15260732 -13753155 -10376309 -7320324 -5688021
5549 -5688021 -4739229 -2978722 99169 3077161 3558086 745025 -3000795 -4359813 -3080223
5540 -3080223 -2298702 -4071802 -6350094 -6029566 -3486066 -1595236 -1013190 571360 4123226
5531 4123226 7067670 6841365 4559716 3253985 3745706 4265397 3493383 1933022 256612
5522 256612 -1798327 -4114116 -5163216 -3637219 -644334 1027862 130693 -1492593 -1238130
5513 -1238130 976090 2744974 2287759 279609 -1786215 -3757848 -6227747 -8592974
5505 -8592974 -9254846 -7758784 -5494819 -3933806 -3091195 -2179582 -1086599 -663888 -1830532
5496 -1830532 -4592053 -7685442 -9286424 -8626505 -6941154 -6247790 -7154406 -8479142 -8976936
5487 -8976936 -8553945 -7594977 -6106798 -4145837 -2388606 -1558028 -1668219 -2359934 -3568734
5478 -3568734 -5290893 -7003749 -7882781 -7429502 -5545411 -2362551 1518273 5036527 7612758
5469 7612758 9821766 12363137 14566009 14978488 13636249 12547281 13046782 13496769 10993875
5460 10993875 5286709 -359391 -2719305 -1956334 -589289 -57242 293457 1147402 1786807
5451 1786807 1192758 -618781 -3064169 -5836898 -8366017 -9129094 -6730036 -1719822 3353105
5442 3353105 5886273 5107243 2436047 368527 520459 2126338 2739863 1023865 -1399916
5433 -1399916 -1560785 1459983 5319888 6695170 4441158 507590 -1967258 -1388466 1314471
5424 1314471 4130038 5762616 5688943 3493010 -344374 -3435837 -3367345 -1026782 -64358
5415 -64358 -2247350 -5464938 -7504991 -9299983 -12272332 -14785715 -14417470 -12249542 -11239425
5406 -11239425 -11032192 -8352144 -2791830 1678353 2086782 -47709 -2023363 -3460463
5398 -3460463 -4501272 -3609292 -53281 3574937 4390024 3375421 3638200 5561074 6705435
5389 6705435 6061806 5394594 6112284 7333377 7629416 6593348 4083275 -57636 -4587736
5380 -4587736 -6928628 -5942134 -3532054 -2369265 -2983791 -4266354 -5947522 -8871815 -12791109
5371 -12791109 -15374429 -14323377 -10043247 -5493152 -3304288 -3424358 -3797604 -3046536 -1938555
5362 -1938555 -2059465 -3517791 -4556664 -3510417 -687768 2090244 3627446 4331185 4750203
5353 4750203 3989956 843273 -3664790 -6563761 -6564081 -5904990 -7155548 -9346977 -9256055
5344 -9256055 -5889138 -1466435 1866019 3894975 4679127 3720398 1822384 1265694 2462483
5335 2462483 2553667 -613058 -4921434 -6859549 -6513592 -6725735 -8022270 -7749031 -4635137
5326 -4635137 -1092202 412673 901473 2894809 6415739 9107894 9643590 8921815 7791766
5317 7791766 5541323 1752628 -1510134 -1161679 3054462 7602407 9027342 7871097
5309 7871097 7234524 7920719 7235616 3350130 -1299062 -2925013 -1521647 -702122 -2623970
5300 -2623970 -5433425 -6429717 -5732556 -5298043 -5515343 -4717406 -1983400 1161263 2492418
5291 2492418 1628663 43 -1241826 -2271158 -3512727 -4523528 -4504684 -3267756 -1082029
5282 -1082029 1726546 4129135 4159135 969718 -3028414 -3940070 -846715 3075529 4652707
5273 4652707 4292062 4195733 4500635 3266291 -226860 -4217253 -6779171 -7870760 -8458638
5264 -8458638 -8711627 -8009285 -6325412 -4685073 -3958281 -3700357 -2931786 -2095769 -3116661
5255 -3116661 -6575738 -9760943 -9251811 -5201973 -1173607 387254 365747 202982 -463330
5246 -463330 -1845170 -2002224 797600 5046662 7638155 7647340 6341553 4284124 912263
5237 912263 -3239302 -6200031 -6746320 -5362693 -3066823 -697308 965555 1912966 3265523
5228 3265523 5261395 5651712 2342577 -2880453 -5875065 -5287227 -3490798 -2314133 -930246
5219 -930246 1250387 2795474 2988541 3600422 5703508 6797521 3710579 -2730727 -8207637
5210 -8207637 -9577101 -7347449 -4037700 -1744647 -1209759 -1975659 -3157244 -4327041 -5283229
5201 -5283229 -5078939 -2686210 872533 2739686 1747718 296313 1234018 4080936 6043547
5192 6043547 5771901 4153543 2028403 -713120 -3738137 -5846057 -6404057 -6024722 -5578128
5183 -5578128 -5476989 -5874856 -6480061 -6230026 -4312880 -1564379 202821 202922 -1086848
5174 -1086848 -3413574 -6831173 -10136575 -11078192 -9015216 -5993860 -4156715 -3220167 -1672534
5165 -1672534 478905 1550177 300894 -2945461 -6883849 -9772275 -9810127 -6464320 -1573773
5156 -1573773 2053316 3415494 3751183 4148351 3977650 2065949 -1812654 -7107276 -12741436
5147 -12741436 -16390402 -15173487 -8835744 -1361172 2472488 1922758 260096 404309
5139 404309 2318459 4455421 5707503 5577421 4235241 2956020 2972297 3550787 2909752
5130 2909752 1303397 986698 2453791 3246371 1806325 -78294 -666993 -1643643 -5253105
5121 -5253105 -9854741 -11702028 -10303359 -8675834 -8446059 -7929417 -5590426 -2562469 -679504
5112 -679504 -187428 -528120 -1677743 -3610924 -5700946 -7465968 -8807860 -8974783 -6579085
5103 -6579085 -1479886 4191733 7548892 7150999 3888828 488023 -268906 1891648 4096842
5094 4096842 3457534 477866 -2052756 -2933406 -3271147 -3723151 -3635918 -3220946 -3827822
5085 -3827822 -5042955 -4121358 -52380 3834146 3533596 -474978 -3792816 -3329520 -203987
5076 -203987 2487330 3175584 2436985 1053970 -1276927 -4855628 -8366318 -9689106 -8540110
5067 -8540110 -6990069 -6756323 -7410370 -8129036 -9353810 -11080716 -11332034 -8648932 -4674397
5058 -4674397 -1767361 471473 3317434 5051157 2856605 -2025305 -5019522 -4089929
5050 -4089929 -1256509 1518091 3847465 4412652 1744154 -1788964 -1722478 1493855 2312126
5041 2312126 -1276042 -4325381 -2970411 -520163 -1532661 -4504274 -5394955 -4819331 -6374267
5032 -6374267 -10166470 -13023212 -13552113 -12580316 -10073608 -5918701 -2463259 -2059073 -3121491
5023 -3121491 -2579605 -1035437 -1251695 -2527279 -1262466 3008717 6477136 6349489 3630191
5014 3630191 253094 -3196665 -6416256 -8937196 -11079735 -13015421 -13363489 -11398564
5006 -11398564 -9701316 -11154808 -14046976 -14163929 -11434171 -10012481 -11299694 -11535402
4998 -11535402 -7916263 -3097747 -1383107 -3481927 -7201383 -10762977 -13213031 -13561420
4990 -13561420 -11729443 -9149840 -6924023 -4531160 -1446698 1339170 2636533 2761922
4982 2761922 2839154 3305487 3969366 4669427 5055007 4445836 2711392 850440 38197
4973 38197 226272 164220 -885909 -1585493 436982 5192160 8975362 8161102 3740790
4964 3740790 -206308 -2084850 -3766103 -6133798 -7610637 -7903993 -8899650 -10321308 -9101832
4955 -9101832 -5199534 -2999590 -3954138 -3300176 1693199 5769449 3604025 -1388200 -2989419
4946 -2989419 -2572490 -5575723 -10748173 -11699517 -7668411 -4120907 -3086195 -1321497 1525927
4937 1525927 1257494 -2829325 -5642835 -4116477 -1015174 767743 1704284 1922091 -61890
4928 -61890 -3311118 -4703048 -4444125 -5985015 -9710352 -12328358 -12848869 -13046513 -11967131
4919 -11967131 -6960865 -465149 1798799 57609 129179 3217501 4509989 2789035
4911 2789035 2155811 2771151 -95273 -5584138 -6418372 -1709221 274936 -3857086 -6971729
4902 -6971729 -4732067 -3125001 -6440719 -8914308 -5741825 -1973646 -2549087 -3410671 -604284
4893 -604284 1503377 -791911 -3115342 -2553194 -4222616 -10154103 -12866049 -8684102 -5330228
4884 -5330228 -7333464 -7822826 -4543384 -7330196 -17789510 -21356781 -14966481 -19207826
4876 -19207826 -41958449 -58348738 -60131216 -95424048 -205281649 -333784318 -366001308
4869 -366001308 -267363293 -129357998 -54149665 -44693064 -41874624 -22800008 -10812360
4862 -10812360 -15300989 -17269580 -9554967 -7066744 -13943762 -15149249 -5916063 -581679
4854 -581679 -5695038 -9201224 -3557988 2223946 1404584 984116 5869549 8634797 4258424
4845 4258424 452698 3855899 8296664 6181528 1186495 459196 2681570 2582242 629180
4836 629180 370977 1266965 774056 -507718 -899379 -1119262 -1881428 -1913853 -1297413 -2495394
4826 -2495394 -5622612 -7397621 -6965945 -7455266 -9325704 -7923793 -926356 6988862 10429635
4817 10429635 9721023 7902842 5824701 3591696 2794800 3876731 4596111 3770516 3224564
4808 3224564 3944413 4067218 2719489 1820939 2006459 1040588 -1436629 -1996365 1176189
4799 1176189 5194323 7290216 8358005 9145320 7710672 3843099 1248906 1618277 1089113
4790 1089113 -3183053 -7340005 -6628120 -3130809 -2277051 -4458740 -5629881 -4287118 -2532232
4781 -2532232 -1465687 -556257 -856027 -4032615 -8229434 -9148333 -5813946 -1923197 -884524
4772 -884524 -2179957 -3084560 -1798100 1462168 4829499 6237924 5683905 5396844 6616019
4763 6616019 7495402 5848615 2553147 114279 -987100 -2181799 -3830585 -4667248 -3963664
4754 -3963664 -2463002 -1306836 -1226682 -2323732 -3729210 -4274813 -4192368 -4897985 -6458963
4745 -6458963 -7082539 -5989093 -4594187 -3677835 -1991642 619743 1543008 -729203 -3611499
4736 -3611499 -4109068 -3135357 -3127363 -3734789 -3471168 -3491046 -5471379 -7288205 -5465804 -1161977
4726 -1161977 994756 -133913 -1152710 -483164 -853003 -3912066 -6777410 -6414804 -4098617
4717 -4098617 -2837485 -2936712 -2823977 -2376732 -2744731 -4008002 -5270773 -6315926 -7270296
4708 -7270296 -7216081 -4912833 -785764 3033221 4636227 3672167 1166310 -1291654 -2562948
4699 -2562948 -2796302 -2991963 -3434169 -3112760 -1122100 1921756 4385196 5223434 4804580
4690 4804580 4475985 5420511 7455215 8849171 7863984 4616435 970535 -1376295 -2144807
4681 -2144807 -2001155 -1705207 -1789373 -2249539 -2389128 -1651934 -574447 -58205 174555 1141230
4671 1141230 2447858 2091359 -810538 -4357623 -6068381 -5850412 -5533656 -6116265 -6957635
4662 -6957635 -7458449 -7935583 -8486661 -8367566 -7249170 -6060514 -5660396 -5485995 -4621844
4653 -4621844 -3529505 -3242762 -3163883 -1469811 1988392 5014007 6079210 6179283 6328056
4644 6328056 5061060 813179 -4260097 -5723252 -2265061 2707423 5331506 5009618
4636 5009618 3314070 1531893 592410 1490204 3937348 5629885 4443466 892037 -2517528
4627 -2517528 -3764666 -2557191 -98223 1602012 1133841 -798810 -2081643 -1828004 -1134372
4618 -1134372 -855168 -380938 531416 618451 -830684 -2419256 -2672255 -2150798 -2024621
4609 -2024621 -2089113 -1923604 -2458302 -4379237 -6375322 -7104527 -7544944 -9045297 -10347712
4600 -10347712 -9273173 -6398374 -4174475 -3044606 -1420057 801797 1719343 528253
4592 528253 -1588781 -3830768 -6401220 -8598286 -9014290 -8046226 -7628669 -8085977 -7880565
4583 -7880565 -6859962 -6852890 -8358748 -9570785 -9567156 -9480095 -9450771 -7707620 -4285351 -2387614
4573 -2387614 -3813187 -5981806 -6139001 -5789686 -7750375 -10987889 -12057465 -10373235 -8469869
4564 -8469869 -7690615 -6979616 -5751202 -4802887 -4132606 -2620999 -344959 1203052 1618906
4555 1618906 1936682 1996609 78245 -3708305 -6032896 -4169207 287665 3317705 3135233
4546 3135233 1278941 -326337 -1570498 -3250685 -5367225 -7088763 -7857051 -7839562 -7328752
4537 -7328752 -6204813 -4368985 -2556285 -2135973 -3735724 -6306440 -7900448 -7291569 -4739962
4528 -4739962 -1587412 548852 640420 -998126 -2853526 -3534539 -2901286 -1689909 -476996
4519 -476996 372268 83579 -2158299 -5855663 -8880313 -9263762 -7381259 -5868708 -6885524
4510 -6885524 -9576091 -11008336 -9986757 -8934916 -10764145 -14497130 -15951858 -13076510
4502 -13076510 -8637524 -6585565 -7481155 -9036062 -9635110 -9133194 -7184483 -3584695 -296694
4493 -296694 -317112 -3419203 -5250035 -2472229 2576410 4439450 1260146 -3042106 -3579290
4484 -3579290 178242 4744711 7033188 6864240 5394645 2924397 -637042 -4130187
4476 -4130187 -5663674 -4913498 -3618163 -3287884 -3514995 -3302826 -3024816 -3804253 -5483333
4467 -5483333 -6621592 -6579977 -6462067 -7569520 -9646240 -11174837 -11187733 -10471910 -10787110
4458 -10787110 -12665776 -14277454 -13382473 -10477966 -8586576 -9199859 -10066915 -8546127 -5633177
4449 -5633177 -4234447 -4378306 -3278910 -257304 1685394 356467 -2438442 -3958185
4441 -3958185 -4310117 -4929331 -5399986 -4674883 -4092023 -5972660 -9638680 -11741688 -10621420
4432 -10621420 -7769809 -4870768 -2134534 -9616 427945 -72593 1052813 3938103
4424 3938103 4645269 301321 -6056200 -8795753 -6772468 -3938332 -3220992 -3105447 -1123511
4415 -1123511 2034709 3627258 2508317 35000 -1888464 -2449976 -2046904 -1630012 -1766708
4406 -1766708 -2111406 -2220557 -2704262 -4418945 -6399172 -6190297 -3060418 518156 1770471
4397 1770471 855888 -153070 -519248 -1366082 -3526955 -6616966 -10008808 -12994271 -13970422
4388 -13970422 -11370837 -6107193 -1677592 -882436 -3152917 -5681097 -6468564 -5757257 -5057210
4379 -5057210 -5209715 -5163337 -2944001 1421987 4568819 3044725 -2170404 -6438906 -7203100
4370 -7203100 -6654733 -7606031 -9235092 -9128935 -7535590 -6570287 -6284965 -4836066 -2378428
4361 -2378428 -1497883 -3071126 -4591325 -3886826 -2128417 -1606819 -2512313 -3658618 -4794370
4352 -4794370 -6323977 -7899293 -9041899 -10244097 -11911279 -13191542 -13381802 -13332195 -13635291
4343 -13635291 -12649126 -8733098 -3700367 -1379010 -2861095 -5605807 -7267555 -7935593
4335 -7935593 -8351813 -8517455 -8750308 -9736096 -10688165 -9677366 -6555363 -3161998 104892
4326 104892 4855406 10358629 12058812 7391674 617911 -1668322 1510945 5325161
4318 5325161 5870784 3658071 748842 -2089623 -4722920 -6791755 -8406461 -9905913
4310 -9905913 -10493727 -8788608 -5043055 -1367530 319765 -616567 -3798421 -7467058 -8763649
4301 -8763649 -6745688 -4412465 -5040891 -7241424 -7039708 -4495514 -4027432 -7369157 -10485357
4292 -10485357 -9474248 -5948889 -3987921 -4569925 -5803556 -6533904 -6965961 -7151751 -7128787
4283 -7128787 -7406421 -7740179 -7011308 -5713790 -6311096 -9199507 -10756439 -8044322 -3365162
4274 -3365162 -1059326 -1377639 -892945 1935847 4954756 5837659 4553715 2174220 -471054
4265 -471054 -2642337 -3831489 -4153144 -3633455 -1841630 712968 2141520 1648231 1016918
4256 1016918 1914282 3361002 3966648 4843959 7518173 10362916 10229904 6802220 2447909
4247 2447909 -1533557 -5626472 -9581060 -12018082 -12451441 -11582509 -10097518 -8974381 -9658880
4238 -9658880 -11704048 -11963187 -8918991 -5926241 -6794931 -10087581 -11788706 -11731161 -12515499
4229 -12515499 -13507904 -11634399 -7734361 -6200874 -7750294 -8309318 -6334380 -5611867 -8704563
4220 -8704563 -12710097 -14196590 -14006641 -14294392 -14478803 -13093946 -10805598 -9035655 -7805280
4211 -7805280 -6619644 -5239718 -2681815 1688530 5413381 4791820 352032 -3203229
4203 -3203229 -3362232 -2123125 -1263108 -137972 525842 -1952379 -6704912 -8438167 -5056564
4194 -5056564 -1448033 -2375789 -5902801 -7287938 -5444464 -2132798 1545514 4527122
4186 4527122 5077996 3601443 2789246 2797879 414120 -4874380 -8937488 -9587221 -9590145 -10269571
4176 -10269571 -8350626 -2997363 385095 -1922321 -6183643 -8088988 -9121563 -10976377
4168 -10976377 -10499478 -6333002 -3826060 -6440875 -8906635 -6353392 -3493594 -6426459
4160 -6426459 -11895633 -13677291 -13256624 -14693992 -15420751 -12345416 -10472066 -14535800 -19013307
4151 -19013307 -18065298 -17484625 -23677047 -29993295 -29679377 -31981248 -46084087 -61366281
4143 -61366281 -70334034 -99160088 -175416024 -265006587 -287183089 -211195058 -100793905
4136 -100793905 -36787185 -26877398 -23955122 -5704989 7885460 3837551 -2465071 602429
4128 602429 2757804 -3977916 -9458079 -5220267 545177 -939781 -4554770 -3257851
4120 -3257851 -670424 -1918668 -3608357 -1923884 -597329 -2667050 -3522683 208486
4112 208486 3461363 1866027 43228 3220973 7794103 7909515 5223741 4536272 5021026
4103 5021026 3233151 560883 620361 2428889 2383717 499596 -535430 -113534 941418
4094 941418 3252353 7034712 9748787 9152666 6397167 3423642 318228 -2308143 -2191312
4085 -2191312 378272 1272754 -1271537 -3324792 -1671303 907760 1005031 808205 3670393
4076 3670393 7081453 5992887 885031 -3123256 -3837022 -3560607 -3986777 -4189250 -3502824
4067 -3502824 -2586042 -1579534 -47446 1461456 1868866 883358 -1511471 -5210276 -8397645
4058 -8397645 -8562823 -6800563 -7531644 -11412109 -12646685 -7180405 357067 2799295 289618
4049 289618 -1601216 -1047202 -951403 -2122749 -1999643 -271695 89960 -1701577 -2811762
4040 -2811762 -1939818 -1343367 -2341828 -2940316 -1584468 327945 1440484 2793921 5322128
4031 5322128 7553874 7655942 5965359 4201604 3627400 4561923 5993081 5387005 937560
4022 937560 -5621781 -10472974 -12156704 -12321120 -11982031 -9922458 -5639460 -1199803 1222953
4013 1222953 1743771 1647920 1630532 1949463 2502764 2015780 -899772 -5056958 -7110517
4004 -7110517 -5739300 -3512854 -3382747 -5084836 -6364274 -6147600 -4962730 -3495742 -2315028
3995 -2315028 -2194436 -3385208 -5089377 -6432675 -7222427 -7252693 -6122165 -4589833 -4767450
3986 -4767450 -7669406 -11500751 -13603736 -13319420 -11817012 -10092648 -8689205 -8624657 -10529783
3977 -10529783 -12798440 -12546507 -9210410 -5719415 -4869764 -5570339 -4397035 -557394 2748870
3968 2748870 2713144 867521 817841 2975345 3983207 1625470 -2014417 -3490359 -2358730
3959 -2358730 -897326 -462693 -36763 1658159 3993007 4824788 2591238 -2053169 -6577873
3950 -6577873 -8815168 -8736848 -7428244 -4920204 -755151 3415586 4351738 1458272 -1715708
3941 -1715708 -1897077 -199812 44963 -2100889 -4901753 -6846418 -7401083 -5910761 -2265537
3932 -2265537 1865379 4529780 5604971 5701271 4270165 1111364 -1636201 -1930330 -1138578
3923 -1138578 -1707847 -2602689 -995913 2058683 2289597 -861127 -2605592 177161 4357629
3914 4357629 5346143 2972353 -304468 -4142984 -9662432 -15579452 -18454292 -16640098
3906 -16640098 -11838883 -6860395 -3263465 -861474 1555497 4637083 7049045 6511808
3898 6511808 2742590 -1884519 -5126457 -6763414 -7193856 -6341533 -5184886 -6084088 -9528592
3889 -9528592 -12273264 -11075013 -7191648 -4852981 -5910699 -8178857 -8786042 -7145627
3881 -7145627 -4452140 -1878459 154078 1724528 2855166 3195077 2597511 1819331 1553273
3872 1553273 789233 -2095803 -6111538 -7706066 -5397250 -2338354 -2267414 -4458932 -5091118
3863 -5091118 -2697784 200488 652894 -1586525 -4566991 -6277837 -6178307 -5559104 -6161608
3854 -6161608 -7886198 -8803000 -8083167 -7264465 -7375962 -6914723 -4845640 -3518218 -5350630
3845 -5350630 -8027401 -7004248 -2509602 76951 -2333433 -6366844 -6946980 -3184428
3837 -3184428 2189460 6432808 7660164 4617873 -1479797 -6308581 -6473722 -3629000
3829 -3629000 -2281478 -3979387 -6064312 -6154304 -5327818 -5831400 -7406910 -7548764 -4880825
3820 -4880825 -939993 1641869 1959573 1242003 735768 122984 -1459413 -3643303 -5294830
3811 -5294830 -6532562 -8752918 -12130357 -14478709 -13735129 -10743862 -8294974 -7762365 -7867898
3802 -7867898 -6659624 -3567465 693761 5201241 9134285 11505496 11316072 8220046
3794 8220046 3050568 -2364826 -6276741 -8324763 -9672468 -11438680 -13117903 -13122502 -10931348
3785 -10931348 -8017022 -6232655 -5746837 -5183675 -3651406 -1949759 -1470981 -2323620 -3163612
3776 -3163612 -3017223 -2716155 -3823414 -6202365 -7648877 -6648623 -4755233 -4907105 -7536845
3767 -7536845 -9958464 -10119376 -9261290 -9573401 -10677519 -10508011 -8862113 -7596210 -7392607
3758 -7392607 -6952560 -5936990 -5988450 -7547704 -8247918 -6489119 -4379548 -4545650 -5847648
3749 -5847648 -5388771 -3471580 -2893103 -3847906 -3544574 -1344405 -287542 -2066881 -4105718
3740 -4105718 -3871274 -3005222 -4226530 -6430727 -6292397 -3508014 -1082493 -730763 -986064
3731 -986064 -213614 975185 1144011 132786 -1156987 -1987397 -2098137 -1485579 -374673
3722 -374673 854118 1789094 1984062 1310270 521757 647368 1403644 1313183 88744 -485230
3712 -485230 737302 2030476 1009079 -1917608 -4217241 -4618646 -3809850 -2404981 -619965
3703 -619965 200074 -1652677 -5361251 -7658968 -6690680 -4034714 -2047949 -1034170 -263596
3694 -263596 -109543 -1291889 -2820070 -2622330 -344826 1861675 2005015 984047 1658272
3685 1658272 4983200 7982478 6759221 1377578 -3803140 -5209106 -3828614 -2801655
3677 -2801655 -3008788 -3079692 -2462462 -1833681 -1065167 406844 1297272 -441948 -3709326
3668 -3709326 -4384256 -618791 4475394 6855667 5967701 3543107 421427 -3023052 -5180997
3659 -5180997 -4941513 -4274111 -6262324 -10760390 -14457115 -15290562 -14396126 -13304667 -11748712
3650 -11748712 -9468557 -8057028 -8938664 -10592204 -10027615 -6982435 -4693229 -5746120
3642 -5746120 -8576770 -9341300 -6485040 -2032722 1331428 2824204 2967886 2183378 1027407
3633 1027407 590918 1325709 2220616 2289125 2053336 2295727 2346312 1384122 624956 1929605
3623 1929605 4480825 5267534 3216712 644246 6849 1247909 3021314 4381340 4258199
3614 4258199 1449542 -3266892 -6658631 -6362537 -3577724 -1206542 -624466 -1568696 -3664558
3605 -3664558 -6204492 -7488516 -6304944 -3531651 -909305 970055 2213901 2491938
3597 2491938 2152037 3122463 6122980 7750962 3523353 -5702477 -13146801 -13331861 -8001166
3588 -8001166 -3288601 -2447550 -3469606 -3391661 -2484905 -2897241 -4558789 -4852698 -2841878
3579 -2841878 -1628159 -4484310 -9792108 -12549915 -10831569 -7822571 -6634559 -6140017
3571 -6140017 -3896331 -643410 956617 552334 201024 1067180 2642669 4612279 6785992
3562 6785992 7509255 5007318 587193 -2083589 -1474189 320041 1209419 1809763 3242924
3553 3242924 4243244 2376268 -2591608 -7892313 -10228447 -8675218 -5503337 -4159215
3545 -4159215 -5878632 -8504987 -9302389 -8252078 -7333163 -7298439 -7091934 -6190172 -5356472
3536 -5356472 -4814037 -3663849 -1584288 672176 2804215 5022054 6244606 4635105
3528 4635105 845925 -1658088 -976663 567018 -162608 -2835246 -4735608 -4670469 -3636265
3519 -3636265 -2532788 -1365348 -339489 38503 -150174 -503457 -1133516 -2136260 -2794851
3510 -2794851 -2598514 -2556542 -4075376 -6739042 -8462919 -7778568 -5003305 -1435659 1540216
3501 1540216 2808176 2164829 672494 -476414 -1423252 -3270939 -6361309 -9562021 -11196311
3492 -11196311 -10359364 -7722146 -5327952 -4854818 -5609965 -5141373 -2409517 787598 2341442
3483 2341442 2388767 2114081 1482956 11107 -1389123 -1565152 -1343100 -2172011 -3060062
3474 -3060062 -1637640 1660229 3418182 2063607 142326 364844 1769899 1801745 347075
3465 347075 -741148 -1074256 -2077645 -4079522 -5431675 -5196331 -4876095 -6158069 -7914079
3456 -7914079 -7091251 -2793748 1733819 2245015 -1664390 -5962220 -6743896 -4329743 -2032077
3447 -2032077 -1883762 -3071989 -4098833 -4626805 -4858241 -4635047 -3894031 -3042107 -2391545
3438 -2391545 -2094776 -2789241 -5003067 -7566182 -8162822 -6209466 -3680087 -2145200 -675478
3429 -675478 1831456 3780223 2499986 -1927919 -6430503 -8323963 -7443049 -5302979 -3734860
3420 -3734860 -4030361 -5792534 -6805789 -5525306 -3263124 -2184349 -1817955 -74693 2498077
3411 2498077 2637368 -627518 -3856328 -3697556 -1090642 857587 976085 -177325 -2602771
3402 -2602771 -6146140 -8775046 -8420679 -5944704 -3895585 -3053747 -2674981 -3188751 -5388408
3393 -5388408 -7304688 -5615880 -804644 2611854 2256671 1016386 2234863 4923934
3385 4923934 6274448 6299055 6793106 7433502 6351191 3807454 2112329 1976191 1665741
3376 1665741 30800 -1944475 -2991995 -2982213 -2150302 -783307 -132728 -1843999 -5730033
3367 -5730033 -9399462 -10609083 -8942901 -5202275 -734423 2435435 2649176 507174
3359 507174 -1719044 -3068060 -4648236 -6797618 -7478311 -4935275 -494901 2973874 4481327
3350 4481327 5189866 5891414 5978477 5042329 4124267 4654531 6548942 7900132 6875413
3341 6875413 3984878 1937941 2650282 4884135 5839296 4641797 2802811 1376134 -461895
3332 -461895 -3472607 -6665571 -8423614 -8101508 -5943253 -2888196 -1131250 -3041176 -8125648
3323 -8125648 -12401116 -12301104 -8440008 -4493327 -3325658 -5132472 -8149322 -9992751
3315 -9992751 -9329149 -7229041 -5838490 -5232509 -3536743 -982583 -969975 -4966437 -9010225
3306 -9010225 -8408359 -3978571 -203866 1187066 1816503 1976076 72561 -3068414 -3878529
3297 -3878529 -1238463 1782386 2746457 2755073 2756034 640181 -5048299 -11104052 -12648978
3288 -12648978 -8903870 -3497075 36473 1019710 795095 1029564 2306321 3137391 1255316
3279 1255316 -3096735 -6635384 -7208838 -6819139 -8429263 -11147624 -11195261 -7102196 -1482871
3270 -1482871 2390996 3794186 4134327 5010424 7025862 9289903 9856114 7605491 3725256
3261 3725256 508007 -1106566 -1974449 -3170231 -5002265 -7244266 -9265912 -10176081 -9807193
3252 -9807193 -9293209 -9813668 -11160572 -12339293 -12896786 -12640589 -10878396 -7336720 -3237173
3243 -3237173 -53551 2213043 4082949 4753272 3191613 563100 -747820 -551976 -1003328
3234 -1003328 -3000187 -4800502 -5080508 -5139497 -6586750 -8529702 -8874059 -7472405 -6297439
3225 -6297439 -6874554 -8834263 -10781907 -11469803 -10132428 -6725549 -2344256 1031864 1825601
3216 1825601 186219 -2137911 -3688073 -4968481 -7368939 -10229935 -10489888 -6538098
3208 -6538098 -1227716 935331 -929135 -3712132 -4921132 -5026178 -4775231 -3094268 580823
3199 580823 3966583 4247589 1747867 -692603 -1430306 -1312293 -1571627 -2191966 -2566391
3190 -2566391 -2434607 -1763701 -622441 470555 781193 290929 -142110 46070 137389
3181 137389 -1091236 -3409651 -4480426 -2146780 2352025 4651448 1943300 -3427071
3173 -3427071 -6725607 -6672729 -6227513 -7413241 -8190543 -5888880 -1374754 2385550 4295627
3164 4295627 5262319 5500924 4372406 2462484 1223963 434518 -1613538 -4886192 -6731937
3155 -6731937 -5177326 -1468249 1648081 2865184 2645942 1854496 1159992 943866 800515
3146 800515 -231199 -2103902 -3065727 -1476742 1986561 4694376 4540596 1737898 -1529583
3137 -1529583 -2976075 -2164604 -800038 -573268 -751639 974338 4844669 7646675 6251359
3128 6251359 1680051 -1918299 -2095505 -447681 -49278 -1976306 -4936608 -7197351 -7936572
3119 -7936572 -7319686 -6237138 -5828009 -6516177 -7455130 -7419508 -6267465 -5038242 -4532252
3110 -4532252 -4343124 -3606192 -2304926 -1385543 -1719424 -3260056 -5057962 -5836027 -4885652
3101 -4885652 -2907952 -1647340 -1902768 -2112146 -88878 3616562 5506847 3255289 -1046900
3092 -1046900 -3161402 -1603975 1276345 2788819 2583431 1538395 -60581 -2044040
3084 -2044040 -3460173 -3718734 -3842962 -4964438 -6012169 -4762609 -1394109 885737 -184631
3075 -184631 -2650785 -2630045 639678 3661148 2816308 -1623916 -6175887 -7795809 -6061219
3066 -6061219 -2617712 246342 784060 -1064136 -3399756 -4174672 -3497595 -3191920 -3914853
3057 -3914853 -4144696 -2751077 -1037548 -740008 -1166074 -447877 840978 -144032 -4135465
3048 -4135465 -7811077 -7740989 -4786763 -2685537 -2968412 -3283316 -943097 3471344 6850876
3039 6850876 7045866 4786759 2436240 1502430 1514819 1077039 -281277 -1590870 -1863490
3030 -1863490 -1606376 -2275820 -4151261 -5487277 -4499496 -1979528 -965986 -3268810 -6942870
3021 -6942870 -8215389 -5863704 -2571721 -1484855 -2496133 -3006887 -1651140 287799
3013 287799 1180234 1196409 1390585 1728395 1195124 -480542 -2201721 -2683732 -1663018
3004 -1663018 145929 1740880 2200436 825462 -2348928 -5918113 -7542153 -5898286
2996 -5898286 -2377486 -90452 -688561 -2730288 -3743890 -3231899 -2730127 -3418593 -4893133
2987 -4893133 -6206132 -6996435 -7422455 -7747531 -7943147 -7098089 -3918625 922638 3756635
2978 3756635 1397860 -4499772 -8958851 -9799726 -9527418 -10328083 -10391100 -7274722 -2218472
2969 -2218472 1760483 4103247 5878882 6244942 3495351 -864309 -2875437 -1470174
2961 -1470174 114574 -906260 -3512676 -5308379 -5676395 -5201285 -4292112 -3871738 -5322816
2952 -5322816 -8109931 -9370676 -7633300 -5154167 -4604801 -5118770 -3972014 -879683 2011384
2943 2011384 3657080 4991264 6525060 7588856 8097553 8716254 8845276 6720297 2396951
2934 2396951 -1319980 -2117086 -862423 89762 -52585 -466382 -586367 -519956 -293140
2925 -293140 -126552 -970611 -3309873 -5752156 -6385957 -5525438 -5424395 -6855542 -7703071
2916 -7703071 -6029042 -3195664 -2385175 -4669202 -8037228 -10007569 -9763504 -7895502 -5724529
2907 -5724529 -5137516 -7291914 -10569421 -11262772 -7566401 -1945611 1601909 1748132 143452
2898 143452 -1396205 -2313462 -2603859 -2595465 -3222983 -4776913 -5564553 -3766380 -655900
2889 -655900 281867 -1932096 -4082695 -2897992 988481 4636415 6746034 8139382 9276251
2880 9276251 9294695 7470162 4345771 1310689 -335041 -235172 491853 5075 -2415603
2871 -2415603 -5663311 -8153141 -9143244 -8625409 -7121050 -5868093 -5693240 -5270669 -2458871
2862 -2458871 1839406 3613633 1185983 -1749140 -1028554 2144536 3472563 2125039
2854 2125039 1219922 2373711 3732541 3743302 3188890 2522167 532637 -2835030 -5120423
2845 -5120423 -4501723 -2125922 94478 1771769 2722934 1828165 -815471 -2728173 -2317051
2836 -2317051 -1625307 -3442916 -6977465 -8787950 -7107918 -3067215 1470961 4955040
2828 4955040 5722617 3110652 -972479 -3613136 -4125311 -4060323 -4244705 -3864797 -2656696
2819 -2656696 -1955071 -2839197 -4649978 -5944993 -5858352 -4308677 -2124845 -1165519 -2845258
2810 -2845258 -6059483 -7948590 -7355039 -6221558 -6776452 -8630643 -9851372 -9921096 -10047464
2801 -10047464 -10810514 -11053778 -9633357 -7294730 -5937152 -6352102 -7573296 -8514113 -9206824
2792 -9206824 -9750266 -9047835 -6131829 -2399020 -606257 -1234744 -1784395 -645639 295904
2783 295904 -1351723 -4469713 -5721594 -4065994 -1674602 -673760 -1167804 -2490705 -4312404
2774 -4312404 -6141774 -7411293 -8288141 -8925942 -8142812 -4820147 -472976 1995555 2327129
2765 2327129 3023385 4822122 5080881 2153039 -1415696 -2261169 -634479 887421 1371042
2756 1371042 1689120 2059695 2016185 1944236 2260128 1842872 -380580 -3110969 -4474148
2747 -4474148 -5350119 -7887131 -11048820 -11121881 -7298467 -3531561 -3439830 -5964699 -7772077
2738 -7772077 -7836585 -7671730 -8463284 -9890085 -10994919 -10806769 -8696181 -5072582 -1129195
2729 -1129195 2467223 5440273 6310060 3231899 -2398282 -5609963 -3373739 1311474
2721 1311474 3400879 2423910 2026990 3763140 5067645 3960615 2435824 3518207 7073388
2712 7073388 10179828 10309403 6976206 1599149 -3057558 -4520648 -2979104 -1166527
2704 -1166527 -957473 -1221296 -161659 1530316 1588881 -504125 -2904105 -3930004 -3742954
2695 -3742954 -3491759 -3972521 -5209484 -6424426 -6424004 -4816294 -2714108 -1507016 -1269034
2686 -1269034 -1166982 -844362 -251516 1273766 4132450 6917825 7499919 5750443 3481065
2677 3481065 1524682 -1051749 -4176587 -5490168 -3454785 -194493 672523 -1800928
2669 -1800928 -5518021 -8351767 -9680544 -9294703 -6832165 -2865786 709606 2030502
2661 2030502 515140 -3120910 -7198353 -9504400 -8621959 -5348774 -2082881 -421173
2653 -421173 79712 596015 1279126 1279257 17473 -2078368 -3943447 -4761521 -4638140 -4465693
2643 -4465693 -4977476 -6005962 -6786326 -6648863 -5184438 -2443305 272168 551761 -2746186
2634 -2746186 -7401971 -9680424 -8610699 -6917868 -7034752 -7834447 -6722734 -3668891 -1060661
2625 -1060661 -27180 716968 1826755 1349982 -2550315 -8198012 -11860757 -12314433 -11860445
2616 -11860445 -12369442 -12450061 -10024803 -6137602 -3923735 -4353650 -5361105 -5320958 -4972422
2607 -4972422 -5084232 -4619515 -2891069 -1610937 -2594467 -4799316 -6109885 -7046803 -9771621
2598 -9771621 -13752840 -15652166 -14119070 -11707277 -10803311 -10424750 -8957240 -7670826 -8820544
2589 -8820544 -11642530 -13059495 -11914691 -10069592 -9305646 -9313660 -9158406 -8883965 -8880622 -8940995
2579 -8940995 -8734854 -8372646 -7896979 -6884848 -5061462 -2835874 -922468 151673 105679
2570 105679 -845973 -1596825 -787828 1555244 3435629 2607554 -1042197 -5109274 -6750341
2561 -6750341 -5056820 -1369474 2471955 5650075 7961676 8720600 7240809 4326923
2553 4326923 1961946 1027992 460014 -732057 -1909212 -2351032 -3094555 -5505339 -8708074
2544 -8708074 -10374764 -9953228 -9254761 -9549380 -9861151 -8931184 -7404171 -6820226 -7213989
2535 -7213989 -7009403 -5293549 -3351294 -3422334 -5950526 -8565672 -8566871 -6375574 -5229677
2526 -5229677 -6821594 -8827888 -8293080 -5982541 -4897404 -5341036 -4635469 -1850521 510738
2517 510738 538386 -502418 -1151061 -2182515 -3785925 -3395753 243850 3220944 984345
2508 984345 -4467849 -6603788 -3509488 -244534 -896456 -2940569 -2169705 513907 986040
2499 986040 -1684157 -4600897 -5742227 -5677888 -4986656 -3473369 -2333631 -3846489 -7770680
2490 -7770680 -10669815 -10243997 -8111972 -6723002 -5734248 -3742328 -1834418 -2302347 -4407872
2481 -4407872 -4637413 -1787830 888473 -15044 -3612150 -6314888 -6422871 -5061623 -3443456
2472 -3443456 -1714140 -660619 -2075453 -6062192 -9523434 -9089744 -4949499 -298117
2464 -298117 2585722 4028236 4782046 4224859 1751720 -1559984 -4209102 -6278338 -8519334
2455 -8519334 -10046650 -9032563 -5836707 -3366350 -3497608 -4875483 -5385171 -5123831 -5253104
2446 -5253104 -5353137 -4316868 -3208464 -4479855 -7956965 -10095146 -8450918 -5062107
2438 -5062107 -3771047 -5373598 -7217555 -7115094 -5872612 -5602415 -6751971 -7667549 -6787717
2429 -6787717 -4523571 -2589575 -1847226 -1705606 -1813965 -2979424 -5246964 -6337222 -4247316
2420 -4247316 -1050252 -1450514 -6850720 -13117021 -15319025 -12655867 -7534039 -2179686
2412 -2179686 1804260 2649760 109470 -3067630 -3980094 -3352749 -4206336 -7372666 -10742131
2403 -10742131 -12518506 -12668061 -11306850 -8265058 -4483041 -1541267 353735 1720282
2395 1720282 1424401 -2061899 -6808152 -8282918 -5277824 -1935653 -2272512 -5448435 -8341195
2386 -8341195 -10100233 -11644317 -12771406 -12593457 -11559758 -10595101 -9214977 -6637060 -3823579
2377 -3823579 -2423146 -2574688 -3528313 -5269841 -7583824 -8822379 -7966940 -6863650 -7924740
2368 -7924740 -10462383 -11849809 -11535602 -11121103 -11021466 -10098326 -8485772 -7712918 -7754673
2359 -7754673 -6941017 -5319531 -5109344 -6902963 -8333540 -7850378 -7090636 -7728719 -8409477
2350 -8409477 -7145461 -5069292 -5280083 -8675358 -12901310 -15104376 -14291500 -11325386 -7897684
2341 -7897684 -5470960 -4414996 -4145837 -4226654 -4765421 -5639003 -6252872 -6322353 -5937869 -4753791
2331 -4753791 -2405347 58380 733437 -629047 -2186337 -2570822 -2201943 -1554391 -297696
2322 -297696 919913 338748 -1620355 -1414971 2809980 7457616 7521045 3142618 -956374
2313 -956374 -1862812 -1069203 -830648 -1254376 -1885476 -3470360 -6562819 -9877958 -11313240
2304 -11313240 -9940813 -6617973 -3389932 -2158810 -2853530 -3205768 -1595363 524786
2296 524786 868040 271498 1718237 5400047 7812259 6710693 4175674 3199038 3591796
2287 3591796 3197208 1315077 -1093746 -3213910 -4534582 -4418109 -3209474 -2581492 -3173211
2278 -3173211 -3258016 -1484917 670807 1319705 1262368 1868753 1463952 -2389996 -7723735
2269 -7723735 -9568145 -7036747 -4895612 -6647310 -9797811 -10175052 -7642432 -4644557
2261 -4644557 -1805954 1429567 3535998 2280115 -1045808 -2276654 305992 3985418
2253 3985418 5407496 3993206 1089882 -1846369 -3342762 -2409293 -178638 751573 -164569
2244 -164569 -287828 2410759 6101574 7531081 6430556 5242375 5084491 4409889 1933670
2235 1933670 -1179684 -3007447 -3432904 -3837165 -4748154 -4846032 -2602084 1362238 3975035
2226 3975035 2337418 -3075349 -8305675 -9577804 -6892264 -3565528 -2548197 -3850482
2218 -3850482 -5417617 -5718392 -5115016 -4949814 -5590578 -5725215 -4008491 -1153464 605515
2209 605515 333959 -528333 -544216 -375010 -1261316 -2581380 -2685885 -1451211 -54977
2200 -54977 1355965 3503805 5398579 4357191 -491240 -6625630 -11071292 -13175743 -13387587
2191 -13387587 -11335021 -7133453 -3192336 -2225691 -3850814 -5272961 -5249268 -5261457 -6375436
2182 -6375436 -7041872 -5265887 -1598154 1619197 3419518 5052334 7501780 9511045
2174 9511045 9012149 5951710 2586506 854898 383109 -384905 -1822873 -2763788 -2157123
2165 -2157123 -211743 1924328 2731053 751257 -4284105 -10376402 -14286008 -14286257 -11473422
2156 -11473422 -8218093 -6076119 -5414487 -6041572 -7421399 -8727419 -9280569 -8867481 -7694245
2147 -7694245 -6409607 -5830608 -5885782 -5278886 -3322959 -1564552 -1921497 -3616471 -4201011
2138 -4201011 -3578336 -4188896 -6515556 -7512362 -5137543 -1605989 93547 314083 620272
2129 620272 -55585 -3492392 -7872075 -9250081 -6873694 -3718764 -2057945 -1688718 -2227968
2120 -2227968 -3658634 -4508777 -3055346 -819083 -1337683 -4722637 -7056186 -6290391 -4923150
2111 -4923150 -5066884 -4724880 -1709164 1996570 3178705 2347716 2238343 3003986 2481949
2102 2481949 370033 -1274032 -1563424 -1893779 -3203695 -4473101 -4590714 -4100850 -4434862
2093 -4434862 -6179884 -8248266 -8518025 -6020251 -2785249 -2054891 -3996539 -5228887 -3854235
2084 -3854235 -2427117 -3622994 -5436847 -4176937 -623338 848976 -1265561 -3973206
2076 -3973206 -4744991 -4362823 -4176490 -4029282 -3924595 -4501001 -4641453 -1847012 3391589
2067 3391589 6692963 5340589 2016288 655830 1121827 837288 -381512 -505704 870335
2058 870335 2217433 3198147 5023149 7447699 8138589 5958120 2969499 2065189 3683204
2049 3683204 5716048 6078470 4808694 3753920 4184063 4837067 3169728 -1107074 -4937305
2040 -4937305 -5272539 -2430396 955288 3039333 3313177 1470263 -1918825 -4359218 -3660445
2031 -3660445 -1079902 161077 -567430 -888262 259444 1012282 271666 -225120 586931
2022 586931 494328 -2284416 -5141148 -4429444 -1393353 -682471 -3102496 -3922988 426359
2013 426359 7375460 11853816 12286470 10667051 8734860 6902998 5834048 6143676 6700829
2004 6700829 5637665 3212692 1591643 1565729 1619005 774232 200717 983401 2215731
1995 2215731 2660417 2678690 2940030 2601718 611921 -2129200 -3724184 -3725354 -3038007 -2217832
1985 -2217832 -1632681 -2335330 -4470755 -5573268 -3252343 709422 2042745 -58072 -2126427
1976 -2126427 -2325223 -3192128 -6474332 -9064350 -7484902 -3513878 -1215591 -412287 2112056
1967 2112056 5867530 6442243 2714199 -696446 -275329 1167920 -856222 -5623692 -8473326
1958 -8473326 -7317933 -4537676 -3080714 -3527733 -4835236 -5602388 -4547203 -1706037 810856
1949 810856 1061391 140251 777474 3092983 4236973 2917852 1657502 2871274 4839238
1940 4839238 4075198 536380 -2382894 -2980627 -3562242 -6502287 -10100335 -10361118 -6067699
1931 -6067699 -214456 3534467 4285894 3553837 2868704 2599752 2376586 1773676 749819
1922 749819 -250535 -961088 -2085865 -4539529 -7583374 -8949224 -7661955 -5448431 -3993915
1913 -3993915 -2173004 1735736 5976690 6607047 3213100 147887 569617 2006070 231479
1904 231479 -4523687 -8283976 -9141054 -9053645 -9869128 -10668480 -10091257 -8929721 -8825550
1895 -8825550 -9738320 -10097960 -8711943 -5586142 -1583189 1902866 3601395 3527089 3031661
1886 3031661 3110263 3219747 2354820 600074 -1224463 -2937554 -5006312 -7339249 -9005493
1877 -9005493 -9365978 -8878993 -8464687 -8399741 -8216534 -7667682 -7390112 -8160562 -9542644 -9969741
1867 -9969741 -8607767 -6551419 -5513457 -5876503 -6899131 -8195873 -9614509 -10007715 -7994463
1858 -7994463 -4310025 -1694538 -1681197 -2908054 -3396214 -2984003 -2415479 -1548092 -66342
1849 -66342 1158955 1220661 931174 1621153 2711450 2417472 718694 -309819 606173
1840 606173 2428371 3684544 4280659 4571398 3830670 899222 -3892846 -8189000 -9274723
1831 -9274723 -6548535 -2473008 -421837 -1026624 -1499784 485718 3373131 3934718 2098116
1822 2098116 1115490 2917343 5830702 7532678 7778191 7010008 4635947 620348 -2889231
1813 -2889231 -3655366 -2129512 -473113 202098 -3999 -1207887 -3319582 -5094933 -5755746
1804 -5755746 -6765984 -9531259 -11901620 -10001341 -3825381 2003108 4057547 3892159
1796 3892159 4420340 5154581 3653659 31403 -3052947 -4483021 -6003910 -8993209 -12034328
1787 -12034328 -12645112 -10073553 -5542303 -784139 2793770 4350036 4127140 3499285 3747219
1778 3747219 4806349 5591605 5321945 4101401 2449973 823375 -473148 -1448432 -2634151
1769 -2634151 -4706851 -7617837 -10266583 -11306825 -10387947 -8602108 -7561204 -7753098 -7792439
1760 -7792439 -5748093 -1500066 2689352 4498065 4029451 3161146 2712718 1539534 -1256503
1751 -1256503 -4513558 -6310237 -6231461 -5366194 -4751073 -4929939 -6409189 -9002176 -10855029
1742 -10855029 -9752692 -5868467 -2034129 -773659 -2052219 -4312912 -6444902 -7910969
1734 -7910969 -8096222 -6846095 -5175179 -4382847 -4707587 -5614906 -7008457 -9222160 -12008732
1725 -12008732 -14434966 -15799379 -15983747 -14939032 -12548452 -9185960 -5905548 -3758238
1717 -3758238 -2981962 -2898382 -2687574 -2458647 -3329991 -5888836 -8817891 -10138664 -9912734
1708 -9912734 -10235604 -11856012 -12401520 -9481080 -4426205 -958005 -561573 -1214995 -834336
1699 -834336 57027 -13600 -711137 -368083 1203214 1795823 -621524 -4875902 -7172552
1690 -7172552 -5384333 -2090212 -1904281 -5831336 -10158343 -11573607 -11119370 -11390782 -11981260
1681 -11981260 -10607947 -7592797 -5873115 -6609118 -7799890 -7663517 -6559479 -4895692
1673 -4895692 -2064071 1257205 2408169 159997 -3210153 -4992547 -5326523 -5565918 -5148366
1664 -5148366 -2440518 2250960 6541947 8381465 7363117 4497597 1762187 691764
1656 691764 392646 -1392310 -4096210 -3691771 1499136 6828432 6620398 1853671 -1422967
1647 -1422967 -580355 1009476 123308 -1971125 -2862417 -3033742 -4173563 -5899724 -6530916
1638 -6530916 -5582856 -3683600 -1379277 429473 307689 -1773796 -3519956 -2972765 -1084614
1629 -1084614 -141378 -687287 -1674466 -2686820 -4010077 -4928367 -3933280 -861951 2504357
1620 2504357 4223667 3714247 1590116 -1049982 -3126612 -4210798 -4853125 -5859976 -7277658
1611 -7277658 -8378844 -8427093 -7242807 -5397401 -3964287 -3487828 -3181919 -2039129 -645951
1602 -645951 -436225 -1028505 -436142 1280722 1121764 -2252744 -5412859 -4497664 -932685
1593 -932685 672376 -630610 -1346509 403493 2220082 2019036 1442787 2436618 3462080
1584 3462080 1995661 -1239335 -3436528 -3756170 -3508405 -3316568 -2821262 -2554791 -3356831
1575 -3356831 -4138687 -2842309 308524 2978536 4244255 5260902 6012924 4495663 475330
1566 475330 -2786581 -2687694 -927597 -515961 -958520 542939 4133414 6851327 6997410
1557 6997410 5792288 4158419 1011917 -3729688 -7085364 -6337336 -2893789 -423884
1549 -423884 6808 461119 1963817 2408792 -262796 -4434746 -6057310 -3259152 1401960
1540 1401960 3643933 1974038 -948626 -1473887 1031837 3909620 4621006 3296020 1552077
1531 1552077 80971 -1457153 -2992494 -3981677 -4473893 -4860828 -4739793 -3535457 -2280500
1522 -2280500 -3010022 -5802392 -8068615 -7803370 -6186606 -5702853 -6826962 -8129123 -8836330
1513 -8836330 -9404118 -9743463 -8774788 -6318482 -4147991 -4353538 -7214271 -11037615 -13558709
1504 -13558709 -13381471 -10874354 -8111441 -7376478 -9241585 -12292803 -14685027 -15420365 -14236698
1495 -14236698 -11303170 -7457504 -3892147 -1047214 1489184 3562490 3985780 2359006
1487 2359006 306716 -516917 -968161 -3159388 -6833509 -9038276 -8014439 -5555207 -4359070
1478 -4359070 -4652781 -5108661 -5795915 -7792092 -10222064 -10327135 -7273484 -3833283 -2966768
1469 -2966768 -4223307 -5023811 -4320907 -3174343 -2440996 -1978025 -2064527 -3583611 -6205713
1460 -6205713 -7972546 -7534923 -5695518 -4062030 -3322448 -3593997 -5116084 -7271399 -7939512
1451 -7939512 -5551810 -1484578 1086656 722407 -1064771 -2010058 -1181016 1171981 4289369
1442 4289369 6821094 7331661 5807428 3947614 3300793 3782063 4524395 5242443 5925360
1433 5925360 6048108 5203725 3958039 2972449 1760078 -434431 -2814673 -3494760 -1873406
1424 -1873406 628811 2284231 2329514 576084 -2541886 -5022858 -4251138 -207018 3576518
1415 3576518 3778384 1080652 -1328677 -2105946 -2548437 -3452819 -3597196 -1970635 367430
1406 367430 1642027 1234198 -692604 -4106269 -8397352 -11669658 -12118085 -9854561 -6590088
1397 -6590088 -3973603 -2883600 -3512166 -4993654 -5447826 -3651182 -653720 1050671 -172814
1388 -172814 -4097582 -9205893 -13286541 -14169477 -11330574 -6663095 -2557952 486425 3163276
1379 3163276 4870577 3906235 290926 -3609083 -6031909 -7710914 -9812450 -11520302
1371 -11520302 -11176096 -8913584 -6613002 -5549511 -5284074 -4779788 -3654376 -2256650 -1164921
1362 -1164921 -746375 -910590 -1314473 -1867401 -2714020 -3640538 -4004783 -3473101 -2388432
1353 -2388432 -1284895 -509343 -265405 -338933 62441 1172483 1541194 -395426 -3411908
1344 -3411908 -4124446 -1466832 1379848 1154183 -970178 -1278123 924729 2169088 -524807
1335 -524807 -5799763 -9545975 -9234412 -5992747 -2913105 -1786984 -1607673 -502193 1232911
1326 1232911 1337213 -850909 -2835154 -2257321 -203116 595587 -423122 -1849775 -3321006
1317 -3321006 -5651575 -8305472 -9492348 -9040587 -8735159 -9413764 -10088283 -10375335 -11210852
1308 -11210852 -12350161 -11810370 -9067333 -6315820 -4996355 -3580771 -934450 461605
1300 461605 -2363846 -7879865 -11315011 -10532841 -7953643 -6560449 -6479347 -6201414 -5222802
1291 -5222802 -4252171 -3753577 -3356738 -2675235 -2361959 -3944447 -7934286 -12208482 -13629608
1282 -13629608 -11774040 -9433546 -8444584 -7053381 -3429227 54437 -750287 -5662755
1274 -5662755 -9803797 -9705873 -6863162 -4357093 -2806394 -1297191 -44189 44793 -872693
1265 -872693 -2137618 -3905040 -6130149 -7100545 -4976763 -585082 2984177 3670282 2179971
1256 2179971 569640 319565 1729867 3819254 4484399 1984077 -3007153 -7451235 -8592056
1247 -8592056 -6282966 -2679896 -277378 -330824 -2264672 -4003293 -3459225 -448187 2974648
1238 2974648 4455858 3463770 1295963 -553562 -1505181 -1647386 -1081772 228802 2107203
1229 2107203 3772003 4078509 2698607 1034532 964668 2136777 1632058 -2407347 -7629025
1220 -7629025 -9747017 -7663694 -4214100 -1704711 545872 3026192 3352406 -343579
1212 -343579 -5124869 -5978041 -2469849 781041 730449 -383163 715357 3477917 5162006
1203 5162006 4981985 3893206 1766115 -2166185 -6509123 -8120179 -5729612 -1365609
1195 -1365609 2028366 2906613 1154526 -2384097 -6030391 -8291969 -9112094 -9184527 -8405450
1186 -8405450 -6505518 -4779293 -4962660 -6202076 -5553292 -2326154 406236 89289 -1525081
1177 -1525081 -848521 2673157 6315916 7886989 7613605 6517210 4974469 3212792 1657860
1168 1657860 278333 -1280759 -2537305 -2265611 -326433 1519886 1449448 -213773 -1316238
1159 -1316238 -263744 2424109 4964701 6223006 6332295 5564902 3459562 -152720 -3742901
1150 -3742901 -5057919 -3798206 -2112564 -1840475 -2542355 -3244627 -4704303 -8055595 -12013363
1141 -12013363 -13792152 -12911901 -11801641 -11837088 -10924538 -6671382 -537087 3282948 2726890
1132 2726890 -166903 -2234556 -2510015 -1977833 -1310012 -87784 2039977 4431754 5956388
1123 5956388 5942850 4350656 1403224 -2294465 -5226756 -5417670 -2333102 1827740 3782868
1114 3782868 2560687 569124 787682 3565727 6877801 8968845 9447241 8059446 4139563
1105 4139563 -1879933 -7469437 -9757720 -8218346 -5041370 -2999508 -3330391 -5289695
1097 -5289695 -7010151 -6855466 -4652784 -1860757 -192802 44039 32011 956956 2774189
1088 2774189 4365722 4536091 2979995 815949 109758 2084321 5446275 7087835 5016444
1079 5016444 354921 -3902155 -5776987 -5530931 -4416029 -3091982 -1568523 -164738
1071 -164738 197537 -1035226 -2996304 -3858678 -2713760 -705224 281863 -49385 -190570
1062 -190570 828056 1800504 895511 -1645804 -3466715 -2876195 -785275 605517 437160
1053 437160 -218711 -162156 447559 745203 555807 298008 -159101 -1388419 -3025297 -3832223
1043 -3832223 -3811928 -4811974 -7610325 -9653874 -7925431 -3451012 -217645 563743 2024901
1034 2024901 6253850 10372149 10443175 7112424 4294760 3502205 2735050 619902 -1523280
1025 -1523280 -2161300 -1475046 -123434 1761680 3733643 5219833 7086301 10813828 15378096
1016 15378096 17286787 14889227 10508371 6988982 4344079 1516726 -754453 -1247731
1008 -1247731 -883189 -1477394 -2834376 -3440697 -3297603 -3697579 -4729905 -5403696 -5922309
999 -5922309 -7336793 -8891494 -8205588 -4669763 -629424 1443429 1241930 -291131 -2239880
990 -2239880 -3473021 -3056103 -1800471 -1747245 -3308309 -4657801 -4803203 -5190344 -6859648
981 -6859648 -8024928 -6560295 -3494855 -1798246 -2590282 -4691453 -7127249 -9579714 -10660458
972 -10660458 -8540166 -4044497 -923187 -1794543 -5205223 -7747466 -7900945 -6700010 -5605540
963 -5605540 -5005195 -4331973 -2597178 940641 5764393 9871267 11267373 9757324 6938477
954 6938477 4609004 3485224 3152376 2757969 1806135 547383 -454184 -1107348 -1801204
945 -1801204 -2667675 -3402773 -3823747 -3861760 -3057033 -1255885 19978 -1387932 -5035392
936 -5035392 -7550818 -7111676 -6388522 -8558299 -11859712 -11577641 -7037905 -2787658 -2118524
927 -2118524 -3233947 -3504419 -3750583 -5347240 -6147598 -3340601 1330771 3446609 2406781
918 2406781 1939186 3850036 5229021 3168065 -1036099 -4280399 -5777299 -6751276 -7863459
909 -7863459 -8988064 -10302614 -11730620 -12097377 -10383152 -7284572 -4413130 -2504782 -1266366
900 -1266366 -291568 623182 1360743 1219423 -222587 -1675095 -1110280 1257211 2816149
891 2816149 2295181 1554811 2276457 3129688 2280577 595279 -316662 -1426234 -4348036
882 -4348036 -7294744 -6783515 -3198806 -944426 -2401777 -5017165 -5521215 -4098442 -2724583
873 -2724583 -1756251 -237880 1804841 3111313 2504969 -337850 -4369666 -6937088 -5725603
864 -5725603 -1849340 665242 -328618 -2397022 -2086051 180732 577785 -3435165 -10370482
855 -10370482 -16226344 -17754837 -14919279 -11079308 -9962206 -11522322 -11780329 -7815096
847 -7815096 -1688253 2096291 1909817 -148119 -1858020 -2917779 -3436431 -2832461 -1139097
838 -1139097 194401 -181126 -2151667 -4891341 -7901112 -10549010 -11624621 -10535922 -8473888
829 -8473888 -7251670 -7045393 -6272618 -3973259 -1437442 -713981 -1912305 -3030630 -2709368
820 -2709368 -2153899 -3412525 -6309553 -8376846 -7890013 -5738413 -3811760 -2645134 -1540013
811 -1540013 -243214 635509 690646 302463 -3245 -343456 -1511776 -4246429 -8184271
802 -8184271 -11549291 -12527482 -11248343 -9792554 -9899211 -11352897 -12983972 -14229752 -14849511
793 -14849511 -14030505 -11153002 -7142028 -3861806 -2222308 -1814298 -2158861 -3044694 -3552800
784 -3552800 -2186101 1229908 4584262 5274926 2699240 -1502012 -5318013 -7939156 -9691612
775 -9691612 -11078710 -12143285 -12587435 -12362531 -12052962 -12395767 -13132325 -12594309 -9208493
766 -9208493 -3780465 413878 697934 -2130597 -4962018 -6123478 -6433788 -6422389 -4812995
757 -4812995 -1246597 1498028 597769 -2486378 -3619044 -1704485 65426 -1007116 -3980613
748 -3980613 -6776429 -8972676 -10602690 -10762628 -9470628 -8806153 -9912265 -10615489 -8501151
739 -8501151 -4894802 -3056610 -3470222 -3844968 -3238229 -3118957 -4160390 -4752923 -3527649
730 -3527649 -1347183 38093 -114329 -1424398 -2840975 -3017456 -1625591 -395065 -1407831
721 -1407831 -4331812 -6851980 -7723659 -7586615 -6834962 -4984395 -2661739 -1913884 -3432575
712 -3432575 -5320633 -5819141 -5615950 -6083544 -6708266 -6060779 -4550784 -4457715 -7103523
703 -7103523 -10933329 -12747494 -10831325 -6974701 -4938056 -6277571 -8431585 -8303643 -6966061
694 -6966061 -8378276 -13285214 -17190580 -15788628 -10269346 -5352635 -3557708 -3511366 -3086794
685 -3086794 -2061003 -1566520 -2359131 -4110268 -5882584 -7073439 -7785619 -7984155 -6804094
676 -6804094 -3825743 -736365 -17833 -1769724 -3612216 -4100213 -4147942 -4415761 -3794646
667 -3794646 -1899404 -652352 -1371405 -2392018 -1949106 -1450403 -2939229 -4876731 -4021459
658 -4021459 -818717 786263 -896655 -3160725 -3270712 -1793302 -249950 1651188 4363430
649 4363430 6191478 5116449 1966190 -296480 -59987 1689716 3270243 3970643 3780541
640 3780541 2705480 863552 -1293450 -3252925 -4806811 -6056736 -7125537 -7879655 -7996110
631 -7996110 -7397732 -6489688 -5787821 -5488561 -5588094 -6068996 -6601122 -6472998 -5413115 -4193058
621 -4193058 -3790976 -4192608 -4620617 -4619129 -4182107 -3187117 -1693399 -619272 -1022814 -2607162
611 -2607162 -3886298 -3974809 -3307606 -2419344 -998159 1393819 4348517 6792416 7745290
602 7745290 6826230 4551446 2136903 380734 -1181887 -3243556 -5002551 -4617272 -1596514
593 -1596514 2352367 5237825 6492397 6311521 4531824 1216284 -2393500 -4677801 -5218570
584 -5218570 -4862688 -4456585 -4194563 -4011303 -3889108 -3740150 -3509033 -3486443 -4159642 -5616112
574 -5616112 -7212024 -7815567 -6411201 -2881792 1385873 3875961 2652199 -1727854 -6041817
565 -6041817 -6733588 -3066297 1914824 3963110 1491521 -3165420 -6208433 -5692553 -2589298
556 -2589298 471197 1092257 -1296023 -4808509 -6571597 -5635569 -3974462 -3863369 -5019178
547 -5019178 -5509933 -4808234 -4264964 -4745034 -5596322 -6248906 -7098032 -8096170 -8021886 -6269600
537 -6269600 -4290978 -4049014 -5645344 -7452171 -8110354 -7513608 -6194900 -4618938 -3012295
528 -3012295 -1387365 149800 942054 158707 -2003684 -4089596 -4855150 -4416617 -3438050
519 -3438050 -1939746 181999 2030438 2378256 1473854 1024915 1893821 2602023 926793
510 926793 -3221357 -7234462 -8391611 -6666631 -4594180 -4511618 -6424323 -8586419 -9478749
501 -9478749 -8834492 -7386772 -6339557 -6688782 -8253773 -9564526 -9403037 -8214465 -7272252
492 -7272252 -6835512 -6133252 -4850876 -3349887 -1507811 1165319 3962360 5024070 3654977
483 3654977 1401930 6480 -709539 -2020447 -4230647 -6484252 -8102948 -9088833 -9456566
474 -9456566 -8835406 -6881326 -3910692 -1165642 -162889 -1153776 -2406305 -1919602 180272
465 180272 1973059 2401423 2200008 1960588 935494 -1457830 -4364449 -6677621 -8281524
456 -8281524 -9217730 -8962359 -7691009 -6977598 -7806147 -8920016 -8620198 -7274942 -6439127
447 -6439127 -6250647 -5482288 -3777667 -2113323 -1093224 -219731 1050341 2596597 3934380
438 3934380 4353159 3051757 70070 -3214610 -5330713 -6020406 -5722955 -4765319 -4012629
429 -4012629 -4992441 -7803365 -10063633 -9818010 -8418109 -8306279 -8957683 -7832290 -4825377
420 -4825377 -2574074 -2161129 -1728735 -135202 1143417 1110616 1322775 2921837 4077405
411 4077405 2811447 524105 43734 1338908 1876352 785627 163219 1967400 5441978
402 5441978 8106487 8142515 5557879 1935751 -802164 -2081479 -3117195 -5161647 -7692278
393 -7692278 -9073102 -8592529 -6960013 -5161309 -3813284 -3324143 -3519241 -3207366 -1355237
384 -1355237 1113230 1858544 -31097 -2667117 -3514330 -2221992 -442129 742920 1999231
375 1999231 4012494 5633246 4946087 2069779 -347024 -38238 2317852 4242407 4371365
366 4371365 3074396 836750 -2206267 -5032598 -5766207 -3693670 -166909 2977296 4774750
357 4774750 4624870 2108381 -1731739 -4425025 -4724969 -4124586 -4491120 -5426703 -5567221
348 -5567221 -5337420 -6260385 -8045331 -8554431 -6751105 -3890077 -1613297 -492659 -603071
339 -603071 -1803504 -3071328 -3234365 -2894685 -3960916 -6559862 -8152308 -6880918 -4315877
330 -4315877 -3386888 -4655150 -6228411 -6645827 -6140991 -5293859 -4066824 -2507322 -1305755
321 -1305755 -1168932 -2098569 -3334267 -3649529 -2104922 736733 2671538 1891378 -952490
312 -952490 -3615215 -4965743 -5647462 -6133701 -5768899 -4385554 -3395495 -4018279 -5298148
303 -5298148 -5218485 -3347313 -1131349 211524 815226 1104886 854556 -170795 -1466084
294 -1466084 -2319220 -2668777 -2954698 -3368555 -3610090 -3317687 -2625709 -2269763 -2821911 -3563240
284 -3563240 -2683816 622744 4668038 6930000 6984826 6485857 6293963 5412956 3373467
275 3373467 1799806 2165280 3298548 2877193 655342 -1544191 -2657749 -3443502 -4707040
266 -4707040 -6039936 -6665282 -6355655 -5202485 -3465236 -1879061 -1188846 -1161666 -846663
257 -846663 133123 1323203 2283533 2682704 1804410 -673322 -3425773 -4537852 -4100384
248 -4100384 -4258163 -6179196 -8410784 -8902186 -7306807 -4525971 -1337418 1504848 2983073
239 2983073 2842038 2148039 1848141 1453673 -20933 -2520235 -5087073 -6800132 -7006811
230 -7006811 -5669169 -4204582 -4727272 -7354131 -9409809 -8619974 -6087481 -4644336 -5147898
221 -5147898 -6077501 -6158972 -5582237 -4844303 -4020473 -3221241 -2513995 -1502076 -121435 534673
$$ [...]
##END NTUPLES=NMR SPECTRUM
##END=
