##TITLE=31P_DE-80H_X3
 64 sc D2O
 26.2.2025
##JCAMPDX= 6.0         $$ Bruker NMR JCAMP-DX V2.0
##DATA TYPE= NMR SPECTRUM
##DATA CLASS= NTUPLES
##ORIGIN= UXNMR, Bruker Analytische Messtechnik GmbH
##OWNER= root
$$ XWIN-NMR		Version 3.5
$$ Thu Apr  3 14:49:25 2025 Russian Standard Time (UT+4h)  Yarkov@DPX200
##.OBSERVE FREQUENCY= 81.013821
##.OBSERVE NUCLEUS= ^31P
##.ACQUISITION MODE= SIMULTANEOUS
##.ACQUISITION SCHEME= undefined
##.AVERAGES= 64
##.DIGITISER RES= 17
##SPECTROMETER/DATA SYSTEM= spect
##.PULSE SEQUENCE= zgpg30
##.SOLVENT NAME= CDCl3
##.SHIFT REFERENCE= (INTERNAL, CDCl3, 0, 198.062)
##AUDIT TRAIL= $$ (NUMBER, WHEN, WHO, WHERE, WHAT)
$$ ##TITLE= Audit trail, XWIN-NMR		Version 3.5
$$ ##JCAMPDX= 5.01
$$ ##ORIGIN= Bruker BioSpin GmbH
$$ ##OWNER= Yarkov
$$ C:/Bruker/XWIN-NMR/data/yarkov2/nmr/P31/2/pdata/1/auditp.txt
$$ ##AUDIT TRAIL=  $$ (NUMBER, WHEN, WHO, WHERE, WHAT)
(   1,<2025-04-03 14:48:08.20 +0400>,<Yarkov>,<DPX200>,
      <created by zg, POWCHK disabled, PULCHK disabled
       configuration hash MD5:
       00 E9 B6 7A A2 85 ED C7 34 08 36 98 17 FE 4E 26
       data hash MD5: 32K
       5D 50 1B 08 9F 76 5C 08 23 16 12 69 26 EE 60 FA>)
(   2,<2025-04-03 14:48:15.40 +0400>,<Yarkov>,<DPX200>,
      <Start of raw data processing
       efp BC_mod = 2 LB = 1.5 FT_mod = 6 PKNL = 1 PHC0 = 1782.13 PHC1 = 19.09542 SI = 64K 
       data hash MD5: 64K
       06 C6 AF 92 E3 1B AE 59 BC 37 3C 2A C8 9E 1C 98>)
(   3,<2025-04-03 14:48:58.90 +0400>,<Yarkov>,<DPX200>,
      <pk PHC0 = 7.186269 PHC1 = -7.600008 
       data hash MD5: 64K
       E2 2B 71 4A 38 45 A9 45 3F 96 8D E4 BD A6 9C F3>)
$$ ##END=
$$ 
$$ hash MD5
$$ A5 82 24 39 CD 2C 54 DC 25 AD AF A3 74 75 C8 B4
##$RELAX= 
##$RELAX= 
##$RELAX= 
##$RELAX= 
##$RELAX= 
##$RELAX= 
##$RELAX= 
##$RELAX= 
$$ Bruker specific parameters
$$ --------------------------
##$DU= <C:/Bruker/XWIN-NMR>
##$EXPNO= 2
##$NAME= <P31>
##$PROCNO= 1
##$TYPE= <nmr>
##$USER= <yarkov2>
##$AMP= (0..31)
100 100 100 100 100 100 100 100 100 100 100 100 100 100 100 100 100 100 
100 100 100 100 100 100 100 100 100 100 100 100 100 100 
##$AQSEQ= 0
##$AQ_mod= 1
##$AUNM= <au_zg>
##$AUTOPOS= <>
##$BF1= 81.014009
##$BF2= 200.13
##$BF3= 200.13
##$BF4= 200.13
##$BF5= 200.13
##$BF6= 200.13
##$BF7= 200.13
##$BF8= 200.13
##$BYTORDA= 1
##$CFDGTYP= 0
##$CFRGTYP= 5
##$CHEMSTR= <none>
##$CNST= (0..31)
1 1 145 1 1 1 1 1 1 1 1 1 1 1 1 1 1 1 1 1 1 1 1 1 1 1 1 1 1 1 1 1 
##$CPDPRG= <waltz16>
##$CPDPRG1= <>
##$CPDPRG2= <waltz16>
##$CPDPRG3= <>
##$CPDPRG4= <mlev>
##$CPDPRG5= <mlev>
##$CPDPRG6= <mlev>
##$CPDPRG7= <mlev>
##$CPDPRG8= <mlev>
##$CPDPRGB= <>
##$CPDPRGT= <>
##$D= (0..31)
0 1 0 0 0 0 0 0 0 0.06 0 0.03 2e-05 3e-06 0 0 0.0002 0 0 0 0 0 0 0 0 0 
0 0 0 0 0 0 
##$DATE= 1743677287
##$DBL= (0..7)
120 120 120 11 120 120 24 19 
##$DBP= (0..7)
150 150 150 150 150 150 150 150 
##$DBP07= 0
##$DBPNAM0= <>
##$DBPNAM1= <>
##$DBPNAM2= <>
##$DBPNAM3= <>
##$DBPNAM4= <>
##$DBPNAM5= <>
##$DBPNAM6= <>
##$DBPNAM7= <>
##$DBPOAL= (0..7)
$$ [...]
##$SUBNAM2= <"">
##$SUBNAM3= <"">
##$SUBNAM4= <"">
##$SUBNAM5= <"">
##$SUBNAM6= <"">
##$SUBNAM7= <"">
##$SUBNAM8= <"">
##$SUBNAM9= <"">
##$SW= 400.765351723535
##$SWIBOX= (0..15)
0 1 3 0 0 0 0 0 0 0 0 0 0 0 0 0 
##$SW_h= 32467.5324675325
##$TD= 32768
##$TD0= 1
##$TE= 0
##$TE2= 300
##$TE3= 300
##$TEG= 300
##$TL= (0..7)
0 120 53 12 22 120 120 120 
##$TP= (0..7)
150 150 150 150 150 150 150 150 
##$TP07= 0
##$TPNAME0= <>
##$TPNAME1= <>
##$TPNAME2= <>
##$TPNAME3= <>
##$TPNAME4= <>
##$TPNAME5= <>
##$TPNAME6= <>
##$TPNAME7= <>
##$TPOAL= (0..7)
0.5 0.5 0.5 0.5 0.5 0.5 0.5 0.5 
##$TPOFFS= (0..7)
0 0 0 0 0 0 0 0 
##$TUNHIN= 0
##$TUNHOUT= 0
##$TUNXOUT= 0
##$USERA1= <user>
##$USERA2= <user>
##$USERA3= <user>
##$USERA4= <user>
##$USERA5= <user>
##$V9= 5
##$VALIST= <valist>
##$VCLIST= <CCCCCCCCCCCCCCC>
##$VD= 0
##$VDLIST= <DDDDDDDDDDDDDDD>
##$VPLIST= <PPPPPPPPPPPPPPP>
##$VTLIST= <TTTTTTTTTTTTTTT>
##$WBST= 1024
##$WBSW= 4
##$XGAIN= (0..3)
0 0 0 0 
##$XL= 0
##$YL= 0
##$YMAX_a= 4635
##$YMIN_a= -8324
##$ZGOPTNS= <>
##$ZL1= 120
##$ZL2= 120
##$ZL3= 120
##$ZL4= 120
##$ABSF1= 0
##$ABSF2= 0
##$ABSG= 0
##$ABSL= 0
##$ALPHA= 0
##$AQORDER= 0
##$ASSFAC= 0
##$ASSFACI= 0
##$ASSFACX= 0
##$ASSWID= 0
##$AUNMP= <proc_1d>
##$AZFE= 0.1
##$AZFW= 0.5
##$BCFW= 0
##$BC_mod= 2
##$BYTORDP= 0
##$COROFFS= 0
##$CY= -3
##$DATMOD= 1
##$DC= 0
##$DFILT= <>
##$DTYPP= 0
##$F1P= 0
##$F2P= 0
##$FCOR= 1
##$FTSIZE= 65536
##$FT_mod= 6
##$GAMMA= 0
##$GB= 0
##$INTBC= 1
##$INTSCL= 9.790993e-09
##$ISEN= 30
##$LB= 1.5
##$LEV0= 0
##$LPBIN= 0
##$MAXI= 10000
##$MC2= 0
##$MEAN= 0
##$ME_mod= 0
##$MI= 50
##$NCOEF= 0
##$NC_proc= -8
##$NLEV= 6
##$NOISF1= 182.463
##$NOISF2= 159.3651
##$NSP= 0
##$NTH_PI= 0
##$NZP= 0
##$OFFSET= 198.0616
##$PC= 4
##$PHC0= 1789.316
##$PHC1= 11.49541
##$PH_mod= 1
##$PKNL= yes
##$PPARMOD= 0
##$PSCAL= 0
##$PSIGN= 0
##$REVERSE= no
##$SF= 81.0140089999434
##$SI= 65536
##$SIGF1= 159.3651
##$SIGF2= -187.1042
##$SINO= 113.3802
##$SIOLD= 16384
##$SREGLST= <1H.CDCl3>
##$SSB= 0
##$STSI= 65536
##$STSR= 0
##$SW_p= 32467.5324675325
##$SYMM= 0
##$S_DEV= 0
##$TDeff= 32768
##$TDoff= 0
##$TI= <>
##$TILT= no
##$TM1= 0
##$TM2= 0
##$TOPLEV= 0
##$USERP1= <user>
##$USERP2= <user>
##$USERP3= <user>
##$USERP4= <user>
##$USERP5= <user>
##$WDW= 1
##$XDIM= 65536
##$YMAX_p= 227797687
##$YMIN_p= -333481985
$$ End of Bruker specific parameters
$$ ---------------------------------
##NTUPLES= NMR SPECTRUM
##VAR_NAME=  FREQUENCY,     SPECTRUM/REAL,   SPECTRUM/IMAG
##SYMBOL=    X,             R,               I
##VAR_TYPE=  INDEPENDENT,   DEPENDENT,       DEPENDENT
##VAR_FORM=  AFFN,          ASDF,            ASDF
##VAR_DIM=   65536,         65536,           65536
##UNITS=     HZ,            ARBITRARY UNITS, ARBITRARY UNITS
##FACTOR=    0.49542278885378, 1,            1
##FIRST=     16045.7642231865, 0,            0
##LAST=      -16421.768244346, 0,            0
##MIN=       -16421.768244346, -333481985,   0
##MAX=       16045.7642231865, 227797687,    0
$$ Real data points
##PAGE= N=1
##DATA TABLE= (X++(R..R)), XYDATA
$$ [...]
##PAGE= N=2
##DATA TABLE= (X++(I..I)), XYDATA
6766a768668L75638o92270j060174p6217Q68927M76791j85245N07785J621046
$$ -1768668 -1393030 -2085300 -3145474 -3221691 -2352764 -1875973 -2061218 -1553433 67613
6757F7613R93233q77644j462115o84754j121461k935491k553465J646144N794272
$$ 67613 1060846 183202 -1278913 -1963667 -3085128 -6020619 -8574084 -6927940 -1133668
6748a133668N459854J544340j608608j941044o96289N24992Q61021k32642j848577
$$ -1133668 4326186 5870526 4261918 2320874 1624585 2149577 3010598 2777956 929379
6739I29379j516118J221596K924909R31757k075563j921393M40667P77834j107678
$$ 929379 -586739 634857 3559766 4491523 2415960 494567 935234 1713068 605390
6730F05390j339245P80524J294618j221377k596941L5035L098787K097832j460013
$$ 605390 -733855 46669 1341287 119910 -2477031 -2441996 656791 2754623 1294610
6721A294610k919487j568908l80979l27657M97588K547938L659727K650802R75063
$$ 1294610 -1624877 -3193785 -3574764 -3902421 -3404833 -856895 2802832 5453634 6428697
6712F428697J65797P4823J92683N70541Q35974J19636j429291k509498k460480
$$ 6428697 6594494 6669317 6862000 7432541 8268515 8388151 6958860 4449362 1988882
6703A988882j920487j514196j176651q86324p50492k83428J053964K519064K675885
$$ 1988882 68395 -1445801 -2622452 -3508776 -4259268 -4542696 -3488732 -969668 1706217
6694A706217J443714J90569l42233p67067j461785j697049q08818Q77462K560463
$$ 1706217 3149931 3340500 2998267 2231200 769415 -927634 -1736452 -858990 1701473
6685A701473L408761K652497N92394p45906J90446J712996O29583k879950m779767
$$ 1701473 5110234 7762731 8355125 7609219 7799665 9512661 10142244 7262294 2482527
6676B482527k687454P53718J861785R12184N42988R77011K14199j658731j931515
$$ 2482527 -204927 548791 2410576 3322760 3865748 4842759 5056958 3398227 1466712
6667A466712K50407J888980L26800k623761l002552j92127K314957J827165n871
$$ 1466712 1717119 3606099 3932899 1309138 -1693414 -1885541 429416 2256581 2250710
6658B250710J11450K217359L027511P27644k376511l103299j513581N9639P86891
$$ 2250710 2362160 4579519 7607030 8334674 5958163 2854864 1341283 1400922 2187813
6649B187813J607353K315902J422521o76989j399537j9682Q05510o58478k078350
$$ 2187813 3795166 6111068 7533589 6856600 5457063 5437381 6242891 5584413 3506063
6640C506063p86128J568305J399182j157563k584241j481888j11110j38884k95265
$$ 3506063 2719935 4288240 5687422 4529859 1945618 463730 352620 213736 -81529
6631h1529O37207J457596Q18054l85286o64704k85088k25442j41903Q55245K235353
$$ -81529 555678 2013274 2831328 2446042 1781338 1496250 1270808 1128905 1984150 4219503
6621D219503K438979Q54783j566676l166291k468450P25502M256263M806452J498828
$$ 4219503 6658482 7513265 5946589 2780298 311848 1037350 5293613 10100065 11598893
6612A1598893k560131l673787j789722J8436l47519k016027k956273k197017j61438
$$ 11598893 9038762 5364975 3575253 3593689 3246170 1230143 -1726130 -3923147 -4084585
6603d084585J865506K389092J011211o03783j59930K394767M352983L273179j17633
$$ -4084585 -2219079 170013 1181224 577441 417511 2812278 7165261 10438440 10320807
6594A0320807k771677k716709q58876N73476O48753L27397Q02246J996639K897815
$$ 10320807 7549130 4832421 3973545 4547021 5195774 5523171 6325417 8322056 11219871
6585A1219871K729462J339135r35494l027042l396666j738771o6788n80683k487641
$$ 11219871 13949333 15288468 14352974 11325932 7929266 6190495 6123707 5543024 3055383
6576C055383k745793m10148J732743R75628j605934k869839j736592K04602J315686
$$ 3055383 309590 -100558 1632185 2607813 1001879 -1867960 -3604552 -3399950 -2084264
6567b084264J271826M01365m79520N7320K492532M836979M472599J506328j449303
$$ -2084264 -812438 -411073 -890593 -833273 1659259 6496238 10968837 12475165 11025862
6558A1025862k808392l344386l789978l379731j704992o7740L44281J73327M43146
$$ 11025862 8217470 4873084 1083106 -2296625 -4001617 -4069357 -3725076 -3551749 -3108603
6549c108603O51123j98227j583285k033538j157104K35568J532140K481568K378216
$$ -3108603 -2457480 -2655707 -4238992 -6272530 -7429634 -7194066 -5661926 -3180358 -802142
6540h02142O72384j561697k252744r01296N73540J43427j967727l793358l816983
$$ -802142 -129758 -1691455 -3944199 -4845495 -4271955 -4128528 -6096255 -9889613 -13706596
6531a3706596k026980N99924K739707L106333J342119j052977j539812Q02992
$$ -13706596 -15733576 -15133652 -12393945 -9287612 -7945493 -8998470 -10538282 -9735290
6523i735290L725659L887540O62914k957723l633201j047959K485338M815644
$$ -9735290 -6009631 -2122091 -1459177 -4416900 -8050101 -9098060 -6612722 -1797078
6515a797078N253971L848475J082624j603992k560789j828256j164975j540630
$$ -1797078 3456893 7305368 8387992 6784000 4223211 2394955 1229980 -310650
6507c10650j760801n37820J140863J194417m66884j628001p21930J238239K267787
$$ -310650 -2071451 -2609271 -1468408 -273991 -740875 -2368876 -3090806 -1852567 415220
6498D15220J904740J141046N03985m60817j650616j637236N27884L312906L902729
$$ 415220 2319960 3461006 3964991 3504174 1853558 216322 744206 4057112 7959841
6489G959841J672195p58012p97083O87339N91391k036395m402490l406266L58102
$$ 7959841 9632036 8874024 8076941 8764280 9355671 7319276 2916786 -489480 -131378
6480a31378L111324K192849j024489k900892j792976K48913M50461q08589n60993
$$ -131378 2979946 5172795 4148306 1247414 -545562 -296649 153812 -654777 -1215770
6471a215770K185248M395541K952757p85783k623416j123758R58016J040667n9134
$$ -1215770 969478 5365019 8317776 7531993 4908577 3784819 4742835 5783502 5724368
6462E724368l00873L83978O98660K39834n36140j431866j985434j020995J362612
$$ 5724368 5423495 5807473 6506133 6745967 6209827 4777961 2792527 1771532 3134144
6453C134144K455051J28670l136296k506805K275202N306861J944074m419017
$$ 3134144 5589195 5717865 2581569 74764 2349966 7656827 9600901 5181884
6445E181884o175202j420399L517553K567091k214652m116390j293603J312891
$$ 5181884 -993318 -2413717 1103836 3670927 1456275 -2660115 -3953718 -2640827
6437b640827j13691k707910j818996J723812L298196J912733J250400L097517
$$ -2640827 -2754518 -5462428 -7281424 -5557612 -2259416 -346683 903717 4001234
6429D001234M403928K749436P33333J706516L885327K694658k154335n755771
$$ 4001234 8405162 11154598 11887931 13594447 17479774 20174432 18020097 12264326
6421A2264326m431538j35429K459443J302875j649335l264203k499924j023376
$$ 12264326 7832788 7697359 10156802 11459677 9810342 6546139 4046215 3022839
6413C022839p39531j065496J81274K976755M170076J733213j961261l295117k341717
$$ 3022839 2283308 1217812 1399086 4375841 8545917 10279130 8317869 5022752 2681035
6404B681035j908414k653035k418939l29247J681583K072751J645905J357065
$$ 2681035 772621 -1880414 -4299353 -4628600 -2947017 -874266 771639 2128704
6396B128704P23844l45750m23886J122682K442396J525336r78147k744840k687336
$$ 2128704 2852548 2506798 2082912 3205594 5647990 7173326 6195179 3450339 763003
6387G63003j616355o88856k70260M8131R02507K248119K923881J899923j16026
$$ 763003 -853352 -1542208 -1812468 -1764337 -861830 1386289 4310170 6210093 6094067
6378F094067j392334j325914n41154P87981K717015L752554J900404j856094l700634
$$ 6094067 4701733 3375819 2834665 3622646 6339661 10092215 11992619 10136525 6435891
6369F435891j823020J142239J885065M58888j023977j625898j607149j018743
$$ 6435891 4612871 5755110 7640175 8099063 7075086 5449188 3842039 2823296
6361B823296k54353m50556j496205j346360O81491J831837k97765l528811l717594
$$ 2823296 2568943 2118387 622182 -724178 -42687 1789150 1491385 -2037426 -5755020
6352e755020n59904K373673K877599K214388J933730J605910M70623r63532j863745
$$ -5755020 -6314924 -3941251 -1063652 1150736 3084466 4690376 5160999 4197467 2333722
6343B333722k028910j397837k3236J156905Q86680p38046k189013k170158o28645
$$ 2333722 304812 -1093025 -1116261 40644 927324 189278 -1999735 -4169893 -4798538
6334d798538J452341K513351J606096N0253M45269K718297L198244j80654l932196
$$ -4798538 -3346197 -832846 773250 823503 1268772 3987069 7185313 7004659 3072463
6325C072463l478629K05379K301820J259743k29435o94045j369660k064956p31967
$$ 3072463 -406166 -200787 2101033 3360776 3131341 2437296 1067636 -997320 -1729287
6316a729287J780527J668318j403870k894605p59952R66976o66068j896006J439596
$$ -1729287 51240 1719558 315688 -2578917 -3338869 -2371893 -3037961 -4933967 -3494371
6307c494371O097536N802314Q55938k643327j931763j00189L46371Q87226K789769
$$ -3494371 2603165 8405479 9261417 6618090 4686327 4586138 4932509 5819735 8609504
6298H609504M035514K423322j137783l983795m432178k545267j1200O59578j198083
$$ 8609504 12645018 15068340 13930557 9946762 5514584 2969317 2958117 3617695 2419612
6289B419612k838304j422383J753907L080497J895708N11121m16851k300559m285607
$$ 2419612 -418692 -1841075 -87168 2993329 4889037 5400158 4983307 2682748 -1602859
6280a602859l267000N11321K473928M08335k089574j474891M65214N11390m01067
$$ -1602859 -4869859 -4358538 -1884610 -1476275 -3565849 -5040740 -4575526 -4064136 -4465203
6271d465203M31568K231564K241637O19230m08779q62877k195021l185870j201105
$$ -4465203 -4033635 -1802071 439566 1058796 650017 -212860 -2407881 -5593751 -6794856
6262f794856K709363M350667K364080l14168j415653j707245j685003k66289J733446
$$ -6794856 -4085493 265174 2629254 2315086 899433 -807812 -2492815 -2759104 -1025658
6253a025658J137322k272027l952251j129138K442599J960504j189404k149412
$$ -1025658 111664 -2160363 -6112614 -7241752 -4799153 -2838649 -4028053 -6177465
6245f177465m30785O9795j872096k919622j028112J341770J486450K83007k76171
$$ -6177465 -6608250 -6538455 -8410551 -11330173 -12358285 -11016515 -9530065 -9247058 -9523229
6236i523229l83323r13534r53476O37498K757585L465032K727986J785472Q70261
$$ -9523229 -9906552 -10820086 -11773562 -11136064 -8378479 -4913447 -2185461 -399989 470272
6227D70272l74357j158301m45758R61680J335788O57914L49805O59529M10197
$$ 470272 95915 -1062386 -1508144 -546464 789324 1447238 1797043 2456572 2866769
6218B866769o84184j538832j705826j805529j622211N2454K909984M495389L265286
$$ 2866769 2182585 643753 -1062073 -2867602 -4489813 -4437359 -1527375 2968014 6233300
6209F233300O94714q35685q67814m38607j98707l08030j069979k240580k564426
$$ 6233300 6928014 6092329 5224515 4785908 4587201 4279171 3209192 968612 -1595814
6200a595814j307638N00463J497945J753446J886455J536496L58659l92817O70007
$$ -1595814 -2903452 -2402989 -905044 848402 2734857 4271353 4630012 4237195 4907202
6191D907202K445395K275615m41257l419395m491931l728223k208698m83711R49862
$$ 4907202 7352597 9628212 9186955 5767560 1275629 -2452594 -4661292 -5145003 -4195141
6182d195141J143875j66851j779634k317219j766893j109308r74620j204452j207331
$$ -4195141 -3051266 -3218117 -4997751 -7314970 -9081863 -10191171 -11165791 -12370243 -13577574
6173a3577574k73223J888104M373155N359994L850799R81075q95999m44960J501153
$$ -13577574 -13850797 -11962693 -7589538 -2229544 1621255 2602330 1706331 1261371 2762524
6164B762524K919876K574637R97822m73418j357013k145294k816375k351702m60452
$$ 2762524 5682400 8257037 9254859 8781441 7424428 5279134 2462759 111057 -349395
6155c49395J225589R75645n70814j204087k31245P01610N3525j622171k538061
$$ -349395 876194 1851839 1281025 76938 -154307 547303 600828 -1021343 -3559404
6146c559404j610642P31074K920992L376527J986199L54820j73554k26478j052025
$$ -3559404 -5170046 -4438972 -1517980 1858547 3844746 4199566 4026012 3799534 2747509
6137B747509k218561k385105j776482j652562j564775J58279K894043L694106
$$ 2747509 528948 -1856157 -3632639 -5285201 -6849976 -6691697 -3797654 -103548
6129a03548J789018J49722R07665K117610J418345J93123Q37337J952567L05316
$$ -103548 1685470 1835192 2742857 4860467 6278812 6471935 7309272 9261839 9567155
6120I567155l306312m407282j500953J465152P60306k037869k729080k03622K856616
$$ 9567155 6260843 1853561 352608 1817760 2578066 540197 -2188883 -2392505 464111
6111D64111L829067K488720N451k267845k801526o03410L010741M597397K136965
$$ 464111 4293178 6781898 6787349 4519504 1717978 1114568 4125309 8722706 10859671
6102A0859671j971184l234276p35893J468188r5523l316503l614691q05911Q03857
$$ 10859671 8888487 5654211 4918318 6386506 6290983 2974480 -640211 -1446122 -642265
6093f42265p16375k045039k06984K742771L480057K726086L027771L498021J288489
$$ -642265 -1358640 -3403679 -3610663 -867892 2612165 5338251 8366022 11864043 13152532
6084A3152532k728063m422088k680296r04232j386880k164900r76900J164674
$$ 13152532 10424469 6002381 3322085 2417853 1030973 -1133927 -2110827 -946153
6076i46153K367013K893338L559785L480163J747572m80118j708256k258614k722167
$$ -946153 1420860 4314198 7873983 11354146 13101718 12621600 10913344 8654730 5932563
6067E932563k076003L04181K322639J551021j066307k519813k056906j548796
$$ 5932563 3856560 4160741 6483380 8034401 6968094 4448281 2391375 842579
6059H42579j865570j612724J23304K009525K240418O42421j491056k588359j752355
$$ 842579 -1022991 -2635715 -2512411 -502886 1737532 2379953 888897 -1699462 -3451817
6050c451817L45739J658562J034466j07027J74831J281699J217490L57227J141914
$$ -3451817 -3106078 -1447516 -413050 -520077 -345246 936453 2153943 2511170 3653084
6041C653084L516432L849816R0582m634581n949141l790715j322881J99752K080379
$$ 3653084 7169516 11019332 11109914 6475333 526192 -3264523 -4587404 -4387652 -2307273
6032b307273M179814L973960O38357k814361l217332j141333N90193O80296k14822
$$ -2307273 1872541 5846501 6484858 3670497 453165 -688168 -97975 582321 367499
6023C67499j513679k913148l280265j683127N84105J175881J07885j20644J623382
$$ 367499 -1146180 -4059328 -7339593 -9022720 -8438615 -7262734 -7154849 -7275493 -5652111
6014e652111L248305K541924L43588q91951m04259N84887R59787N12099o91446
$$ -5652111 -2403806 138118 481706 -410245 -814504 -229617 730170 1242269 550823
6005E50823k209470k881285j949866k83434O56766P02959P13842R05592P77385
$$ 550823 -1658647 -4539932 -6489798 -6773232 -6116466 -5413507 -4699665 -3794073 -3016688
5996c016688L91697L83809Q11313J138369J205529J219653J127066R65464J225440
$$ -3016688 -2624991 -2241182 -1429869 -291500 914029 2133682 3260748 4226212 5451652
5987E451652J755900J193085j060864l226974l267964j673252j76358J109140
$$ 5451652 7207552 8400637 7339773 4112799 844835 -828417 -1004775 104365
5979A04365K719949L260699J240171j243680p39002J683483J373570k245326l947426
$$ 104365 2824314 6085013 7325184 6081504 5342502 7025985 8399555 6154229 2206803
5970B206803p66117L002715K318058j024585j688518J056762L157566K276066
$$ 2206803 1440686 4443401 6761459 5736874 4048356 5105118 8262684 10538750
5962A0538750J04985j253477j486833p64350O72795J587682R00476l99148n44744
$$ 10538750 10643735 9390258 7903425 7139075 7811870 9399552 10300028 9900880 9356136
5953I356136M29550J371534K098239K501585J098482k580194n581282m939919
$$ 9356136 9785686 11157220 13255459 15757044 16855526 14275332 8694050 3754131
5945C754131k302752j396204k035909j130081J048743Q76484j907383k949839
$$ 3754131 1451379 55175 -1980734 -3110815 -2062072 -1185588 -3092971 -6042810
5937f042810m13447J688401q5623l173197l286800p18980J155124J152580O25321
$$ -6042810 -6456257 -4767856 -4853479 -8026676 -11313476 -12032456 -10877332 -9724752 -9099431
5928i099431L48380K06158O88262K028626K943048K401689J394865R92069L15525
$$ -9099431 -8751051 -8544893 -7856631 -5828005 -2884957 -483268 911597 1903666 2219191
5919B219191j334352k169935n01138J860219J848808j93519j224983l14715L93887
$$ 2219191 884839 -1285096 -1786234 73985 1922793 1729274 504291 189576 583463
5910E83463m50505j466420j027542N54102J941209K142480O58237k071380m085763
$$ 583463 132958 -1333462 -2361004 -1806902 134307 2276787 2935024 863644 -3222119
5901c222119l394517m58215K121281K608930J627162O19593J89444J56437O6294
$$ -3222119 -6616636 -7074851 -4953570 -2344640 -717478 -97885 91559 247996 314290
5892C14290n70202j626025k038461j099405K40968M91530l11518q98692p31026
$$ 314290 -255912 -1881937 -3920398 -5019803 -4778835 -4287305 -4598823 -5497515 -6228541
5883f228541k76171K74066R76781J134505M2359j410093j619937o38087J38895
$$ -6228541 -6504712 -6230646 -5253865 -4119360 -4077001 -5487094 -7107031 -7745118 -7606223
5874g606223M34997J106054J768462J060515k56537O28431M104518O445866M597359
$$ -7606223 -7171226 -6065172 -4296710 -3236195 -3492732 -2864301 1240217 7686083 12283442
5865A2283442M85133j800261j375481m49152j94628P0170R6842j494101m073192
$$ 12283442 12768575 10968314 9592833 9143681 8949053 9019223 9116065 7621964 3548772
5856C548772m699682k284197M10688O50460n00398m90143M02941M4457j183083
$$ 3548772 -1150910 -3435107 -3024419 -2373959 -2874357 -3364500 -2961559 -2917102 -4100185
5847d100185n69098J953491K635021m85451l829531l050206N60303K127894O04353
$$ -4100185 -4669283 -2715792 -80771 -566222 -4395753 -7445959 -6885656 -4757762 -4153409
5838d153409j99145J649812K922497P63220k276912k137524L59526J067908p99003
$$ -4153409 -4352554 -2702742 219755 982975 -1293937 -3431461 -3071935 -2004027 -2803030
5829b803030j838239l28937J217095O30293l40783P48692K840851L133534J463306
$$ -2803030 -4641269 -4970206 -3753111 -3122818 -3463601 -2714909 125942 3259476 4722782
5820D722782J09505o5046n30576k036754l065422k191277k56693R34900R53086
$$ 4722782 4832287 4767241 4236665 2199911 -865511 -3056788 -3313481 -2378581 -1425495
5811a425495O35777M64680K91515K96500R68125K044662K468545J698933L45969
$$ -1425495 -789718 -325038 -33523 262977 1231102 3275764 5744309 7443242 7789211
5802G789211p88546j599316k220594k360288j668007l34165J102936K056001J731704
$$ 7789211 7000665 5401349 3180755 820467 -847540 -1181705 -78769 1977232 3708936
5793C708936l40146k907919l297664n18679K740856K969881K43675k142210k231302
$$ 3708936 3368790 460871 -2836793 -3355472 -614616 2355265 2598940 456730 -1774572
5784a774572j300601q65513l33718J098050K309578J839220K71603o57467l88811
$$ -1774572 -3075173 -3940686 -4274404 -3176354 -866776 972444 1244047 586580 197769
5775A97769M81330J558173K438211K067800P0055j894788j842558j94861Q25862
$$ 197769 679099 2237272 4675483 6743283 6813338 4918550 3075992 2881131 3706993
5766C706993K93460n50818m91517J89036P40740J116336J518627J612110Q41704
$$ 3706993 4000453 3449635 2958118 3147154 3887894 5004230 6522857 8134967 8976671
5757H976671o29632j580495o92546J609947K640250J35446m326715o317327l800597
$$ 8976671 8347039 6766544 6073998 7683945 10324195 10459641 6132926 -184401 -3984998
5748c984998L14820K100118J349384O52954J269926K201217K481186K142552J301833
$$ -3984998 -3670178 -1570060 -220676 432278 1702204 3903421 6384607 8527159 9828992
5739I828992J37993n69330l81702p5510k48697j51115N44976L13935j778227l733025
$$ 9828992 9966985 9397655 9015953 8940443 8691746 8540631 9085607 9399542 7621315 3888290
5729C888290l270046j338216j00000R44620L165219M604249K248286k020344k865039
$$ 3888290 618244 -719972 -819972 124648 3289867 7894116 10142402 8122058 5257019
5720E257019N14416K850940P36875k660769l047488r21484P45637J135459Q13579
$$ 5257019 5771435 8622375 9359250 6698481 3650993 2729509 3475146 4610605 5424184
5711E424184o37450k983181l723012j215720K431655M187402L853269K632139
$$ 5424184 4786734 1803553 -1919459 -3135179 -703524 3483878 7337147 9969286
5703I969286L93669k629365l724187j004325K594544K363887j758324n101954
$$ 9969286 10362955 7733590 4009403 3005078 5599622 7963509 6205185 1103231
5695A103231m361731r61985J626090J557198m58478k123383j605147K28845O03142
$$ 1103231 -3258500 -4220485 -2594395 -1037197 -1495675 -3619058 -5224205 -4995360 -4392218
5686d392218r93280j347422J762822N532889N755531K757106K33447n93281j686998
$$ -4392218 -5385498 -6732920 -4970098 562791 6318322 9075428 9308875 8715594 7028596
5677G028596l543675l979088k155889k58641n6581o45376o86903l89845j57158
$$ 7028596 3484921 -494167 -2650056 -2908697 -2965278 -3610654 -4297557 -4687402 -4844560
5668d844560N18546J653256K101132J307695K10460l32025n40335o49361m14824
$$ -4844560 -4326014 -2672758 -571626 736069 946529 614504 74169 -575192 -990016
5659i90016j39476n64060j243654o76721J344154L023778K835536J209220m80925
$$ -990016 -1129492 -1693552 -2937206 -3613927 -2269773 754005 3589541 4798761 4317836
5650D317836j323632r61958L42252J375057R66144m23806j265347j056497n14105
$$ 4317836 2994204 2032246 2374498 3749555 4715699 4291893 3026546 1970049 1455944
5641A455944Q5362J024201J695037R96159n98079j244807l90883N03419K69986
$$ 1455944 1541306 2565507 4260544 5256703 4658624 3413817 3022934 3526353 3796339
5632C796339n62093r66470n01812Q71189K463898K583919N17507j581796j194972
$$ 3796339 3234246 2267776 1765964 2637153 5101051 7684970 8202477 6620681 5425709
5623E425709M96674N7899k633473l830735j795237M37828q4658j898047j980001
$$ 5425709 5922383 5980282 3346809 -483926 -2279163 -1841335 -1925993 -3824040 -5804041
5614e804041k59074J305995K022676K287876J840430O07370j60064K36383M19238
$$ -5804041 -6063115 -4757120 -2734444 -446568 1393862 2001232 1841168 2077551 2496789
5605B496789o32545j343122j34093J389834O50346j752602l001475k287291j198569
$$ 2496789 1864244 521122 387029 1776863 2427209 674607 -2326868 -4614159 -5812728
5596e812728n50028K32611R01762M95614l36761J11199J533369J793603N53380
$$ -5812728 -6362756 -6130145 -5228383 -4732769 -5069530 -4958331 -3424962 -1631359 -1077979
5587a077979p839J165598K242867J499903k06438j260887j587171j731245j483802
$$ -1077979 -1085818 79780 2322647 3822550 3616112 2355225 768054 -963191 -2446993
5578b446993r53842j304851k642640k747829j22664K903633K784159j6795j293867
$$ -2446993 -3400835 -4705686 -7348326 -10096155 -10218819 -7315186 -4531027 -4547822 -5841689
5569e841689R63560L668362L090611L6595j623633l94699J357000J156601o02797
$$ -5841689 -4878129 -1209767 1880844 1917439 293806 -100893 1256107 2412708 1809911
5560A809911j975279j962346q25690P12175J603555R50196o67424j365010m07042
$$ 1809911 -165368 -2127714 -2953404 -2241229 -637674 312522 -354902 -1719912 -2126954
5551b126954O79168N18393j8885K97115N70590n78554k075498j883878p49926
$$ -2126954 -1447786 -929393 -948278 -651163 -80573 -659127 -2734625 -4618503 -5368429
5542e368429j251497l164937l263027m86812K123236K156331J292560J892478
$$ -5368429 -6619926 -9784863 -13047890 -13534702 -11411466 -9255135 -7962575 -6070097
5534f070097K956298K295549O21740L22023J438391J904198J062028J11006n42325
$$ -6070097 -3113799 -818250 -196510 125513 1563904 3468102 4530130 4641136 4098811
5525D098811j581862k438634j412184J241932K729904J368935r27634j205056
$$ 4098811 2516949 78315 -1333869 -91937 2637967 4006902 3079268 1874212
5517A874212N63066J567359J3156k421197k731052o63155Q03308k32863j398000
$$ 1874212 2437278 4004637 4017793 1596596 -1134456 -1797611 -994303 -1227166 -2625166
5508b625166O03458M285385M482906j63124m552822m118916j079685k95128j607340
$$ -2625166 -2021708 2263677 6746583 6583459 2030637 -2088279 -3167964 -3463092 -5070432
5499e070432r70302K107138L511899J387035q00204P3313J906677R00639k624504
$$ -5070432 -6040734 -3933596 -421697 965338 165134 238447 2145124 3045763 421259
5490D21259m898298l846328j029118R80079J174663K24466n75104l59757N67578
$$ 421259 -4477039 -8323367 -9352485 -8372406 -7197743 -6973277 -7548381 -7908138 -7340560
5481g340560J100440O57849l00608j172913j779444j770040m67956K107882M722365
$$ -7340560 -6240120 -5582271 -5882879 -7055792 -8835236 -10605276 -11073232 -8965350 -4242985
5472d242985N838960M645523J406104k253544l757179j867193J329278K387627
$$ -4242985 1595975 6241498 7647602 5394058 1636879 -230314 1098964 3486591
5464C486591P13460j054577j237455j287039k625357l771790k715963l64023Q30458
$$ 3486591 4200051 3145474 1908019 620980 -2004377 -5776167 -8492130 -8856153 -8025695
5455h025695N25095L29275P75275R72820Q81352J350923J906560J091955n52694
$$ -8025695 -7500600 -7171325 -6396050 -5423230 -4541878 -3190955 -1284395 -192440 -745134
5446g45134m53577K055542M095658L060829K14233j308178o89801K80921J72901
$$ -745134 -1198711 856831 4952489 8013318 8227551 6919373 6229572 6510493 6683394
5437F683394p49392j624311j710459l72609K022998L503536K455416O635j294303
$$ 6683394 5934002 4309691 2599232 2226623 4249621 7753157 10208573 10215208 8920905
5428H920905j045147j205274k561770l290196j926627K95628J422387J449794
$$ 8920905 7875758 6670484 4108714 818518 -1108109 -812481 609906 2059700
5420B059700J563081K057747K485997K701942K374809P05717j881260l120021
$$ 2059700 3622781 5680528 8166525 10868467 13243276 13948993 12067733 8947712
5412H947712j775816J12303j10221j947555k872357k153900j052499n5260J291292
$$ 8947712 7171896 7284199 7173978 5226423 2354066 200166 -852333 -907593 383699
5403C83699K318253J845582N39174p6398m21811j618027k196980J0114L055463
$$ 383699 2701952 4547534 5086708 5010310 4588499 2970472 773492 783606 3839069
5394C839069K649977q05449k136589L12606J825718p35202l656232k882785p47902
$$ 3839069 6489046 5683597 3547008 3859614 5685332 4950130 1293898 -1588887 -2336789
5385b336789j169291k346511l02796L252465L241321q7692j379995J088539L081894
$$ -2336789 -3506080 -5852591 -6155387 -2902922 338399 250707 -1129288 -40749 3041145
5376C041145J699981n25860n74854O22255Q90846M19818M52198R21483J111740
$$ 3041145 4741126 4215266 3640412 4262667 5153513 5573331 6025529 6947012 8058752
5367H058752P48730m60863k415232l477142k157548j707Q8008j488696j426280
$$ 8058752 8807482 8346619 5931387 2454245 296697 294990 382998 -1105698 -2531978
5358b531978J023575K784826K167938J399700K182222K491854L59373k264901
$$ -2531978 -1508403 1276423 3444361 4844061 7026283 9518137 9877510 7612609
5350G612609k394768n28433N53749r5623j204043j798344j941280j840613j811241
$$ 7612609 5217841 4689408 5243157 5147534 3943491 2145147 203867 -1636746 -3447987
5341c447987k164042k074957r4782L073399M256373J900782j367645k211804r62237
$$ -3447987 -5612029 -7686986 -7781768 -4708369 -451996 1448786 81141 -2130663 -3092900
5332c092900l10295r22484q95459Q50688K840692L021313J232242o61805p56627
$$ -3092900 -3403195 -4325679 -5221138 -4370450 -1529758 1491555 2723797 2061992 1305365
5323A305365P48895J684972Q09914j98054P76257K566534K053634r23337l075264
$$ 1305365 2054260 3739232 4549146 4351092 5127349 7693883 9747517 8824180 5748916
5314E748916k709513k033514l037690m122773k865109K68015L040103M317459
$$ 5748916 3039403 1005889 -2031801 -6154574 -9019683 -8751668 -5711565 -1394106
5306a394106M064299K453888O17714K33210R07718L23714j654249k077009J9313
$$ -1394106 2670193 5124081 5741795 5975005 6882723 7206437 5552188 3475179 3494492
5297C494492J224683o95939k418869j72799L699459L984540M03245k767336l638314
$$ 3494492 4719175 4023236 1604367 1431568 5131027 9115567 9518812 6751476 3113162
5288C113162m124765m751161l262889O06659L408352K740943M72741m39130K88443
$$ 3113162 -1011603 -5762764 -9025653 -8418994 -5010642 -2269699 -1796958 -2236088 -1947645
5279a947645J215040J681393J793364J453501O84350q2658o88594j291131j585357
$$ -1947645 -732605 948788 2742152 4195653 4880003 4797345 4108751 2817620 1232263
5270A232263j131468m65269o15935j505179j995727j429771r2973J451098K449346
$$ 1232263 100795 -364474 -980409 -2485588 -4481315 -5911086 -6004059 -4552961 -2103615
5261b103615K101518P88811J70166P13308N24561j505296k992566j197935K264649
$$ -2103615 -2097 786714 956880 1670188 2194749 689453 -2303113 -3501048 -1236399
5252a236399L047555N6995l230855l615210j636620K26551N54315k97945p55889
$$ -1236399 1811156 1868151 -1362704 -4977914 -6614534 -6387983 -5833668 -6131613 -6887502
5243f887502P46589L614188M826295K667497l80251r40375L10120K50348j119464
$$ -6887502 -6140913 -2526725 2299570 4967067 4586816 3646441 3956561 4206909 3087445
5234C087445p98913J652867L003178J599482k95344p73916j139884k636895l646520
$$ 3087445 2288532 3941399 6944577 8544059 8248715 7474799 6334915 3698020 51500
5225E1500k432610p4402J540987K471434L415604L606597K069818m62167k495593
$$ 51500 -2381110 -2455512 -914525 1556909 4972513 8579110 10648928 10186761 7691168
5216G691168l300141k456564K31225L148273L306705M7948l451795l987625j992383
$$ 7691168 4391027 1934463 2165688 5313961 8620666 8668614 5216819 1229194 -763189
5207g63189P6519J159193J593042J356308L75065n41761q04295j033870j528066
$$ -763189 -686670 472523 2065565 3421873 3796938 3255177 2450882 1417012 -111054
5198a11054j104074Q19468K301185J102462j947864l732283k583501K88705K709339
$$ -111054 -1215128 -395660 1905525 3007987 1060123 -2672160 -5255661 -4966956 -2257617
5189b257617L446673K430897L45079j782394l076476k982398j277219J245810
$$ -2257617 1189056 3619953 3965032 2182638 -893838 -3876236 -5153455 -3907645
5181c907645K493358J093894j265511j478931O50940J997493P96750q19004m79958
$$ -3907645 -1414287 -320393 -1585904 -3064835 -2413895 -416402 380348 -438656 -918614
5172i18614P05898L72261j073810j334434M137J234780J492759J463116J267200
$$ -918614 -212716 159545 -914265 -2248699 -2244562 -1009782 482977 1946093 3213293
5163C213293J7326k034492k826939j024324J777741K464428m4374l240359l512971
$$ 3213293 3230619 1196127 -1630812 -2655136 -877395 1587033 1542659 -1697700 -5210671
5154e210671k10618L515074M429728K741251P15517r49867l007238m648825l859057
$$ -5210671 -5421289 -1906215 2523513 5264764 5980281 5030414 2023176 -2625649 -6484706
5145f484706j162708K52071p20864j397433N2383J491521P25122n13034K95450
$$ -6484706 -7647414 -7395343 -8116207 -9513640 -9461257 -7969736 -7244614 -7757648 -7462198
5136g462198J732822O86227k210326l377192j867127k40348J67692J087265L566503
$$ -7462198 -5729376 -5043149 -7253475 -10630667 -12497794 -12738142 -12570450 -11483185 -7916682
5127g916682N628088N184703K968347J024534M659o30798j033722r86943p46190
$$ -7916682 -2288594 2896109 5864456 6888990 6893649 6262851 5229129 4242186 3495996
5118C495996q30967j366943k080823k427416j621747N55065K788989L167484J538074
$$ 3495996 2665029 1298086 -782737 -3210153 -4831900 -4276835 -1487846 1679638 3217712
5109C217712j05989k12425L83538Q459j241199j801436j216739q45642j541692
$$ 3217712 3111723 2899298 3282836 3291295 2050096 248660 -968079 -1813721 -3355413
5100c355413j990848n63465J914847K862074J459910j42013J65558J668300K238433
$$ -3355413 -5346261 -5909726 -3994879 -1132805 327105 185092 350650 2018950 4257383
5091D257383J365199J76036p87832j895398k739308k065604K06772K345328K678961
$$ 4257383 5622582 5798618 5010786 3115388 376080 -1689524 -1482752 862576 3541537
5082C541537J135987j174187k807892k462082L4964K986151M207262L278668J536047
$$ 3541537 4677524 3503337 695445 -1766637 -1731673 1254478 5461740 8740408 10276455
5073A0276455K08710k38797L94530J458765R97545j931946m902996m609937j586280
$$ 10276455 10485165 10246368 10640898 12099663 13097208 11165262 6262266 1652329 66049
5064F6049L34690n58981k013337k004048j550966j987708k347248j371845J48655
$$ 66049 400739 -158242 -2171579 -4175627 -5726593 -7714301 -10061549 -11433394 -11284739
5055a1284739R60941J433478K313770L007280K707494J854448J094678J17084
$$ -11284739 -10323798 -8890320 -6576550 -3569270 -861776 992672 2087350 2204434
5047B204434j274651k209263j918296p59697N23494J364616J090026k97154j191845
$$ 2204434 929783 -1279480 -3197776 -3957473 -3433979 -2069363 -979337 -1276491 -2468336
5038b468336l02671Q85340K33522r66579L63006L415476L829070N38944k190895
$$ -2468336 -2771007 -1885667 -1652145 -2618724 -2255718 1159758 4988828 5527772 3336877
5029C336877j200464J360568K238858J374160k27688k837395n682273o144461
$$ 3336877 2136413 3496981 5735839 7109999 6882311 4044916 -1637357 -7781818
5021g781818l841845j747804r95904R93139M637721N650656K024727j591482j036426
$$ -7781818 -11623663 -13371467 -14367371 -13374232 -8736511 -3085855 -1061128 -2652610 -3689036
5012c689036P25046o54054l115920k271076N88291J187192K1630O60264K560500
$$ -3689036 -2963990 -3618044 -6733964 -9005040 -8416749 -7229557 -7207927 -6547663 -3987163
5003c987163K353394O35324P30313J807719J4335l924363m786856r69114L180791
$$ -3987163 -1633769 -998445 -268132 1539587 1553922 -2370441 -7157297 -8126411 -4945620
4994d945620L777262J330045j903176l916630k541097K255566N926158L918950
$$ -4945620 -1168358 161687 -1741489 -5658119 -8199216 -5943650 -17492 3901458
4986C901458j622994m380640k484590K97275J307994J474918J218212n50943k852835
$$ 3901458 2278464 -2102176 -4586766 -4289491 -2981497 -1506579 -288367 -839310 -3692145
4977c692145l024136j199988l7934m613O68517J801530J722704J214404K057875
$$ -3692145 -6716281 -7916269 -7954203 -7958816 -7290299 -5488769 -3766065 -2551661 -493786
4968d93786K611540L06602k539892j616602J509056J299775k204200l123931L12271
$$ -493786 2117754 2424356 -115536 -1732138 -223082 1076693 -1127507 -4251438 -3939167
4959c939167K992201J673968m88867l83547M67865K60761K12922J028499R52242
$$ -3939167 -946966 727002 238135 -145412 322453 583214 796136 1824635 2776877
4950B776877n89655j740992j807033j810000j229646R43473K315105M9258k860047
$$ 2776877 2187222 446230 -1360803 -3170803 -4400449 -3456976 -1141871 -1092613 -3952660
4941c952660j052003L805166M678374M17579k806311k069429j126235j824088
$$ -3952660 -5004663 -1199497 3478877 3896456 1090145 -979284 -2105519 -3929607
4933c929607q92661K381934L729530J773278K98349L66554j441294m689149m108354
$$ -3929607 -4822268 -2440334 1289196 3062474 3360823 3727377 2286083 -2403066 -6511420
4924f511420K78072J511784k451679m798406j568107K301249K733028K476682
$$ -6511420 -6233348 -4721564 -7173243 -11971649 -13539756 -11238507 -8505479 -6028797
4916f028797K904766J30774n532726o618304q62294L593466J397805j836076p89241
$$ -6028797 -3124031 -2993257 -8525983 -15144287 -16006581 -12413115 -11015310 -12851386 -13640627
4907a3640627P92151n68557q30544K027164K144239k656660m569328N77447M798325
$$ -13640627 -12848476 -13417033 -14247577 -12220413 -10076174 -12732834 -17302162 -16724715 -11926390
4898a1926390J893615j865511m18084R88387k390725m476943p92172J699597j555267
$$ -11926390 -10032775 -11898286 -12316370 -11327983 -13718708 -18195651 -18987823 -17288226 -18843493
4889a8843493k877144J786920K697196m803915q541841j748622K238260m772611
$$ -18843493 -21720637 -19933717 -17236521 -22040436 -30582277 -32330899 -30092639 -34865250
4881c4865250p742926K560506O895104q060293j8982760n917376M805460j2492746
$$ -34865250 -42608176 -40047670 -33152566 -41212859 -60195619 -66112995 -61307535 -73800281
4873g3800281j7246404M7155209J43295361J58787564N6962602o2255026r0955464
$$ -73800281 -91046685 -43891476 99403885 258191449 315154051 252899025 161943561
4866A61943561m3320774o932769j3604761k4027587j3340841k621101p681843
$$ 161943561 118622787 111690018 98085257 74057670 60716829 58095728 50413885
4859E0413885j3162588p411382j723621l711344l679138K624702M612387j224511
$$ 50413885 37251297 29839915 28116294 24404950 20725812 23350514 27962901 26738390
4851B6738390l615050J701180M026908j361471m483321o6677L081714l96834k957788
$$ 26738390 23123340 24824520 28851428 27489957 23006636 22939959 26021673 25624839 22667051
4842B2667051j2214J013201m164203p261678k090102M258643L741687k68251j304620
$$ 22667051 22654837 23668038 19503835 12242157 10152055 14410698 18152385 17884134 16579514
4833A6579514n95531j518578j878157O95330K737223Q39644k464627l653171l256988
$$ 16579514 15983983 14465405 12587248 13282578 16019801 16859445 14394818 10741647 7484659
4824G484659k347324j41355K070448J174538j398032o76479K804354L054857n60627
$$ 7484659 5137335 4995980 7066428 8240966 6842934 6166455 8970809 12025666 11465039
4815A1465039j712023J286365K150466j492179l033567J191515M470265O61544
$$ 11465039 9753016 11039381 13189847 11697668 8664101 9855616 14325881 14987425
4807A4987425n548162o283684j828620K165669L274894K334882p9201k203250
$$ 14987425 9439263 3155579 1326959 3492628 6767522 9102404 9023203 6819953
4799F819953j037025K077059J337650m102656o949826k586017L517901M600105
$$ 6819953 5782928 7859987 9197637 5094981 -1854845 -4440862 -922961 3677144
4791C677144K375370J778725J890733p18664m196794m234071j490651J78387K02603
$$ 3677144 6052514 7831239 9721972 9003308 4806514 572443 -918208 -739821 -537218
4782e37218L84784K90089j059411j531866Q40622L345439K316427q25346j884564
$$ -537218 -152434 137655 -921756 -2453622 -1613000 1732439 4048866 3223520 1338956
4773A338956j47369J913146L002657L102821J523386j327287k622428j109753
$$ 1338956 1191587 3104733 6107390 9210211 10733597 9406310 6783882 5674129
4765E674129K86317p63200j923490o34206J055890M53494o05045N75941K119134
$$ 5674129 5960446 5197246 3273756 2639550 3695440 4148934 3543889 4119830 6238964
4756F238964J108096n98944J94634J576005k81413l630044l391083L52675K512431
$$ 6238964 7347060 6748116 6942750 8518755 8237342 4607298 1216215 1568890 4081321
4747D081321J170207m56978l12825m3672n69427k67733J274663K009998J051868
$$ 4081321 5251528 4794550 4481725 4438053 3868626 3600893 4875556 6885554 7937422
4738G937422q1639o10064j435275k314531j476881J068706K761234J896547m66020
$$ 7937422 7855783 7245719 5810444 3495913 2019032 3087738 5848972 7745519 7279499
4729G279499k378870k724086j149184J580651L410963L114890J914129J158237
$$ 7279499 4900629 2176543 1027359 2608010 6018973 9133863 11047992 12206229
4721A2206229j10793k753961m506342k821261N95720J933116J020218Q86263K196248
$$ 12206229 12095436 9341475 4835133 2013872 2609592 4542708 5562926 6449189 8645437
4712H645437K506195J097031J47015L81945l01260k609419l940189k386333L02743
$$ 8645437 11151632 12248663 12395678 12777623 12476363 9866944 5926755 3540422 3843165
4703C843165J449712P78827m01273j253821j357121l46143J295662K419067K675691
$$ 3843165 5292877 6071704 5670431 4416610 3059489 2713346 4009008 6428075 9103766
4694I103766K464227J552199l66116j990055j694512m59373q11580k600915k846889
$$ 9103766 11567993 13120192 12754076 10764021 9069509 8610136 7798556 5197641 2350752
4685B350752n68661J344527N64051j170593j026801O28391J287749K19730j040275
$$ 2350752 1782091 3126618 3690669 2520076 1493275 2121666 3409415 3629145 2588870
4676B588870j352584r87999k55453R28241J813075Q32999k157728m601352l589089
$$ 2588870 1236286 248287 -7166 921075 2734150 3567149 1409421 -3191931 -6781020
4667f781020M67796L776431L443252P21961j179943j391598j380704j383726R5013
$$ -6781020 -6313224 -2536793 906459 1628420 448477 -943121 -2323825 -3707551 -3612538
4658c612538K741026L603190J372289j253220j476142k15363K77031K27188R44034
$$ -3612538 -871512 2731678 4103967 2850747 1374605 1159242 1436273 1663461 2607495
4649B607495J626174P67121o98948q32910j08999k85611r45871l85893R93568
$$ 2607495 4233669 5000790 4301842 3468932 3359933 3074322 2128451 1742558 2736126
4640B736126J478871J309621J690905J532442q17473l309145k313072J009569
$$ 2736126 4214997 5524618 7215523 8747965 7930492 4621347 2308275 3317844
4632C317844J489253j978229m292215k139438P64462k25750l315686l382670n652
$$ 3317844 4807097 2828868 -1463347 -3602785 -2838323 -3064073 -6379759 -9762429 -9768081
4623i768081K344909J380195j23933P13686K493115K107172k93242j537306l38183
$$ -9768081 -7423172 -6042977 -6166910 -5453224 -2960109 -852937 -1146179 -2683485 -3021668
4614c021668O28820j097993l443497k402539J722843M251718K982047J225191
$$ -3021668 -2392848 -3490841 -6934338 -9336877 -7614034 -3362316 -380269 844922
4606H44922J895567K496365k58614l965855l647849M26781L290742K856339J664170
$$ 844922 2740489 5236854 4978240 1012385 -2635464 -2208683 1082059 3938398 5602568
4597E602568J215944J21627j319678k67156L104992M288236J192823k294885k407973
$$ 5602568 6818512 6940139 5620461 5353305 8458297 12746533 13939356 11644471 9236498
4588I236498j006529j549863l131574k522421L46140K808226L670530L591321
$$ 9236498 8229969 6680106 3548532 1026111 1372251 4180477 7851007 11442328
4580A1442328K592390L05887k201699l418334l414783k963495j871025j01560
$$ 11442328 14034718 14340605 12138906 8720572 5305789 2342294 471269 369709
4572C69709R10637K05621p67686k47734J037537J151995j07209j339214j510110
$$ 369709 1280346 1485967 718281 470547 1508084 2660079 2552870 1213656 -296454
4563b96454m04172J501194K542381J241738q20060k88196K501586L048213j28368
$$ -296454 -700626 800568 3342949 4584687 3764627 3476431 5978017 9026230 8897862
4554H897862k257442J4730K253647q59202n842090m877982J703945N294583J847328
$$ 8897862 6640420 6655150 8908797 8049595 2207505 -2670477 -966532 4328051 6175379
4545F175379k682179k113583J259467J625491j480428l754650k728414J51847
$$ 6175379 3493200 1379617 2639084 4264575 2784147 -970503 -3698917 -3547070
4537c547070K484995L023669J868781M75890L78176R04031P530j881668j672686
$$ -3547070 -1062075 1961594 3830375 4306265 4684441 5588472 5596002 3714334 2041648
4528B041648J336973L506000K266430L17589J178277L232960K282012j610486
$$ 2041648 3378621 6884621 9151051 9468640 10646917 13879877 16161889 14551403
4520A4551403m155265l200471j040535j74937m26574j057244k431673m155367
$$ 14551403 10396138 7195667 6155132 5980195 5553621 4496377 2064704 -2090663
4512b090663m204667j677162J438857K851064K832863K934264L100538J979373
$$ -2090663 -6295330 -7972492 -6533635 -3682571 -849708 2084556 5185094 7164467
4504G164467m40114k298326k189755q04480K32554L77944L15099M26052J28657
$$ 7164467 6724353 4426027 2236272 1431792 1664346 2042290 2357389 2783441 2912098
4495B912098p81693j005332P02660L041525L046232J74336k270947j300466J646397
$$ 2912098 2130405 1125073 1827733 4869258 7915490 8089826 5818879 4518413 6164810
4486F164810K835484J444373P909K5029R9349r15929j690860q14442O19996N80199
$$ 6164810 9000294 10444667 10452576 10477605 10576954 9661025 7970165 7155723 7775719 8355918
4476H355918j029257k523068k510273p61901J871856L446875K168419j240432
$$ 8355918 7326661 4803593 2293320 1531419 3403275 6850150 9018569 7778137
4468G778137l774211l790069k709003j896505k47310K912750M882817K902377
$$ 7778137 4003926 213857 -2495146 -4391651 -4638961 -1726211 3156606 6058983
4460F058983j041953k430828n62769J018500K44902j152588j396480r45673j86471
$$ 6058983 5017030 2586202 2023433 3041933 3286835 2134247 737767 -207906 -394377
4451c94377J487732L127675K408140k00997j204514K28343N21184j848495k737595
$$ -394377 1093355 4221030 6629170 6428173 5223659 5452002 5973186 4124691 1387096
4442A387096Q03099M294092K120514k862878k841626K830795O157066K286052
$$ 1387096 2190195 6484287 8604801 5741923 2900297 5731092 11888158 14174210
4434A4174210l716734m756647j158639J699716J445324r8530j543816l124969
$$ 14174210 10457476 5700829 4542190 6241906 7687230 7588700 6044884 2919915
4426B919915l869332j722579K694219N424390L736736l83888k728194j834723
$$ 2919915 -949417 -2671996 22223 5446613 9183349 8799461 6071267 4236544
4418D236544l4071J21741j053379j499016n44048N14096P93161J109652K169022
$$ 4236544 4202473 4324214 3270835 1771819 1227771 1741867 2535028 3644680 5813702
4409E813702K941323K159547L96376q76781j488969k116015k298682j000554J018301
$$ 5813702 8755025 10914572 11310948 10434167 8945198 6829183 4530501 3529947 4548248
4400D548248J502734k81497k573338l502112k840086j135356J089036K749585
$$ 4548248 6050982 5769485 3196147 -305965 -3146051 -4281407 -3192371 -442786
4392d42786K564921P96949p37549r86017o82119p07930r92007j368397j704892
$$ -442786 2122135 2919084 2181535 1195518 513399 -194531 -1186538 -2554935 -4259827
4383d259827p99894K512676O289197O216828J290471l620278l519945Q5136J460053
$$ -4259827 -5059721 -2547045 3742152 9958980 11249451 7629173 4109228 4194364 5654417
4374E654417j275003l845532k140928K249277M548554K921900p5697j424198q76052
$$ 5654417 4379414 533882 -1607046 642231 5190785 8112685 8036988 6612790 5736738
4365E736738M9247N81635R54903R87412P9972j247495j398288q7407O67236o84298
$$ 5736738 5785985 6367620 7322523 8309935 8389907 7142412 5744124 5656717 6323953 5639655
4355E639655k477993j759257J430963L785282L046327O26124r49860j465197k302798
$$ 5639655 3161662 1402405 2833368 6618650 9664977 10291101 9341241 7876044 5573246
4346E573246l309068k391242J347821N373367N839872J920654k984929m993709
$$ 5573246 2264178 -127064 1220757 6594124 12433996 14354650 11369721 6376012
4338F376012l841552k058840q99121N96070K477807K867493J348257M55882J561153
$$ 6376012 2534460 475620 -423501 172569 2650376 5517869 6866126 7322008 8883161
4329H883161J961359q29647m176095l648398J92124K667661J996098R60783J502595
$$ 8883161 10844520 10014873 5838778 2190380 2382504 5050165 7046263 8007046 9509641
4320I509641K130610J560300P66952J39628j547994l791958l671695m04717K671773
$$ 9509641 11640251 13200551 13967503 14107131 12559137 8767179 5095484 4690767 7362540
4311G362540K608613M20352j475573k285302j693299Q15422L462023K626350j681235
$$ 7362540 9971153 10391505 8915932 6630630 4937331 5752753 9214776 11841126 10159891
4302A0159891m358844k199610J126894O17128k723441m200287k496008K8161K093349
$$ 10159891 5801047 3601437 4728331 5345459 2622018 -1578269 -4074277 -4046116 -1952767
4293a952767L882167L989834Q60867l090102l320646M76373L700521L180166P20235
$$ -1952767 1929400 5919234 6780101 3689999 369353 845726 4546247 7726413 8446648
4284H446648o26874o75257r21057j546862j502609n38074K88953L7163p92688
$$ 8446648 7819774 7144517 6223460 4676598 3173989 2635915 2924868 2962031 2169343
4275B169343p39100N79743J569931R59678K31841J468775L159442J607974k805370
$$ 2169343 1430243 2009986 3579917 4539595 4771436 6240211 9399653 11007627 8202257
4266H202257m807859j663382K448071K434009p47169k720973k348700j601838
$$ 8202257 3394398 1731016 4179087 6613096 5865927 3144954 796254 -805584
4258h05584j039889K10545J425693J304583Q79973J735147K636649J668685K30184
$$ -805584 -1845473 -1634928 -209235 1095348 1975321 3710468 6347117 8015802 8245986
4249H245986Q17874K244705J573233l36310j43536J748933J511798j472190l460459
$$ 8245986 9063860 11308565 12881798 12545488 12401952 14150885 15662683 14190493 10730034
4240A0730034k615926j467398j729882j338660J194173L388851K440136n11139
$$ 10730034 8114108 6646710 4916828 3578168 4772341 8161192 10601328 10090189
4232A0090189k238417j690638l74309K34167O4112j43209K4278P58q88018j689934
$$ 10090189 7851772 6161134 5786825 6020992 6085104 5941895 5966173 5966931 5078913 3388979
4222C388979m93112K259597L337754J320407r37004q45478j69412j231952k094634
$$ 3388979 2895867 5155464 8493218 9813625 8876621 8031143 7861731 6629779 4535145
4213D535145m8415K687322K203771N076Q35913M320139N078560J343115k600588
$$ 4535145 4486730 7174052 9377823 9382899 10218812 14538951 19617511 20960626 18360038
4204A8360038l486593l013836l341215l657747k948802j964784r69212P95223
$$ 18360038 14873445 11859609 8518394 4860647 1911845 -52939 -1022151 -226928
4196b26928K483207K102095J21902r20541m58363J27691R31794K633010L139163
$$ -226928 2256279 4358374 4480276 3559735 3101372 3229063 4160857 6793867 9933030
4187I933030K28402l248521k453739J717043L958961L017541K306343K558041
$$ 9933030 10161432 6912911 4459172 6176215 10135176 13152717 15459060 18017101
4179A8017101J125020j366538j376501Q1625j591597n361584m967104K7865K684292
$$ 18017101 19142121 17775583 16399082 16480707 14889110 9527526 4560422 4588287 7272579
4170G272579M05422j114367J297931K905974M93899j730887k75905J721207J191225
$$ 7272579 7678001 6563634 7861565 10767539 11261438 9530551 9254646 10975853 12167078
4161A2167078J35979J37583m29960q08875J948463N015807K136730m094234m272357
$$ 12167078 12303057 12440640 12010680 11201805 13150268 18166075 20302805 16208571 11936214
4152A1936214J373202K844252o74182R35794P360482N707235l147649p68129J4786416
$$ 11936214 13309416 16153668 15479486 16415280 23775762 29482997 26335348 25567219 40353635
4143D0353635K0231437J1268372K1744267O5132128Q7734478L1323244p1942480
$$ 40353635 60585072 71853444 93597711 158729839 246464317 277787561 205845081
4136B05845081j24386711q5849327j8096531P963878k819431o150310N859846
$$ 205845081 81458370 -4390957 -22487488 -14523610 -17343041 -23493351 -17633505
4129a7633505Q724984j343758m268948L768724N555216l414822p781136r57264
$$ -17633505 -8908521 -10252279 -14521227 -10752503 -5197287 -8612109 -16393245 -17350509
4121a7350509N117108K926446K04875K586714L923287l4458l523946k284889n61226
$$ -17350509 -12233401 -9306955 -9102080 -6515366 -2592079 -2626537 -6150483 -8435372 -8996598
4112h996598j403771j070862K175006L676931J276684l46828J568470K906273
$$ -8996598 -10400369 -11471231 -9296225 -5619294 -4342610 -4689438 -3120968 -214695
4104b14695N09834k371894k428038j579916k194419k638949r91577J523389L315347
$$ -214695 295139 -2076755 -4504793 -6084709 -8279128 -10918077 -11909654 -10386265 -7070918
4095g070918M369092L974630J115317j998118j853076K71484k50258l259170l558745
$$ -7070918 -2701826 1272804 2388121 390003 -1463073 -1191589 -1441847 -4701017 -8259762
4086h259762l8984J901923n33386k759441o26699K947771L323710J150927k74374
$$ -8259762 -8298746 -6396823 -6930209 -9689650 -10316349 -7368578 -4044868 -2893941 -3168315
4077c168315n39394p08443J66635K818921M641080K822566j117286l195816j975008
$$ -3168315 -3707709 -4416152 -4249517 -1430596 3210484 6033050 4915764 1719948 -255060
4068b55060P63282K780472K720371M29421k122738k050729N93964K226483O79887
$$ -255060 508222 3288694 6009065 6438486 4315748 2265019 2858983 5085466 5765353
4059E765353j655875j736679m06882k83245j119217n10652J839725L576104L060086
$$ 5765353 4109478 2372799 1965917 1682672 563455 52803 1892528 5468632 8528718
4050H528718Q85000j770622m128098n094902l604297l55628K080006J755084n54670
$$ 8528718 9413718 7643096 3514998 -1579904 -5184201 -5539829 -3459823 -1704739 -2259409
4041b259409k304957k032941p00902J8770J30457Q50390J887451J116648j915961
$$ -2259409 -4564366 -6597307 -7298209 -7279439 -7148982 -6298592 -4411141 -3294493 -5210454
4032e210454l946712j618801L734297P234852O141837K346746o98667j509031
$$ -5210454 -9157166 -10775967 -7041670 193182 6335019 8681765 7983098 6474067
4024F474067q35084k57583r51423k532323l018700j123994J676330K732534J477775
$$ 6474067 5638983 5381400 4429977 1897654 -1121046 -2245040 -568710 2163824 3641599
4015C641599m04135j535667j814365j316470j99988N39933L5195r93567j323937
$$ 3641599 3237464 1701797 -112568 -1429038 -1629026 -1089093 -1053898 -2047465 -3371402
4006c371402j115293r96778l80415J112430J817185L94168j204935m53103J200316
$$ -3371402 -4486695 -5483473 -5863888 -4751458 -2934273 -2540105 -3745040 -4198143 -2997827
3997b997827M75414j833019j802768Q22038J969966K56922p07061J083846K450662
$$ -2997827 -2522413 -4355432 -6158200 -5336162 -3366196 -3109274 -3816335 -2732489 -281827
3988b81827J062627J13176K743525N745275L932259j659444n109781l977616j517056
$$ -281827 780800 893976 3637501 9382776 13315035 11655591 6545810 2568194 1051138
3979A051138p22336n36823J055520L418106M224213K281691j449388m532351m607754
$$ 1051138 328802 -208021 847499 4265605 8489818 10771509 9322121 4789770 182016
3970A82016j467038K373408M056792L017031N37656k189068m160358l944572j232474
$$ 182016 -1285022 1088386 5145178 8162209 8699865 6510797 2350439 -1594133 -2826607
3961b826607J439869Q92343k496754m818617l493489l12631J417575J267793J488958
$$ -2826607 -1386738 -494395 -2991149 -7809766 -11303255 -11615886 -10198311 -8930518 -7441560
3952g441560L001331L659144J436052j999172k795665L4953L087856L043074Q58074
$$ -7441560 -4440229 -781085 654967 -1344205 -4139870 -4104917 -1017061 2026013 2884087
3943B884087l20527O1654M668q54842l42194K312529M458542L396928j68126l385758
$$ 2884087 2563560 2625214 2629882 1775040 1432846 3745375 8203917 11600845 11432719 8046961
3933H046961m426740l342406j337677k43846j189478k816267k401302L64102K596587
$$ 8046961 3620221 277815 -1059862 -1303708 -2493186 -5309453 -7710755 -7346653 -4750066
3924d750066K273420R26248Q14235J573846J648299J149825J033412R69417L60707
$$ -4750066 -2476646 -1550398 -736163 837683 2485982 3635807 4669219 5638636 5999343
3915E999343J11483R79760J446388j17787k204835k032284o0133M52227j545404
$$ 5999343 6110826 7090586 8536974 8419187 6214352 4182068 4121935 4574162 3028758
3906C028758l258032k084576J054528L255430K710720k89633l714652m732109
$$ 3028758 -229274 -2313850 -1259322 1996108 4706828 4417195 702543 -4029566
3898d029566k134357J622312K642038M86759j161320K93858K694779K500300P6336
$$ -4029566 -6163923 -4541611 -1899573 -1412814 -2574134 -2280276 414503 2914803 2991139
3889B991139j002509P00194K583209J976511k69378j502487j002057j74833J27996
$$ 2991139 1988630 2688824 5272033 7248544 6979166 5476679 4474622 4299789 4427785
3880D427785L99166O96171K24387p79064q66540j16729p93731l464538m722511
$$ 4427785 4826951 5523122 5747509 4968445 4101905 3985176 3191445 -273093 -4995604
3871d995604j706332K789435L542762N02034j228796O55814K450116Q93534j656409
$$ -4995604 -6701936 -3912501 -369739 132295 -1096501 -440687 2009429 2902963 1246554
3862A246554j539205L88433J081825P12174J409704K385668R46819k226241l228183
$$ 1246554 -292651 95782 1177607 1889781 3299485 5685153 6631972 4405731 1177548
3853A177548p30217K125020K434831Q74941p44039k244837l741509l842904j331202
$$ 1177548 447331 2572351 5007182 5882123 5138084 2893247 -848262 -4691166 -6022368
3844f022368K342056L829905J194092l794580o594607m032431J624983M152912
$$ -6022368 -3680312 149593 1343685 -2450895 -9045502 -13077933 -11452950 -7300038
3836g300038P60073l542033j968767M655834Q611591N614112Q945k059232n58959
$$ -7300038 -6539965 -10081998 -12050765 -7394931 1216660 6830772 6839717 4780485 4221526
3827D221526M73961j25012J06852K193478L716978K327805j188634m060442m350668
$$ 4221526 4695487 4570475 4677327 6870805 10587783 12915588 11726954 7666512 3315844
3818C315844k304643J18785R46005M1200j020537j309107j700417k765359k926821
$$ 3315844 1011201 1129986 2075991 2117191 1096654 -212453 -1912870 -4678229 -7605050
3809g605050o13771K654735L728272K209902R27439J529711K072636L93846k091356
$$ -7605050 -8218821 -5564086 -1835814 374088 1301527 2831238 4903874 5297720 3206364
3800C206364k194167L22028K146368P57998k432589m033722k584429L72759K344338
$$ 3206364 1012197 1334225 3480593 4238591 1806002 -2227720 -4812149 -4439390 -2095052
3791b095052K058412P2939j773138j659840N59654K940846L381256J940568M61460
$$ -2095052 -36640 36299 -1736839 -3396679 -2837025 103821 3485077 5425645 5887105
3782E887105K37j78817q00972j202220o91152j54765q53586k118335j820169O47047
$$ 5887105 5887342 5708525 4907553 3705333 3014181 2859416 2005830 -112505 -1932674 -1285627
3772a285627L074726K832713L5376k367989j777566J074346K795411J234274j879475
$$ -1285627 1789099 4621812 4657188 2289199 511633 1585979 4381390 5615664 3736189
3763C736189l058912j395250O71372R15841k04861j276457k053617k469346j447921
$$ 3736189 677277 -717973 -46601 869240 664379 -612078 -2665695 -5135041 -6582962
3754f582962J180188L036504K008011k33049k78973J937207L084115J489595q14193
$$ -6582962 -5402774 -2366270 -358259 -591308 -870281 1066926 4151041 5640636 4826443
3745D826443j730664j746348j674964n84211K029837M122342L417308N46678j980454
$$ 4826443 3095779 1349431 -325533 -909744 1120093 5242435 8659743 9206421 7225967
3736G225967k793721k012203Q5456K760701M187955L181106R53703n44134j265745
$$ 7225967 4432246 2420043 2505499 5266200 9454155 12635261 13588964 13044830 11779085
3727A1779085k258354l167877k835535j776050j539989j818904q23895J282472
$$ 11779085 9520731 6352854 3517319 1741269 201280 -1617624 -2441519 -1159047
3719a159047K096962Q12396l52989K43989J183734P73949k4904K48974M08182
$$ -1159047 937915 1750311 1397322 1641311 2825045 3598994 3574090 3823064 4231246
3710D231246j450418l928854l490084K75213L416897K614942o89482k441625r26426
$$ 4231246 2780828 -1148026 -4638110 -4362897 -946000 1668942 979460 -1462165 -2388591
3701b388591J712621K298920O6018k584081k582725L03014K874734K163217r28805
$$ -2388591 -675970 1622950 1688968 -895113 -3477838 -3174824 -300090 1863127 934322
3692I34322k974871k419107o24875J174757L202073M768160L620274m92405m061194
$$ 934322 -2040549 -4459656 -5084531 -3909774 -707701 4060459 7680733 7188328 3127134
3683C127134m057046k019333j198105j303991M15111L686460M738232J883325
$$ 3127134 -929912 -2949245 -4147350 -5451341 -5036230 -1349770 3388462 5271787
3675E271787j779130k636561j035429J87142j28702n95308J98094J666909J822584
$$ 5271787 3492657 856096 -179333 7809 -120893 -716201 -518107 1148802 2971386
3666B971386k93659k809137k629292L79708K385148N81180k493096k528709Q7028
$$ 2971386 2677727 -131410 -2760702 -2380994 4154 585334 -1907762 -4436471 -4349443
3657d349443J411855Q80520K033680N518146O677545K607576k900377m767744
$$ -4349443 -2937588 -2057068 -23388 5494758 12172303 14779879 11879502 7111758
3649G111758l315464j983385j592695q89143k47799o42194q07899N61792J463783
$$ 7111758 3796294 1812909 220214 -668929 -916728 -1558922 -2366821 -1805029 -341246
3640c41246n20721l440371l302555j22407K536462L186168L268202L014267J046748
$$ -341246 -861967 -4302338 -7604893 -7727300 -5190838 -2004670 1263532 4277799 5324547
3631E324547j817614k686213j020817P74905J447409J900726K093298R02030p75240
$$ 5324547 3506933 820720 -200097 574808 2022217 3922943 6016241 6918271 6143031
3622F143031q95834l78570j892723m370770l795777j26300K099798J387753J565446
$$ 6143031 5247197 4868627 2975904 -1394866 -5190643 -5316943 -3217145 -1829392 -263946
3613b63946M215822N015803J189572l090188l303082j604750k053436l168102
$$ -263946 3951876 8967679 10157251 7067063 3763981 2159231 105795 -3062307
3605c062307j251252K146931K530077K16100m67086J313654K110342N27927j205745
$$ -3062307 -4313559 -2166628 363449 579549 112463 1426117 3536459 4064386 2858641
3596B858641k103874l560114n041896l747380J52639K481117J024297j281568
$$ 2858641 754767 -2805347 -7847243 -11594623 -11441984 -8960867 -7936570 -9218138
3588i218138r85042J337556L033157L027405J716071l33083j853941j213811J167336
$$ -9218138 -10203180 -8865624 -5832467 -2805062 -1088991 -1422074 -3276015 -4489826 -3322490
3579c322490K643271J851521M01396r3013l46527j216330j493497l6797J655466
$$ -3322490 -679219 1172302 1573698 1480685 1134158 -82172 -1575669 -1612466 43000
3570D3000J417338j81317q04888j06607p0014j447512k082141O5814L510118M539473
$$ 43000 1460338 1279021 474133 367526 297512 -1150000 -3232141 -3166327 343791 4883264
3560D883264J899433j364223j781790q0735J16793k017691l005156m73358K793546
$$ 4883264 6782697 5418474 3636684 3555949 3672742 1655051 -1350105 -1823463 970083
3551I70083K893287P01381O5461J345388J111081j658835l546281k207003O2936
$$ 970083 3863370 4564751 4630212 5975600 7086681 5427846 1881565 -325438 -262502
3542b62502M97766K11684J403860K805697J548361j700844l012331n57581L029742
$$ -262502 235264 446948 1850808 4656505 6204866 4504022 1491691 934110 3963852
3533C963852M145460K184811n17259j440735j29548J603967J651843J31940o76568
$$ 3963852 8109312 10294123 9776864 8336129 8206581 9810548 11462391 11594331 10917763
3524A0917763N22543K065825J677586k90573j714520k017981k406946k950290
$$ 10917763 11440306 13506131 15183717 14893144 13178624 11160643 8753697 5803407
3516E803407j958235R01239L051242K156554o17371k325394k294839k306136l004316
$$ 5803407 3845172 4746411 7797653 9954207 9336836 7011442 4716603 2410467 -593849
3507e93849k682711n90909Q61413n63262k748075j472475L085161N455332K181380
$$ -593849 -3276560 -3867469 -3006056 -3569318 -6317393 -7789868 -4704707 750625 2932005
3498B932005k838344l407639L36767K465226K15589k182611m42161L096002L355619
$$ 2932005 93661 -3313978 -2977211 -511985 -296396 -2479007 -2921168 174834 3530453
3489C530453N18343o09191J444281K492764k89451l424131k361769J346182K342847
$$ 3530453 4048796 3439605 4883886 7376650 7087199 3663068 1301299 2647481 4990328
3480D990328l95967k392243j005512P05677l97771k101605q64698J468401J50905
$$ 4990328 4594361 2202118 1196606 1902283 1504512 -597093 -1461791 6610 157515
3471A57515m048521m622731R30154O278578M713333j293923l790217o28123K394794
$$ 157515 -3891006 -8513737 -7583583 -1305005 3408328 2114405 -1675812 -2303935 90859
3462I0859P68555k595369k597645O09923K750464J796367k80687j337397j431787
$$ 90859 859414 -1735955 -4333600 -3723677 -973213 823154 542467 -794930 -2226717
3453b226717j115466n4872J563109K217086J175181J78119J256214L522926M065876
$$ -2226717 -3342183 -3397055 -1833946 383140 1558321 1736440 2992654 6515580 10581456
3444A0581456K017612k51956o57510j49052n07831j085554n5210J965876K280385
$$ 10581456 12599068 12347112 11689602 11540550 11032719 9947165 9891955 11857831 14138216
3435A4138216J92545j830461j762436n21303Q6138j89062q04990j599760j870946
$$ 14138216 14330761 12500300 10737864 10216561 10302699 10113637 9308647 7708887 5837941
3426E837941l92455K051427K378594m79229l205500k662685o98430j026056l022585
$$ 5837941 5445486 7496913 9875507 9396278 6190778 3528093 2829663 1803607 -1218978
3417a218978k831077O4579J888071O60307r91983n03897Q02668N73999p94159
$$ -1218978 -4050055 -3985476 -2097405 -1437098 -2429081 -2932978 -2130310 -1556311 -2350470
3408b350470j502672j285229p47304N22887K899605M892374M481991J777040j161560
$$ -2350470 -3853142 -5138371 -5885675 -5362788 -2463183 2429191 6911182 8688222 7526662
3399G526662k680600k559692j267028N55524K028445K341860J326148k90302j034392
$$ 7526662 4846062 2286370 1019342 1574866 3603311 5945171 7271319 6981017 5946625
3390E946625K98600K879120L761220J115520k898058m445609k988776j549417
$$ 5946625 6245225 9124345 12885565 14001085 11103027 6657418 3668642 2119225
3382B119225j840045k006766l15365J663996J535690k22587j254504p91200m2941
$$ 2119225 279180 -1727586 -2042951 -378955 1156735 934148 -320356 -1111556 -1154497
3373a154497J65208K60450N73684N44794l97227j695998j712873O49620M000185
$$ -1154497 -989289 -728839 -155155 389639 -7588 -1703586 -3416459 -2766839 1233346
3364A233346N091516K625911o08364j338700m45581j085802k922290k256126J575887
$$ 1233346 6324862 8950773 8342409 7003709 6558128 5472326 2550036 293910 1869797
3355A869797M231547K578351q96155k324222j807401j600508j696881n48471J643871
$$ 1869797 6101344 8679695 7783540 5459318 3651917 2051409 354528 -193943 1449928
3346A449928L340357L980264L562986J630468j058522j872923R6473J818645M52938
$$ 1449928 4790285 8770549 12333535 13964003 12905481 11032558 11129031 12947676 13400614
3337A3400614k364426l334128k446157j731728j115677N97881K221671J767804
$$ 13400614 11036188 7702060 5255903 3524175 2408498 3006379 5228050 6995854
3329F995854L44303M41196J415118Q41061o61438m71803Q94442N07217j414625
$$ 6995854 7340157 7781353 9196471 10037532 9376094 8904291 9798733 10305950 8891325
3320H891325j637749K49430J198450L98710L72955J436964N94947k316423k976706
$$ 8891325 7253576 7503006 8701456 9100166 9473121 10910085 11505032 9188609 6211903
3311F211903K53812K786054R53209j988424j319993J509904J593075j693555m458374
$$ 6211903 6465715 9251769 10204978 8216554 6896561 8406465 9999540 8305985 3847611
3302C847611m326551k497746o58138O40092J143863J227662K178607L869696L752916
$$ 3847611 -478940 -2976686 -3634824 -2994732 -1850869 -623207 1555400 5425096 9178012
3293I178012P28500k066377j583670J48074o01545k747813k194303Q57934J994588
$$ 9178012 9906512 7840135 6256465 6404539 5802994 3055181 860878 1718812 3713400
3284C713400J80094n17230J706920K931780L36818k493080j329114J446353N65996
$$ 3713400 3893494 3376264 5083184 8014964 8351782 5858702 4529588 5975941 6541937
3275F541937l403250m767897j632321J435876Q18801r66942r4709K314154K398239
$$ 6541937 3138687 -1629210 -3261531 -1825655 -1006854 -1973796 -2068505 245649 2643888
3266B643888j56748j966180j387753n05401j264613k626576k715412j565166l15884
$$ 2643888 2487140 520960 -866793 -1372194 -2636807 -5263383 -7978795 -9543961 -9859845
3257i859845P23717J781064K505922K419007J707576P22838m42164j256572q54542
$$ -9859845 -9136128 -7355064 -4849142 -2430135 -722559 279 -441885 -1698457 -2552999
3248b552999M40191J097786O89852N48230J210996J329137M25602J96035J105149
$$ -2552999 -2112808 -1015022 -325170 223060 1434056 2763193 3188795 3384830 4489979
3239D489979N91634k393827m040145j082097K908078K043396k475858l702261
$$ 4489979 5081613 2687786 -1352359 -2434456 473622 2517018 41160 -3661101
3231c661101L90689M152268L484767J278631R17346N37125k129570m407006l137973
$$ -3661101 -3270412 881856 4366623 5645254 6562600 7099725 4970155 563149 -2574824
3222b574824m04973L51067L90880K302538L688323P14310l962660l815578J417082
$$ -2574824 -2979797 -2628730 -2237850 64688 3753011 4467321 504661 -3310917 -1893835
3213a893835M998672L327881L15648j59820J8012j808913l597153k414964m4413
$$ -1893835 3104837 6432718 6748366 6588546 6606558 4797645 1200492 -1214472 -1258885
3204a258885j37908k004644j709953J589410M337428L603683L99481k369619k967111
$$ -1258885 -1396793 -3401437 -5111390 -3521980 815448 4419131 4818612 2448993 -518118
3195e18118j467212P60418J722178M61201j469973j416483J038365L205939K358162
$$ -518118 -1985330 -1224912 497266 958467 -511506 -1927989 -889624 2316315 4674477
3186D674477j103341m152579m333638j898177R65740K431273K391801J828111
$$ 4674477 3571136 -581443 -4915081 -6813258 -5847518 -3416245 -1024444 803667
3178H03667J292048M05036j148124k628734k773524j323115M24003R18139O2149
$$ 803667 2095715 2500751 1352627 -1276107 -4049631 -5372746 -4948743 -4030604 -3968455
3169c968455p77546m77499N90694J261697J065095N12148K04323K35027K77929
$$ -3968455 -4746001 -5223500 -4632806 -3371109 -2306014 -1793866 -1589543 -1354516 -1076587
3160a076587k38095j660837l166096k926892m29270J937636J401462j140435j711774
$$ -1076587 -1314682 -2975519 -6141615 -9068507 -9497777 -7560141 -6158679 -7299114 -9010888
3151i010888J451266N237894N538585K147526j703766l412549k934633j544070
$$ -9010888 -7559622 -2321728 3216857 5364383 3660617 248068 -2686565 -4230635
3143d230635l88905L15l1076L80506J451748K467910K898769K734576J548250
$$ -4230635 -4619540 -4619225 -4650301 -4269795 -2818047 -350137 2548632 5283208 6831458
3134F831458j025149l392575k921443Q7566J854550L14544j702678q79385J515303
$$ 6831458 5806309 2413734 -507709 -420143 1434407 1748951 46273 -833112 682191
3125F82191K096203P73032l1863J5861n43273j061239M66164L041577L337852
$$ 682191 2778394 3551426 3519563 3535424 2992151 1930912 2397076 5438653 8776505
3116H776505R19186j275388j952846k697149l601361k334308J029122K780419
$$ 8776505 9695691 8420303 6467457 3770308 168947 -2165361 -1136239 1644180
3108A644180J220826o80535o14608o47871k576412l731789j504652J358521Q14691
$$ 1644180 2865006 2184471 1569863 921992 -1654420 -5386209 -6890861 -5532340 -4717649
3099d717649j459988l53279M398446P329548M990533K58954k266031j846878r65199
$$ -4717649 -6177637 -6530916 -2132470 5197078 10187611 10446565 8180534 6333656 5368457
3090E368457j341609k313921k243628n67632J345059J542677O149j144196p06722
$$ 5368457 4026848 1712927 -530701 -1098333 246726 1789403 1795552 651356 -55366
3081e5366j97249j173459k362442j642733L18311J005990k9537q36972l70384
$$ -55366 -252615 -1426074 -3788516 -5431249 -5112938 -4106948 -4136485 -4973457 -5343841
3072e343841M31478R03072J534669K292709K297509J624522J405805J689697J150085
$$ -5343841 -4912363 -4009291 -2474622 -181913 2115596 3740118 5145923 6835620 7985705
3063G985705n68072k099517k511719k362119j982350o27673J685761L176325K390149
$$ 7985705 7417633 5318116 2806397 444278 -1538072 -2165745 -479984 2696341 5086490
3054E086490J77390j477454j727935j115929l25103M64971J332629K144729K196767
$$ 5086490 5263880 3786426 2058491 942562 617459 1082430 2415059 4559788 6756555
3045F756555O65201j959482l517588k466562q9870R89313J58156q75001p72748
$$ 6756555 7421756 5462274 1944686 -521876 -611746 377567 535723 -339278 -1112026
3036a112026K36639J608392K864180K777521M28058k701082l914298k873965j657440
$$ -1112026 -875387 733005 3597185 6374706 6802764 4101682 187384 -2686581 -4344021
3027d344021j085445J05086J875011K072976L73587l67904J259134K466159P62923
$$ -4344021 -5429466 -5324380 -3449369 -1376393 -1002806 -1370710 -111576 2354583 3117506
3018C117506j794605k083101r87801j189533k047139j104853O78398J2278k799795
$$ 3117506 1322901 -760200 -1748001 -2937534 -4984673 -6089526 -5411128 -5398850 -8198645
3009h198645l765699j502948Q14939Q74853M02176J285581K375004K325178K248274
$$ -8198645 -11964344 -13467292 -12652353 -11777500 -11375324 -10089743 -7714739 -5389561 -3141287
3000c141287K981717K691547J47835k078996r90613K041734L205002J790196M74405
$$ -3141287 -159570 2531977 2679812 600816 -389797 1651937 4856939 6647135 7121540
2991G121540O78048R23911q9620j646002k750506l379370l369574k033477L53094
$$ 7121540 7799588 8723499 8633879 6987877 4237371 858001 -2511573 -4545050 -4191956
2982d191956K122810J884182k95590l241783n054584l769991M68668M290105M407019
$$ -4191956 -2069146 -184964 -480554 -3722337 -8776921 -12546912 -12078244 -7788139 -3381120
2973c381120J922204P81653J885541J971680p24908l246369k550837l85977l81466
$$ -3381120 -1458916 -677263 1208278 3179958 2455050 -791319 -3342156 -3728133 -4109599
2964d109599k293272k731970o56980J443846J803325J518726J812967J988926
$$ -4109599 -6402871 -9134841 -9791821 -8347975 -6544650 -5025924 -3212957 -1224031
2956a224031J268948M37002L10031L19656p7846j25589O75305J084673j10367
$$ -1224031 44917 481919 791950 1111606 1033760 908171 1583476 2668149 2557782
2947B557782j770561j638793N07778K574848K941891K068024J148525N39751L2695
$$ 2557782 787221 -851572 -343794 2231054 5172945 7240969 8389494 8929245 8961940
2938H961940l97435q41963j688563k812506l102060j703892N51690J950897K070583
$$ 8961940 8564505 7722542 6033979 3221473 119413 -1584479 -1032789 918108 2988691
2929B988691K040028K327235J580851j186822m147431m151696p52047K853687
$$ 2988691 5028719 7355954 8936805 7749983 3602552 -549144 -1301191 1552496
2921A552496L504011J402771j043540k399936k817143k390343q14767J289486
$$ 1552496 5056507 6459278 5415738 3015802 198659 -2191684 -3006451 -1716965
2913a716965K314732J515544n6914r76922j021027q07247n31061J93812J410944
$$ -1716965 597767 2113311 2056397 1079475 58448 -748799 -1279860 -1086048 324896
2904C24896K315339J922521K08535j607147k209752j598306r10775q10783p47662
$$ 324896 2640235 4562756 4771291 3164144 954392 -643914 -1554689 -2365472 -3113134
2895c113134q0996R11546J708344K416101L236708L764712L532566K547214P53192
$$ -3113134 -3194130 -2282584 -574240 1841861 5078569 8843281 12375847 14923061 15676253
2886A5676253j882371m041145l512243l84149J995557J255405n61481l99162P71711
$$ 15676253 13793882 9752737 6240494 5856345 7851902 9107307 8545826 8146664 8918375
2877H918375m7634k151556k073072p8490m34798l869602n034551m48228N392736
$$ 8918375 8870741 6719185 4646113 4567623 4132825 263223 -4771328 -5219556 173180
2868A73180N833271R46707l573946m323734k807003j389832o30820l20684q587
$$ 173180 6006451 6953158 3379212 -944522 -3751525 -5141357 -5772177 -6092861 -6101448
2859f101448J323893L662902M745093K915379J68441m59745N63818N16145q14555
$$ -6101448 -4777555 -1114653 3630440 6545819 6714260 6254515 6818333 7334478 6519923
2850F519923j295909p64970j124646k130225j210409J859142L983181L434074
$$ 6519923 5224014 4459044 3334398 1204173 -6236 1852906 5836087 9270161
2842I270161J898035Q05017o47448k461515k694327j233541r97749l028428l949013
$$ 9270161 11168196 11973213 11325765 8864250 6169923 4936382 3938633 910205 -3038808
2833c038808j182610K557588L355479J887553J406900K163351J848936J20805
$$ -3038808 -4221418 -1663830 1691649 3579202 4986102 7149453 8998389 9119194
2825I119194j267586j929654k756197l068896j522427N73566N26778j187374j299739
$$ 9119194 7851608 5921954 3165757 96861 -1425566 -852000 -325222 -1512596 -2812335
2816b812335R64136K517903J178499j381147k491817j502135R55449L798728M620668
$$ -2812335 -1848199 669704 1848203 467056 -2024761 -3526896 -2571447 1227281 5847949
2807E847949J229150m345705o547019l160153J402386K266226P24449J200178
$$ 5847949 7077099 2731394 -3815625 -6975778 -5573392 -3307166 -2582717 -1382539
2799a382539L753851M130648Q05713k371094j658687J627742L330227J632212
$$ -1382539 2371312 6501960 7307673 4936579 3277892 4905634 8235861 9868073
2791I868073j531076l108446j840772Q35421K256309J380067j9779J25121J143181
$$ 9868073 8336997 5228551 3387779 4223200 6479509 7859576 7839797 7964918 9108099
2782I108099Q25447q58109j711238j062537p08312j364121j280342R5046L32894
$$ 9108099 9933546 9075437 7364199 6301662 5593350 4229229 2948887 3043933 3376827
2773C376827j601698k317201R79838M865092L777637j560493m927116l603232
$$ 3376827 1775129 -542072 437766 5302858 9080495 7520002 2592886 -1010346
2765a010346j224953p76448l64592J662979K672210N78174j613419o85367Q36999
$$ -1010346 -2235299 -3011747 -3376339 -1713360 958850 1537024 -76395 -761762 75237
2756G5237j114527m543968l950268P17763L779990K539996L92044K01564K48778
$$ 75237 -1039290 -5583258 -9533526 -8815763 -5035773 -2495777 -2103733 -1902169 -1653391
2747a653391j130088j948979n90220P86437J89917l60990J462824L679071K941857
$$ -1653391 -2783479 -4732458 -5322678 -4536241 -4346324 -4707314 -3244490 434581 3376438
2738C376438m2197j846892j465259m65016O74613K625641M370708L897081J497974
$$ 3376438 3334241 1487349 22090 -442926 231687 2857328 7228036 11125117 12623091
2729A2623091o64211j926137l087082l571502k059931K02250L62792j389528j757499
$$ 12623091 11958880 10032743 6945661 3374159 1314228 1516478 1879270 489742 -1267757
2720a267757K18975J294502p78645l451789l119622j98945K094380K347738J783905
$$ -1267757 -1048782 245720 -532925 -3984714 -7104336 -7303281 -5208901 -2861163 -1077258
2711a077258J488679J165048M05543m98570j078286j074488m68265L43256Q55853
$$ -1077258 411421 1576469 1982012 1483442 405156 -669332 -1137597 -794341 61512
2702F1512J221180J857321K110639P19263j788452k804561r36337J817964K663235
$$ 61512 1282692 3140013 5250652 5969915 4181463 1376902 440565 2258529 4921764
2693D921764J607775P60096R13530Q29274l28455j688971k078121j399078k90034
$$ 4921764 6529539 7289635 8203165 9032439 8703984 7015013 4936892 3537814 3247780
2684C247780O16376Q78867N33946L33869R18719J674003J254887n62188k373843
$$ 3247780 3864156 4743023 5276969 5610838 6529557 8203560 9458447 8896259 6522416
2675F522416k858444k301976j887399j926194j507907O9164K068594K941556K073517
$$ 6522416 3663972 1361996 -525403 -2451597 -3959504 -3890340 -1821746 1119810 3193327
2666C193327M32186p06456j141007j311863j001659M26835K453648L261123J795685
$$ 3193327 3625513 2919057 1778050 466187 -535472 -108637 2345011 5606134 7401819
2657G401819q24602k633372k904538k243701j280486k46831N47813R13630J366500
$$ 7401819 6577217 3943845 1039307 -1204394 -2484880 -2731711 -2183898 -1270268 96232
2648I6232K459702L399423K482557m32589k824826k080520J097108L184663K138467
$$ 96232 2555934 5955357 8437914 8005325 5180499 3099979 4197087 7381750 9520217
2639I520217q9001m54598P36730K80004l009140o001375n078125p54822L070387
$$ 9520217 9431216 8976618 9713348 9993352 6984212 982837 -4095288 -4850110 -1779723
2630a779723L557028J138214j840926l023578j253770K264285M403728L412090
$$ -1779723 1777305 2915519 1074593 -1948985 -3202755 -938470 3465258 6877348
2622F877348J209758N47084Q72649j57418j830114j007709J993171K602249j044294
$$ 6877348 8087106 8634190 9506839 9349421 7519307 6511598 8504769 11107018 10062724
2613A0062724m462988l191750O20232J866450J31820q36611K34554R02782J10970
$$ 10062724 5599736 2407986 3028218 4894668 5026488 4189877 4424431 5327213 5438183
2604E438183j13493J171021J935011P83673q61439j619191k163696k745897j597025
$$ 5438183 5324690 6495711 8430722 9214395 8352956 6733765 4570069 1824172 227147
2595B27147J985187N222717M950151J616548j825097l595378l687029k275650
$$ 227147 2212334 7435051 12385202 14001750 12176653 8581275 4894246 2618596
2587B618596Q2924J637381J181595j454j06563p988j855121m716661m745341o36120
$$ 2618596 2701520 4338901 5520496 5519042 5412479 5404491 3549370 -1167291 -5912632 -6548752
2577f548752L745320L966379M52430k693341l037574j652680j73884J276759K566254
$$ -6548752 -2803432 1162947 1615377 -1077964 -4115538 -5768218 -5942102 -4665343 -2099089
2568b099089K326625N2283j944248r34381K188890L506011J207659j869013k051650
$$ -2099089 227536 279819 -1664429 -2598810 -409920 3096091 4303750 2434737 383087
2559C83087L92750K052414J023039j207350k297673j645500j69993J001449J126317
$$ 383087 775837 2828251 3851290 2643940 346267 -1299233 -1469226 -467777 658540
2550F58540K38569n98145k90321Q15662J359864R05584L28524K18203K65219M63767
$$ 658540 897109 298964 8643 824305 2184169 3089753 3418277 3636480 3901699 4365466
2540D365466J320252K282222J608562j163792l968557m576373l117629j178591
$$ 4365466 5685718 7967940 9576502 8412710 4444153 -132220 -3249849 -4428440
2532d428440M34986J701916K171757J326241l35028j770431k454705k070471j53795
$$ -4428440 -3993454 -2291538 -119781 1206460 871432 -898999 -3353704 -5424175 -5577970
2523e577970K627713L893784K111121q44984j635859K38359J959406J250349j116308
$$ -5577970 -2950257 943527 3054648 2209664 573805 812164 2771570 4021919 2905611
2514B905611k964255l136734j729392N12291K176594J812986l74741k156591j455707
$$ 2905611 -58644 -3195378 -4924770 -4412479 -2235885 -422899 -797640 -2954231 -4409938
2505d409938J402895M062296M489709K772606P88767P8308M7977j029230k989849
$$ -4409938 -3007043 1055253 5544962 8317568 9106335 9184643 9232620 8203390 5213541
2496E213541l218771m10776K537167J758402k103562m415825k696923N79432K099202
$$ 5213541 1994770 1583994 4121161 5879563 3776001 -639824 -3336747 -2757315 -658113
2487f58113J835577J541983J543797J158263O01833K80424n81962k482217l828377
$$ -658113 1177464 2719447 4263244 5421507 6023340 6303764 5721802 3239585 -588792
2478e88792k781887j79937J546230J796042J874994K058796J191958n76073j260001
$$ -588792 -3370679 -3550616 -2004386 -208344 1666650 3725446 4917404 4341331 3081330
2469C081330j22127R51810M43896l17683O35300K597456L065302J268631j070275
$$ 3081330 2959203 3911013 4354909 4037226 4672526 7269982 10335284 11603915 10533640
2460A0533640k348858k649613k377192j084660J252609K969794K272420k92007
$$ 10533640 8184782 5535169 3157977 2073317 3325926 6295720 8568140 8276133
2452H276133k372526k859663k874400l269358k909715q11344J444395J573184
$$ 8276133 5903607 3043944 169544 -3099814 -6009529 -6820873 -5376478 -3803294
2444c803294J58974r5698J378296K210770J199375M42293J809854L702242L525328
$$ -3803294 -3644320 -3740018 -2361722 -150952 1048423 1490716 3300570 7002812 10528140
2435A0528140J517673m10954k122038m534832o405825n194962j230129K016672
$$ 10528140 12045813 11634859 9512821 4977989 -1427836 -6622798 -7852927 -5836255
2427e836255K447985J579895J493906J958676J695145M92383j103108k534712
$$ -5836255 -3388270 -1808375 -314469 1644207 3339352 3831735 2728627 193915
2419A93915k787154j053942J202485J007921j906080l802899j805720J875168
$$ 193915 -2593239 -3647181 -2444696 -1436775 -3342855 -7145754 -8951474 -7076306
2411g076306L079493J555238N74648J327310J181217j645676m591684l930790
$$ -7076306 -3996813 -2441575 -1866927 -539617 641600 -1004076 -5595760 -9526550
2403i526550Q0881L452946L560334K059790K005439L456051L643963J284210j306242
$$ -9526550 -9445669 -5992723 -2432389 -372599 1632840 5088891 8732854 10017064 8710822
2394H710822j490324j46288k18932k214799l595912k771720j242076q95057j243854
$$ 8710822 7220498 7074210 6855278 4640479 1044567 -1727153 -2969229 -3864286 -5108140
2385e108140o62043J092487K771414K984182J058762k051988l463982j118555
$$ -5108140 -5770183 -4677696 -1906282 1077900 2136662 84674 -3379308 -4497863
2377d497863K630545K984783o68653l434843k118338O5147p40597k260199m1994
$$ -4497863 -1867318 1117465 448812 -2986031 -5104369 -5039222 -5779819 -8040018 -8082012
2368h082012M358055N171369J554457j196822j49757J365723J16830j989120j926219
$$ -8082012 -3723957 1447412 3001869 1805047 1655290 3021013 3137843 1148723 -777496
2359g77496l52128O64313J216815J768766R16414j733859l187811j155064J746644
$$ -777496 -1129624 -465311 751504 2520270 3436684 1702825 -1484986 -2640050 -893406
2350h93406J686094l14915j99471K325010L273983P74000k124055k166609k74911
$$ -893406 792688 477773 278302 2603312 5877295 6651295 4527240 2360631 2085720
2341B085720M69426q52906k373201k101305n4122J905235J970567L51642r84611
$$ 2085720 2555146 1702240 -670961 -2772266 -2826388 -921153 1049414 1401056 416445
2332D16445q74108k98752l64545l33926P03487J482497K47041j905713k029606
$$ 416445 -457663 -756415 -1120960 -1454886 -751399 731098 978139 -927574 -2957180
2323b957180L34412K418884K310975J321394J294054J723186J087777m39309j356705
$$ -2957180 -2622768 -203884 2107091 3428485 4722539 6445725 7533502 7094193 5737488
2314E737488j222201j171044k064314l100288k723589p37795R96170O40769r49384
$$ 5737488 4515287 3344243 1279929 -1820359 -4543948 -5281743 -4285573 -3644804 -4594188
2305d594188r56733J385848L138521J560418j742987k913892j254257K62804j84608
$$ -4594188 -5550921 -4165073 -1026552 533866 -1209121 -4123013 -5377270 -5114466 -5299074
2296e299074r21429q4924J367699J486307K61585r05114j353220j305579q25182
$$ -5299074 -6220503 -6305427 -4937728 -3451421 -3189836 -4094950 -5448170 -6753749 -7578931
2287g578931O4840Q73386J209881J280562J243538R04686N58844J044582K269410
$$ -7578931 -7514091 -6640705 -5430824 -4150262 -2906724 -2002038 -1443194 -398612 1870798
2278A870798K767696J553180n41346k142084k974449l392839l194546j891462
$$ 1870798 4638494 6191674 5650328 3508244 533795 -2859044 -6053590 -7945052
2270g945052L27158K505817L447787K418280K02145q93936L67691J876741O97915
$$ -7945052 -7617894 -5112077 -1664290 753990 956135 62199 429890 2306631 3004546
2261C004546k189810k700653Q8093K044524L01404k058063q55654K493280L356115
$$ 3004546 814736 -1885917 -1797824 246700 548104 -1509959 -2365613 127667 3483782
2252C483782J203594j55808P97151J124214j276343m235799m822754l185019j076852
$$ 3483782 4687376 4531568 5328719 6452933 5176590 940791 -3881963 -7066982 -8143834
2243h143834R04038K636383L089368J785977L19594M51565J557193J635173K63468
$$ -8143834 -7239796 -4603413 -1514045 271932 591526 1043091 2600284 4235457 4498925
2234D498925r40502n78523Q94049J771779Q40810j266102k347765q91263J887540
$$ 4498925 3558423 2979900 3873949 5645728 6486538 5220436 2872671 1981408 3868948
2225C868948L175321J851007m87232j967006k469500k681395k628658k112720
$$ 3868948 7044269 8895276 8408044 6441038 3971538 1290143 -1338515 -3451235
2217c451235j439516p84219J32404R72732O80779n62238o79971J579076M366804
$$ -3451235 -4890751 -5674970 -5542566 -4569834 -3889055 -4451293 -5131264 -3552188 814616
2208H14616M781352K469043k74605j400645p52025N65674J076077k25260k530168
$$ 814616 5595968 8065011 7790406 6389761 5637736 6203410 7279487 7054227 4524059
2199D524059l312736j212022J817764K828141J639311L55020k50926j367132l149233
$$ 4524059 1211323 -699 1817065 4645206 6284517 6639537 6388611 5021479 1872246
2190A872246l704708j866633J079813L291674M135345L317736M34233l285869
$$ 1872246 -1832462 -3699095 -2619282 672392 4807737 8125473 8559706 5273837
2182E273837m766569k482527J227887K920222J975032K15736j061231j667796
$$ 5273837 507268 -1975259 -747372 2172850 4147882 4363618 3302387 1634591
2174A634591j238179K39434J156167l7000k048578k041271J61880J639052P14549
$$ 1634591 396412 635846 1792013 1755013 -293565 -2334836 -2172956 -533904 180645
2165A80645p09990l07243J369734K331854K172757J779250J283418K86127o60584
$$ 180645 -529345 -836588 533146 2865000 5037757 6817007 8100425 8386552 7725968
2156G725968p10779l96954q25681j503952q70071J000448K159039J643485O96745
$$ 7725968 7015189 6618235 5792554 4288602 3418531 4418979 6578018 8221503 8918248
2147H918248L59221l04049k138201l505463k065646J478650L543288K115465n96748
$$ 8918248 9277469 8973420 6835219 3329756 1264110 2742760 6286048 8401513 7804765
2138G804765j135378O39138J625022m0181k385099k374611M7134K225902K451125
$$ 7804765 6669387 7308525 8933547 8893366 6508267 4133656 4180790 6406692 8857817
2129H857817J460025L00829j176792k826485l137436j311456Q80469J161637k00499
$$ 8857817 10317842 10618671 9441879 6615394 3477958 2166502 3046971 4208608 4008109
2120D008109j257222j468856j724736j858870q04455Q09258J070834K27267O10168
$$ 4008109 2750887 1282031 -442705 -2301575 -3106030 -2296772 -1225938 -998671 -388503
2111c88503K145776J489168k212305m233648o52380M767471M949729k32520l438141
$$ -388503 1757273 3246441 1034136 -3199512 -3851892 915579 5865308 5632788 2194647
2102B194647m24104M018256L369170j440271m217981k547441k1953J02745q49622
$$ 2194647 1770543 5788799 9157969 7717698 3499717 952276 930323 1033068 183446
2093A83446l07460J271275J690037O46088l42920p06133j163995j499372k76640
$$ 183446 -124014 1147261 2837298 3483386 3140466 2434333 1270338 -229034 -505674
2084e05674K542750M545069L669128Q67796j358767k128937k297855k140561j002783
$$ -505674 2037076 6582145 10251273 11119069 9760302 7631365 5333510 3192949 2190166
2075B190166P16860J344174L99898m52762O5815Q77914L38994j238907k250126
$$ 2190166 2907026 4251200 4651098 4198336 4264151 5142065 5481059 4242152 1992026
2066A992026k048379j207568l68300q4170q74421k066833j714685O19739K218145
$$ 1992026 -56353 -1263921 -1632221 -1716391 -2590812 -4657645 -6372330 -5752591 -3534446
2057c534446O52603k109321k004177J078131K934023J304073r44832n26154J308528
$$ -3534446 -2881843 -4991164 -6995341 -5917210 -2983187 -1679114 -2623946 -3150100 -1841572
2048a841572J014345j930606m600264m561043j970060J686215M832978N936294
$$ -1841572 -827227 -2757833 -7358097 -11919140 -13889200 -12202985 -7370007 -1433713
2040a433713M310064J246972q15754p03758M57763O58755r09059k972587l149506
$$ -1433713 2876351 4123323 3307569 2603811 3061574 3720329 2811270 -161317 -3310823
2031c310823l15268L715575N590925L918748O42244j398531j336638l52128m6490
$$ -3310823 -3626091 89484 5680409 9599157 10241401 8842870 7506232 7154104 7107614
2022G107614j263410l296381l798698j073681K910858L855208O51853k705770
$$ 7107614 5844204 2547823 -1250875 -2324556 586302 4441510 5093363 2387593
2014B387593k584511p35178j088988l440050l940142j063611K591422M439975
$$ 2387593 -196918 -932096 -2021084 -5461134 -9401276 -10464887 -7873465 -3433490
2006c433490M446716L134888M25565k461201k892978k10586K882961L676321K426983
$$ -3433490 1013226 4148114 4573679 2112478 -780500 -991086 1891875 5568196 7995179
1997G995179R95265M24202Q96943K095127K465516K27801l537143m977434k375111
$$ 7995179 8990444 9414646 10311589 12406716 14872232 15100033 11562890 6585456 4210345
1988D210345J102385J670824Q4994j14027J785800K842704J042544j915490k994133
$$ 4210345 5312730 6983554 7068548 6954521 8740321 11583025 12625569 10710079 7715946
1979G715946j329429J200815K003112J87528k498786l460683k357563j477011
$$ 7715946 6386517 7587332 9590444 9777972 7279186 3818503 1460940 -16071
1971a6071k325842l236029j768205J663783M332650M585166K966660O48355j422652
$$ -16071 -2341913 -5577942 -7346147 -5682364 -1349714 3235452 6202112 6850467 5427815
1962E427815k268783j619150o74106n81197o05151N22426K048528K043243M16980
$$ 5427815 3159032 1539882 865776 284579 -320572 201854 2250382 4293625 4710605
1953D710605j095086j787993k517325l296396k766092n94462J660387K654612
$$ 4710605 3615519 1827526 -689799 -3986195 -6752287 -7346749 -5686362 -3031750
1945c031750K431505J241794p56203k343152k068811o72098k98636r03755k56730
$$ -3031750 -600245 641549 -114654 -2457806 -4526617 -5198715 -5497351 -6401106 -6657836
1936f657836J795243K426396O14626o80047O48996K239115J523219M86442K153919
$$ -6657836 -4862593 -2436197 -1821571 -2501618 -1852622 386493 1909712 2396154 4550073
1927D550073M677489L665690p20474l769898l139512j254422l58154L91185J631263
$$ 4550073 9227562 12893252 12172778 8402880 5263368 4008946 3650792 4041977 5673240
1918E673240J691295k23945k067549k281533k126773k493595j438778K184224
$$ 5673240 7364535 7140590 5073041 2791508 664735 -1828860 -3267638 -1083414
1910a083414N291383M403145J127612j18203J135346J144448j553262l661690
$$ -1083414 4207969 8611114 9738726 9620523 10755869 11900317 10347055 6685365
1902F685365k464543M3246P02325J35929J151968L745615M880932K963282j73853
$$ 6685365 4220822 4264068 4966393 5102322 6254290 9999905 14880837 17844119 17670266
1893A7670266k118793k495447k055099j218057o94110j754308m136672m994541
$$ 17670266 15551473 13056026 11000927 9782870 9088760 7334452 3197780 -1796761
1885a796761k126222K431334M457743L059012J404666J403559P95703k445430
$$ -1796761 -3922983 -1491649 2966094 6025106 7429772 8833331 9629034 7183604
1877G183604n539588m178705Q60510M206710L145149P77410P40015K037574J500671
$$ 7183604 1644016 -2534689 -1674179 2532531 5677680 6455090 7195105 9232679 10733350
1868A0733350r31147k465841j974492j171179j207267q30733J030802K903815
$$ 10733350 9802203 7336362 5361870 4190691 2983424 2152691 3183493 6087308
1860F087308K670597P64624l64297K27409P31215n12292k270614k019517L23516
$$ 6087308 8757905 9522529 9158232 9385641 10116856 9604564 7333950 5314433 5637949
1851E637949K095975J616043L96440N18112J320450N93014j725527l191539k200267
$$ 5637949 7733924 9349967 9746407 10264519 11584969 12177983 10452456 7260917 5060650
1842E060650J37678J718296J491331l70698k670201l288577r20698K750922M321343
$$ 5060650 5198328 6916624 8407955 8037257 5367056 2078479 1157781 3908703 8230046
1833H230046K637682k13692k202270l315598l586924k057141P17881J880647K41708
$$ 8230046 10867728 10654036 8451766 5136168 1549244 -507897 209984 2090631 2332339
1824B332339j359799k81395J539494N81522k616464m325408l018884l86870K198293
$$ 2332339 972540 691145 2230639 2812161 195697 -4129711 -7148595 -7535465 -5337172
1815e337172M538136N419033L495200M73625l83937O65603J38268k620311l850263
$$ -5337172 -799036 4619997 8115197 8588822 8204885 8870488 9008756 6388445 2538182
1806B538182j355374J952544K731868J849955J560234J147210j225703m480822
$$ 2538182 1182808 3135352 5867220 7717175 9277409 10424619 9198916 4718094
1798D718094n846641m805195k931172r56984J209149K534157J861943M35633P57133
$$ 4718094 -1128547 -5933742 -8864914 -9821898 -8612749 -6078592 -4216649 -3781016 -3023883
1789c023883K927042M321251L103248L33634j619279j506370P278J114847O69825
$$ -3023883 -96841 4224410 7327658 7661292 6042013 4535643 4542921 5657768 6327593
1780F327593l75140k37144O97974m35k770040m503269k861517J33945J317955
$$ 6327593 5952453 5715309 6413283 6412848 3642808 -860461 -3721978 -3588033 -2270078
1771b270078J112266J895545L300186K895829P51562n18712j27966J14903l89915
$$ -2270078 -1157812 737733 4037919 6933748 7685310 7166598 7038632 7153535 6763620
1762F763620j34928Q86618L41756k214942l506096j029705K966590M236307J750360
$$ 6763620 6628692 7515310 7857066 5642124 2136028 1106323 4072913 8309220 10059580
1753A0059580j743203l373710k772491j534734j120628j301693p47231O11052
$$ 10059580 8316377 4942667 2170176 635442 -485186 -1786879 -2534110 -1923058
1745a923058R49812m29803j042159J215537L725291K211187k194471l562557J01410
$$ -1923058 -973246 -1403049 -2445208 -1229671 2495620 4706807 2512336 -1050221 -948811
1736i48811L460537J691671k430183l018668L64486L016192K347051M43221l64210
$$ -948811 2511726 4203397 1773214 -1245454 -880968 2135224 4482275 4925496 4561286
1727D561286o81086j952172l767203m435315k997670j21932K315900K679554J266060
$$ 4561286 3880200 1928028 -1839175 -6274490 -9272160 -9394092 -7078192 -4398638 -3132578
1718c132578O3714K34126P83624N09926m4505J81602Q34343R40977O32062N93873
$$ -3132578 -3068864 -2834738 -2051114 -1541188 -1585693 -1404091 -569748 371229 1003291 1597164
1708A597164P45004Q54417J405757K353271K210532J59855j987912j897686O433
$$ 1597164 2342168 3196585 4602342 6955613 9166145 9326000 7338088 5440402 5446835
1699E446835J210284L69541j788683l965331m894229l380498K08551L166693L144807
$$ 5446835 6657119 7026660 5237977 1272646 -3621583 -7002081 -6793530 -3626837 -482030
1690d82030J077595k81931J04952J264443K284871K588832J352278r84936j923333
$$ -482030 595565 313634 418586 1683029 3967900 6556732 7909010 6924074 5000741
1681E000741k66295J212219l03544k637347j737541J212161R98417l061604n245631
$$ 5000741 4734446 5946665 5643121 3005774 1268233 2480394 3478811 417207 -4828424
1672d828424j858813L326847M776545K367070k64641j311796j318962n24846Q84946
$$ -4828424 -6687237 -3360390 1416155 3783225 3518584 2206788 887826 362980 1247926
1663A247926J448424L19381p76979o8009J095733K59606k011068k771306r35271
$$ 1247926 2696350 3015731 2238752 2170743 3266476 3526082 1515014 -1256292 -2191563
1654b191563J517136K350154J210252p66418j930601j102845J124929K647003
$$ -2191563 -674427 1675727 2885979 2119561 188960 -913885 211044 2858047
1646B858047K398165J567276J212245L68583j740465l361790k488981j95456R02994
$$ 2858047 5256212 6823488 8035733 8404316 6663851 3302061 813080 617624 1520618
1637A520618N42006M48775Q63878M42221o50672o50787N21664Q45678k55987p83408
$$ 1520618 2062624 2511399 3375277 3817498 3166826 2516039 3037703 3883381 3627394 2843986
1627B843986K79680Q96519p39821k869713k368504P44862L156494K472477l7214
$$ 2843986 3123666 4020185 3280364 410651 -1957853 -1212991 1943503 4415980 4378766
1618D378766j275668J02858K540368L575371K359164P5121j595134j839296q77122
$$ 4378766 3103098 3205956 5746324 9321695 11680859 11755980 10160846 8321550 7444428
1609G444428K96344L23764j266047k997099k827163q96621N50654M28357J08733
$$ 7444428 7740772 8064536 6798489 3801390 974227 77606 628260 1056617 1165350
1600A165350O10116P25219m74098j492514r46441j45024m48849j16300K681731
$$ 1165350 1775466 2500685 2026587 534073 -412368 -557392 -1006241 -1122541 1559190
1591A559190N321218L571830j623848m781732l495337q73767L58942J278223K509573
$$ 1559190 6880408 10452238 8828390 4046658 551321 -322446 36496 1314719 3824292
1582C824292J563920k345700m980791k749235J316806J802447r51398j820435
$$ 3824292 5388212 3042512 -1938279 -4687514 -3370708 -1568261 -2519659 -4340094
1574d340094R83590L723947L354795J428778M81091K43803m96243j052847k72022
$$ -4340094 -3356504 367443 3722238 5151016 5632107 5875910 5379667 4326820 4054798
1565D054798R34378Q10739m09585q92020k8395P98460L11712j067771k001844
$$ 4054798 4989176 5799915 5390330 4498310 4469915 5268375 5580087 4512316 2510472
1556B510472j728241m43438J127429K072061J673148J32004j171983q46623Q23715
$$ 2510472 782231 338793 1466222 3538283 5211431 5343435 4171452 3324829 4148544
1547D148544J948852J254817l34901j035397n62701j23467m18574r61987j268347
$$ 4148544 6097396 7352213 7017312 5981915 5419214 5295747 4877173 3915186 2646839
1538B646839j259884m61702J443856K918314J540731k300735m760796l194677
$$ 2646839 1386955 925253 2369109 5287423 6828154 4527419 -233377 -3428054
1530c428054L55834K337794K601994L395646M704594M152580J483759m76086m09584
$$ -3428054 -3072220 -734426 1867568 5263214 9967808 14120388 15604147 15128061 14718477
1521A4718477q24393l746155o622619n394057m07501L615695L352947K52216k174144
$$ 14718477 13894084 10147929 3525310 -1868747 -2276248 1339447 4692394 4944610 2770466
1512B770466k334712j006376N00966J276811Q87554r2411j03506J576779L281030
$$ 2770466 435754 -570622 -69656 1207155 2094709 2002298 1898792 3475571 6756601
1503F756601K549471o53996l659250m354946l328476k097152q20417Q28339J859847
$$ 6756601 9306072 8652076 4992826 637880 -2690596 -4787748 -5608165 -4779826 -2919979
1494b919979J102711n11495r43070n2519O09512Q92732K196651M023857L467722
$$ -2919979 -1817268 -2328763 -3271833 -3324352 -2714840 -1822108 374543 4398400 7866122
1485G866122k67557l566254k983791m5696J236103L6800j133275r04188l28194
$$ 7866122 7598565 4032311 1048520 1002824 2238927 2275727 1142452 238264 -89930
$$ [...]
##END NTUPLES=NMR SPECTRUM
##END=
